##TITLE=1H_EC-3059(X-1)
 CDcl3, 8 sc, 
 19.9.2019
##JCAMPDX= 6.0         $$ Bruker NMR JCAMP-DX V2.0
##DATA TYPE= NMR FID
##DATA CLASS= NTUPLES
##ORIGIN= UXNMR, Bruker Analytische Messtechnik GmbH
##OWNER= root
$$ XWIN-NMR		Version 3.5
$$ Thu Sep 19 13:58:32 2019 Russian Standard Time (UT+4h)  she@DPX200
##.OBSERVE FREQUENCY= 200.1315
##.OBSERVE NUCLEUS= ^1H
##.DELAY= (6, 6)
##.ACQUISITION MODE= SIMULTANEOUS
##.ACQUISITION SCHEME= undefined
##.AVERAGES= 8
##.DIGITISER RES= 18
##SPECTROMETER/DATA SYSTEM= spect
##.PULSE SEQUENCE= zg30
##.SOLVENT NAME= D2O
##.SHIFT REFERENCE= (INTERNAL, D2O, 0, 15.7039)
##AUDIT TRAIL= $$ (NUMBER, WHEN, WHO, WHERE, WHAT)
$$ ##TITLE= Audit trail, XWIN-NMR		Version 3.5
$$ ##JCAMPDX= 5.01
$$ ##ORIGIN= Bruker BioSpin GmbH
$$ ##OWNER= she
$$ F:/spectra/data/she/nmr/H-F/1/audita.txt
$$ ##AUDIT TRAIL=  $$ (NUMBER, WHEN, WHO, WHERE, WHAT)
(   1,<2019-09-19 13:57:05.35 +0400>,<she>,<DPX200>,
      <created by zg, POWCHK disabled, PULCHK disabled
       configuration hash MD5:
       00 E9 B6 7A A2 85 ED C7 34 08 36 98 17 FE 4E 26
       data hash MD5: 16K
       42 1B EE 00 FB 17 58 78 35 68 2D F7 95 7A 63 CA>)
$$ ##END=
$$ 
$$ hash MD5
$$ C3 AC F0 82 5F 10 DF 99 8D E8 F7 DA 32 48 C7 17
##$RELAX= 
##$RELAX= 
##$RELAX= 
##$RELAX= 
##$RELAX= 
##$RELAX= 
$$ Bruker specific parameters
$$ --------------------------
##$DU= <F:/spectra>
##$EXPNO= 1
##$NAME= <H-F>
##$PROCNO= 1
##$TYPE= <nmr>
##$USER= <she>
##$AMP= (0..31)
100 100 100 100 100 100 100 100 100 100 100 100 100 100 100 100 100 100 
100 100 100 100 100 100 100 100 100 100 100 100 100 100 
##$AQSEQ= 0
##$AQ_mod= 1
##$AUNM= <au_zg>
##$AUTOPOS= <>
##$BF1= 200.13
##$BF2= 200.13
##$BF3= 200.13
##$BF4= 200.13
##$BF5= 200.13
##$BF6= 200.13
##$BF7= 200.13
##$BF8= 200.13
##$BYTORDA= 1
##$CFDGTYP= 0
##$CFRGTYP= 5
##$CHEMSTR= <none>
##$CNST= (0..31)
1 1 145 1 1 1 1 1 1 1 1 1 1 1 1 1 1 1 1 1 1 1 1 1 1 1 1 1 1 1 1 1 
##$CPDPRG= <>
##$CPDPRG1= <>
##$CPDPRG2= <>
##$CPDPRG3= <>
##$CPDPRG4= <mlev>
##$CPDPRG5= <mlev>
##$CPDPRG6= <mlev>
##$CPDPRG7= <mlev>
##$CPDPRG8= <mlev>
##$CPDPRGB= <>
##$CPDPRGT= <>
##$D= (0..31)
0 1.2 0 0 0 0 0 0 0 0.06 0 0.03 0 0 0 0 0.0002 0 0 0 0 0 0 0 0 0 0 0 0 
0 0 0 
##$DATE= 1568887024
##$DBL= (0..7)
120 120 120 120 120 120 120 120 
##$DBP= (0..7)
150 150 150 150 150 150 150 150 
##$DBP07= 0
##$DBPNAM0= <>
##$DBPNAM1= <>
##$DBPNAM2= <>
##$DBPNAM3= <>
##$DBPNAM4= <>
##$DBPNAM5= <>
##$DBPNAM6= <>
##$DBPNAM7= <>
##$DBPOAL= (0..7)
0.5 0.5 0.5 0.5 0.5 0.5 0.5 0.5 
##$DBPOFFS= (0..7)
0 0 0 0 0 0 0 0 
##$DE= 6
##$DECBNUC= <off>
##$DECIM= 24
##$DECNUC= <off>
##$DECSTAT= 4
##$DIGMOD= 1
##$DIGTYP= 9
##$DL= (0..7)
0 120 120 120 120 120 120 120 
##$DP= (0..7)
150 150 150 150 150 150 150 150 
##$DP07= 0
##$DPNAME0= <>
##$DPNAME1= <>
##$DPNAME2= <>
##$DPNAME3= <>
##$DPNAME4= <>
##$DPNAME5= <>
##$DPNAME6= <>
##$DPNAME7= <>
##$DPOAL= (0..7)
0.5 0.5 0.5 0.5 0.5 0.5 0.5 0.5 
##$DPOFFS= (0..7)
0 0 0 0 0 0 0 0 
##$DQDMODE= 0
##$DR= 18
##$DS= 0
##$DSLIST= <SSSSSSSSSSSSSSS>
$$ [...]
##$SUBNAM2= <"">
##$SUBNAM3= <"">
##$SUBNAM4= <"">
##$SUBNAM5= <"">
##$SUBNAM6= <"">
##$SUBNAM7= <"">
##$SUBNAM8= <"">
##$SUBNAM9= <"">
##$SW= 24.0689530833862
##$SWIBOX= (0..15)
0 0 2 0 0 0 0 0 0 0 0 0 0 0 0 0 
##$SW_h= 4816.95568400771
##$TD= 16384
##$TD0= 1
##$TE= 0
##$TE2= 300
##$TE3= 300
##$TEG= 300
##$TL= (0..7)
0 120 120 120 120 120 120 120 
##$TP= (0..7)
150 150 150 150 150 150 150 150 
##$TP07= 0
##$TPNAME0= <>
##$TPNAME1= <>
##$TPNAME2= <>
##$TPNAME3= <>
##$TPNAME4= <>
##$TPNAME5= <>
##$TPNAME6= <>
##$TPNAME7= <>
##$TPOAL= (0..7)
0.5 0.5 0.5 0.5 0.5 0.5 0.5 0.5 
##$TPOFFS= (0..7)
0 0 0 0 0 0 0 0 
##$TUNHIN= 0
##$TUNHOUT= 0
##$TUNXOUT= 0
##$USERA1= <user>
##$USERA2= <user>
##$USERA3= <user>
##$USERA4= <user>
##$USERA5= <user>
##$V9= 5
##$VALIST= <valist>
##$VCLIST= <CCCCCCCCCCCCCCC>
##$VD= 0
##$VDLIST= <DDDDDDDDDDDDDDD>
##$VPLIST= <PPPPPPPPPPPPPPP>
##$VTLIST= <TTTTTTTTTTTTTTT>
##$WBST= 1024
##$WBSW= 4
##$XGAIN= (0..3)
0 0 0 0 
##$XL= 0
##$YL= 0
##$YMAX_a= 99075
##$YMIN_a= -78625
##$ZGOPTNS= <>
##$ZL1= 120
##$ZL2= 120
##$ZL3= 120
##$ZL4= 120
##$ABSF1= 10
##$ABSF2= 0
##$ABSG= 5
##$ABSL= 3
##$ALPHA= 0
##$AQORDER= 0
##$ASSFAC= 0
##$ASSFACI= 0
##$ASSFACX= 0
##$ASSWID= 0
##$AUNMP= <proc_1d>
##$AZFE= 0.1
##$AZFW= 0.1
##$BCFW= 1
##$BC_mod= 2
##$BYTORDP= 1
##$COROFFS= 0
##$CY= 11.3945322036743
##$DATMOD= 1
##$DC= 2
##$DFILT= <>
##$DTYPP= 0
##$F1P= 20.1720416913024
##$F2P= 0.152960286110954
##$FCOR= 0.5
##$FTSIZE= 0
##$FT_mod= 4
##$GAMMA= 1
##$GB= 0.15
##$INTBC= 1
##$INTSCL= 1
##$ISEN= 128
##$LB= 0.24
##$LEV0= 0
##$LPBIN= 0
##$MAXI= 10000
##$MC2= 0
##$MEAN= 0
##$ME_mod= 0
##$MI= 1.114404
##$NCOEF= 0
##$NC_proc= 0
##$NLEV= 6
##$NOISF1= 3.799351
##$NOISF2= 2.8
##$NSP= 1
##$NTH_PI= 0
##$NZP= 0
##$OFFSET= 15.70392
##$PC= 1
##$PHC0= -9734.692
##$PHC1= 19.40096
##$PH_mod= 1
##$PKNL= yes
##$PPARMOD= 0
##$PSCAL= 0
##$PSIGN= 0
##$REVERSE= no
##$SF= 200.130013532006
##$SI= 16384
##$SIGF1= 3
##$SIGF2= 2
##$SINO= 400
##$SIOLD= 16384
##$SREGLST= <1H.CDCl3>
##$SSB= 0
##$STSI= 0
##$STSR= 0
##$SW_p= 3612.71676300578
##$SYMM= 0
##$S_DEV= 0
##$TDeff= 0
##$TDoff= 0
##$TI= <>
##$TILT= no
##$TM1= 0
##$TM2= 0
##$TOPLEV= 0
##$USERP1= <user>
##$USERP2= <user>
##$USERP3= <user>
##$USERP4= <user>
##$USERP5= <user>
##$WDW= 1
##$XDIM= 8192
##$YMAX_p= 0
##$YMIN_p= 0
$$ End of Bruker specific parameters
$$ ---------------------------------
##NTUPLES= NMR FID
##VAR_NAME=  TIME,          FID/REAL,        FID/IMAG
##SYMBOL=    X,             R,               I
##VAR_TYPE=  INDEPENDENT,   DEPENDENT,       DEPENDENT
##VAR_FORM=  AFFN,          ASDF,            ASDF
##VAR_DIM=   8192,          8192,            8192
##UNITS=     SECONDS,       ARBITRARY UNITS, ARBITRARY UNITS
##FACTOR=    0.0002076,     1,               1
##FIRST=     0,             0,               0
##LAST=      1.7004516,     0,               0
##MIN=       0,             -78625,          0
##MAX=       1.7004516,     99075,           0
$$ Real data points
##PAGE= N=1
##DATA TABLE= (X++(R..R)), XYDATA
0 0 0 0 0 0 0 0 0 0 -7 8 -8 8 -8 15 -16 17 -24 25 -32 39 -43 50 -58 67 -79 90 -104 115 -130 148 -169 187
32 187 -210 236 -263 293 -326 363 -401 446 -495 546 -604 670 -743 823 -915 1019 -1140 1280
50 1280 -1442 1642 -1882 2189 -2587 3133 -3932 5212 -7601 13607 -60662 -73974 61457 34009
64 34009 -43911 -78625 -25816 18428 6156 -51885 -43948 11688 25014 -9392 -14069 -15144 -24598
77 -24598 -5551 33114 29342 -2128 -24067 -11863 28854 40746 -11889 -32792 29959 66092
89 66092 7670 -44961 -19610 39408 58409 12187 -40396 -14172 45252 32798 -17963 -15808
101 -15808 14364 20763 15071 5270 -7319 -3779 6000 10134 24260 21682 -19615 -28732 26711 51636
115 51636 4482 -33337 -13001 30760 45396 4829 -39027 -10229 42796 25475 -21701 -16508
127 -16508 12654 16829 4570 -11405 -16106 748 7354 -5916 -2826 1991 -20202 -23154 8723
140 8723 9335 -24308 -26487 2140 15409 -1996 -36379 -40470 11403 42380 -4949 -48226 -20021
153 -20021 18980 16129 -6978 -22250 -9635 21970 20366 -13930 -19308 3053 9405 11299 16016
166 16016 -582 -15755 -804 12701 8469 5412 -945 -5962 9061 13202 -12703 -16651 11692
179 11692 17269 -2278 -10969 -9085 -921 9438 -2183 -18431 -830 17355 -1910 -18942 -9011
192 -9011 -96 4371 8327 -3683 -12981 -683 2598 -6460 2577 9802 -5317 -7848 6949 5103
206 5103 -3831 -1778 -1429 2964 13892 3604 -14269 -3251 10596 1740 312 8201 -306 -6891
220 -6891 1217 1907 483 7234 1314 -7190 4214 7325 -8293 -5176 9851 4084 -2925 2674 269
235 269 -3165 2606 -836 -3478 11244 11379 -9644 -11134 3721 5578 5433 5989 -5306 -6980 7737
250 7737 5116 -7693 -1524 5669 1273 4130 2807 -11040 -7762 8377 5312 -2522 1711 -1714
264 -1714 -6650 1427 586 -7131 3287 10845 -3246 -9704 -2243 -1033 2781 8198 -3851 -10785 5679
279 5679 9692 -6445 -8579 585 3510 8243 5364 -10903 -9505 8557 6529 -3740 978 1035 -4480
294 -4480 3042 5475 -5422 -3639 4566 -402 -817 4543 -3175 -5926 5152 1411 -8953 577 7447
309 7447 -2357 -4084 -9 -4301 -1294 4479 -4387 -5949 7105 3827 -9087 -5014 -154 -3273 3348
324 3348 6561 -4323 -5079 1071 -5711 -5549 7603 6139 -3532 -661 -1534 -7495 502 5961 -1622
339 -1622 1211 8261 -1539 -8243 -1145 -503 801 11263 7257 -6712 -4794 -160 -3483 3681 10799
354 10799 1007 -2936 3711 -2026 -7802 2063 6526 2847 5636 1201 -9322 -3109 5474 -1669 -631
369 -631 10143 3925 -7153 -4272 -2305 -1455 7816 6066 -5019 -1182 3516 -5690 -4743 5819 2388
384 2388 -1351 4345 -370 -7453 -155 2904 -2336 2850 5509 -3933 -3215 3234 -3339 -4150 6842
399 6842 4409 -3914 -311 394 -3275 3215 4254 -5380 -988 8638 1536 -4398 704 -655 -870 7153
415 7153 3520 -5633 1079 6160 -1930 -2000 2949 -999 1008 7068 -1155 -6774 1862 2065 -4355 1126
431 1126 3467 -3869 -1571 1490 -6721 -6100 2568 -35 -3315 632 -4608 -9967 -431 1878 -6891
446 -6891 -3296 3152 -3610 -5688 -1529 -5093 -3341 5310 945 -5617 800 695 -6211 536 6861
461 6861 212 -123 4533 -897 -1934 5446 2401 -745 7195 5759 -2978 1318 4747 -1149 2219
476 2219 8152 757 -1990 3897 177 -2817 4323 2972 -3034 2344 3345 -5261 -2352 4113 -982
491 -982 -1222 3819 -1664 -4680 3050 1489 -4316 1613 3881 -2147 347 2804 -3904 -1406 6461 926
507 926 -3507 2882 1346 -3264 1996 2190 -3642 1011 3677 -4105 -3323 2405 -2864 -4186 3049 -541
523 -541 -6644 -868 53 -5368 -1536 1042 -4768 -2062 2301 -4373 -4818 3491 680 -3554 2849 2520
539 2520 -3241 1729 4864 -679 2273 6897 1057 1149 7020 2335 -391 7531 6560 -140 3975 5212
555 5212 -816 2299 6064 -310 -203 4776 -513 -3772 2010 -490 -5234 1063 1599 -6310 -4395 -693
571 -693 -5615 -4301 285 -5052 -6111 458 -3038 -8450 -2158 -43 -4751 -899 1321 -5519 -3873
586 -3873 2056 -1711 -2657 3387 391 -2941 2874 1190 -4842 1084 5574 -78 342 2844 -2989 -2135
602 -2135 5025 1102 -3303 2678 2432 -2935 172 475 -4371 1426 6435 -1769 -4225 1708 -214 -1841
618 -1841 3885 1818 -2386 3276 4050 -2545 220 4362 623 3212 7624 35 -3439 5021 5734 798
634 798 3393 2993 -322 4554 5062 -3717 -1338 6703 2440 -2099 1027 -1178 -3070 2728 1274 -5471
650 -5471 -1651 1621 -3807 -2162 678 -5293 -4920 2582 -656 -6146 -1577 -247 -3122 403 -328 -6240
666 -6240 -1058 5324 -763 -3540 1453 -347 -1574 3734 1697 -2718 2909 4342 -2183 -566 3157
681 3157 -690 1097 6023 388 -3652 1495 878 -1512 3763 2781 -3995 -417 3420 -3069 -3601 2247
697 2247 773 -250 2094 -3391 -6557 1590 3225 -2920 -536 1711 -3699 -2351 1916 -2387 -2352 3813
713 3813 980 -3417 -107 -1685 -4535 2933 5385 -3283 -3789 1606 -915 -1736 1310 -1669 -1740 4237
729 4237 226 -7133 -1736 3363 -652 71 1215 -3947 -2447 3308 -687 -3195 2547 1463 -2512
744 -2512 1219 876 -3971 1129 5853 -51 -2141 1773 -423 62 5147 1529 -2583 3298 4057 -1889
760 -1889 203 3643 669 2296 4595 -1775 -2281 4841 2936 -1452 2877 2852 -1863 1280 2998 -1496
776 -1496 768 4418 -649 -1665 3115 -168 -2916 3137 3084 -2456 -61 1316 -2672 52 3253 -1848
792 -1848 -1731 3114 -1036 -4007 1579 1018 -3178 1154 1968 -3553 -1873 1190 -2446 -984 3033 -2283
808 -2283 -4320 1578 442 -4195 -302 1007 -2642 -129 901 -4586 -2667 2810 -915 -2874 1366
823 1366 -1210 -3990 1172 819 -4008 -463 2443 -2442 -1985 1103 -2454 -1936 3273 -15 -3556 1086
839 1086 811 -3244 599 2631 -2070 -516 2708 -1623 -1958 2554 -104 -1762 3526 1769 -3466 70
855 70 2281 -1225 1428 3586 -1746 -1489 3483 229 -2031 2738 1880 -1152 2690 1692 -3673 59
871 59 4564 815 169 2171 -2218 -1657 4796 1996 -3301 1131 3155 -599 215 307 -2966 1709 6386
888 6386 -751 -4769 645 1395 -185 2712 488 -3583 1013 3006 -2382 -1597 2271 -457 339 3559
904 3559 -2357 -5886 1733 4796 372 -560 -1693 -3688 1834 4459 -2832 -3167 3936 2152 -2719 -1306
920 -1306 -1534 -1180 4867 3886 -3760 -3219 420 -1223 1306 4503 -1403 -3746 2188 1411 -3462 -887
936 -887 1224 799 4047 1626 -7380 -5009 4567 3922 -1 -25 -2806 -3122 2342 572 -4493 421 4534
953 4534 -475 -2584 -1911 -5054 -1328 6210 2578 -4302 -3062 -2235 -2382 2686 1788 -4702 -1267 4226
969 4226 -1376 -5859 -2302 -87 2426 4984 -1970 -8299 -1373 3819 -117 -469 719 -2470 -1004
984 -1004 2797 -2025 -3998 1993 2948 126 983 -1826 -5420 1772 7114 312 -3549 -509 -15 1350
1000 1350 3813 -1038 -3318 3803 4556 -1963 -1579 1628 979 3362 4551 -2495 -3745 3313 3865 1299
1016 1299 2766 389 -2618 2689 4671 -1116 -308 4270 2246 868 1618 -2400 -1583 6433 5653 -1585
1032 -1585 -1281 529 -883 2419 3976 -965 -400 3811 -418 -3689 617 1248 21 3560 1716 -5086
1048 -5086 -3267 1231 -370 656 2554 -2559 -4031 693 -1156 -4703 -120 1655 -1720 -1048 -1834
1063 -1834 -6178 -3177 2408 -563 -2547 -336 -3582 -5560 -235 568 -3497 -1227 488 -3355 -2737
1078 -2737 -804 -4054 -2289 3355 125 -4534 -1824 -1298 -2787 1055 1538 -3102 -1325 1749 -2410
1093 -2410 -2534 1673 -177 -1084 2637 623 -3602 129 2409 -273 1579 2997 -1520 -310 4044
1108 4044 903 -1022 3493 3207 611 3154 2519 -874 2810 5572 1397 1731 4565 972 473 5202
1124 5202 3620 311 2981 3081 567 3390 3272 -1823 685 5632 1787 -1358 975 -163 -548 3483
1140 3483 1077 -3445 -109 1793 -2065 -1235 700 -2873 -1908 2431 -1089 -4988 -1552 -451 -1718
1155 -1718 672 -1114 -5451 -1452 2322 -2803 -4451 -95 -615 -1636 -53 -3191 -5129 890 1906
1170 1906 -3423 -2934 -561 -2856 -1273 1488 -2817 -4125 618 -1 -2468 -243 -974 -4041 556 2807
1186 2807 -2515 -2934 785 -252 100 2503 -1512 -3258 2186 2823 -838 1157 2161 -1221 706 3910
1202 3910 174 -177 3839 2290 461 2795 427 -2041 3799 5954 409 -523 1740 121 1039 3437
1218 3437 -143 -424 4608 2058 -3750 -1573 1399 889 3363 2923 -3782 -3706 1624 501 -965 1487
1234 1487 -77 -1726 1765 -220 -5682 -2024 3633 2015 544 -673 -5330 -3759 2875 1802 -1756
1249 -1756 826 401 -3071 -1271 -164 -2748 634 4177 -444 -3224 -874 -2370 -2425 2906 2263 -2109
1265 -2109 -488 -76 -3500 -1359 2018 -590 42 2878 -1225 -4123 -60 910 -246 2592 1560 -3116
1281 -3116 -741 2680 -579 -686 2247 154 215 3551 356 -3621 897 3667 1026 1300 782 -2363
1297 -2363 739 4969 455 -2700 1092 1718 632 2634 191 -3405 717 3429 -805 -983 1817
1312 1817 -269 -297 1839 -1785 -3388 1949 2550 -1349 -550 60 -2737 -807 1385 -1675 -1162 2770
1328 2770 -424 -3715 -1108 -1002 -1893 2254 2211 -3102 -2576 -207 -2284 -1124 2085 -724 -2158 1109
1344 1109 -848 -4097 -822 841 -1091 1549 2262 -3165 -3579 191 -238 435 3148 -285 -3534 438
1360 438 1370 -1870 239 2136 -163 1079 2270 -2516 -2669 2872 2557 74 1821 685 -2122 1140
1376 1140 2339 -1255 646 3907 421 -1326 993 -484 -527 3655 2089 -2000 536 1858 -1072
1391 -1072 158 1664 -1094 156 3637 -241 -3230 511 1126 -541 1747 928 -2712 -197 2057
1406 2057 -1299 -1039 1921 -554 -1633 1640 265 -2383 285 712 -1619 889 1700 -2577 -1486 1971
1422 1971 -424 -1196 1590 -311 -2117 1320 975 -2250 227 1775 -1368 -281 1907 -1452 -1724 2289
1438 2289 410 -1787 1089 468 -1584 814 821 -2495 190 2988 -1136 -2356 934 75 -828 1734
1454 1734 -389 -2789 1026 1864 -2217 -1161 1130 -1007 -427 1814 -1471 -2746 991 392 -1712 917
1470 917 432 -2959 -368 1445 -2078 -1594 1398 -602 -1436 871 -1049 -2648 1018 854 -2156 234
1486 234 1769 -1850 -1455 1378 -538 -378 2490 189 -1637 1583 708 -1696 1391 3058 -237 465
1502 465 2300 -382 -365 2669 694 -8 3542 1877 -1702 704 1882 -493 1513 3381 -260 -691
1518 -691 1689 -638 -1310 2119 1084 -1187 1330 644 -3070 -1075 1446 -683 -234 1638 -1665 -2734
1534 -2734 642 -774 -2228 1373 1690 -1949 -768 112 -2630 -782 2387 -85 -801 1507 -541 -2279
1550 -2279 709 794 -1174 1705 2501 -1575 -1233 979 -1182 -488 2583 463 -1403 1288 -196 -2968
1566 -2968 94 1681 -865 288 1557 -1960 -2032 906 -795 -1103 2293 848 -2125 373 543 -2340
1582 -2340 -55 2689 608 243 1390 -1496 -1624 2265 1082 -1000 2248 2106 -1928 -886 623 -1149
1598 -1149 366 2448 -731 -1638 640 -1860 -3538 329 976 -1964 -905 -559 -3680 -2524 -209 -1974
1614 -1974 -1117 1424 -1754 -3995 -547 -292 -2585 204 1773 -694 -101 583 -1814 -315 3313 1345
1630 1345 -93 3203 2131 -975 1176 2849 1505 2973 3379 -77 1040 3766 754 -685 3199
1645 3199 2733 277 1611 953 -1388 770 2070 -934 90 2099 -1057 -2147 1120 -27 -2197
1660 -2197 632 1011 -1218 -68 11 -2441 -236 2156 -1182 -1509 2147 662 -2156 -218 325 -477
1676 -477 1849 1131 -2581 -533 1881 -1348 -1828 1259 234 -1338 303 -1006 -2935 -471 -139 -2473
1692 -2473 -356 828 -3103 -3386 5 -1213 -2087 372 -850 -2640 -331 -431 -2844 -193 1754 -1207
1708 -1207 -639 1812 -570 -1696 1402 1523 528 2436 904 -1438 1554 2966 -438 357 3085 1303
1724 1303 -297 1013 -173 -328 2824 1322 -2159 222 1801 -1131 -1071 413 -1164 -431 1661 -1369
1740 -1369 -3372 -12 306 -1199 576 163 -2920 -652 1732 -1076 -1387 1152 65 -387 1527 -539
1756 -539 -2047 1841 2625 -663 140 1760 -158 139 1853 -107 66 2914 806 -1898 840 1690
1772 1690 -445 935 1809 -916 -179 1569 -1245 -1163 2121 926 -1097 857 73 -1913 311 1510
1788 1510 -813 332 1881 -1072 -1687 905 133 -375 1979 584 -1944 169 1173 -1229 -130 1414
1804 1414 -323 -45 1365 -1684 -2443 1583 1583 -973 -75 -152 -1858 71 878 -2023 -1070 1874 -326
1821 -326 -2257 -406 -653 -1218 998 -133 -2713 -343 1377 -1621 -1595 650 -643 -694 1165 -969 -2399
1838 -2399 938 1120 -1841 -631 498 -1029 196 1453 -1542 -1621 1508 198 -1438 735 768 -857
1854 -857 788 195 -2478 -137 2723 241 -957 678 -488 -954 1274 190 -958 2200 2286 -1796
1870 -1796 -1511 860 414 1412 2674 -321 -1319 1451 470 -1303 1546 2697 465 927 630 -2021 -278
1887 -278 3019 1309 245 1873 151 -1515 626 769 -298 2266 2885 -1241 -1738 423 -3 384
1903 384 2473 286 -1005 1075 -349 -2690 54 2450 478 -115 -200 -2376 -1245 1724 -309 -1657
1919 -1657 976 518 -2163 -1080 -797 -1734 748 1770 -1941 -2428 224 -649 -1295 323 -590 -1717 728
1936 728 148 -2864 -1037 1409 -268 -767 37 -1723 -842 2117 54 -2347 270 1231 -713 104 626
1953 626 -776 730 2046 -921 -1385 1756 1353 -414 943 216 -1117 979 1546 -883 273 2233
1969 2233 -82 -1082 550 -215 -139 2268 467 -2214 -3 1145 -1132 -598 829 -494 59 1040
1985 1040 -2154 -2758 1022 1332 -1186 -566 -409 -1857 -392 300 -2035 -611 2076 -353 -2333 -486
2001 -486 -474 -579 1584 700 -1993 -31 1483 -874 -651 1144 351 699 2205 -394 -1846 1577 2421
2018 2421 172 914 1303 -404 932 1989 -330 202 3037 1408 -900 1014 1164 -11 1444 1342
2034 1342 -683 889 2010 -910 -1121 1546 939 -224 944 -453 -1528 990 1294 -1313 -488 1240
2050 1240 -594 -644 321 -1524 -991 1626 298 -2328 -594 248 -1161 -260 -142 -2121 -252 1463 -1818
2067 -1818 -3240 -387 326 -713 -440 -1746 -2972 4 650 -2610 -2252 23 -651 -1127 -440 -2256 -2280
2084 -2280 1212 744 -1814 -707 -7 -1149 168 1335 -687 -110 2074 310 -1011 1283 1407 459
2100 459 2048 1486 -454 1237 2372 87 492 2805 1371 -21 1260 530 -160 1984 1436 -978
2116 -978 358 1573 -900 -838 1028 -36 -175 831 -1185 -2144 1083 1179 -1183 -735 3 -981 156
2133 156 981 -1623 -1090 2159 1247 -1123 -407 -39 149 2351 1713 -1834 -734 2068 902 -19 878
2150 878 -18 158 1813 -64 -2107 478 2105 -15 -350 -249 -1957 -660 1426 -454 -1642 418
2166 418 -188 -1940 -768 -532 -1365 602 1367 -1951 -2057 113 -558 -503 1351 142 -1255 411 95
2183 95 -1563 750 1947 -378 -212 1064 -570 -994 770 251 -37 1778 201 -2932 -928 1170
2199 1170 -110 -101 46 -1963 -1324 908 -957 -2209 306 537 -1060 -527 -1091 -2414 245 2235 -455
2216 -455 -1512 250 3 46 1477 114 -734 2111 2318 -904 -464 1488 1406 1962 1832 -676 -644 2479
2234 2479 1773 -270 1119 1370 -124 779 775 -1111 97 1962 -14 -1013 353 -874 -1349 790 631
2251 631 -1492 -480 2 -1672 -700 742 -916 -1082 666 -888 -1649 537 152 -1299 525 1066 -1239
2268 -1239 -900 334 -556 206 1671 -783 -1870 937 845 -1042 85 418 -551 863 687 -2005 -1133
2285 -1133 1696 646 -846 -18 -660 -958 1225 757 -1478 -153 1369 -310 -424 475 -705 -93 2151
2302 2151 505 -1476 529 1163 123 1064 1033 -831 525 1980 -202 -705 1365 757 -55 1172 381
2319 381 -1127 832 1429 -576 -4 1040 -802 -574 1105 -170 -921 516 37 -1283 245 357 -1778
2336 -1778 -481 997 -735 -1028 166 -1166 -969 1077 -269 -2156 -197 383 -1017 -315 -16 -1590
2352 -1590 -291 1338 -989 -1837 195 86 -690 494 -446 -1911 285 1092 -1095 -1007 434 -564 -34
2369 -34 1053 -822 -1560 1129 1296 -965 -346 396 -587 760 1211 -1031 -666 1816 691 -845 670
2386 670 377 -322 1317 1370 -856 149 1407 -90 236 1677 11 -590 1467 945 -688 831 1253
2403 1253 -116 1013 1246 -819 -188 1769 300 -394 1352 537 -794 755 781 -589 679 1102 -654
2420 -654 124 1248 -722 -938 1257 694 -879 50 -169 -933 552 485 -1520 -366 1149 -865 -1619
2437 -1619 12 -518 -921 567 -299 -2010 -473 82 -1429 -472 471 -1414 -1250 509 -822 -1705 75
2454 75 -149 -1073 276 -252 -1835 -318 1014 -1013 -917 762 -285 -960 418 -381 -933 966 661 -1162
2472 -1162 255 1139 -805 -368 1160 -87 -367 1185 211 -708 1062 781 -891 632 1338 -354 103
2489 103 1382 -346 -305 1430 333 -453 1193 654 -757 608 885 -894 213 1667 -241 -501 784
2506 784 -288 -688 1232 488 -1010 693 695 -1104 -92 798 -519 -103 1300 -374 -1213 690 51
2523 51 -886 778 619 -1120 173 824 -1117 -608 1224 -111 -525 864 -248 -1259 608 520 -795
2540 -795 586 1070 -975 -425 1000 -425 -496 1210 226 -610 786 124 -1170 604 1195 -847 -115
2557 -115 1228 -504 -692 775 -275 -364 1318 195 -1212 515 629 -1074 -89 1059 -468 -558 711
2574 711 -715 -993 511 -155 -1072 708 360 -1784 -589 634 -1038 -826 523 -769 -838 259 -836
2591 -836 -1662 519 429 -1452 -454 411 -1115 -786 631 -494 -583 1029 -434 -1180 612 181 -1109 513
2609 513 1139 -637 -308 711 -393 -133 1231 -176 -641 1576 753 -1055 323 1161 -105 579 1061
2626 1061 -587 -180 1371 -93 -575 1355 596 -679 744 875 -767 173 1266 -89 100 948 -531
2643 -531 -494 1548 376 -1054 821 1034 -497 218 704 -665 520 1629 -468 -785 1140 317 -667
2660 -667 808 479 -878 548 868 -961 -364 763 -667 -455 1039 -555 -1478 511 493 -971 0
2677 0 128 -1238 -9 757 -1287 -1032 882 -212 -1024 399 -300 -1202 340 629 -1001 3 668 -1055
2695 -1055 -548 979 -578 -889 930 96 -1112 304 196 -1025 468 787 -1218 -569 866 -614
2711 -614 -801 473 -315 -1059 618 119 -1531 -139 405 -958 -222 854 -935 -911 1101 -75 -989
2728 -989 635 253 -698 823 867 -1080 -179 1147 -236 -21 1175 17 -483 1092 452 -841 768
2745 768 1153 -366 629 1059 -801 -391 1226 230 -362 1305 308 -1043 555 618 -796 579 1435 -457
2763 -457 -286 715 -593 -532 1474 567 -674 578 237 -1150 320 935 -466 236 1273 -548 -955
2780 -955 577 -155 -262 1431 748 -1179 -230 367 -694 133 1167 -527 -414 798 -674 -1353 647
2797 647 617 -398 672 278 -1764 -465 856 -389 -320 927 -471 -1087 597 -308 -1314 692 853
2814 853 -709 -279 0 -1329 -337 1262 -460 -912 693 -133 -1047 341 7 -1166 339 1003 -1100
2831 -1100 -706 539 -602 -405 936 -396 -1175 668 533 -982 2 264 -1018 90 1121 -754
2847 -754 -705 856 -162 -910 490 25 -847 809 853 -1184 -480 646 -399 165 1380 -339 -951 846
2865 846 174 -1027 598 960 -321 574 808 -1184 -615 1340 467 47 1103 -213 -1189 612 842
2882 842 -603 645 1207 -432 -196 544 -834 -378 1862 823 -588 439 -11 -852 647 1130 -564
2899 -564 185 1207 -640 -822 678 -38 -277 1531 433 -1404 -29 607 -521 348 988 -615 -480
2916 -480 1027 -427 -1221 665 500 -521 494 144 -1407 -61 1104 -521 -471 620 -571 -871 760
2933 760 -182 -1168 404 477 -1023 -151 318 -1131 -338 1027 -506 -950 545 -280 -956 421 162 -1300
2951 -1300 95 730 -938 -482 500 -733 -541 920 -390 -1036 534 174 -1013 217 447 -995 7
2968 7 887 -574 -707 720 -92 -382 899 -239 -1282 574 915 -742 -105 678 -563 16 933 -419
2986 -419 -694 1134 394 -737 624 534 -754 505 1046 -616 -250 1099 -224 -516 900 31 -562
3003 -562 946 482 -1082 197 880 -519 0 1001 -425 -338 1101 -114 -819 781 555 -857 324
3020 324 633 -628 113 921 -595 -348 1003 -178 -757 876 379 -857 322 437 -799 393 1138
3037 1138 -646 -442 955 -189 -546 817 346 -741 581 465 -1248 -150 865 -246 37 745
3053 745 -749 -1070 767 102 -758 737 512 -941 -264 132 -1019 163 1410 -463 -962 153 -501
3070 -501 -1063 569 404 -924 408 213 -1550 -675 728 -348 -114 764 -699 -1381 140 -107 -861
3087 -861 537 791 -1000 -500 82 -1117 -213 1199 -77 -815 488 -83 -1145 263 672 -351 561
3104 561 644 -1167 -692 1073 -55 -233 874 177 -746 535 315 -925 425 1268 -267 -244 649 -474
3122 -474 -237 1232 238 -777 788 642 -533 354 747 -596 374 1224 -532 -316 1200 414 -546 712
3140 712 229 -595 827 945 -605 244 1157 -598 -497 887 124 -261 915 -79 -1114 392 767 -616
3158 -616 246 614 -804 -514 502 -684 -681 973 383 -954 4 -152 -1136 398 946 -639 -239 699
3176 699 -767 -1096 354 241 -200 774 51 -1294 -75 708 -608 100 1156 -381 -675 441 -427
3193 -427 -815 748 434 -788 318 138 -1218 -341 798 -288 -372 679 -646 -1078 511 215 -667
3210 -667 410 276 -1077 -40 665 -743 -605 852 -47 -421 416 -409 -832 1115 766 -980 -9 1005
3228 1005 -302 -317 682 -232 26 1194 -57 -1068 541 709 -632 276 523 -807 92 985 -520
3245 -520 -739 590 137 -394 642 -125 -1216 625 1065 -758 -480 597 -162 71 875 -496 -810 1077
3263 1077 605 -763 293 698 -476 304 679 -445 -17 999 -208 -376 913 265 -705 594 606
3280 606 -640 5 565 -652 -131 679 -604 -614 641 55 -961 210 283 -785 133 349 -867 -212
3298 -212 682 -469 -457 641 -462 -800 819 696 -772 -35 460 -217 453 726 -888 -445 1276 276
3316 276 -733 350 200 -423 627 287 -1048 68 996 -461 -434 693 -426 -783 632 -69 -818
3333 -818 329 372 -998 -385 317 -722 -218 729 -614 -1039 517 4 -761 141 26 -618 424 403 -1214
3352 -1214 -378 869 -249 -420 581 -266 -956 337 91 -660 539 648 -1016 -537 723 -389 -447
3369 -447 879 -63 -486 652 10 -932 352 839 -416 161 616 -735 -458 1096 100 -328 781 182
3387 182 -603 507 488 -674 345 1166 -327 -303 823 -49 -229 906 249 -187 985 479 -796 21
3405 21 854 -182 108 1026 -391 -382 924 161 -583 681 561 -673 408 698 -702 -118 812 -247
3423 -247 -228 842 -67 -750 593 206 -795 373 320 -980 -138 705 -681 -495 378 -347 -545 611
3441 611 -144 -1302 103 450 -766 -154 290 -742 -392 497 -806 -1054 559 80 -795 -16 -140 -953
3459 -953 -40 411 -880 -398 613 -499 -882 153 -315 -757 667 234 -1041 -56 496 -669 -153 540
3477 540 -614 -420 763 -155 -1053 364 212 -479 503 502 -830 -48 774 -236 -99 909 46 -360 808
3496 808 360 -545 655 834 -359 499 982 -334 44 1003 212 -71 953 395 -448 664 727 -398
3514 -398 395 955 -297 -36 757 -270 -404 863 141 -643 553 434 -644 115 446 -765 -188 794
3532 794 -408 -704 600 -242 -577 523 35 -962 251 507 -683 -151 471 -604 -367 565 -264 -732
3550 -732 456 17 -823 422 529 -776 -33 581 -557 -394 735 -281 -583 432 -45 -736 320
3567 320 250 -737 19 525 -700 -445 547 -426 -604 530 59 -745 360 182 -885 86 512 -674 -171
3586 -171 671 -436 -466 658 -70 -603 428 57 -769 299 414 -647 -95 670 -484 -415 665 -186
3604 -186 -647 637 229 -760 194 373 -697 -57 698 -638 -212 646 -289 -566 587 10 -588 400 472
3623 472 -628 58 710 -375 -169 702 -175 -397 699 192 -501 593 432 -372 379 790 -360 105
3641 105 950 -59 -165 885 57 -463 723 617 -308 511 634 -346 137 802 -236 -245 945 155 -446
3660 -446 449 297 -468 524 518 -700 -165 642 -406 -302 485 -336 -581 541 -165 -1017 120 385 -789
3679 -789 -196 265 -769 -430 635 -459 -766 374 -91 -768 311 0 -827 65 516 -765 -493 570
3697 570 -290 -391 634 -95 -801 221 228 -718 192 455 -792 -262 413 -496 -503 405 -148 -501 466 -6
3717 -6 -1085 76 470 -552 -41 283 -625 -466 643 -136 -647 589 342 -441 353 297 -650 368 1025
3736 1025 -247 -370 564 31 -93 737 115 -609 721 680 -658 -51 535 -152 258 675 -647 -589 748
3755 748 293 -518 278 152 -599 263 447 -799 -149 797 -190 -473 417 -168 -381 787 396 -700 278
3774 278 586 -437 169 819 -104 -61 924 -100 -391 588 433 -272 525 572 -632 -98 704 -287 -127 645
3794 645 -443 -598 570 114 -674 40 138 -617 112 298 -1098 -605 602 -117 -651 82 -319 -723 605
3813 605 275 -1013 -91 623 -361 -328 315 -478 -190 849 -29 -928 278 432 -310 201 163 -770 188 795
3833 795 -601 -680 449 46 -447 321 -260 -918 277 431 -688 -338 335 -555 -210 474 -399 -715 603
3852 603 37 -602 270 258 -792 259 740 -393 -363 510 -216 -264 704 151 -716 375 474 -398 235 669
3872 669 -572 -57 840 -148 -504 631 71 -311 576 70 -691 466 680 -522 -103 527 41 48 708
3891 708 -327 -510 769 587 -597 66 463 -111 502 698 -734 -366 898 308 -413 238 -51 -333
3909 -333 751 436 -804 -177 670 -183 -160 452 -461 -331 681 58 -779 396 408 -640 -42 423 -593
3928 -593 -218 650 -398 -409 574 -181 -706 183 157 -591 185 427 -757 -312 388 -586 -596 638 -111 -793
3948 -793 166 -203 -649 385 491 -846 -319 616 -230 -410 291 -423 -436 978 -1 -1096 -149 588 -117
3967 -117 145 282 -795 -263 806 -132 -700 410 369 -307 402 26 -902 170 837 -309 -301 403 -212
3986 -212 -328 587 -124 -658 642 313 -764 -151 565 -261 136 543 -458 -320 623 0 -470 530 332
4005 332 -578 302 593 -434 47 664 -148 -61 920 -136 -563 626 526 -191 515 346 -607 119 1019
4024 1019 -109 -253 489 -83 -71 879 36 -816 354 724 -480 -87 316 -518 255 767 -426 -784 604
4043 604 196 -479 284 226 -476 238 252 -790 -135 778 -22 -497 307 -390 -518 713 255 -815 111 472
4063 472 -505 -209 332 -615 -221 952 -180 -873 4 -188 -676 371 374 -842 -350 321 -727 -269 570
4082 570 -249 -769 265 120 -745 101 -14 -688 323 601 -767 -598 405 11 -239 660 -75 -756 413
4101 413 317 -690 88 742 -267 -88 419 -385 -241 894 180 -639 339 391 -332 264 297 -659 167 988
4121 988 -169 -615 428 106 -194 661 9 -782 377 765 -422 -110 520 -320 -124 729 -158 -521 537
4140 537 205 -457 354 252 -568 215 724 -253 -169 810 -215 -505 670 370 -465 376 252 -549 262 813
4160 813 -528 -156 631 -169 -382 413 18 -391 557 126 -691 292 510 -426 -269 456 -266 -69 602 -445
4180 -445 -702 570 348 -646 84 213 -553 26 680 -645 -543 347 -42 -527 243 -161 -808 488 248
4199 248 -741 -79 535 -482 -273 521 -331 -395 564 -113 -756 352 303 -651 -98 335 -588 -213 488 -487
4219 -487 -454 548 -80 -683 288 133 -665 170 386 -568 -117 586 -357 -306 551 -82 -361 563 96 -663
4239 -663 238 606 -442 92 706 -295 -150 604 -197 -412 803 491 -535 291 436 -270 310 738 -409
4258 -409 -209 869 -136 -474 540 233 -429 402 326 -618 79 493 -249 -92 622 -299 -356 483 -11 -582
4278 -582 570 381 -633 128 424 -448 64 711 -287 -352 738 6 -602 484 224 -352 363 399 -491
4297 -491 23 675 -451 -296 668 -75 -523 464 52 -620 316 263 -785 -101 493 -495 -410 386 -289 -511
4317 -511 454 -88 -780 160 196 -616 87 332 -579 -225 648 -203 -549 497 -90 -584 305 183 -718 189
4337 189 434 -831 -301 564 -195 -350 491 -240 -641 328 29 -607 297 439 -530 -313 389 -394 -351 619
4357 619 -146 -490 503 -46 -769 160 417 -409 123 585 -414 -273 491 -60 -213 629 182 -485 381 452
4377 452 -512 308 757 -266 -101 538 -141 -235 783 81 -437 563 391 -582 121 556 -264 166 615
4396 615 -236 -360 529 188 -392 499 339 -582 185 465 -476 17 594 -137 -184 532 -44 -373 543 264
4416 264 -605 239 359 -472 48 453 -363 -129 623 -263 -433 542 117 -727 252 240 -456 11 460 -555
4436 -555 -244 455 -354 -532 351 -30 -563 187 128 -643 97 339 -625 -204 524 -532 -497 495 -250 -669
4456 -669 303 173 -627 2 159 -624 -59 360 -486 -503 499 -166 -569 279 115 -503 237 346 -713 -69
4476 -69 564 -357 -331 693 -170 -522 518 201 -444 388 463 -571 144 662 -403 -193 729 -65 -308 577
4496 577 117 -407 582 444 -337 257 664 -431 -88 778 -106 -467 666 63 -422 403 158 -509 332
4515 332 660 -398 -14 536 -234 -343 549 -63 -426 542 267 -564 329 524 -453 71 682 -369 -250
4534 -250 635 -162 -344 371 205 -506 383 301 -477 -31 410 -382 -246 346 -216 -447 340 81 -646 341
4554 341 295 -575 -12 328 -582 -114 515 -344 -479 527 -303 -633 293 204 -515 87 382 -702 -31 445
4574 445 -408 -311 494 -126 -590 263 59 -653 124 311 -523 -98 440 -420 -361 414 -173 -536 363 45 -545
4595 -545 197 209 -632 -80 337 -340 -302 536 -185 -422 300 108 -416 253 314 -554 41 386 -410 -130 564
4616 564 -68 -386 478 -21 -478 513 309 -493 220 510 -337 14 579 -22 -90 508 47 -396 493 322
4636 322 -457 386 511 -345 44 472 -192 -171 636 -20 -272 620 218 -412 402 544 -430 122 464 -264
4656 -264 -149 568 -46 -338 511 103 -397 254 323 -354 135 547 -401 -119 456 -144 -343 310 16 -530
4676 -530 355 212 -605 25 508 -498 -174 411 -403 -532 325 -260 -529 261 6 -514 156 245 -546 -219
4696 -219 285 -368 -436 384 -132 -479 330 -13 -795 124 414 -445 64 354 -462 -240 490 -141 -493 488
4716 488 -4 -521 222 51 -542 30 357 -348 -218 325 -275 -383 341 -58 -565 213 257 -419 121 397
4736 397 -394 -105 613 -199 -291 432 -40 -412 508 267 -549 211 458 -226 -19 516 -173 -130 640 -105 -375
4757 -375 441 316 -418 191 341 -442 171 477 -282 -136 553 93 -327 506 18 -618 467 548 -357 59
4777 59 437 -292 74 544 -121 -392 521 208 -366 254 291 -417 291 516 -491 -144 521 -169 -261 423 -23
4798 -23 -535 335 169 -526 60 268 -430 -119 431 -378 -352 483 -33 -457 144 38 -482 114 282 -650 -148
4819 -148 447 -361 -372 252 -251 -543 349 76 -673 130 124 -483 69 287 -559 -291 463 -27 -487 167 -45
4840 -45 -388 227 170 -643 -8 443 -416 -214 205 -314 -358 528 -19 -465 314 277 -548 122 266 -512 -26
4861 -26 514 -190 -300 343 23 -351 376 80 -440 358 529 -305 -150 409 -100 21 500 -65 -433 331
4881 331 175 -312 352 361 -452 157 576 -199 -146 463 -75 -168 488 75 -456 507 503 -208 79 321 -306 17
4903 17 681 -152 -208 414 17 -333 337 157 -395 230 368 -394 -226 342 -93 -134 525 -125 -389 332 166
4924 166 -498 68 328 -372 10 514 -478 -310 441 82 -342 174 -33 -515 303 365 -621 -106 418 -249
4944 -249 -180 321 -307 -505 374 -60 -589 -21 91 -426 63 367 -455 -380 301 -195 -340 305 -113 -612 252
4965 252 169 -553 -7 240 -338 -82 248 -307 -479 360 56 -411 231 83 -270 118 192 -521 -19 469 -216
4986 -216 -274 282 -169 -89 580 118 -414 79 366 -167 186 290 -254 -18 649 -93 -424 297 217 -94 427
5007 427 253 -470 63 628 -75 -152 637 -144 -101 446 207 -343 396 345 -362 120 351 -385 -60 406 -70
5028 -70 -265 439 72 -356 414 220 -336 163 346 -472 -149 380 -215 -94 556 -84 -588 291 271 -254 119
5049 119 74 -380 7 588 -235 -380 293 78 -301 273 -89 -552 342 407 -491 -229 160 -260 -82 480 -328
5070 -328 -403 345 3 -405 -60 -37 -453 127 333 -466 -232 306 -126 -294 134 -61 -407 356 70 -599 3
5091 3 286 -313 -226 225 -236 -314 447 -39 -356 150 100 -469 226 389 -409 -177 424 -143 -74 257 -177 -294
5113 -294 334 202 -443 51 104 -191 177 489 -399 -191 579 90 -289 268 11 -310 461 353 -376 190
5133 190 405 -198 3 401 -209 -190 518 214 -377 308 425 -194 185 350 -352 145 683 -192 -208 307 54
5154 54 -235 319 140 -466 206 468 -232 -81 187 -271 36 503 -133 -421 328 217 -375 111 217 -389
5174 -389 86 386 -227 -206 384 -267 -428 386 -74 -567 95 298 -289 26 297 -451 -161 395 -158 -315
5194 -315 288 -184 -338 76 -17 -517 56 413 -386 -277 244 -311 -377 319 -165 -436 235 281 -380 -34 128
5215 128 -366 93 275 -375 -369 453 46 -343 277 53 -396 329 293 -386 -34 464 -197 -236 306 -131 -371
5236 -371 429 106 -395 124 171 -347 86 447 -256 -196 483 -32 -211 329 -21 -343 258 217 -282 15 322
5257 322 -260 -1 390 -206 -414 466 132 -247 427 199 -266 251 364 -359 -48 554 11 -107 402 -23
5277 -23 -258 435 256 -412 129 356 -285 204 207 -137 -105 570 37 -439 378 36 -303 381 165 -427 74
5298 74 354 -275 -182 389 -111 -277 473 -145 -477 210 204 -398 -37 211 -446 -119 266 -338 -403 408 -50 -422
5320 -422 226 24 -500 75 192 -478 -177 233 -424 -134 272 -252 -346 215 72 -396 158 109 -346 -147 310
5341 310 -285 -215 212 -244 -229 194 108 -504 72 342 -326 13 251 -181 -98 466 -226 -319 506 113 -329 229
5363 229 281 -333 150 416 -338 -73 397 -54 -241 325 39 -241 513 222 -322 193 439 -216 35 380
5383 380 -235 -89 500 54 -270 434 265 -316 276 329 -372 186 417 -208 -87 502 80 -169 330 238 -291
5404 -291 256 341 -343 1 333 -238 -109 482 -58 -186 369 43 -332 129 242 -403 25 274 -238 -77
5424 -77 322 -196 -285 354 -56 -385 174 167 -418 107 332 -369 -104 407 -251 -264 357 -117 -353 264 144 -412
5446 -412 149 270 -433 -132 260 -310 -195 374 -24 -378 290 54 -403 114 138 -342 -47 417 -345 -192
5466 -192 420 -79 -368 167 -20 -386 180 207 -374 63 264 -393 -53 323 -136 -340 246 -28 -362 179
5486 179 139 -476 22 282 -414 -119 351 -173 -160 352 -66 -401 311 76 -352 177 296 -288 -41 476 -276
5507 -276 -249 359 -81 -346 266 58 -406 237 415 -297 29 425 -131 -61 400 -86 -175 385 55 -346 272
5528 272 333 -268 162 373 -119 -62 536 -237 -222 443 113 -373 334 177 -432 109 328 -299 -101 381 -184
5549 -184 -220 314 -10 -226 369 233 -408 97 248 -314 53 341 -167 -192 391 -47 -294 251 115 -384 116
5570 116 317 -510 -29 342 -215 -288 300 -177 -322 237 -18 -336 124 88 -500 -150 250 -369 -235 185 -161
5591 -161 -362 227 -105 -426 241 127 -381 95 272 -370 -134 319 -190 -295 376 -42 -384 355 128 -382
5611 -382 196 242 -326 16 421 -202 -172 402 -73 -306 368 159 -249 170 338 -259 -7 375 -194 -137 405
5632 405 -8 -203 305 162 -192 248 279 -305 117 372 -167 -24 445 -124 -188 467 117 -186 279 307 -224
5653 -224 123 289 -228 72 369 -185 -279 364 55 -321 205 179 -334 50 256 -341 107 354 -192 -211 424
5674 424 -27 -339 283 94 -353 140 196 -300 -114 439 -191 -173 324 52 -309 308 94 -440 142 242 -230
5695 -230 63 223 -351 -231 396 -161 -319 240 -176 -426 109 193 -454 6 96 -401 -258 272 -222 -383 220
5716 220 -28 -315 63 20 -434 -18 252 -499 -162 246 -241 -299 272 92 -356 356 148 -258 284 306 -269
5737 -269 19 355 -60 -173 346 73 -250 248 195 -252 251 371 -296 -6 506 -104 -284 397 -9 -70 396
5758 396 139 -290 261 237 -322 217 381 -159 48 255 23 -177 426 179 -235 278 217 -222 114 333 -342
5779 -342 8 375 -238 -267 388 -28 -156 178 106 -247 196 272 -194 -45 316 -230 -101 321 -129 -412 282
5800 282 144 -345 117 192 -269 -95 210 -229 -164 257 -143 -389 276 105 -321 145 89 -443 6 322 -236
5821 -236 -274 158 -153 -294 300 -89 -470 60 186 -281 -10 205 -348 -220 297 -222 -268 134 -78 -444 209
5842 209 239 -381 29 224 -366 -176 384 -122 -240 234 -108 -312 337 51 -387 114 261 -274 68 228
5862 228 -353 -145 426 25 -281 408 63 -314 331 413 -297 45 324 -148 -10 398 -168 -311 501 182
5882 182 -292 130 133 -191 213 287 -75 -177 478 -167 -70 432 -21 -275 350 243 -239 228 231 -181 -49 343
5904 343 -101 -98 261 -153 -311 298 277 -202 113 178 -303 173 400 -276 -280 311 -21 -129 256 -4 -459 143
5926 143 290 -285 -12 254 -420 -37 325 -155 -354 206 -25 -240 151 226 -446 -23 208 -374 -184 296
5946 296 -258 -386 203 -110 -396 107 80 -388 11 199 -328 -187 296 -305 -348 367 -63 -351 68 -15 -342
5967 -342 161 278 -576 -101 258 -43 -34 236 -168 -247 303 195 -220 140 34 -128 124 360 -374 -221 324
5988 324 52 -195 307 82 -327 386 302 -262 97 304 -215 -14 501 16 -195 371 -15 -204 346 130
6008 130 -398 130 321 -120 15 300 -164 -111 319 212 -127 355 206 -347 109 337 -297 -68 230 -155
6028 -155 -55 439 -10 -265 149 191 -163 171 268 -304 -65 387 -158 -256 225 -178 -151 308 69 -425 53
6049 53 210 -293 25 240 -315 -145 220 -42 -244 50 60 -339 102 225 -310 79 187 -239 -29 341 -211
6070 -211 -262 261 -158 -267 314 192 -322 23 131 -241 -128 197 -296 -230 255 57 -350 243 -4 -342 171
6091 171 321 -279 -37 90 -180 -126 252 -263 -408 117 133 -306 63 74 -521 152 386 -225 -227 175 -92 -89
6113 -89 294 20 -348 187 194 -213 87 168 -220 -113 402 -78 -72 340 56 -283 128 144 -195 199 185 -370 -50
6136 -50 467 -4 -167 350 -119 -182 279 266 -316 81 223 -64 104 351 -248 -122 345 36 -162 250 27
6157 27 -273 286 306 -318 -27 324 -166 -84 239 -112 -187 208 118 -263 155 29 -285 78 280 -310 -329 184
6179 184 -149 -228 211 -110 -309 114 -7 -311 -30 296 -203 -166 178 -153 -75 321 -130 -398 157 153 -293 230
6201 230 53 -291 -6 288 -127 -211 168 -65 -184 242 -8 -374 86 231 -196 100 172 -196 -181 212 -82
6222 -82 -251 220 2 -419 147 106 -350 9 234 -167 -113 294 -121 -312 220 17 -261 209 112 -253 84
6243 84 356 -233 -100 305 -159 -205 363 109 -163 303 40 -140 180 345 -86 -35 303 9 7 318 -63 -281
6265 -281 308 219 -276 167 181 -136 174 257 -146 -11 441 54 -126 264 17 -395 154 155 -301 109 277 -240
6287 -240 -58 296 -16 -90 307 108 -253 96 -19 -278 43 178 -277 -40 237 -165 -152 170 -80 -215 285
6308 285 -10 -458 -32 129 -335 -108 114 -296 -181 267 -71 -462 78 1 -229 151 134 -165 -73 248 -284
6329 -284 -160 96 -154 -331 196 -55 -416 157 152 -209 -20 315 -327 -110 184 -122 -298 210 -148 -304 133
6350 133 3 -338 91 359 -308 -232 194 -131 -221 227 -15 -164 212 58 -119 132 297 -150 72 299 -95
6371 -95 -134 203 17 -160 165 11 -231 172 247 -249 -5 333 -109 -63 382 19 -120 309 190 -210 98
6392 98 198 -142 125 322 -258 -73 208 21 -44 254 85 -190 118 170 -245 84 282 -93 -66 248 -179
6413 -179 -96 167 -92 -227 71 98 -323 92 266 -170 -23 203 -213 -86 231 -9 -299 161 20 -270 51
6434 51 192 -98 -72 213 -376 -187 299 -62 -193 169 -118 -372 137 222 -196 16 257 -196 -114 182 -233
6455 -233 -184 264 30 -389 47 151 -300 -28 208 -174 -175 194 -71 -197 235 25 -257 98 180 -187 123
6476 123 168 -174 -19 231 -115 -140 294 74 -155 150 46 -209 47 181 -202 -17 291 -190 -229 225 20
6497 20 -130 311 74 -193 191 242 -266 19 130 -88 -81 317 19 -112 148 99 -143 227 199 -243 73 277
6519 277 -123 -155 257 -53 -123 217 20 -147 143 166 -182 117 135 -172 -20 374 -62 -103 274 -116 -237 197
6541 197 111 -194 187 239 -191 112 337 -176 -121 217 57 -308 317 69 -275 235 312 -119 -34 226 -157 -115
6563 -115 295 -73 -290 178 1 -367 47 -32 -312 25 126 -177 -106 137 -163 -284 166 -32 -261 136 103
6584 103 -302 -188 112 -255 -40 278 -235 -213 35 -18 -321 127 122 -237 45 92 -240 -204 100 -86 -119 286
6606 286 -33 -364 184 4 -155 22 194 -159 31 250 -108 -217 122 -90 -92 171 14 -217 156 214 -271
6627 -271 -61 91 -110 -85 377 -23 -21 254 -65 -105 169 104 -78 47 214 -204 -22 357 -49 -89 245 111
6649 111 -71 293 230 -192 133 191 -260 -6 374 -52 -72 237 -17 -217 260 61 -192 167 201 -161 41
6670 41 187 -232 -119 261 -1 -228 216 9 -227 129 173 -245 25 52 -248 -8 161 -123 -241 338 30
6691 30 -301 75 209 -216 -48 127 -361 -145 113 -201 -273 117 -58 -236 76 -1 -353 42 141 -268 -70
6712 -70 148 -160 -163 252 -78 -136 11 -20 -214 160 125 -230 -44 140 -126 -153 168 -159 -201 125 69 -216 158
6735 158 239 -215 83 210 -75 -81 173 -99 -92 275 -61 -127 211 288 -316 159 285 -192 13 262 -65 -66 313
6758 313 -43 -219 211 47 -183 60 157 -67 -30 362 -77 -43 325 -65 -157 173 191 -200 166 233 -312 6
6780 6 230 -106 -93 300 63 -76 269 46 -176 204 171 -115 -27 297 -179 -147 127 -88 -208 206 88 -275
6802 -275 150 81 -225 6 146 -217 -158 114 -112 -225 120 -42 -168 33 170 -287 -65 236 -215 -149 233
6823 233 -177 -243 186 -102 -434 189 6 -333 44 114 -246 -175 201 -155 -153 175 -145 -277 258 137 -204 108
6845 108 249 -161 -17 170 -156 -125 153 -80 -222 170 64 -221 31 216 -201 99 155 -65 -122 230 -82
6866 -82 -42 189 104 -211 173 81 -227 160 241 -89 -7 279 -136 -48 285 -4 -92 206 81 -157 81 226 -129
6889 -129 8 244 31 -136 194 35 -154 285 48 -157 39 237 -146 105 157 -175 -102 248 -45 -74 177
6910 177 -19 -206 69 196 -243 10 190 -133 -28 270 -59 -338 183 -20 -277 72 100 -251 134 202 -192
6931 -192 -41 202 -103 -7 110 -57 -225 41 50 -200 -33 124 -71 -149 206 -161 -252 159 -155 -235 102 37
6953 37 -271 107 89 -127 -15 159 -173 -187 231 -65 -268 244 -61 -369 66 217 -269 -73 222 -127 -109
6974 -109 256 -185 -102 124 -7 -163 198 128 -251 -95 181 -243 -32 278 -173 -126 221 -70 -229 164 94
6995 94 -266 177 229 -220 7 251 73 -155 255 -57 -170 208 182 -161 214 152 -153 79 250 -95 -23 318
7017 318 -49 -52 226 -17 -221 154 102 -237 113 250 -63 -127 290 -53 -36 217 51 -273 160 185 -233 -45
7039 -45 139 -164 -203 395 -58 5 258 -53 -216 202 127 -336 -68 142 -206 -107 249 -145 -113 213 12 -252
7061 -252 125 40 -217 176 74 -179 67 239 -85 -175 166 -224 -237 39 -6 -254 54 182 -245 -16 94
7082 94 -263 -100 182 -113 -117 150 -92 -245 158 128 -309 61 150 -230 -127 246 -74 -96 140 -57 -156 129
7104 129 81 -237 -70 158 -343 -45 245 -231 -125 37 -80 -209 180 36 -312 65 163 -223 -84 224 -139
7125 -139 -122 106 13 -199 254 79 -263 94 161 -116 89 269 -221 -65 317 -31 -203 171 35 -119 220
7146 220 122 -323 35 225 -139 78 292 -60 -61 249 13 -132 109 57 -220 188 184 -271 -78 211 -29 -88
7168 -88 186 28 -146 221 130 -202 61 58 -238 38 255 -105 -77 225 -55 -145 115 -63 -229 152 211 -209
7190 -209 -14 220 -126 -293 158 -69 -218 259 74 -359 225 143 -253 -41 43 -172 -181 221 -176 -175 134 20
7212 20 -152 156 104 -404 -2 19 -256 -109 186 -180 -71 259 59 -268 89 175 -158 151 225 -212 16 223
7234 223 -233 -141 155 -150 -296 238 125 -140 132 221 -250 -37 341 -174 -123 343 -16 -181 322 94 -244
7255 -244 131 221 -148 122 227 -110 -109 281 32 35 332 2 -231 222 255 -134 120 90 -262 -5 351 -49
7277 -49 -49 183 7 -4 194 78 -316 49 256 -88 -76 193 -155 -93 276 -34 -262 215 88 -148 7 70
7299 70 -230 34 164 -228 -77 276 -114 -218 228 44 -383 81 38 -269 -3 128 -72 -158 219 -203 -247
7320 -247 278 57 -326 6 72 -296 -15 129 -231 -153 158 -123 -122 177 -16 -194 139 111 -220 71 111 -204
7342 -204 122 257 -211 -144 150 51 -135 137 27 -166 36 200 -290 9 233 -117 -162 199 -80 -121 149
7363 149 -98 -120 96 276 -127 -50 290 -127 -103 248 -118 -209 178 129 -134 169 138 -286 162 99 -89 -54 281
7386 281 -140 -128 260 94 -301 130 165 -253 74 277 -120 -16 238 -118 -44 325 73 -145 203 162 -217
7407 -217 53 200 -299 -44 199 -117 -82 321 55 -84 334 123 -151 60 140 -223 -6 246 -230 -133 228
7428 228 -1 -191 185 -9 -269 163 63 -262 -23 186 -152 -110 224 -115 -263 148 -21 -232 110 21 -296
7449 -296 -5 215 -418 -56 137 -86 -153 189 -108 -219 164 67 -288 -20 97 -229 57 171 -210 -187 179
7470 179 -113 -269 240 10 -200 34 68 -227 -68 282 -154 0 298 23 -81 218 -36 -155 117 176 -226
7491 -226 126 209 -72 -63 227 -125 -201 107 21 -60 176 103 -274 131 188 -163 26 245 -105 -136 223 -113 -184
7514 -184 198 166 -198 14 192 -277 30 217 -106 62 155 43 -164 149 90 -170 12 157 -295 17 228
7535 228 -72 -92 199 131 -142 246 141 -158 65 137 -181 8 186 -221 -6 227 54 -118 165 27 -253
7556 -253 43 194 -108 -34 148 -157 -52 148 -128 -270 177 -35 -338 36 134 -336 26 167 -313 60 232
7577 232 -91 -178 200 -18 -266 211 45 -201 57 33 -285 21 205 -196 -163 265 42 -267 27 69 -208
7598 -208 149 93 -268 4 133 -216 -118 192 -22 -219 271 -15 -97 78 74 -329 35 43 -194 96 207 -140
7620 -140 -222 210 74 -168 153 67 -191 -7 185 -165 8 175 -120 -57 217 58 -208 240 140 -161 65
7641 65 17 -121 81 271 -119 -58 292 -5 -128 271 211 -119 154 103 -114 0 73 -121 -60 271 -40 -188
7663 -188 167 107 -271 112 107 -186 48 187 -132 69 195 9 -89 26 11 -187 91 61 -207 -112 53 -148
7685 -148 41 224 -187 -273 140 -1 -144 182 42 -244 -6 90 -230 59 165 -261 -154 256 4 -260 185
7706 185 95 -98 64 85 -300 50 212 -196 -181 129 -207 -176 140 -31 -139 43 -10 -268 94 150 -165 -112
7728 -112 81 -109 -50 154 86 -190 97 135 -247 32 172 -176 -32 168 -89 -46 308 -62 -228 211 206 -95
7750 -95 5 178 -165 56 307 -62 23 285 101 -92 235 211 -68 158 175 -53 62 187 -72 -90 291 -31
7772 -31 -175 222 -1 -164 123 71 -95 -14 140 -71 -49 158 -44 -118 138 58 -136 153 75 -185 -43 161
7794 161 -113 -131 66 -65 -145 80 58 -164 114 57 -115 -13 24 -236 -80 178 -88 -113 248 -101 -193 98
7816 98 22 -201 -93 47 -214 -29 159 -198 -119 66 -3 -214 164 106 -299 13 112 -188 -2 142 -153 -94
7838 -94 111 -12 -283 178 82 -228 84 49 -191 -33 112 -166 -60 285 -158 -197 122 6 -238 20 87 -269
7860 -269 182 252 -237 -79 147 -139 -143 184 83 -154 87 158 -209 243 14 -171 70 153 -60 -10 160 -18
7882 -18 -43 201 66 -154 65 256 -165 128 247 -103 -111 232 -87 -101 247 55 -176 97 128 -141 89 149
7904 149 -106 -42 269 -10 -60 223 -2 -328 228 115 -265 -24 186 -172 -103 166 -82 -60 230 -48 -130 225
7926 225 90 -158 -126 132 -221 5 72 -128 -104 146 65 -157 190 126 -211 62 42 -157 12 115 -178 -87
7948 -87 59 -192 -184 42 47 -205 46 70 -231 -30 78 -82 -72 224 -151 -211 100 -79 -120 90 78 -213 -93
7971 -93 127 -128 -56 139 -75 -171 180 -57 -201 183 -24 -171 101 243 -103 26 119 -139 -12 174 -59
7992 -59 -34 205 97 -201 32 126 -96 46 228 -62 26 184 -52 -112 178 31 -159 35 156 -157 28 178
8014 178 -66 102 95 -140 -132 254 38 -40 196 205 -179 43 167 -92 79 157 -94 -123 294 -74 -142 102 65 -178
8038 -178 71 168 -227 4 146 -95 -109 228 15 -76 218 48 -53 -5 85 -241 74 131 -91 -2 170 -26
8060 -26 -161 75 49 -172 66 30 -218 -91 128 -182 -45 125 -54 -180 75 58 -298 66 105 -264 -72 123
8082 123 -171 -79 150 -57 -209 169 -5 -172 8 60 -229 72 187 -239 -69 130 -97 -199 166 -109 -264
8103 -264 66 88 -235 166 105 -114 -13 127 -206 -57 200 -70 -154 15 -31 -55 92 78 -178 104 153 -83
8125 -83 -46 232 -106 -95 142 -2 -29 120 168 -191 73 151 -188 35 277 -59 -159 119 58 -177 98 153 -228
8148 -228 52 160 -87 -27 98 3 -71 169 15 -107 204 173 -78 76 101 -68 -111 162 -86 16 192 3
8170 3 -67 257 60 -70 86 133 -122 -50 252 -102 -90 142 -21 -170 97 35 -304 28 13 -237 17
8191A7
$$ Imaginary data points
##PAGE= N=2
##DATA TABLE= (X++(I..I)), XYDATA
0 0 0 0 0 0 0 0 0 0 0 0 0 0 0 0 0 0 0 0 0 0 0 0 0 0 0 0 0 2 -3 4 -4 6 -6 6 -7 8 -8 11 -11 13 -15 16 -19 20 -21 25 -26 27
48 27 -31 32 -34 35 -35 32 -26 6 34 -129 395 -1397 10341 99075 59815 -45685 -52811 14288 57391
67 57391 28894 -22013 -11312 48351 52325 4663 -6721 9794 9431 23184 48865 33526 -6132
80 -6132 -16115 6045 37850 38067 -9685 -27569 29681 56326 -8395 -53950 -9793 47801 43774
93 43774 -11351 -50647 -14772 43391 24488 -32351 -25261 15908 18291 226 -9056 -14430 -6910
106 -6910 7282 8273 8536 3597 -25137 -27588 23002 39637 -14600 -47030 -11607 29661 26091 -17708
120 -17708 -49093 -14510 36155 12774 -39433 -28563 9897 9124 -11684 -22463 -19477 -1633 6139
133 6139 -9342 -12263 -3180 -15451 -18143 10859 13287 -19700 -19498 12912 19775 -3668 -26159 -17221
147 -17221 28301 46975 -4812 -44082 -4477 39072 24152 -7069 -13654 3564 27749 20534
159 20534 -14669 -17133 13014 19719 8801 6577 -5023 -16620 616 16104 5637 -3423 -5331
172 -5331 -7611 2618 7468 -13391 -17219 11160 15673 -9964 -17365 -6335 2249 7711 -1315 -15030
186 -15030 -238 17347 -1843 -19797 -3781 10549 8385 6118 -3212 -10902 2077 9925 -711
199 -711 2191 10541 -2358 -7707 8011 7987 -4346 -1585 3436 3797 8936 1022 -14536 -3352 13815
214 13815 3776 -4373 3793 -907 -8804 921 5036 -12 3179 672 -7841 863 7337 -6667
228 -6667 -6094 10188 5110 -6629 -758 1165 -3721 1382 2207 -2468 6603 7367 -11903 -12557 7130
243 7130 9144 1183 268 -6475 -8164 5960 5730 -8462 -3652 6702 822 -1914 -351 -9461 -6413
258 -6413 10132 6854 -6137 -2590 -928 -5713 787 3789 -3969 1613 9269 -4253 -11743 340
272 340 4920 2956 5478 -3008 -10028 4729 10387 -6653 -9254 4331 6608 4061 875 -10652
286 -10652 -8454 10011 8665 -6285 -3165 2054 -3665 167 4610 -5242 -5563 4719 1297 -3585
300 -3585 1845 -2161 -6809 3237 3060 -8045 -808 8045 -2469 -6916 493 -955 -1297 4692 -1330
315 -1330 -5370 5908 4695 -9175 -4667 5120 1884 2884 5886 -3926 -6372 3011 766 -1956 8830
330 8830 7738 -5045 -3074 1436 -3141 2575 9322 921 -1175 5821 -1422 -8527 1252 5949 2997
345 2997 7823 4153 -9768 -6855 3598 1771 3532 9058 -957 -7813 600 -163 -6122 3053 8624
360 8624 894 -733 -1757 -9135 -3222 8030 1458 -2581 6188 1321 -10574 -5109 2238 1583 6010
375 6010 4393 -7108 -4998 3457 -2980 -4299 6562 4167 -3902 663 -308 -7024 -221 5753 -812
390 -812 344 4085 -4072 -5228 3464 23 -3452 5923 4727 -5777 -2557 2118 -1728 1568 4234
405 4234 -4222 -2635 7429 1151 -7270 -739 1788 -1022 4116 2130 -7496 -2162 5264 -2828 -5406
420 -5406 1723 -347 -2204 2727 -2943 -9336 -440 2922 -4865 -1816 2531 -4753 -4881 716 -4530
435 -4530 -5520 4133 2399 -4330 -702 -1701 -6356 1987 6681 -2574 -1734 6159 471 -3641 2711 2242
451 2242 1324 8142 5060 -3569 2051 5748 -957 2898 9997 2526 -1163 4613 1410 -1622 5500
466 5500 4464 -1498 3836 4213 -4940 -2304 4182 -1129 -1003 4847 -1423 -6318 585 65 -4435 1573
482 1573 2293 -4956 -1563 2035 -5354 -3898 4372 242 -3434 2021 -855 -5099 2090 2953 -3950 12
498 12 4421 -2405 -2305 2499 -2539 -2406 5287 795 -6005 105 1651 -4139 -676 1942 -3899 -1717
514 -1717 2651 -3966 -5073 2302 -881 -4513 2421 1082 -5796 -489 3525 -2250 -270 4195 -835
529 -835 -647 4945 473 -1958 6391 5105 -1333 3533 5513 -848 1893 6643 850 683 5833 882
545 882 -2064 3972 1208 -3704 2722 3181 -5221 -2966 1027 -4747 -3838 1152 -4144 -6561 -540 -3649
561 -3649 -8394 -2218 -1474 -7081 -2416 485 -7001 -5806 702 -2667 -3546 1888 -1143 -4209 2557 1524
577 1524 -4499 1289 5707 47 1110 4937 -834 -978 6258 3425 -350 4973 3728 -1452 3057
592 3057 3909 -2341 1557 7025 693 -1771 2413 -1137 -2106 4997 2549 -3633 1221 3292 -2788 -903
608 -903 2460 -1563 1417 6664 -748 -4902 2610 3333 -554 3647 3496 -2069 1938 4650 -2026 -863
624 -863 4964 1467 280 4330 -1398 -5740 2709 4761 -2556 -1733 218 -3353 -765 1083 -6097 -5365
640 -5365 3534 -151 -7009 -3111 -2004 -4952 -244 122 -6613 -3481 1750 -2923 -3609 943 -2566 -3759
656 -3759 3694 1881 -4749 -352 3465 -456 1071 2482 -2456 644 7403 1359 -3597 2399 2866
671 2866 -439 3497 2944 -2540 1328 4342 -2251 -2332 3240 220 -1069 3322 -951 -5892 35 1906
687 1906 -2166 782 1629 -5216 -2817 2881 -2422 -4417 2400 1789 -2202 -239 -2571 -5275 2365 5071
703 5071 -2351 -2179 1984 -2019 -2360 2968 307 -1862 3577 2024 -4060 -651 1156 -1912 3023 5573
719 5573 -3087 -4845 2605 1573 -1511 1705 619 -1372 3401 1285 -5865 -553 6437 1379 -983
734 -983 1684 -1715 -1389 4714 2008 -2283 2739 3481 -1849 731 2962 -1478 1345 6361 350 -3248
750 -3248 2004 1894 46 3899 1766 -3364 1489 4151 -2223 -1622 3526 425 -659 2106 -2337 -3863
766 -3863 3218 2590 -3652 -462 1547 -3316 -1553 1908 -2209 -1963 2319 -1725 -4437 861 -345 -4146
782 -4146 941 2108 -4254 -2861 808 -2560 -1649 2258 -1973 -3681 1624 -698 -4887 517 1809
797 1809 -3412 -896 1804 -3340 -2963 1858 -905 -1725 2289 -1196 -4579 1411 2139 -3374 -619 2513
813 2513 -1508 -841 1632 -2552 -1841 4130 1030 -2950 1353 1018 -2613 1665 3140 -2168 -191 4005
829 4005 -625 -1943 2596 587 -776 3899 1840 -2891 1210 3012 -1468 966 4298 -590 -726
844 -726 3453 206 -1751 3188 1883 -1335 2917 2550 -3145 -163 3984 105 275 3302 -1151 -2228
860 -2228 3148 1341 -2451 1858 2468 -1849 594 1751 -3221 -636 4644 630 -2255 626 -1391
875 -1391 -2201 3734 1869 -4327 -500 3155 -1464 -1919 327 -1941 458 4679 -1830 -6424 333 2912
891 2912 -784 400 67 -3679 -265 2940 -2179 -2674 2255 330 -1478 1546 -1964 -5265 2053 5523
907 5523 -1038 -3182 -1486 -2157 1599 4216 -2443 -4044 3435 2472 -3910 -1904 567 65 3393 2692
923 2692 -4923 -4318 1974 1132 514 3097 -1668 -4948 1262 2120 -3256 -1166 2524 526 817 -209
939 -209 -6679 -3942 6198 4656 -2630 -2638 -2188 -2452 2138 1844 -3590 -160 4485 -1084 -4581 -1338 -1511
956 -1511 417 6198 2094 -5922 -3482 712 427 2982 2593 -3444 -1423 4761 -367 -5214 140 3763
972 3763 3208 3207 -2081 -6714 812 7255 1791 -1306 1399 -482 -192 3365 373 -2460 3141 4836
988 4836 -223 -310 -313 -2402 3152 7774 265 -4705 492 2666 1787 3200 -165 -2828 3190 4782 -2437
1005 -2437 -2539 2765 2091 1693 2560 -2921 -4076 3524 4556 -706 -349 -512 -3023 1116 3868 -1871
1021 -1871 -2682 2678 715 -2650 -1066 -2067 -2044 4228 3016 -5238 -4821 -5 -942 38 1886 -2861
1037 -2861 -3874 919 -1773 -5545 -873 1373 -1715 -393 -1003 -6548 -4657 1822 262 -1565 100
1052 100 -3492 -5270 102 222 -3970 -274 2567 -1892 -2753 -1238 -3720 -1410 4308 1367 -3014 -453
1068 -453 -1080 -3148 1921 3654 -1120 -395 2466 -779 -1471 2106 129 402 5060 2187 -3278 -93
1084 -93 2883 860 2978 3975 -608 -28 3950 1106 -482 3973 3219 458 3298 2630 -1560 1817
1100 1817 5242 1718 1652 3677 101 18 4713 2424 -965 3134 3791 -287 1158 2146 -1367 1091
1116 1091 4398 -69 -1868 1689 -518 -2328 1920 1262 -3402 -1195 537 -2691 -1396 -43 -4307
1131 -4307 -3095 2115 -1478 -5824 -2681 -1706 -2933 -189 -1133 -5837 -3046 586 -3034 -3640 -393 -2580
1147 -2580 -3186 1132 -1214 -5508 -1526 1230 -1363 -563 -525 -4083 -968 3397 -1308 -4047 1172 1706
1163 1706 -1081 63 -1027 -2761 2291 4064 -2018 -2287 1795 443 -21 2871 -186 -2294 2665
1178 2665 3176 -615 875 1890 -661 2167 4910 -309 -1748 3332 3056 1311 3053 738 -1492
1193 -1492 3363 5079 52 525 3066 -33 485 3958 928 -1018 2859 2038 -1268 564 356 -2112
1209 -2112 2144 4184 -1869 -3921 101 -329 -1035 1502 -1051 -2869 1439 120 -5551 -2990 1922
1224 1922 577 318 2 -5073 -4805 1864 1465 -1791 178 -266 -2725 51 -122 -4441 -1217 4948
1240 4948 1986 -2071 -2282 -3818 -2020 4425 3224 -2318 -704 734 -2713 -1258 1703 -520 735
1255 735 3815 -748 -4181 -498 424 -382 3295 3011 -2339 -1510 1022 -1458 -228 3694 1169 -396
1271 -396 2408 -325 -3207 1342 3474 723 1823 1728 -2631 -817 3665 746 -1008 2240 1185 -541
1287 -541 2080 315 -3542 712 4258 304 -1157 -102 -2135 -242 3645 -393 -4251 127 2003
1302 2003 -617 102 -729 -3881 -338 3086 -1311 -2820 649 -479 -2054 375 -1410 -3375 1590
1317 1590 2561 -2505 -2509 -29 -2068 -1107 1848 -842 -1797 1690 -270 -4201 -1139 1138 -566 1706
1333 1706 1905 -3270 -3005 1245 60 -338 2818 699 -2152 986 808 -2680 463 3326 669 883
1349 883 2207 -2272 -2683 2528 2813 1000 2665 425 -3086 826 3314 -285 436 3141 580 -113
1365 -113 1675 -1487 -2013 3469 3515 -839 55 457 -2117 473 2795 -821 -444 2950 -226 -2984 275
1382 275 347 -915 2182 1345 -3262 -1258 1712 -1113 -1281 1163 -936 -1227 2059 -678 -4009 -28
1398 -28 1871 -942 1 265 -2951 -1203 2093 -1100 -2114 1348 -64 -2307 814 772 -2496 -249
1414 -249 1500 -1099 67 1607 -2180 -1999 2234 583 -1681 966 480 -2040 765 1567 -1982 -270
1430 -270 2171 -819 -1144 1531 -787 -1869 2037 978 -2174 209 1217 -1496 -114 1272 -1875
1445 -1875 -429 2776 -907 -3049 869 1146 -1125 777 58 -2747 511 2262 -2039 -1841 1632 -152
1461 -152 -980 1386 -859 -2592 1183 1653 -1362 243 1094 -2010 -381 2532 -787 -1428 2098 870
1477 870 -1044 1059 627 -1552 1708 2600 -1111 162 2722 -567 -1068 2428 1344 100 2457 1220
1493 1220 -1396 1430 1968 -925 1194 3357 -259 -861 1712 -24 -1037 2073 1010 -1125 1549
1508 1549 887 -2994 -1010 1683 -903 -500 1637 -1726 -2927 246 -728 -2291 808 581 -2571 -859
1524 -859 -26 -3360 -1807 1656 -325 -1383 795 -1458 -2856 622 812 -1470 1275 2226 -1784 -1307
1540 -1307 1060 -887 -345 3185 743 -1533 893 114 -2166 865 2000 -754 675 1927 -1838
1555 -1838 -2134 1126 -31 -608 1986 331 -2409 35 310 -2396 4 2455 -464 -801 973 -1393
1571 -1393 -2080 1452 973 -637 1976 1211 -2176 -333 1502 -1220 70 3201 481 -1208 444 -1152
1587 -1152 -1859 1977 1554 -1757 376 1038 -2789 -2194 670 -596 -652 1340 -1416 -3187 -165 -911 -2795
1604 -2795 848 2207 -1566 -1431 381 -1929 -1011 2163 827 243 2488 472 -2111 1682 3172 448
1620 448 2027 4050 1100 634 2354 692 1241 4611 2633 -281 2319 2209 -1176 390 2920 895
1636 895 666 1341 -1558 -1384 1689 -466 -2704 761 997 -2286 -1683 -799 -2809 -1216 850 -1952 -2228
1653 -2228 301 -1806 -3323 122 93 -2441 -337 1054 -1677 -1350 86 -1656 -474 2269 -675 -2085
1669 -2085 1500 758 -2707 -891 1120 -356 549 406 -2917 -1693 1637 -1060 -2494 788 349 -2206
1685 -2206 -551 -456 -2525 -254 1215 -1266 -357 1456 -1741 -2356 1730 1482 -524 1391 1281 -1000
1701 -1000 1014 2116 -283 1455 3577 656 -27 2755 1034 -802 2272 2865 556 1377 823 -1508
1717 -1508 764 2799 -713 -1194 1946 355 -2166 -385 -324 -1133 1176 229 -3303 -1301 1380 -1441
1733 -1441 -2052 481 -444 -957 1085 -897 -2919 584 2084 -469 365 977 -1460 -188 2784 535
1749 535 -1055 1704 1465 -234 1275 321 -1258 1931 3116 -829 -943 1513 86 -567 1444 206
1765 206 -808 1555 78 -2853 -143 1774 -721 -563 824 -1396 -1450 988 -840 -1632 1473 883
1781 883 -1918 -416 266 -1756 -55 1737 -827 -803 1140 -1132 -2148 977 855 -866 817 305
1797 305 -2498 -502 1520 -1058 -1039 1194 -478 -1326 347 -1346 -2426 1260 1703 -1772 -1368 -107
1813 -107 -1576 -276 1237 -1348 -1306 1798 20 -2400 -208 790 -442 876 714 -1983 -181 2260
1829 2260 -582 -1490 1433 760 -302 1181 79 -1621 1377 2128 -1194 -600 1662 114 300 1651
1845 1651 -719 -1201 1963 1560 -1007 685 1456 -468 474 1033 -1207 378 3379 763 -1555 645
1861 645 630 -482 1531 1319 -545 1466 2044 -1893 -1407 1888 1459 760 1700 -616 -2058 938 997 -1123
1879 -1123 1026 2360 -418 -930 -57 -1836 -524 2968 982 -1578 -158 -501 -2129 54 1187 -626
1895 -626 562 1290 -2433 -3051 295 484 -403 987 -565 -2634 -433 -409 -2572 -349 2210 -369 -2065
1912 -2065 -1058 -1989 -1300 1629 147 -2119 117 526 -2233 -1206 439 -556 541 1712 -1675 -2532
1928 -2532 946 829 -812 667 389 -1064 879 1185 -1685 -275 2829 697 -819 517 -102 154
1944 154 2537 952 -1816 719 2398 -144 -197 1225 -39 461 1894 -620 -1562 1876 1739 -944
1960 -944 59 500 -1111 399 1488 -891 -622 1575 -372 -2202 119 271 -507 1069 119 -2712
1976 -2712 -772 1477 -909 -1209 857 -153 -725 438 -1400 -2193 1556 2113 -1229 -1028 319 -929
1992 -929 179 1337 -579 -106 2477 413 -2040 343 1373 493 1744 1371 -1302 188 2521 246
2008 246 -416 1835 1291 403 1532 -100 -1680 1705 2874 -198 -348 744 -566 -125 1373 -539
2024 -539 -925 1689 325 -2265 -489 570 -960 -290 340 -1677 -978 688 -1808 -2441 761 492 -1638
2041 -1638 -802 -1014 -2141 23 852 -2081 -1548 591 -854 -1871 -352 -1104 -1400 1048 117 -2847 -1114
2058 -1114 611 -861 -764 -46 -1406 -456 1353 -1245 -2902 537 1589 -390 -441 -599 -1470 978 2206
2075 2206 -1063 -1160 1800 1332 -101 815 204 -153 2768 2695 -605 209 2017 958 1254 2692 721
2092 721 451 2536 1310 -662 1565 2435 450 1036 1221 -810 174 2002 -346 -816 1562 352 -1867
2109 -1867 -145 37 -1125 348 501 -2204 -1186 728 -1290 -1781 549 -97 -1311 -185 -881 -1942
2125 -1942 795 1686 -1303 -1080 659 -186 94 1227 -635 -856 2156 1547 -1559 -626 824 508 1541
2142 1541 1116 -2259 -1378 2129 698 -1236 -70 -387 -944 333 -692 -2628 -162 1798 -1002 -1923
2158 -1923 -899 -1488 -816 1293 -338 -2083 165 344 -1527 -555 714 -408 701 1466 -1266 -1666
2174 -1666 1190 1101 114 1432 473 -1264 350 859 -669 597 2104 -512 -1006 678 -209 -1224 662
2191 662 482 -502 569 -173 -2784 -832 1986 348 -737 -41 -1131 -882 1410 253 -1311 993
2207 993 1863 -548 -227 527 -260 1403 3223 451 -1128 1164 1604 704 1694 991 -459 1642 2133
2224 2133 -984 -805 1795 1326 428 354 -1361 -1416 1519 973 -1847 -714 250 -1409 -900 -219 -1752 -1063
2242 -1063 1070 -901 -2399 -614 -653 -1556 417 672 -1834 -963 381 -1015 -629 1272 -196 -1039 697
2259 697 32 -1072 826 1104 -689 247 1369 -704 -893 1049 354 230 1495 -451 -1703 1002 1460
2276 1460 -894 -218 968 -253 214 701 -1217 -661 2244 1021 -1295 -203 261 -260 1289 1161 -1171
2293 -1171 -97 1884 229 -689 813 201 236 1839 568 -1814 212 1630 4 177 643 -893
2309 -893 -340 1384 -451 -1432 720 614 -993 -114 -154 -1667 -139 836 -1255 -1201 527 -1040 -1419 513
2327 513 -214 -1615 18 96 -1510 -179 326 -1506 -665 1096 -324 -1332 209 -332 -809 1112 354
2344 354 -1612 12 1370 -409 -337 613 -603 -81 1672 -138 -1418 719 1238 -253 569 516 -1060
2361 -1060 574 2104 -218 -849 1166 634 120 1124 -50 -977 1562 2038 -633 -418 1140 287 567
2378 567 1380 -440 -558 1988 1102 -1113 370 1096 -138 724 1256 -817 -420 1342 -52 -440 1088
2395 1088 -32 -1226 737 878 -1187 -42 922 -609 -95 613 -1085 -972 1236 46 -1453 279
2411 279 15 -1604 -167 443 -1114 -459 522 -1134 -1084 438 -991 -1664 655 250 -1901 -815 -264
2428 -264 -1227 -107 390 -1639 -1012 923 -824 -1853 85 173 -803 319 6 -1749 -201 991 -710
2445 -710 -196 994 -424 -920 1147 353 -840 757 1007 -403 451 710 -732 306 1841 91 -586
2462 -586 1483 790 -468 935 801 -354 1116 1366 -617 229 1649 -111 -376 1351 372 -470 1081
2479 1081 571 -791 714 970 -788 179 1338 -273 -530 972 -184 -715 1049 387 -933 437
2495 437 639 -1102 43 707 -962 -392 1254 -209 -1172 325 -209 -901 708 579 -1319 -47 710
2512 710 -1097 -531 895 -261 -633 865 -365 -1443 407 518 -832 250 626 -1142 -357 911
2528 911 -764 -658 1262 251 -939 489 15 -1112 483 1039 -823 -1 1067 -880 -777 1056
2544 1056 -110 -870 1013 467 -1021 91 251 -1048 307 1230 -822 -759 1015 -313 -1198 384 133
2561 133 -796 557 208 -1422 -222 658 -1052 -665 1136 -562 -1195 372 -218 -1257 351 244 -1170
2578 -1170 268 456 -1440 -688 1110 -329 -800 772 -174 -807 763 -58 -1025 812 1185 -832 -40
2595 -40 1298 -282 -312 1373 446 -188 1424 415 -767 840 1304 -360 670 1746 -230 -420 1214
2612 1214 421 -13 1309 248 -633 1176 1010 -1272 -16 1458 -10 -144 770 -542 -563 1147 131
2629 131 -1050 788 743 -1030 92 836 -958 -344 1125 -241 -642 584 -417 -805 973 407 -1292
2646 -1292 131 917 -866 -537 536 -724 -186 976 -791 -1622 573 265 -1319 -30 184 -1205
2662 -1205 -359 618 -1175 -1091 510 -562 -1017 530 -499 -1753 295 769 -1090 -339 361 -840 -231
2679 -231 1004 -819 -1071 1107 330 -1117 238 311 -726 377 1046 -758 -272 1062 -488 -525 1082
2696 1082 21 -982 783 591 -1091 167 679 -599 86 981 -837 -785 1130 76 -921 552 379
2713 379 -776 630 693 -897 34 1148 -184 -233 1066 -63 -572 1306 708 -813 734 1051 -297
2730 -297 465 1136 -698 -325 1519 177 -418 1029 320 -745 897 602 -962 307 1240 -638 -276
2747 -276 725 -699 -665 1221 213 -875 511 119 -1253 -32 705 -816 44 1100 -669 -1138 408
2764 408 -179 -715 1177 533 -1310 -126 394 -1116 -77 1108 -448 -508 777 -729 -1410 278 349
2781 349 -573 761 259 -1701 -789 630 -423 -216 847 -655 -1141 369 -399 -1479 479 938 -630
2798 -630 -93 -22 -1581 -384 1346 18 -630 787 -301 -1206 543 262 -844 606 1108 -918 -642
2815 -642 545 -596 -203 1388 -95 -1135 561 388 -957 319 713 -638 154 1142 -729 -900 995
2832 995 253 -417 910 55 -974 663 1054 -800 -269 956 -436 27 1286 -257 -877 949 403
2849 403 -789 480 876 -521 548 1101 -942 -706 1144 381 -69 1199 13 -1206 754 788 -756
2866 -756 411 1214 -337 -93 735 -752 -616 1605 681 -558 470 16 -1326 347 1174 -518 119
2883 119 1075 -561 -877 567 -320 -412 1491 582 -1330 -355 312 -775 180 1052 -731 -795 744 -587
2901 -587 -1175 492 336 -549 518 112 -1700 -471 784 -451 -163 694 -772 -962 595 -234 -1332
2918 -1332 401 656 -823 -40 -9 -1240 -372 1153 -330 -1035 471 -215 -1049 582 265 -1045 210
2935 210 940 -897 -353 783 -684 -425 997 -74 -1099 496 371 -934 508 588 -803 47 1148
2952 1148 -542 -581 1018 50 -356 928 307 -1001 495 916 -585 156 948 -669 -104 1084 -142
2969 -142 -681 954 537 -482 588 340 -1000 521 1302 -624 -361 884 -134 -375 1084 -60 -708
2986 -708 919 788 -971 82 833 -499 171 1058 -524 -619 1077 183 -738 735 217 -780 451 673
3004 673 -942 -163 1000 -501 -524 747 -226 -798 730 85 -1122 347 652 -977 -141 774 -501
3021 -501 -424 856 -458 -857 942 154 -942 447 553 -1092 -54 694 -695 -168 954 -576 -993
3038 -993 579 -30 -860 548 349 -975 -38 429 -1094 -398 1045 -159 -532 276 -790 -1161 703
3055 703 481 -885 113 484 -1143 -577 443 -680 -275 1234 -382 -1452 132 37 -817 626 738
3072 738 -834 -294 390 -1032 -587 1271 294 -382 513 -263 -1257 464 740 -337 604 1027 -830 -752
3090 -752 859 -214 -4 1392 344 -805 490 570 -754 424 1343 -55 163 714 -685 -524 1346
3107 1346 704 -355 730 316 -865 445 706 -577 262 1286 -279 -536 566 -47 -452 1027 416
3124 416 -940 431 810 -680 -91 813 -504 -244 848 -460 -737 838 232 -1088 17 460 -663
3141 -663 111 452 -938 -578 720 -588 -1105 605 194 -790 152 -290 -1443 -126 884 -514 -439 336
3159 336 -906 -881 540 -316 -818 767 431 -1221 -341 256 -526 388 1095 -545 -727 829 -286 -1000
3177 -1000 632 821 -419 353 80 -1186 -77 1079 -161 -371 907 -194 -977 340 96 -602 673
3194 673 746 -953 -195 304 -849 -290 1221 127 -638 498 -298 -984 705 887 -470 258 705 -735
3212 -735 -192 1071 -198 -370 1111 545 -620 324 128 -477 926 1047 -833 -290 1169 -74 -544
3229 -544 614 142 -357 789 49 -1142 354 976 -585 -295 538 -453 -293 911 -334 -1020 574
3246 574 633 -650 260 169 -865 462 1198 -589 -852 759 181 -179 637 -126 -741 936 816 -936
3264 -936 -190 810 -437 -210 653 -370 -421 624 -181 -811 395 297 -1094 -132 571 -726 -309 543
3282 543 -533 -633 619 -278 -824 661 178 -967 77 641 -636 -169 682 -500 -332 1021 -109
3299 -109 -493 649 105 -745 643 721 -750 -334 719 -49 -139 481 -774 -839 1080 308 -1111 42
3317 42 443 -633 74 268 -1007 -298 936 -444 -907 391 -14 -866 392 276 -891 165 582 -794
3335 -794 -459 685 -308 -311 825 -277 -917 582 641 -574 160 621 -433 172 633 -814 -277 1145
3353 1145 200 -598 549 142 -726 317 768 -436 292 755 -693 -361 997 213 -411 790 235 -478
3371 -478 463 426 -802 352 1147 -99 -102 687 -278 -470 1209 575 -529 460 384 -680 307 716 -501
3390 -501 162 1137 -435 -631 566 132 -379 608 399 -776 333 371 -939 -249 928 -239 -437 518
3408 518 -373 -804 520 310 -920 231 361 -810 -217 503 -693 -496 639 -358 -782 357 -122 -1093
3426 -1093 201 303 -817 -216 362 -930 -472 644 -463 -998 334 90 -734 346 -50 -1217 -60
3443 -60 804 -531 -382 510 -367 -409 499 -345 -889 672 656 -712 77 487 -499 144 975 -415 -339 933
3463 933 117 -781 510 392 -338 800 727 -669 -46 980 -197 57 911 17 -107 924 338 -603
3481 -603 601 1005 -74 465 763 -478 -20 1242 300 -78 1062 422 -437 609 604 -302 414 874 -387
3500 -387 -46 812 -218 -502 672 228 -593 350 161 -878 125 501 -820 -298 613 -504 -681 467
3518 467 -312 -809 286 74 -1078 29 297 -909 -399 342 -695 -504 577 -412 -934 318 60 -816
3536 -816 316 176 -845 -14 540 -588 -456 522 -171 -571 531 -56 -830 356 372 -807 -6 576
3554 576 -422 -293 673 -258 -489 647 48 -658 278 313 -757 164 597 -600 -131 746 -397 -459 743
3573 743 -91 -580 638 269 -695 292 564 -507 -63 670 -338 -326 752 -104 -509 606 372 -459 204
3592 204 395 -616 81 704 -467 -251 703 -165 -519 685 228 -604 439 509 -659 117 754 -463
3610 -463 -121 897 -113 -466 757 171 -535 477 567 -431 290 683 -414 -3 861 -102 -217 921
3628 921 131 -443 763 363 -480 384 745 -306 -2 845 -116 -285 673 101 -502 620 276 -602 384
3647 384 419 -698 -45 521 -435 -324 466 -417 -801 428 -118 -883 -60 33 -770 -99 188 -950 -630 522
3667 522 -357 -780 156 -225 -781 291 111 -1099 32 550 -564 -383 431 -434 -344 770 -71 -787 377
3686 377 325 -555 190 543 -593 79 747 -420 -491 675 91 -344 547 159 -707 226 580 -459 40
3705 40 666 -516 -375 731 -185 -482 574 378 -504 366 371 -562 85 951 -199 -139 631 -218 -229 862
3725 862 449 -603 606 580 -319 207 633 -312 258 1086 -284 -667 667 211 -266 476 73 -666 390
3744 390 702 -700 -386 666 -89 -408 552 -539 -785 657 525 -732 -24 272 -366 29 526 -533
3762 -533 -360 890 -38 -515 401 300 -380 660 482 -747 -20 680 -335 -273 632 -264 -517 566 -88
3781 -88 -849 290 485 -719 -74 285 -891 -537 433 -417 -699 247 -504 -935 281 217 -911 -237 300
3800 300 -583 -164 353 -770 -507 921 103 -783 156 131 -386 493 593 -723 -167 819 -176 -340 363
3819 363 -102 -215 668 129 -1002 351 696 -295 -128 126 -447 -74 749 -389 -891 527 404 -358 214
3838 214 24 -614 372 934 -539 -435 596 81 -253 707 116 -525 639 694 -545 185 601 -384 128
3857 128 812 -273 -354 659 135 -244 703 517 -837 295 791 -353 75 627 -364 -162 858 -38
3875 -38 -624 449 341 -473 334 181 -701 221 817 -355 -588 645 177 -351 348 -211 -493 715 651
3894 651 -867 -318 603 -109 12 450 -754 -642 871 220 -739 -103 100 -478 212 313 -1043 -529 693
3913 693 -44 -568 231 -188 -695 436 70 -849 24 470 -686 -307 367 -489 -459 572 -117 -675 348
3932 348 78 -875 78 468 -511 -109 451 -560 -359 673 -120 -539 630 347 -687 102 306 -341 222
3951 222 545 -661 -322 824 38 -411 422 173 -241 705 280 -862 -29 966 177 -91 365 -435 -197
3970 -197 1060 212 -705 451 530 -455 218 302 -759 193 993 -279 -485 342 48 -367 583 117 -526
3989 -526 345 594 -670 -96 867 28 -13 505 -194 -548 696 376 -532 377 502 -482 55 715 -309
4008 -309 -199 726 -92 -335 648 79 -752 374 674 -321 -101 124 -633 -139 966 -343 -841 376 -138
4027 -138 -460 406 17 -1029 76 632 -608 -565 95 -224 -109 585 -619 -963 438 360 -742 25 405
4046 405 -483 -52 278 -766 -309 781 124 -741 270 -13 -562 589 337 -802 -210 555 -491 -336
4064 -336 349 -329 -383 654 -8 -1041 -45 395 -417 177 500 -586 -342 444 -120 -207 756 51 -639 439
4084 439 499 -483 178 474 -109 135 806 -549 -380 872 386 -216 492 229 -533 466 588 -314 6 833
4104 833 -61 -288 512 -35 -247 771 233 -757 125 617 -309 75 307 -414 -1 992 -257 -747 472
4123 472 376 -314 418 20 -723 263 847 -398 -457 567 -92 -278 600 -10 -655 511 410 -575 102 357
4143 357 -401 -84 564 -292 -476 683 -64 -595 427 228 -517 33 281 -658 -72 602 -399 -524 613
4162 613 -142 -615 259 148 -634 92 297 -708 -123 590 -514 -495 471 -110 -550 312 -269 -737 355
4181 355 514 -725 -332 288 -528 -57 578 -533 -679 509 200 -567 85 121 -576 320 553 -739 -313
4200 -313 642 -149 -316 522 -8 -491 540 128 -623 242 729 -507 -142 597 -211 -239 613 -72 -469 649
4220 649 290 -531 319 453 -389 61 736 -339 -259 777 54 -375 672 285 -418 521 382 -454 260
4239 260 634 -445 -192 686 -47 -262 580 86 -428 607 523 -592 -93 371 -274 -115 411 -441 -407 648
4259 648 -32 -760 300 335 -515 -52 331 -785 -158 574 -330 -305 646 -118 -549 332 37 -550 220 582
4279 582 -584 -161 482 -307 -240 695 -153 -647 353 171 -701 119 351 -548 -65 322 -520 -321 452 -383
4299 -383 -579 392 2 -874 46 57 -600 71 394 -575 -365 632 -234 -592 365 -12 -596 367 284 -737
4319 -737 155 474 -455 -37 559 -371 -317 810 22 -673 354 164 -486 186 420 -508 43 660 -439
4338 -439 -256 703 205 -469 441 70 -493 390 450 -446 208 763 -385 -382 621 -101 -174 502 221 -404 424
4359 424 483 -486 258 811 -182 -200 616 -180 -399 712 264 -346 500 327 -627 181 587 -449 -136 716
4379 716 -205 -470 481 -60 -549 584 242 -679 280 493 -563 -192 582 -197 -224 429 -259 -529 401 162
4399 162 -685 317 329 -598 -113 418 -377 -364 429 -248 -508 410 -44 -666 264 344 -651 -74 376 -597 -369
4420 -369 352 -282 -504 449 -156 -762 441 285 -732 -53 383 -604 -208 385 -434 -430 511 -187 -651 405
4440 405 212 -659 113 397 -551 -78 431 -433 -353 587 -144 -536 403 145 -541 316 585 -380 -130 548
4460 548 -288 -92 559 -114 -338 656 303 -516 385 457 -443 238 515 -429 -84 713 -117 -272 636 326
4480 326 -480 377 420 -433 265 606 -358 27 752 -229 -250 638 80 -501 366 232 -461 241 413 -349 -221
4501 -221 698 -196 -323 568 -31 -419 440 392 -646 198 371 -474 -91 510 -336 -216 507 -150 -546 262
4521 262 45 -548 344 298 -702 -15 460 -375 -218 551 -405 -502 418 -48 -595 290 130 -614 6 332
4541 332 -581 -165 516 -343 -463 245 -85 -613 230 -6 -597 185 438 -507 -226 488 -246 -283 492 -100
4561 -100 -538 473 149 -701 100 395 -562 -158 577 -409 -256 556 -20 -450 381 63 -653 204 300 -498
4581 -498 49 637 -483 -232 561 -192 -370 381 99 -554 389 359 -460 139 549 -285 1 744 -109 -341
4601 -341 474 30 -388 509 425 -363 224 593 -440 -16 766 -154 -150 656 39 -470 509 252 -437 440 483
4622 483 -335 -42 533 -267 -293 609 19 -295 485 119 -607 313 401 -497 -12 459 -300 -291 501 -88 -324
4643 -324 532 176 -539 212 266 -569 36 437 -388 -368 428 -310 -428 353 -12 -623 301 70 -734 12 314
4664 314 -564 -180 465 -519 -436 389 -105 -602 275 172 -482 16 366 -611 -172 383 -272 -363 364 -184 -509
4685 -509 275 20 -630 150 396 -477 25 501 -322 -283 566 -165 -363 466 144 -431 237 319 -633 110 634
4706 634 -325 -146 487 -209 -280 560 109 -412 289 349 -449 74 388 -326 84 609 -153 -258 455 -38 -310
4727 -310 569 282 -325 159 511 -370 -42 596 -202 -163 635 6 -469 504 286 -324 371 369 -371 15 596
4748 596 -200 -264 446 -64 -295 545 129 -571 343 467 -505 36 442 -293 -93 561 -233 -429 483 161
4768 161 -494 257 157 -482 201 495 -474 -224 447 -239 -315 438 -130 -584 288 244 -594 20 284 -545 24
4789 24 363 -441 -415 515 -17 -515 304 13 -513 190 150 -498 -156 310 -336 -306 407 -308 -382 330 -29 -524
4811 -524 116 369 -390 -64 345 -553 -279 516 -153 -517 255 20 -445 213 269 -509 -19 386 -325 -7
4831 -7 493 -280 -436 542 73 -399 227 269 -284 368 342 -373 19 583 -129 -231 474 -6 -378 337 253 -370
4853 -370 230 491 -244 24 524 -150 -117 585 -55 -305 461 304 -293 294 298 -467 155 444 -215 -249 492
4874 492 85 -216 597 100 -395 410 274 -272 100 150 -378 -98 553 -221 -310 301 -3 -403 288 138 -510
4895 -510 125 357 -383 -213 223 -190 -251 362 -51 -642 190 28 -552 79 246 -544 40 352 -332 -540
4915 -540 343 -87 -316 163 -94 -709 190 317 -439 -63 353 -278 -264 306 -351 -573 577 205 -514 -57
4935 -57 -5 -416 135 513 -474 -306 475 -138 -284 263 -53 -538 372 333 -615 -92 301 -311 -71 554 -343
4956 -343 -389 499 61 -371 337 242 -309 235 584 -451 -88 606 -78 -58 438 -130 -315 533 274 -365 242
4977 242 397 -151 100 409 -309 -113 672 -86 -442 291 24 -233 493 169 -659 -61 651 38 -50 261
4997 261 -156 -210 528 -36 -523 187 321 -186 276 327 -343 -164 439 -12 -363 305 -35 -308 276 124 -519
5018 -519 254 390 -366 -136 395 -229 -152 477 -205 -490 248 70 -563 48 322 -341 -7 276 -444 -262
5038 -262 309 -19 -384 284 -106 -648 175 283 -367 -89 182 -393 -158 392 -241 -530 215 194 -344 151
5058 151 -58 -513 217 450 -463 -283 332 -150 -251 281 -180 -516 243 201 -381 92 303 -312 -44 461
5078 461 -384 -299 525 52 -398 95 110 -385 304 323 -469 34 487 -127 -181 381 -64 -261 386 120 -371
5099 -371 206 279 -171 191 378 -188 -168 609 -53 -277 430 48 -258 491 327 -389 -79 365 -88 27 449
5120 449 -216 -244 501 288 -298 207 104 -312 339 494 -368 -212 468 31 -203 286 -116 -233 509 102
5140 102 -417 129 444 -283 -182 350 -272 -252 405 -234 -430 321 65 -360 191 72 -508 -48 313 -453
5160 -453 -359 284 -83 -259 345 -168 -533 143 99 -430 -59 287 -443 -200 291 -176 -375 251 8 -528 237
5181 237 187 -567 130 338 -352 -151 377 -357 -314 472 -129 -420 252 259 -420 -22 154 -432 -50 395 -184
5202 -184 -291 455 -14 -256 350 6 -302 236 382 -332 -163 352 -136 -13 384 -163 -364 588 198 -374
5222 -374 82 212 -255 81 425 -150 -142 571 -50 -321 339 84 -187 307 310 -235 155 383 -240 8 474
5243 474 -227 -222 402 79 -369 347 305 -248 216 361 -309 28 412 -213 -173 497 -74 -407 289 208 -325 219
5265 219 237 -366 151 416 -401 -202 384 -101 -299 225 251 -311 237 311 -625 -155 379 -310 -189 265 -222
5286 -222 -308 321 -93 -549 222 21 -347 13 216 -470 -162 345 -296 -324 285 -195 -391 183 -7 -453 -20
5307 -20 319 -507 -170 226 -124 -224 366 -63 -347 244 33 -419 163 245 -414 -59 477 -231 -298 330 -45
5328 -45 -202 425 105 -352 209 375 -255 82 370 -155 -105 476 -29 -207 324 49 -167 309 131 -403 146
5349 146 495 -179 -206 364 -15 -125 394 -49 -272 517 294 -204 73 275 -233 28 500 -186 -242 426 96
5370 96 -235 437 169 -316 217 299 -246 -64 383 -154 -108 400 -91 -348 234 45 -311 213 280 -470 -5
5391 -5 316 -264 -169 338 -162 -321 270 65 -423 54 144 -318 -78 340 -337 -131 331 -257 -372 290 -92
5412 -92 -592 95 74 -423 -93 269 -448 -109 255 -134 -155 265 -113 -528 342 99 -458 -12 304 -323 -7
5433 -7 334 -290 -290 541 -179 -480 355 86 -315 114 202 -306 -54 240 -178 -117 443 -99 -323 346 175 -264
5455 -264 264 304 -488 -38 429 -166 -62 221 -225 -224 341 -58 -405 225 177 -323 -2 304 -181 -16 387
5476 387 -228 -291 361 7 -308 333 126 -322 124 357 -286 76 453 -161 -165 399 -28 -220 241 78 -370
5497 -370 215 327 -451 -31 328 -177 -54 412 25 -168 241 186 -313 276 181 -364 125 341 -173 -61 397
5518 397 -162 -267 275 73 -326 240 253 -407 120 272 -399 -240 277 -165 -304 286 -86 -403 190 111 -354
5539 -354 93 167 -300 -168 323 -335 -221 347 -67 -425 143 132 -371 200 273 -357 -75 299 -242 -353 267
5560 267 -152 -232 143 88 -318 60 230 -453 -39 272 -361 -122 262 -133 -347 304 -42 -408 155 195 -333
5581 -333 74 250 -309 -239 450 -160 -233 463 32 -249 291 126 -297 172 267 -312 88 353 -72 -73 461 64
5603 64 -264 384 237 -282 195 349 -284 -7 415 -190 -81 435 10 -295 312 80 -298 177 201 -281 -34
5624 -34 417 -214 -132 292 -25 -277 372 110 -234 253 228 -285 40 334 -188 -30 388 -160 -382 251 44
5645 44 -438 195 254 -383 139 347 -336 -191 372 -141 -276 260 -32 -337 239 39 -436 16 317 -366 -158
5666 -158 239 -241 -270 182 -196 -382 159 -20 -470 54 197 -352 14 107 -313 -314 249 -198 -401 265 3
5687 3 -448 180 180 -348 -77 250 -298 -190 316 -180 -272 402 -2 -323 192 149 -376 142 285 -256 -43 432
5709 432 -114 -219 399 64 -222 219 51 -368 273 244 -286 -17 432 -213 -71 342 57 -193 497 189
5729 189 -244 203 272 -178 80 423 -199 -86 610 113 -212 284 142 -267 190 253 -325 161 246 -253 -62
5750 -62 373 -139 -339 253 59 -289 230 184 -285 127 372 -254 -162 328 -233 -313 459 -85 -498 163 50
5771 50 -338 118 169 -391 -94 302 -227 -101 170 -76 -422 305 191 -321 182 55 -308 -56 342 -157 -316
5792 -316 226 -177 -324 227 89 -445 27 80 -397 -6 302 -399 -256 289 -125 -249 218 -6 -428 172
5812 172 196 -265 11 166 -260 -184 348 -213 -402 229 127 -248 219 66 -357 97 329 -275 64 398 -132
5833 -132 -178 295 -129 -166 209 138 -390 96 183 -260 4 287 -277 38 478 -26 -352 358 262 -269 211 129
5855 129 -360 -44 449 -160 -84 294 -46 -124 390 91 -274 261 189 -148 206 352 -321 -132 558 86 -174
5876 -174 219 21 -318 292 366 -226 88 279 -292 27 282 -155 -215 419 -4 -243 206 110 -395 165 110
5897 110 -245 -8 345 -308 -67 447 -147 -328 208 -106 -502 294 200 -391 -203 272 -263 -87 344 -332
5917 -332 -391 150 155 -318 71 54 -326 -37 363 -273 -152 103 -213 -143 333 57 -523 181 134 -270 64 89
5939 89 -365 -264 281 34 -158 278 -166 -286 335 177 -347 125 285 -221 -52 266 -249 -130 434 -84
5959 -84 -171 340 271 -334 43 232 -68 153 385 -343 -75 488 24 -197 223 61 -251 397 357 -242 -38
5980 -38 195 3 91 357 -147 -265 379 291 -300 181 130 -216 203 298 -225 -21 308 -130 -189 444 -5 -221
6002 -221 147 133 -181 187 302 -220 -133 389 -170 -166 390 -144 -276 199 129 -283 129 73 -249 26 351 -281
6024 -281 -310 139 -151 -169 231 25 -477 104 72 -239 168 168 -388 -245 398 -20 -332 113 -64 -134 227 179
6046 179 -509 -52 173 -228 -4 188 -302 -192 379 -7 -396 260 76 -191 10 358 -192 35 305 -252
6066 -252 -104 307 -14 -293 142 -52 -303 224 217 -304 -83 279 -165 -146 308 -96 -372 164 45 -347 134
6087 134 12 -393 31 396 -229 -135 192 -60 -309 296 -9 -413 238 355 -165 28 233 -223 -53 362
6107 362 -188 -158 301 38 -100 340 143 -305 133 402 -158 75 378 -62 -123 301 -10 -192 322 178 -421
6128 -421 201 382 -260 -3 134 -195 -86 422 18 -250 69 5 -176 235 102 -374 -47 299 -172 -85 199
6149 199 -215 -264 465 111 -409 9 69 -309 121 335 -410 -324 175 -183 -293 26 -36 -427 163 80 -286 -55
6171 -55 107 -430 -65 361 -349 -192 191 -57 -387 162 136 -316 0 54 -407 16 299 -209 -178 223 -65
6192 -65 -163 239 -36 -427 129 341 -179 -69 194 -201 47 428 -144 -215 215 102 -175 212 52 -442 74
6213 74 288 -135 -159 349 -165 -226 386 61 -373 127 42 -307 198 210 -261 9 423 -62 -245 204 42 -256
6235 -256 254 212 -141 215 300 -290 -21 388 -166 -51 451 -44 -121 239 219 -227 31 164 -239 65 457
6256 457 -169 -114 151 -131 -215 242 -7 -338 222 74 -361 -87 200 -313 -7 324 -220 -309 421 16 -303
6277 -303 193 164 -277 57 329 -298 -153 262 -201 -269 213 10 -150 121 17 -325 42 205 -313 45 210
6298 210 -152 -218 244 -114 -314 156 -138 -320 76 71 -284 -86 214 -226 -172 70 -169 -244 294 -78 -324 38
6320 38 27 -239 21 169 -172 -194 269 -32 -225 212 -2 -206 170 189 -245 125 153 -180 -122 331 -3 -146
6342 -146 351 26 -192 248 253 -241 204 265 -145 72 279 -20 -91 328 -10 -112 149 176 -278 157 409 -111
6364 -111 -24 192 -37 -68 322 -66 -143 345 82 -215 209 86 -261 46 348 -78 -119 204 7 -190 298
6385 298 84 -308 142 257 -388 55 194 -108 -117 281 -67 -165 329 -19 -153 87 130 -294 85 155 -407 -214
6407 -214 190 -225 -234 185 -66 -330 90 85 -256 96 165 -288 95 131 -214 -113 177 -199 -175 180 23 -269
6429 -269 -4 177 -299 -116 128 -215 -37 280 -189 -252 211 146 -235 80 209 -300 23 321 -239 14 248
6450 248 -83 -151 270 -33 -279 48 93 -250 16 151 -221 -20 300 -156 -138 303 -59 -140 245 60 -238
6471 -238 136 141 -149 34 221 -119 -35 245 -55 -195 163 143 -207 202 215 -53 90 159 -163 -178 256 -41
6493 -41 -229 237 11 -145 133 96 -302 13 233 -225 -195 329 -99 -190 223 53 -149 187 123 -200 -20 256
6515 256 -168 25 294 -155 -114 243 4 -133 216 90 -286 114 273 -293 -150 329 -193 -123 319 -110 -243
6536 -243 94 61 -369 97 122 -279 -79 243 -181 -106 149 -76 -123 116 -36 -307 70 153 -261 20 162 -221
6558 -221 -57 154 -99 -253 128 71 -271 170 28 -302 83 113 -250 -124 203 -174 -148 123 51 -224 31
6579 31 100 -329 17 165 -181 -14 285 -110 -114 197 46 -213 269 111 -246 105 47 -162 -44 339 -146 -11
6601 -11 267 82 -164 258 186 -179 305 156 -227 114 244 -42 166 408 -58 -162 233 82 -144 251 191
6622 191 -149 62 377 -104 -70 297 -114 12 93 54 -234 149 221 -233 -29 187 -85 -22 358 -101 -188 258
6644 258 -64 -261 219 8 -215 18 195 -198 -161 70 -137 -68 191 -111 -261 80 66 -149 82 185 -248
6665 -248 74 3 -186 -135 148 -62 -164 260 -28 -370 -6 52 -381 -50 134 -224 -137 248 -70 -208 204
6686 204 -81 -251 48 117 -311 74 107 -294 56 265 -78 -194 263 -86 -245 187 138 -119 56 218 -133
6707 -133 7 217 -159 -121 194 -8 -63 252 97 -158 178 197 -185 63 288 -170 33 235 -67 -71 238 -44
6729 -44 -196 155 253 -159 71 214 -127 -75 217 11 -135 208 31 -283 280 113 -125 108 285 -120 7
6750 7 210 -32 -5 227 -2 -164 196 206 -124 100 113 -117 -64 156 -120 -176 356 -33 -171 154 96 -410 122
6773 122 125 -184 -20 178 -224 -223 250 32 -251 213 -168 -288 98 -10 -395 -35 13 -189 -58 144 -210 -222
6795 -222 171 -39 -322 134 5 -264 -102 99 -174 -143 91 -62 -144 160 -42 -291 73 158 -305 73 213
6816 213 -295 -107 211 -78 -151 135 -147 -101 124 -18 -251 132 199 -326 47 322 -233 -51 237 -11 -141
6837 -141 177 19 -162 142 97 -153 26 229 -100 -38 286 -76 -102 194 30 -191 215 99 -236 62 287
6858 287 -125 -33 193 -147 -117 260 -13 -160 255 77 -186 135 260 -101 38 183 -30 -74 232 -84 -173
6879 -173 197 95 -91 74 84 -159 -82 208 -162 -44 302 -47 -185 155 -81 -222 71 45 -214 103 226
6900 226 -177 -90 225 -29 -174 182 -8 -216 33 -3 -349 144 220 -229 -111 94 -29 -233 286 -85 -274
6921 -274 163 52 -93 53 173 -279 -200 223 -215 -164 87 -86 -238 129 112 -303 1 156 -357 -79 74
6942 74 -246 126 280 14 -238 183 39 -175 168 114 -160 16 216 -146 -69 200 -74 -189 248 64 -232
6963 -232 164 23 -269 134 194 -142 -105 211 -111 -92 260 -79 -236 109 54 -226 100 158 -146 -133 314 -118
6985 -118 -202 240 82 -232 230 120 -208 147 169 -183 39 307 -138 -141 195 -36 -152 223 44 -124 136
7006 136 107 -152 52 162 -165 -129 196 -72 -59 75 -30 -246 34 50 -194 11 137 -207 -53 166 -158
7027 -158 -169 42 -9 -244 22 2 -186 -7 63 -245 -119 246 -118 -188 272 -89 -164 141 118 -237 22 237
7049 237 -278 -69 313 -127 -119 193 -115 -174 183 39 -201 129 204 -178 -25 99 -57 -149 164 -111 -236 224
7071 224 38 -261 77 157 -290 59 239 -104 -87 167 -81 -141 111 125 -251 109 190 -183 -24 246 -150 -21
7093 -21 295 -279 -160 297 -27 -66 260 245 -184 170 236 -167 -74 323 -190 -101 205 77 -192 181 144 -80
7115 -80 138 124 -155 -18 241 -107 -19 201 -113 -162 249 45 -222 37 92 -199 63 154 -143 -83 353 -64
7137 -64 -88 287 -140 -79 135 111 -254 166 337 -274 -41 159 -81 -148 199 -80 -160 233 266 -285 -41 235
7159 235 -170 9 268 -264 -98 238 -82 -294 114 -141 -188 -22 145 -230 -71 102 -209 -157 165 -84 -221
7180 -221 112 -74 -273 -10 83 -270 -72 228 -310 -41 190 -105 -194 35 -72 -271 18 124 -281 -56 41
7201 41 -177 40 136 6 -124 303 -95 -243 67 127 -303 96 140 -204 -118 314 -173 -78 241 -21 -70 279
7223 279 -18 -190 100 38 -112 109 248 -210 -98 295 59 -138 153 -26 -96 207 215 -269 14 216 -270
7244 -270 67 204 -213 -146 120 -42 -220 174 188 -99 -22 226 -195 -47 211 -143 -117 260 136 -251 106
7265 106 -25 -290 84 181 -140 29 312 -258 -80 191 -87 -173 181 41 -164 -85 99 -230 -160 148 -158
7286 -158 -213 192 -166 -206 173 1 -261 187 183 -201 13 197 -223 -176 138 -121 -196 87 -93 -289 13 107
7308 107 -285 -27 173 -335 -83 167 -143 -264 53 -68 -105 -9 187 -369 -99 222 -215 -20 168 -108 -113
7329 -113 268 -56 -287 170 93 -180 124 181 -278 0 260 -58 -74 257 -31 -125 283 47 -133 122 174 -194
7351 -194 78 314 -2 -188 268 66 -190 299 48 -122 127 11 -133 47 138 -120 38 232 -116 -131 252
7372 252 -7 -191 -7 183 -196 20 168 -152 -63 264 -66 -70 188 40 -149 212 113 -190 153 215 -242 -41
7394 -41 205 -126 -137 193 -102 -175 151 66 -155 55 249 -192 -41 168 -122 -48 160 -131 -219 179 27 -275
7416 -275 -91 58 -269 -30 120 -350 -84 274 -92 -257 262 -11 -302 164 60 -163 -42 29 -135 -132 206
7437 206 -141 -123 288 -57 -126 123 77 -165 40 181 -219 13 201 -183 -104 177 -162 -173 236 70 -135 141
7459 141 193 -166 15 102 -115 -56 257 59 -183 107 -56 -189 141 191 -55 38 128 -89 -121 159 -19 -99 203
7482 203 3 -198 196 346 -124 56 274 -39 16 365 -1 -111 193 1 -213 239 157 -172 137 291 -108
7503 -108 50 290 56 -54 135 -31 -61 35 27 -149 50 163 -138 34 255 -137 -184 303 -115 -203 182 -17
7525 -17 -305 126 163 -159 -35 190 -230 -38 78 -82 -111 140 -82 -203 77 135 -243 -56 156 -213 -67
7546 -67 248 -173 -147 321 28 -231 215 98 -222 117 65 -318 12 306 -154 -200 46 -9 -237 215 35 -141
7568 -141 46 71 -87 14 127 -169 -115 30 59 -226 187 -67 -306 0 160 -212 24 193 12 -74 159
7589 159 -152 -213 239 43 -76 143 101 -160 -23 211 -34 -57 200 -57 17 156 32 -143 115 134 -161 60
7611 60 189 -152 -34 265 -24 -256 217 77 -124 184 96 -111 138 156 -95 105 200 -161 -115 121 155 -207
7633 -207 227 37 -257 134 145 -143 -33 235 -30 -121 194 41 -214 136 -22 -283 43 146 -154 58 126
7654 126 -152 -91 132 -151 -106 35 -66 -242 -6 153 -281 -39 189 -155 -168 45 -146 -227 134 -22 -287
7675 -287 58 5 -385 96 77 -239 34 248 -14 -158 222 -131 -253 120 58 -230 -20 147 -288 -64 107
7696 107 -198 -69 -17 33 -116 203 75 -200 151 130 -124 36 291 -265 -27 229 -27 -64 163 89 -79 127
7718 127 106 -92 33 206 -69 83 246 -22 -125 254 56 -57 187 150 -183 132 204 -119 69 172 -21
7739 -21 -75 180 -12 -168 152 150 -172 83 164 -221 -38 77 -217 -53 310 -19 -135 141 40 -244 73 26
7761 26 -246 -1 195 -218 -60 47 -124 -109 79 -9 -188 66 11 -179 23 195 -164 -186 115 -109 -109 144
7783 144 -104 -331 158 107 -142 115 76 -266 -99 243 -102 -132 91 10 -186 31 -16 -288 90 208 -265 -71
7805 -71 102 -158 -155 112 -161 -293 174 66 -228 184 69 -302 42 214 -300 -112 117 -58 -166 174 42
7826 42 -127 99 42 -215 72 175 -123 -84 204 -111 -181 255 107 -238 8 20 -21 77 178 -72 -25 222 -36
7849 -36 -145 268 -27 -53 346 -8 -180 32 175 -189 100 315 -81 -137 112 -30 -124 168 152 -145 92 168
7871 168 -184 6 228 -91 -27 220 84 -121 163 28 -79 6 166 -220 13 130 -156 2 217 -89 -145
7892 -145 101 101 -148 74 59 -307 66 67 -35 -106 62 -197 -253 138 42 -141 188 95 -143 22 139 -144 -49
7915 -49 209 -133 -206 134 -22 -204 135 4 -219 -36 102 -185 -107 140 -216 -83 121 -179 -162 47 22 -194
7937 -194 270 41 -238 -56 153 -87 -145 226 -25 -139 142 -106 -220 136 139 -199 108 135 -144 -71 112 -187
7959 -187 41 264 -45 -187 116 40 -134 34 155 -97 33 241 -1 -14 246 22 -40 97 152 -139 77
7980 77 221 -90 166 154 -75 -129 227 -40 -250 265 107 -230 186 127 -264 63 235 -109 51 254 -82
8001 -82 7 107 -1 -218 119 89 -165 -7 113 -101 -100 191 -71 -79 130 -90 -127 78 43 -109 -79 150 -163
8024 -163 -88 126 -170 -111 183 3 -263 38 -68 -197 15 68 -150 48 139 -77 -49 217 18 -111 46 46
8046 46 -194 53 85 -177 -16 79 -159 -162 282 -140 -205 213 -31 -153 61 53 -244 93 235 -238 -158 97 -119
8069 -119 -98 83 -54 -238 65 21 -203 -23 48 -100 -71 170 -109 -60 172 -1 -179 98 -43 -52 63 35 -7
8092 -7 2 231 -228 18 239 -86 -207 110 93 -144 44 55 -133 32 112 -182 -30 230 -45 -39 207 -14 -167
8115 -167 54 174 -185 64 119 -136 65 177 30 -21 229 69 -107 182 143 -175 18 106 -173 57 309
8136 309 -5 -155 230 -55 -95 161 52 -129 -18 67 -229 -12 222 -154 -151 93 -61 -174 199 -14 -281
8157 -281 45 86 -162 -37 118 -25 -99 138 -75 -205 113 -178 -184 126 35 -228 -58 118 -209 -181 146 -66
8179 -66 -158 124 -195 -149 146 27 -142 -25 102 -140 -9 229
8191B29
##END NTUPLES=NMR FID
##END=
