##TITLE=1H_EC-3059(IX)
 CDCl3, 8 sc, 
 3.7.2019
##JCAMPDX= 6.0         $$ Bruker NMR JCAMP-DX V2.0
##DATA TYPE= NMR FID
##DATA CLASS= NTUPLES
##ORIGIN= UXNMR, Bruker Analytische Messtechnik GmbH
##OWNER= root
$$ XWIN-NMR		Version 3.5
$$ Wed Jul  3 13:58:05 2019 Russian Standard Time (UT+4h)  she@DPX200
##.OBSERVE FREQUENCY= 200.13155
##.OBSERVE NUCLEUS= ^1H
##.DELAY= (6, 6)
##.ACQUISITION MODE= SIMULTANEOUS
##.ACQUISITION SCHEME= undefined
##.AVERAGES= 8
##.DIGITISER RES= 18
##SPECTROMETER/DATA SYSTEM= spect
##.PULSE SEQUENCE= zg30
##.SOLVENT NAME= THF
##.SHIFT REFERENCE= (INTERNAL, THF, 0, 15.7039)
##AUDIT TRAIL= $$ (NUMBER, WHEN, WHO, WHERE, WHAT)
$$ ##TITLE= Audit trail, XWIN-NMR		Version 3.5
$$ ##JCAMPDX= 5.01
$$ ##ORIGIN= Bruker BioSpin GmbH
$$ ##OWNER= she
$$ F:/spectra/data/she/nmr/H-F/1/audita.txt
$$ ##AUDIT TRAIL=  $$ (NUMBER, WHEN, WHO, WHERE, WHAT)
(   1,<2019-07-03 13:56:15.10 +0400>,<she>,<DPX200>,
      <created by zg, POWCHK disabled, PULCHK disabled
       configuration hash MD5:
       00 E9 B6 7A A2 85 ED C7 34 08 36 98 17 FE 4E 26
       data hash MD5: 16K
       B2 BD D4 3D 22 DC 06 54 F8 45 38 81 62 4C D3 9D>)
$$ ##END=
$$ 
$$ hash MD5
$$ C4 CB 03 3E D5 52 9F F0 51 E1 48 A0 2C 42 5B 6A
##$RELAX= 
##$RELAX= 
##$RELAX= 
##$RELAX= 
##$RELAX= 
##$RELAX= 
$$ Bruker specific parameters
$$ --------------------------
##$DU= <F:/spectra>
##$EXPNO= 1
##$NAME= <H-F>
##$PROCNO= 1
##$TYPE= <nmr>
##$USER= <she>
##$AMP= (0..31)
100 100 100 100 100 100 100 100 100 100 100 100 100 100 100 100 100 100 
100 100 100 100 100 100 100 100 100 100 100 100 100 100 
##$AQSEQ= 0
##$AQ_mod= 1
##$AUNM= <au_zg>
##$AUTOPOS= <>
##$BF1= 200.13
##$BF2= 200.13
##$BF3= 200.13
##$BF4= 200.13
##$BF5= 200.13
##$BF6= 200.13
##$BF7= 200.13
##$BF8= 200.13
##$BYTORDA= 1
##$CFDGTYP= 0
##$CFRGTYP= 5
##$CHEMSTR= <none>
##$CNST= (0..31)
1 1 145 1 1 1 1 1 1 1 1 1 1 1 1 1 1 1 1 1 1 1 1 1 1 1 1 1 1 1 1 1 
##$CPDPRG= <>
##$CPDPRG1= <>
##$CPDPRG2= <>
##$CPDPRG3= <>
##$CPDPRG4= <mlev>
##$CPDPRG5= <mlev>
##$CPDPRG6= <mlev>
##$CPDPRG7= <mlev>
##$CPDPRG8= <mlev>
##$CPDPRGB= <>
##$CPDPRGT= <>
##$D= (0..31)
0 1.2 0 0 0 0 0 0 0 0 0 0.03 0 0 0 0 0 0 0 0 0 0 0 0 0 0 0 0 0 0 0 0 
##$DATE= 1562147774
##$DBL= (0..7)
120 120 120 120 120 120 120 120 
##$DBP= (0..7)
150 150 150 150 150 150 150 150 
##$DBP07= 0
##$DBPNAM0= <>
##$DBPNAM1= <>
##$DBPNAM2= <>
##$DBPNAM3= <>
##$DBPNAM4= <>
##$DBPNAM5= <>
##$DBPNAM6= <>
##$DBPNAM7= <>
##$DBPOAL= (0..7)
0.5 0.5 0.5 0.5 0.5 0.5 0.5 0.5 
##$DBPOFFS= (0..7)
0 0 0 0 0 0 0 0 
##$DE= 6
##$DECBNUC= <off>
##$DECIM= 24
##$DECNUC= <off>
##$DECSTAT= 4
##$DIGMOD= 1
##$DIGTYP= 9
##$DL= (0..7)
0 120 120 120 120 120 120 120 
##$DP= (0..7)
150 150 150 150 150 150 150 150 
##$DP07= 0
##$DPNAME0= <>
##$DPNAME1= <>
##$DPNAME2= <>
##$DPNAME3= <>
##$DPNAME4= <>
##$DPNAME5= <>
##$DPNAME6= <>
##$DPNAME7= <>
##$DPOAL= (0..7)
0.5 0.5 0.5 0.5 0.5 0.5 0.5 0.5 
##$DPOFFS= (0..7)
0 0 0 0 0 0 0 0 
##$DQDMODE= 0
##$DR= 18
##$DS= 0
##$DSLIST= <SSSSSSSSSSSSSSS>
##$DSPFIRM= 0
$$ [...]
##$SUBNAM2= <"">
##$SUBNAM3= <"">
##$SUBNAM4= <"">
##$SUBNAM5= <"">
##$SUBNAM6= <"">
##$SUBNAM7= <"">
##$SUBNAM8= <"">
##$SUBNAM9= <"">
##$SW= 24.9336996594482
##$SWIBOX= (0..15)
0 0 2 0 0 0 0 0 0 0 0 0 0 0 0 0 
##$SW_h= 4990.01996007984
##$TD= 16384
##$TD0= 1
##$TE= 0
##$TE2= 300
##$TE3= 300
##$TEG= 300
##$TL= (0..7)
0 120 120 120 120 120 120 120 
##$TP= (0..7)
150 150 150 150 150 150 150 150 
##$TP07= 0
##$TPNAME0= <>
##$TPNAME1= <>
##$TPNAME2= <>
##$TPNAME3= <>
##$TPNAME4= <>
##$TPNAME5= <>
##$TPNAME6= <>
##$TPNAME7= <>
##$TPOAL= (0..7)
0.5 0.5 0.5 0.5 0.5 0.5 0.5 0.5 
##$TPOFFS= (0..7)
0 0 0 0 0 0 0 0 
##$TUNHIN= 0
##$TUNHOUT= 0
##$TUNXOUT= 0
##$USERA1= <user>
##$USERA2= <user>
##$USERA3= <user>
##$USERA4= <user>
##$USERA5= <user>
##$V9= 5
##$VALIST= <valist>
##$VCLIST= <CCCCCCCCCCCCCCC>
##$VD= 0
##$VDLIST= <DDDDDDDDDDDDDDD>
##$VPLIST= <PPPPPPPPPPPPPPP>
##$VTLIST= <TTTTTTTTTTTTTTT>
##$WBST= 1024
##$WBSW= 4
##$XGAIN= (0..3)
0 0 0 0 
##$XL= 0
##$YL= 0
##$YMAX_a= 419247
##$YMIN_a= -751927
##$ZGOPTNS= <>
##$ZL1= 120
##$ZL2= 120
##$ZL3= 120
##$ZL4= 120
##$ABSF1= 10
##$ABSF2= 0
##$ABSG= 5
##$ABSL= 3
##$ALPHA= 0
##$AQORDER= 0
##$ASSFAC= 0
##$ASSFACI= 0
##$ASSFACX= 0
##$ASSWID= 0
##$AUNMP= <proc_1d>
##$AZFE= 0.1
##$AZFW= 0.1
##$BCFW= 1
##$BC_mod= 2
##$BYTORDP= 1
##$COROFFS= 0
##$CY= 11.3945322036743
##$DATMOD= 1
##$DC= 2
##$DFILT= <>
##$DTYPP= 0
##$F1P= 18.9103706918063
##$F2P= -1.10871071338519
##$FCOR= 0.5
##$FTSIZE= 0
##$FT_mod= 4
##$GAMMA= 1
##$GB= 0.15
##$INTBC= 1
##$INTSCL= 1
##$ISEN= 128
##$LB= 0.24
##$LEV0= 0
##$LPBIN= 0
##$MAXI= 10000
##$MC2= 0
##$MEAN= 0
##$ME_mod= 0
##$MI= 1.114404
##$NCOEF= 0
##$NC_proc= 0
##$NLEV= 6
##$NOISF1= 3.799351
##$NOISF2= 2.8
##$NSP= 1
##$NTH_PI= 0
##$NZP= 0
##$OFFSET= 15.70392
##$PC= 1
##$PHC0= -8501.691
##$PHC1= 14.40097
##$PH_mod= 1
##$PKNL= yes
##$PPARMOD= 0
##$PSCAL= 0
##$PSIGN= 0
##$REVERSE= no
##$SF= 200.130013532006
##$SI= 16384
##$SIGF1= 3
##$SIGF2= 2
##$SINO= 400
##$SIOLD= 16384
##$SREGLST= <1H.CDCl3>
##$SSB= 0
##$STSI= 0
##$STSR= 0
##$SW_p= 3612.71676300578
##$SYMM= 0
##$S_DEV= 0
##$TDeff= 0
##$TDoff= 0
##$TI= <>
##$TILT= no
##$TM1= 0
##$TM2= 0
##$TOPLEV= 0
##$USERP1= <user>
##$USERP2= <user>
##$USERP3= <user>
##$USERP4= <user>
##$USERP5= <user>
##$WDW= 1
##$XDIM= 8192
##$YMAX_p= 0
##$YMIN_p= 0
$$ End of Bruker specific parameters
$$ ---------------------------------
##NTUPLES= NMR FID
##VAR_NAME=  TIME,          FID/REAL,        FID/IMAG
##SYMBOL=    X,             R,               I
##VAR_TYPE=  INDEPENDENT,   DEPENDENT,       DEPENDENT
##VAR_FORM=  AFFN,          ASDF,            ASDF
##VAR_DIM=   8192,          8192,            8192
##UNITS=     SECONDS,       ARBITRARY UNITS, ARBITRARY UNITS
##FACTOR=    0.0002004,     1,               1
##FIRST=     0,             0,               0
##LAST=      1.6414764,     0,               0
##MIN=       0,             -751927,         0
##MAX=       1.6414764,     419247,          0
$$ Real data points
##PAGE= N=1
##DATA TABLE= (X++(R..R)), XYDATA
$$ [...]
$$ plain form
2770 1374 1674 -1164 -4435 -5535 -3261 -1057 -3383 -5688 -4468 -3144 -3940 -4945 -4750 -4733 -2481 -288
2786 -288 -1654 -3724 -3473 -1619 268 1534 309 -494 -78 485 801 1644 2331 1193 2160 2718 628
2803 628 -1352 1231 4547 3742 1409 -401 -129 2262 3284 863 728 3362 3432 919 15 875 2089
2820 2089 3148 3150 461 -490 -135 718 2159 1525 -1940 -2653 878 1558 -2690 -4357 -2387 -656 -931
2837 -931 -2577 -4669 -3627 -1006 -1756 -3747 -3400 -1968 -1330 -640 -1602 -3343 -3469 -236 1137 1058 -251
2854 -251 -1533 -1159 717 903 467 2368 3949 1450 -427 -599 361 2534 5668 4444 514 -883
2870 -883 85 1853 3794 3816 2837 2461 1527 -791 -1347 1810 4927 4833 2037 -1832 -4427 -2186 1743
2887 1743 3437 1953 -1088 -4033 -4311 -1688 -2139 -2641 -277 685 -3053 -7386 -7683 -3854 1131 1931
$$ packed form
2770A374L00k838l271j100K274K204k326k305J220J324p96j005J95J7K252K193
2786b88j366k070K51J854J887J266j225q03M16N63L16Q43O87j138R67N58k090
2803F28j980K583L316q05k333j810K72K391J022k421j35K634P0k513r04Q60J214
2820B089J059Kk689r51L55Q53J441o34l465p13L531O80m248j667J970J731k75
2837i31j646k092J042K621p50j991L47J432O38O90r62j741j26L233J373p9j309
2854b51j282L74J876J86m36J901J581k499j877j72R60K173L134j224l930j397
2870h83R68J768J941K2r79l76r34k318n56L157L117r4k796l869k595K241L929
2887A743J694j484l041k945k78K623m51n02K364R62l738m333k97L829M985Q00
$$ plain form
2903 1931 -1612 -5514 -5534 -4012 -1389 1181 952 -504 -269 -306 -2220 -1626 1879 4993 5054 1994 -1715
2920 -1715 -1856 3353 6100 4073 2387 2685 2299 1933 2364 2368 2948 4481 3759 1442 -271 -468 1552 3922
2938 3922 2562 -1879 -2396 609 1140 -1106 -2280 -2539 -1765 -61 -1347 -4071 -4030 -2442 -2696 -3038 -2752
2955 -2752 -3510 -2544 -830 -2319 -5331 -5131 -1539 1421 702 -1842 -3944 -2436 551 950 908 2416 1780
2972 1780 652 505 862 779 3705 6847 4720 747 -858 510 4006 6858 5396 2086 1673 1322
2988 1322 344 1217 2992 3775 2997 1408 -2540 -3424 -1208 1569 2872 1379 -2786 -6091 -3522 -372
3004 -372 -1336 -2466 -1281 -1534 -3567 -5517 -4801 -2806 396 709 -2772 -4720 -4714 -2693 179 1487 -773
3021 -773 -2249 -971 334 -795 -684 983 2994 3863 1604 -2218 -688 4544 5101 2920 2052 1768
$$ packed form
2903A931l543l902k0J522K623K570k29j456K35l7j914N94L505L114O1l060l709
2920a715j41N209K747k027j686K98l86l66M31MN80J533p22k317j713j97K020K370
2938C922j360m441n17L005N31k246j174k59P74J704j286k724M1J588k54l42K86
2955b752p58R66J714j489l012K00L592K960p19k544k102J508K987L99m2J508o36
2972A780j128j47L57q3K926L142k127l973j605J368L496K852j462l310m13l51
2988A322r78Q73J775P83p78j589l948q84K216K777J303j493m165l305K569L150
3004c72r64j130J185k53k033j950P16J995L202L13l481j948OK021K872J308k260
3021g73j476J278J305j129J11J667K011Q69k259l822J530N232N57k181q68k84
$$ plain form
3037 1768 1939 3071 3378 2244 2186 3569 2762 1533 401 204 1724 2930 1656 -1008 -1049 -46 -631
3054 -631 -114 -270 -1568 -1863 -1322 -2093 -2503 -1771 -1658 -2508 -1581 -2024 -3833 -3548 -1401 -1166 -2222 -2675 -2381
3073 -2381 -2025 -1248 -1013 -1700 -889 -480 -758 -122 -416 -1145 586 3327 2046 -1071 -246 2159 3277 3174
3091 3174 1293 915 3323 4487 1815 684 3215 4355 3218 2055 895 1044 2268 2928 1680 551
3107 551 -203 -526 535 403 -1605 -2089 -53 -360 -2983 -3932 -2100 -1650 -2182 -3048 -3824 -3032 -1854 -2776
3125 -2776 -3981 -2699 -1754 -2624 -2302 -1729 -1505 -1003 -1086 -1688 -968 949 1133 618 714 752 893 2203 2343
3144 2343 1742 3325 4412 1724 -8 2208 4684 4816 3856 1886 1113 1654 2455 1552 2367 3451 2295
3161 2295 197 -1426 -1924 -285 2295 2727 -848 -3656 -4205 -2949 -671 -362 -1787 -1976 -1746 -4971
$$ packed form
3037A768J71J132L07j134n8J383q07j229j132j97J520J206j274k664m1J003n85
3054f31N17j56j298k95N41p71m10P32J13q50R27m43j809K85K147K35j056m53K94
3073b381L56P77K35o87Q11M09k78O36k94p29J731K741j281l117Q25K405J118j03
3091C174j881l78K408J164k672j131K531J140j137j163j160J49J224O60j248j129
3107E51p54l23J061j32k008m84K036l07k623r49J832M50n32q66p76P92J178r22
3125b776j205J282R45q70L22N73K24N02q3o02P20J917J84n15R6L8J41J310J40
3144B343o01J583J087k688j732K216K476J32r60j970p73N41Q01r03Q15J084j156
3161B295k098j623m98J639K580M32l575k808n49J256K278L09j425j89K30l225
$$ plain form
3177 -4971 -6932 -3477 871 661 -1759 -4088 -4862 -4043 -1924 -41 1226 1173 -1104 -4055 -3074 -40
3193 -40 1946 3971 3404 67 -1064 -48 969 2973 4863 4584 2511 650 -522 178 4591 6686
3209 6686 3708 784 229 947 1151 1609 1892 2728 2834 -438 -3304 -2268 1158 1833 656 -1751 -3469
3226 -3469 -2732 -424 -1510 -3073 -1830 -446 -1616 -3151 -4100 -3292 -278 712 -2743 -4977 -1646 848
3242 848 -368 -2410 -2814 -1132 858 584 -1318 -1249 678 348 92 533 1051 1841 3406 1887 -693
3259 -693 -30 3041 4046 3331 3347 1595 1285 1757 1844 3072 4576 4370 612 -857 14 1071 2039 2325
3277 2325 1014 -996 -2334 -3295 -3062 -699 656 -732 -2311 -4359 -6076 -3780 -110 -214 -2695 -2320
3293 -2320 -2599 -4002 -3841 -1493 1367 2677 -146 -4324 -3011 1140 2312 907 812 1412 1210 115
$$ packed form
3177d971j961L455M348k10k420k329p74Q19K119J883J267n3k277k951R81L034
3193d0J986K025n67l337j131J016J017K004J890k79k073j861j172P00M413K095
3209F686k978k924n55P18K04M58K83Q36J06l272k866J036L426O75j177k407j718
3226c469P37K308j086j563J243J384j170j535r49Q08L014R90l455k234L331K494
3242H48j216k042m04J682J990k74j902O9J927l30k56M41N18P90J565j519k580
3259f93O63L071J005p15J6j752l10M72Q7J228J504k06l758j469Q71J057R68K86
3277B325j311k010j338r61K33K363J355j388j579k048j717K296L670j04k481L75
3293b320k79j403J61K348K860J310k823m178J313M151J172j405r5O00k02j095
$$ plain form
3309 115 -1125 -646 3202 4843 1847 -262 -527 -124 1736 3464 3080 981 377 1357 869 827 1845
3326 1845 2555 3187 1213 -1159 -447 2059 2450 -19 -423 634 765 -967 -2610 -2326 133 1223 -2507
3343 -2507 -4834 -2854 -685 -1406 -2605 -3777 -2672 -1095 -831 -2828 -3086 -426 324 -1356 -1482 -951
3359 -951 385 998 -3 -948 859 2096 1061 303 582 622 1344 2034 955 -406 610 2528 2327
3376 2327 372 -1111 5 2655 3372 190 -1835 1001 3838 2501 217 302 1998 3121 1238 -7
3392 -7 956 2275 215 -499 956 1312 -1175 -2173 -828 -230 -1081 -2867 -3961 -2466 -1182 -2845 -4365
3409 -4365 -2955 -2471 -2962 -2668 -2290 -2529 -1996 -1123 -1305 -1318 -730 -281 441 1627 519 -287 1963 3281
3427 3281 1852 772 2163 3606 4003 2257 -241 1099 5038 5505 848 -1050 1353 4062 3706 407
$$ packed form
3309A15j240M79L848J641k996k109k65M03J860J728l84k099o04R80m88m2J018
3326A845P10O32j974k372P12K506L91k469m04J057J31j732j643K84K459J090l730
3343b507k327J980K169p21j199j172J105J577K64j997k58K660P50j680j26N31
3359i51J336O13j001r45J807J237j035p58K79M0P22O90j079j361J016J918k01
3376B327j955j483J116K650P17l182k025K836K837j337k284Q5J696J123j883j245
3392gR63J319k060p14J455L56k487r98J345N98q51j786j094J495J284j663j520
3409d365J410M84m91K94L78k39N33Q73j82j3N88M49P22J186j108q06K250J318
3427C281j429j080J391J443L97j746k498J340L939M67m657j898K403K709l56l299
$$ plain form
3443 407 -1175 1496 4199 2051 -2254 -1809 712 1905 1260 -1084 -2663 -1945 -697 -1053 -1608 -1469 -2748
3460 -2748 -3329 -2517 -3080 -4155 -2896 -1009 -1993 -4038 -4924 -3400 -1385 -1036 -2484 -1791 457 -668 -2992
3477 -2992 -1518 1968 3555 2041 536 242 1757 3196 2941 3688 5083 3740 763 2077 4259 4107
3493 4107 3267 2707 3035 3043 1947 -127 -29 2617 3313 1311 -1187 -2215 -2045 -106 1198 -1005 -3199
3510 -3199 -2654 -2194 -2068 -2799 -3551 -3547 -1681 -1444 -4239 -5535 -3550 -1893 -1596 -2313 -3530 -3028 -1039 -1254
3528 -1254 -2822 -1480 580 1167 324 -597 -136 2230 3353 1509 864 3436 4312 2960 2281 2605 3210
3545 3210 3556 4293 3119 2454 2311 2172 2463 3117 2306 865 896 1519 -13 -592 -210 -28 -35 -785 -2072
3564 -2072 -2747 -2723 -3211 -2603 -990 -1461 -4348 -5952 -3527 -2434 -2988 -3253 -3388 -2390 -2111 -3103 -3840 -1566
$$ packed form
3443D07j582K671K703k148m305M45K521J193o45k344j579P18J248l56n55J39j279
3460b748n81Q12n63j075J259J887r84k045q86J524K015L49j448O93K248j125k324
3477b992J474L486J587j514j505k94J515J439k55P47J395j343k977J314K182j52
3493D107q40n60L28Qj096k074R8K646O96k002k498j028J70J939J304k203k194
3510c199N45M60J26p31p52MJ866K37k795j296J985J657K97p17j217N02J989k15
3528a254j568J342K060N87q43r21M61K366J123j844o45K572Q76j352o79L24O05
3545C210L46P37j174o65j43j39K91O54q11j441L1O23j532n79L82J82pp50j287
3564b072o75K4m88O08J613m71k887j604K425J093n54k65j35R98K79r92p37K274
$$ plain form
3582 -1566 1025 524 -741 -935 -661 727 2343 2208 2032 2759 3222 2587 1944 2941 3692 4928 4291 2303
3600 2303 1245 2776 3773 2930 1924 1424 1590 1383 446 -1086 -751 587 918 -383 -1816 -3014 -2276
3617 -2276 -548 -792 -2342 -2353 -1830 -2083 -2415 -2135 -1887 -1551 -797 -1720 -2182 -1326 -1327 -1870 -905 130 -831 -1788
3637 -1788 -894 -337 -224 -305 -564 221 800 180 -427 527 1431 1235 1145 2018 1433 942 1530 2097 2203 2240 2045
3658 2045 2061 2292 1685 577 1547 2510 1601 24 207 893 895 235 -519 -650 184 -153 -1189 -1553 -837 -853
3678 -853 -1036 -614 -1619 -2081 -1190 -531 -1405 -1434 -1547 -1584 -1234 -1085 -1827 -1880 -688 -556 -1430 -1789 -1180 -847
3698 -847 -757 -210 -968 -886 -129 54 272 559 810 1035 1962 1293 947 1881 2936 2409 1665 2958 2651 2326
3718 2326 2602 2227 1988 2515 1992 1288 1312 1397 543 515 905 204 -1238 -888 -385 -1314 -1871 -2556 -2071 -1646
$$ packed form
3582a566K591n01j265j94K74J388J616j35j76P27M63o35o43R97P51J236o37j988
3600B303j058J531R97q43j006n00J66k07r37j532L35J338L31j301j433j198P38
3617b276J728k44j550j1N23k53l32K80K48L36P54r23m62Q56jn43R65J035r61r57
3637a788Q94N57J13q1k59P85N79o20o07R54R04j96r0Q73n85m91N88N67J06L7j95
3658B045J6K31o07j108R70R63r09j577J83O86Ko60p54j31Q34l37j036l64P16j6
3678h53j83M22j005m62Q91O59q74k9j13l7L50J49p42n3J192J32q74l59O09L33
3698h47R0N47p58Q2P57J83K18K87K51K25R27o69l46R34J055n27p44J293l07l25
3718B326K76l75k39N27n23p04K4Q5q54k8L90p01j442L50N03r29n57o85M85M25
$$ plain form
3738 -1646 -2494 -3590 -3380 -1784 -2319 -3698 -3386 -2595 -2657 -2314 -1774 -2022 -1830 -1002 -902 -673 -26 -158 680
3757 680 1550 1287 395 1463 2461 2377 2053 2426 2355 2658 3109 2371 2299 3031 2426 1188 1571 2308 1309 841
3777 841 1561 488 51 44 -58 -84 -24 -769 -1396 -1007 -780 -1064 -1249 -1623 -2433 -1948 -573 -1576 -2426 -2235
3797 -2235 -1394 -1336 -1793 -2378 -2313 -924 -161 -1760 -2387 -1692 -862 38 -79 -673 -802 401 815 122 350
3816 350 1257 1865 2518 1516 -161 998 3669 4065 1784 1155 2020 2526 2119 2044 1321 1865 2560 934
3834 934 -590 -483 959 836 596 -652 -1943 -1686 -608 -495 -1128 -1595 -1748 -1582 -1495 -2029 -2456 -566
3852 -566 -88 -1938 -2133 -1457 -1421 -1289 -347 -416 -753 -1473 -1927 -1347 323 617 -981 -1523 -416 178 -293
3871 -293 -545 -66 923 1918 602 -828 877 2933 2978 2241 1252 965 2709 4372 2932 1220 1737 3458
$$ packed form
3738a646q48j096K10J596n35j379L12P91o2L43N40k48J92Q28J00K29O47j32Q38
3757F80Q70k63q92J068R98q4l24L73p1L03M51p38p2P32o05j238L83P37r99m68
3777H41P20j073m37pj02k6O0p45o27L89K27k84j85l74q10M85J375j003q50J91
3797b235Q41N8m57n85O5J389P63j599o27O95Q30R00j17n94j29J203M14o93K28
3816C50R07O08O53j002j677J159K671L96k281o29Q65N06m07p5p23N44O95j626
3834I34j524J07J442j23k40j248j291K57J078J13o33m67j53J66Q7n34m27J890
3852e66M78j850j95O76L6J32R42o9l37p20m54N80J670K94j598n42J107N94m71
3871b93k52M79R89R95j316j430J705K056M5p37r89k87J744J663j440j712N17J721
$$ plain form
3889 3458 2985 1330 315 1237 2566 2294 -532 -2392 -934 242 64 -1123 -3389 -3505 -1450 -1161
3905 -1161 -3379 -3836 -2038 -1102 -1783 -3405 -3826 -1508 234 -75 -2690 -2131 -341 336 133 215 -99 -139
3923 -139 579 261 702 883 1092 1080 1350 599 -446 851 2240 2004 1511 856 823 627 2072 2329 1711
3942 1711 1394 966 713 2041 2019 350 305 2249 2398 55 -1802 -1161 1368 1915 -612 -3691 -2453
3959 -2453 388 -275 -2303 -3123 -2382 -1395 -1005 -2915 -4239 -2119 291 -897 -2414 -3151 -1876 277
3975 277 1088 -922 -2163 -470 1644 1644 -432 -769 928 2945 2370 -562 -691 2236 3706 1977 238
3992 238 -34 1418 3034 2325 -57 160 2254 2176 649 409 1111 1118 1391 1059 169 350 -454 -161 586
4011 586 1073 -786 -2091 -1149 167 -393 -1188 -2409 -1761 -875 -1248 -2669 -2830 -1624 -1407 -1538 -1091 -2486
$$ packed form
3889C458m73j655j015R22J329k72k826j860J458J176j78j187k266j16K055K89
3905a161k218m57J798R36o81j622m21K318J742l09k615N59J790O77k03Q2l14m0
3923a39P18l18M41J81K09j2K70p51j045J297J389k36m93o55l3j96J445K57o18
3942A711l17m28k53J328k2j669m5J944J49k343j857O41K529N47k527l079J238
3959b453K841o63k028q20P41R87L90j910j324K120K410j188j517p37J275K153
3975B77Q11k010j241J693K114%k076l37J697K017n75k932j29K927J470j729j739
3992B38k72J452J616p09k382K17K094p8j527k40P02PK73l32q90J81q04K93P47
4011E86M87j859j305R42J316n60p95j221O48Q86l73j421j61J206K17j31M47j395
$$ plain form
4029 -2486 -2920 -892 303 -905 -2458 -1501 748 1633 -307 -2013 38 3397 2580 -1046 -1548 1981
4045 1981 4291 3257 237 -552 2204 4571 2222 65 534 2684 3204 2118 -190 -889 1393 3305
4061 3305 1401 -839 -1676 -315 1129 870 -1066 -2261 -983 -205 -1423 -2517 -2152 -1383 -518 -1042 -2815
4078 -2815 -2918 -1124 -859 -1595 -1472 -797 -1301 -1350 -1261 -832 799 659 -847 -1426 24 684 -175 370 1265
4097 1265 1340 439 -228 24 2487 2892 514 -488 1255 2490 1523 296 723 1734 2739 2061 -559
4114 -559 -628 1337 2850 2450 237 -1787 -390 2371 2356 -486 -2183 -504 1075 169 -2035 -3105 -1001
4131 -1001 884 -1283 -4013 -3306 -1128 -665 -1523 -2465 -2875 -1790 -814 -1445 -2124 -850 -342 -866 -1487 -971
4149 -971 -297 1543 1717 -76 -504 769 2117 1796 1929 1004 1154 1916 1702 1009 1872 2348 1247 954
$$ packed form
4029b486m34K028J195j208j553R57K249Q85j940j706K051L359q17l626n02L529
4045A981K310j034l020p89K756K367k349k157M69K150N20j086k308o99K282J912
4061C305j904k240q37J361J444k59j936j195J278P78j218j094L65P69Q65n24j773
4078b815j03J794K65p36J23O75n04m9Q9M29J631j40j506n79J450O60q59N45Q95
4097A265P5r01o67K52K463M05k378j002J743J235r67j227M27J011J005o78k620
4114e59o9J965J513m00k213k024J397K761j5k842j697J679J579r06k204j070K104
4131a001J885k167k730P07K178M63q58r42m10J085R76o31o79J274N08n24o21N16
4149i71O74J840J74j793m28J273J348l21J33r25J50P62k14o93Q63M76j101k93
$$ plain form
4167 954 1457 1249 253 1137 1937 1751 1333 -511 -1066 302 2409 2114 -270 -1869 -1915 -146 1007 -216
4185 -216 -2595 -1641 44 -1081 -2728 -3475 -2299 -12 43 -3217 -4773 -2704 -651 -638 -1535 -1794 -1873 -999
4203 -999 -541 -1275 -692 1265 2032 1024 -777 159 2125 3722 2537 558 1512 3446 2873 1414 1524
4220 1524 2131 2600 2798 848 -346 725 2090 1486 704 -562 -736 -593 426 269 -737 -1039 -1372
4237 -1372 -972 -568 -501 -1263 -1674 -1339 -1500 -1216 -696 -2051 -2303 -375 80 -1421 -2597 -1803 -143 448
4255 448 -585 -2889 -1912 -55 567 -340 -1146 -334 381 536 172 -327 763 2443 1754 -159 294 1481
4273 1481 2620 3038 817 -92 1867 3320 1304 -102 1046 2236 2332 748 -1078 -679 1604 1972
4289 1972 176 -1041 -1400 -562 368 -199 -1545 -1807 -598 -816 -1675 -1940 -1593 -1498 -420 -1030 -2366 -1629
$$ packed form
4167I54N03k08r96Q84Q00j86m18j844n55J368K107k95k384j599m6J769J153j223
4185b16k379R54J685j125j647p47J176K287N5l260j556K069K053J3q97k59p9Q74
4203i99M58p34N83J957P67j008j801R36J966J597j185j979R54J934n73j459J10
4220A524O07M69J98j950j194J071J365o04p82j266j74J43J019j57j006l02l33
4237a372M00M04O7p62m11L35j61K84N20j355k52J928M55j501j176P94J660N91
4255D48j033k304R77J857O22r07q06Q12P15J55l64m99J090J680o89j913M53J187
4273A481J139M18k221r09J959J453k016j406J148J190R6j584j826L99K283L68
4289A972j796j217l59Q38R30n67j346k62J209k18q59k65L47R5J078o10j336P37
$$ plain form
4307 -1629 -1338 -1553 -1376 -542 -751 -1647 -1690 -671 -523 194 -124 -606 23 667 394 354 1042 1316 1465 1394
4327 1394 801 566 1880 2344 1272 935 1692 1983 1438 1650 661 1765 2798 1595 -570 -382 1507
4344 1507 1905 635 -477 -794 -4 946 -232 -2047 -1479 -605 -653 -985 -2649 -3105 -1488 -71 -1636
4361 -1636 -2933 -2651 -1390 -1153 -1641 -1998 -1909 -311 -300 -1920 -1652 299 824 184 -249 326 588 1519 1441
4380 1441 862 1742 2226 1368 1474 1725 1229 1917 2306 1345 789 1162 1345 876 871 841 621 505 357 -53 -226
4401 -226 530 59 -1147 -661 -360 -716 -874 -999 -933 -341 -477 -1674 -1967 -1033 -705 -1347 -1457 -1950 -2007 -688
4421 -688 -356 -1564 -2207 -775 -164 -950 -1213 -873 -201 625 -95 -767 371 1575 884 603 1187 1407 1384
4440 1384 1707 1581 1288 2104 2156 1137 1177 1511 1486 2029 1739 508 -282 635 1149 207 -39 -207 -428 -354
$$ packed form
4307a629K91k15J77Q34k09q96m3J019J48P17l18m82O29O44k73m0O88K74J49p1
4327A394n93k35J314M64j072l37P57K91n45K12r89J104J033j203k165J88J889
4344A507L98j270j112l17P90R50j178j815N68Q74m8l32j664m56J617J417j565
4361a636j297K82J261K37m88l57Q9J598J1j620K68J951N25o40m33N75K62R31p8
4380A441n79Q80M84q58J06K51m96O88L89r61n56L73J83m69nl0k20j16j48m10j73
4401b26P56m71j206M86L01l56j58j25O6N92j36j197k93R34L28o42j10m93n7J319
4421f88L32j208o43J432O11p86k63L40O72Q26p20o72J138J204o91k81N84K20k3
4440A384L23j26k93Q16N2j019M0L34k5N43k90j231p90R17N14r42k46j68k21P4
$$ plain form
4460 -354 -882 -1196 -545 50 -874 -1638 -1346 -1412 -1180 -864 -782 -982 -1036 -1164 -2071 -1759 -164 -309 -701 -954 -1532
4481 -1532 -1189 -351 -63 -443 -486 -67 51 -678 -591 543 1241 1015 755 -147 835 941 1119 1567 1952 1222
4501 1222 829 1490 1237 1143 1820 1642 1172 903 598 119 1009 1350 -52 -273 -67 -153 -851 -885 -343 -564
4521 -564 -1102 -1159 -1664 -1077 -986 -1846 -1887 -1130 -937 -1679 -1429 -1545 -1498 -572 -841 -1628 -1006 -221 -574 -766 -415
4542 -415 -202 233 837 554 221 455 590 597 534 1359 1128 1364 1351 989 607 1449 1900 1435 1351 1053 520 1167
4564 1167 1989 1081 530 1499 1025 -36 -204 -91 154 493 -177 -1283 -1074 -627 -1201 -1211 -785 -797 -1626 -1785
4584 -1785 -1516 -1412 -1070 -1333 -1649 -1247 -829 -1879 -1740 -351 -142 -435 -504 -537 -592 -368 67 177 570 1112
4604 1112 -243 683 1170 957 1211 1654 1917 1488 1104 1398 1474 2211 1796 996 1143 1694 1419 331 893
$$ packed form
4460c54n28l14O51N95r24p64K92o6K32L16Q2k00n4j28r07L12J595j45l92k53n78
4481a532L43Q38K88l80m3M19J18p29Q7J134O98k26k60r02R82J06J78M48L85p30
4501A222l93O61k53r4O77j78m70k69l05m79Q90L41j402k21K06q6o98l4N42k21
4521e64n38n7n05N87R1q60m1P57J93p42K50j16M7R26k69p87O22P85l53j92L51
4542d15K13M35O04k83l33K34J35Po3Q25k31K36j3l62l82Q42M51m65q4k98n33O47
4564A167Q22r08n51R69m74j061j68J13K45L39o70j106K09M47n74j0M26j2q29j59
4584a785K69J04L42k63l16M02M18j050J39J389K09k93o9l3n5K24M35J10L93N42
4604A112j355R26M87k13K54M43K63m29l84K94P6P37m15q00J47N51k75j088N62
$$ plain form
4623 893 1333 284 386 219 -200 -161 132 -509 -721 -825 -712 -1070 -1014 -1150 -1619 -1042 -1181 -1502 -1420 -1403 -1602
4644 -1602 -1635 -903 -1222 -1506 -1080 -766 -734 -412 -308 -551 82 316 -193 -18 844 729 176 849 882 889 1333
4665 1333 903 1294 1654 1865 891 1399 2373 1544 886 1404 1730 997 780 543 621 970 644 -231 15 45
4685 45 -245 -1109 -373 -533 -1002 -1275 -1183 -1187 -1646 -1331 -1685 -1356 -1043 -1573 -1881 -1222 -855 -1377 -1119 -587 -715
4706 -715 -836 -674 -660 -515 442 278 -339 374 802 517 644 1084 673 1092 1431 640 536 1212 1235 1471 1552
4727 1552 1328 749 893 1315 789 1053 1572 588 427 530 426 102 250 618 -69 -377 -604 -1061 -425 -279
4747 -279 -911 -1077 -832 -1277 -1858 -1260 -1074 -1295 -1134 -1269 -1635 -1605 -753 -1107 -584 -301 -795 -693 -527 -161
4767 -161 -304 -16 963 312 46 463 734 808 1746 826 707 1433 1228 592 1215 1594 990 1124 1462 932
$$ packed form
4623H93M40j049J02j67m19L9K93o41k12j04J13l58N6j36m69N77j39l21Q2J7j99
4644a602l3P32l19k84M26L14L2L22J04k43O33K34n09J75Q62j15n53O73L3PM44
4665A333m30L91L60K11r74N08R74q29o58N18L26p33k17k37P8L49l26q75K46L0
4685D5k90q64P36j60m69k73R2mm59L15l54L29L13n30l08O59L67n22K58N32j28
4706g15j21J62J4J45R57j64o17P13M28k85J27M40m11M19L39p91j04O76K3K36Q1
4727A552k24n79J44M22n26K64N19r84j61J03j04l24J48L68o87l08k27m57O36J46
4747b79o32j66K45m45n81N98J86k21J61j35l66L0Q52l54N23K83m94J02J66L66
4767a61j43K88R79o51k66M17K71P4R38r20j19P26k05o36O23L79o04J34L38n30
$$ plain form
4787 932 868 1010 802 539 1028 708 95 589 570 -362 -506 125 -171 -431 -617 -713 -1236 -1025 -1046 -1120 -1032 -1176
4809 -1176 -1883 -1433 -1024 -1568 -1451 -947 -801 -1488 -1505 -932 -533 -383 -172 -397 -366 361 -156 83 691 1115
4829 1115 815 835 556 434 758 1509 1588 1683 1626 459 1351 1657 1568 1126 1512 1384 868 803 650 65 350
4850 350 915 414 -699 -511 -102 -507 -186 -575 -1146 -703 -740 -1428 -1379 -1078 -939 -974 -1245 -1346 -1529 -1069 -915
4871 -915 -1208 -653 -947 -1458 -972 -159 -43 -717 -218 511 365 -139 124 423 982 917 687 409 1313 1103
4891 1103 979 1151 958 963 1603 1348 731 863 1080 1076 1079 1279 685 212 854 473 -222 -266 -177 -183 -25 -400 -1118
4914 -1118 -1112 -915 -536 -857 -1099 -1524 -1572 -868 -1101 -1727 -1396 -407 -1250 -1350 -1088 -1345 -881 -252 -289 -762 -114
4935 -114 46 -23 -24 412 281 431 1177 716 421 634 988 1555 1697 617 557 960 1893 860 610 663 853
$$ packed form
4787I32o4J42k08k63M89l20o13M94j9r32j44O31k96k60j86r6n23K11k1p4Q8j44
4809a176p07M50M09n44J17N04J46o87j7N73L99J50K11k25L1P27n17K39O08M24
4829A115l00K0k79j22L24P51P9R5n7j167Q92L06q9m42L86j28n16o5j53n85K85
4850C50N65n01j113J88M09m05L21l89n71M43l7o88M9L01J39l5k71j01j83M60J54
4871i15k93N55k94n11M86Q13J16o74M99P29j46n04K63K99N59o5k30k78R04k10
4891A103j24J72j93NO40k55o17J32K17mLK00n94m73O42l81o95m4Q9oJ58l75p18
4914a118OJ97L79l21k42m25m8P04k33o26L31R89q43j00K62k57M64O29l7m73O48
4935a14J60o9jM36j31J50P46m61k95K13L54N67J42j080o0M03R33j033k50N3J90
$$ plain form
4956 853 930 1096 540 -174 882 1202 801 -47 -191 -300 191 356 -723 -1282 -837 -634 -725 -1038 -1409 -1488
4976 -1488 -816 -888 -1450 -1303 -1237 -661 -1040 -901 -1490 -1278 -362 -114 -847 -892 -60 -260 -306 -121 189 311 613
4997 613 828 298 791 628 841 1253 1448 741 782 1376 1689 1231 813 848 1139 1855 1007 -296 160 1539
5017 1539 1302 187 92 -248 -382 651 330 -712 -1198 -773 -725 -234 -984 -1562 -1501 -173 -608 -1470 -1933
5036 -1933 -1298 -536 -590 -1190 -1577 -981 -6 -676 -874 -188 -411 -471 89 -374 -392 415 856 414 380 401 963
5057 963 1209 1358 782 752 1210 1420 949 919 986 709 1346 1680 725 -114 583 1204 931 357 -417 -530 578
5078 578 925 -400 -822 -464 -1119 -394 -406 -1184 -1452 -845 -533 -1007 -1569 -1958 -1007 -532 -521 -1901 -1968 -913
5098 -913 -98 -319 -763 -950 -375 -171 166 -426 -131 817 621 445 81 375 899 1634 1212 345 520 1368
$$ packed form
4956H53P7J66n56p14J056L20m01q48j44j09M91J65j079n59M45K03r1l13l71p9
4976a488O72p2n62J47O6N76l79J39n89K12R16K48p33m5Q32k00m6J85L10J22L02
4997F13K15n30M93j63K13M12J95p07M1N94L13m58m18L5K91P16q48j303M56J379
5017A539k37j115r5l40j34J033l21j042m86M25M8M91p50n78O1J328m35q62m63
5036a933O35P62n4o00l87N96R75o70j98O86k23o0N60m63j8Q07M41m42l4K1N62
5057I63K46J49n76l0M58K10m71l0O7k77O37L34r55q39O97O21k73n74p74j13J108
5078E78L47j325m22L58o55P25j2p78k68O07L12m74n62l89R51M75J1j380o7J055
5098i13Q15k21m44j87N75K04L37n92K95R48j96j76l64K94N24P35m22q67J75Q48
$$ plain form
5118 1368 1731 1256 993 615 1395 2020 831 -216 577 1607 1454 583 -252 -639 153 884 659 -621
5136 -621 -1049 -605 -356 -270 -1171 -1405 -865 -200 -821 -1078 -1562 -1542 -840 -203 -815 -1451 -1565 -1105 -730 -320 -368
5157 -368 -1043 -753 208 91 -395 -13 535 590 363 0 135 1015 1250 946 444 940 886 1425 1238 519 382
5178 382 1358 1708 916 388 456 1096 1788 844 -680 -494 1181 1104 142 -1257 -1149 -206 356 -19 -1387
5197 -1387 -1719 -420 -333 -697 -1571 -1836 -865 -441 -780 -2035 -1569 -758 -451 -435 -703 -979 -616 -195 89 -431
5217 -431 182 526 -78 504 412 122 626 1020 687 536 820 925 987 986 601 614 897 1238 1060 661 715 666
5239 666 655 1135 424 -555 21 807 985 202 -858 -864 60 612 -522 -1306 -1163 -244 -208 -637 -1929 -1929 -849
5260 -849 -250 -939 -2097 -1868 -907 -422 -315 -1601 -1539 -313 425 -399 -877 -130 386 640 447 -90 327
$$ packed form
5118A368L63m75k63l78P80O25j189j047P93J030j53q71q35l87P92P31k25j280
5136f21m28M44K49Q6r01k34N40O65o21k57m84K0P02O37o12o36j14M60L75M10m8
5157c68o75K90R61j17m86L82N48N5k27l63J35Q80K35l04n02M96n4N39j87p19j37
5178C82R76L50p92n28O8O40O92r44j524J86J675p7r62j399J08R43N62l75j368
5197a387l32J299Q7l64q74k65R71M24l39j255M66Q11L07J6k68k76L63M21K84n20
5217d31O13L44o04N82r2k90N04L94l33j51K84J05O2jl85J3K83L41j78l99N4m9
5239F66j1M80p11r79N76P86J78p83j060oR24N52j134p84J43R19L6m29j292%J080
5260h49N99o89j158K29R61M85J07j286O2J226P38q24m78P47N16K54j93n37M17
$$ plain form
5279 327 1433 1017 741 637 766 1239 1531 1082 575 836 1505 1424 419 463 512 844 1482 658 -61 26 716
5300 716 544 105 -127 -513 -335 179 94 -814 -1370 -842 -371 -92 -549 -1742 -1481 -607 -220 -843 -1235 -1405
5320 -1405 -1219 -329 -229 -1272 -1595 -170 5 -228 -802 -718 70 995 679 -274 23 1024 1186 902 714
5339 714 593 1688 1498 1135 363 879 1508 1296 717 443 591 1514 1437 518 -533 366 890 475 126 -699
5359 -699 -538 1 202 -748 -895 -723 -129 -385 -979 -1204 -1238 -557 -528 -706 -849 -1263 -1326 -816 -217 -676 -995
5380 -995 -525 -591 -647 -229 -107 -445 88 478 -290 106 -98 610 1005 941 528 242 1055 1488 974 1042 811
5401 811 1182 1401 1083 459 611 1594 1440 273 -17 363 444 690 615 -415 -683 420 212 -574 -1052 -764
5421 -764 -319 -293 -1145 -1785 -910 -238 -612 -1241 -1430 -1538 -720 -450 -536 -1079 -677 -243 -325 -395 -454 -679 -35 623
$$ packed form
5279C27J106m16k76j04J29M73K92m49n07K61O69q1j005M4M9L32O38q24p19Q7O90
5300G16j72m39k32l86J78N14q5r08n56N28M71K79m57j193K61Q74L87o23l92j70
5320a405J86Q90J00j043l23J425J75k33n74Q4P88R25l16r53K97J001J62k84j88
5339G14j21J095j90l63p72N16O29k12n79k74J48R23p7r19j051Q99N24m15l49q25
5359f99J61N39K01r50j47J72N94k56n94k25l4O81K9j78j43m14o3N10N99m59l19
5380i95M70o6n6M18J22l38N33L90p68L96k04P08L95o4m13k86Q13M33n14O8k31
5401H11L71K19l18o24J52R83j54j167k90L80Q1K46p5j030k68J103k08p86m78K88
5421g64M45K6q52o40Q75O72l74o29j89j08Q18K70q6n43M02M34q2p0n9k25O44O58
$$ plain form
5443 623 -39 -150 267 697 412 803 762 712 937 540 484 1202 1137 411 761 1425 699 681 807 855 717 611
5465 611 593 180 353 686 78 -668 -250 -151 40 -272 -195 -1069 -504 -270 -926 -1191 -1052 -292 -858 -1039 -1837
5486 -1837 -1684 -614 -523 -898 -1201 -839 -787 -322 -530 -1116 -382 221 295 -280 -448 355 825 964 489 -3
5506 -3 722 1408 1029 501 1052 1051 1252 1081 906 732 1180 1025 299 421 569 422 349 470 258 -22 -113 116
5528 116 -10 -216 -70 -313 -404 -260 -557 -943 -356 -675 -862 -441 -397 -950 -1261 -834 -644 -648 -765 -1055 -663
5549 -663 -45 -381 -760 -556 -23 149 -141 46 -91 296 627 199 141 486 993 702 672 776 599 1409 1241
5570 1241 886 1063 1323 1347 762 618 501 89 1087 860 -382 -9 135 215 -227 -67 -108 -761 -120 -401
5590 -401 -767 -616 -679 -596 -1060 -849 -1255 -753 -682 -1101 -1075 -445 -849 -779 -507 -448 -417 -489 -354 -272 -60 -211 -72
$$ packed form
5443F23o62j11M17M30k85L91m1n0K25l97n6P18o5p26L50O64p26j8J26M8j38j06
5465F11j8m13J73L33o08p46M18R9J91l12P7q74N65K34o56k65J39P60n66j81p98
5486a837J53J070R1l75l03L62N2M65k08n86P34O03P4n75j68Q03M70J39m75m92
5506cP25O86l79n28N51jK01j71j75j74M48j55p26J22J48j47p3J21k12k80r1K29
5528A16j26k06J46k43r1J44k97l86N87l19j87M21M4n53l11M27J90mj17k90L92
5549f63O18l36l79K04N33J72k90J87j37L87L31m28n8L45N07k91l0J04j77Q10j68
5570A241l55J77K60K4n85j44j17m12R98k27j242L73J44Q0m42J60m1o53O41k81
5590d01l66J51o3Q3m64K11m06N02P1m19K6O30m04P0K72N9L1p2J35Q2K12j51J39
$$ plain form
5613 -72 11 536 449 308 433 602 544 823 827 919 1054 980 874 1128 1056 1214 842 1197 935 155 655 1243 1107
5636 1107 388 136 166 -131 253 -42 -565 -301 -357 -733 -464 -684 -886 -665 -675 -982 -1003 -784 -1140 -945 -777
5657 -777 -1225 -1256 -514 -691 -970 -758 -99 -191 -451 -330 -162 -144 464 47 377 562 873 623 775 1085 1090 761
5679 761 1172 1090 934 891 1354 935 1072 936 963 636 917 494 302 568 -5 -417 6 -10 -607 -396 -669
5700 -669 -422 -779 -715 -862 -1035 -896 -725 -1113 -943 -942 -1067 -992 -660 -1117 -767 -493 -658 -820 -486 -707 -337
5721 -337 178 164 59 52 511 38 501 467 809 858 785 883 811 901 994 973 1224 1378 845 918 1099 873 794 845 614
5746 614 177 108 -95 33 -120 -35 -481 -432 -344 -979 -978 -825 -579 -1099 -950 -837 -1143 -666 -730 -736 -757 -393 -501
5769 -501 -527 -398 -291 -793 -180 72 -153 68 196 -155 -17 349 259 145 431 719 414 447 609 702 663 662
$$ packed form
5613g2Q3N25q7j41J25J69n8K79MR2J35p4j06K54p2J58l72L55k62p80N00N88j36
5636A107p19k52L0k97L84k95n23K64n6l76K69k20k02K21j0l07k1K19l56J95J68
5657g77m48l1P42j77k79K12O59r2k60J21J68J8O08m17L30J85L11k50J52L10Nl29
5679G61M11q2j56m3M63m19J37j36K7l27K81m23j92K66n73m12M23j6n97K11k73
5700f69K47l57O4j47j73J39J71l88J70Jj25P5L32m57L50K74j65j62L34k21L70
5721c37N15j4j05pM59m73M63l4L42M9p3R8p2R0R3k1K51J54n33P3J81k26p9N1k31
5746F14m37o9k03J28j53Q5m46M9Q8o35JJ53K46n20J49J13l06M77o4ok1L64j08
5769e01k6J29J07n02O13K52k25K21J28l51J38L66r0j14K86K88l05L3J62R3l9j
$$ plain form
5791 662 433 768 518 545 560 660 913 393 661 510 396 377 903 224 -15 358 -138 -152 -148 -139 -320 -414 -380
5814 -380 -606 -579 -589 -924 -804 -461 -703 -1060 -918 -391 -524 -436 -227 -382 -311 -243 -409 -62 125 -73 -427 189
5836 189 382 -158 -42 283 419 275 413 178 322 662 301 521 537 275 285 557 561 272 560 862 743
5857 743 646 533 234 715 550 313 147 611 325 104 -3 38 -285 -649 -299 -713 -559 -464 -762 -906 -1010
5878 -1010 -846 -1136 -1061 -902 -1168 -938 -470 -729 -968 -423 -58 -411 -393 201 -133 268 764 178 573 926
5898 926 430 568 689 735 827 809 777 873 1045 1024 773 633 616 568 43 583 437 -167 453 311 69 -38 172
5921 172 -133 -220 206 2 -341 -724 -109 -475 -490 -554 -890 -673 -508 -992 -1025 -749 -690 -710 -414 -616 -987 -558
5943 -558 -417 -821 -104 310 -185 -371 347 442 308 495 283 -9 798 694 525 875 800 664 737 922 1055
$$ packed form
5791F62k29L35k50K7J5J00K53n20K68j51j14j9N26o79k39L73m96j4MRj81r4L4
5814c80k26K7j0l35J20L43k42l57J42N27j33Q8K09j55P1O8j66L47J87j98l54O16
5836A89J93n40J16L25J36j44J38k35J44L40l61K20J6k62J0K72Mk89K88L02j19
5857G43r7j13k99M81j65k37j66M64k86k21j07M1l23l64L50m14J54R5k98j44j04
5878a010J64k90P5J59k66K30M68k59k39N45L65l53J8N94l34M01M96n86L95L53
5898I26m96J38J21M6R2j8l2R6J72k1k51j40j7m8n25N40j46o04O20j42k42j07K10
5921A72l05q7M26k04l43l83O15l66j5o4l36K17J65m84l3K76N9k0K96k02l71M29
5943e58J41m04P17M14m95j86P18R5j34J87k12k92Q07j04j69L50p5j36P3J85J33
$$ plain form
5964 1055 702 811 633 485 521 616 164 326 773 273 416 150 -373 -527 184 326 -438 -617 -659 -421 -340
5985 -340 -623 -968 -1024 -619 -333 -893 -888 -596 -768 -404 -302 -836 -858 -295 -334 -533 132 -393 29 -131 234 177
6007 177 102 672 74 152 362 647 353 811 469 684 712 763 491 316 937 620 848 729 107 94 404 366
6029 366 465 363 -286 -191 141 320 -206 -381 -309 -892 -637 -111 -732 -1083 -857 -175 -389 -932 -917 -1086 -582
6050 -582 -147 -808 -1064 -752 -452 -177 88 -242 -413 -263 131 198 71 283 311 409 701 742 278 741 597
6071 597 544 676 1078 546 571 449 584 846 661 264 -132 91 754 670 288 -260 -440 275 687 8 -325
6092 -325 -158 -403 -143 -250 -275 -740 -807 -339 -394 -817 -549 -810 -968 -297 -529 -828 -874 -578 -437 139 10
6113 10 -671 -444 -129 23 114 15 -5 86 748 440 327 398 390 684 446 1045 699 620 607 721 290 980 832
$$ packed form
5964A055l53J09j78j48L6R5m52J62M47n00J43k66n23j54P11J42p64j79m2K38Q1
5985c40k83l45n6M05K86n60NK92j72L64J02n34k2N63l9j99O65n25M22j60L65n7
6007A77p5N70n98P8K10K85k94M58l42K15K8N1k72j75O21l17K28j19o22j3L10l8
6029C66R9j02o49R5L32J79n26j75P2n83K55N26o21l51K26O82k14n43J5j69N04
6050e82M35o61k56L12L00K75K65l30j71J50L94O7j27K12K8R8K92M1m64M63j44
6071E97n3J32M02n32K5j22J35K62j85l97l96K23O63q4l82n48j80P15M12o79l33
6092c25J67k45K60j07k5m65o7M68n5m23K68k61j58O71k32k99m6K96J41N76j29
6113A0o81K27L15J52R1r9k0R1O62l08j13P1qK94k38N99l46p9j3J14m31O90j48
$$ plain form
6136 832 346 87 223 869 583 477 -449 -227 387 558 135 -521 -536 -521 89 119 -1032 -875 -431 -315 -316
6157 -316 -933 -956 -878 -314 -146 -891 -1013 -696 -574 -176 96 -388 -667 -371 -16 -20 -48 -22 -126 215 409 446
6179 446 324 396 492 726 567 793 559 605 563 793 1023 700 316 545 687 520 457 737 430 -415 237 125
6201 125 301 -58 -612 -634 194 447 -132 -842 -1156 -325 -178 -73 -803 -1289 -638 124 -394 -773 -904 -714
6221 -714 92 10 -612 -830 -912 -143 -83 143 -203 -592 44 637 323 309 465 300 437 652 758 304 305 524
6243 524 885 776 767 430 569 536 637 454 524 287 57 153 496 288 -28 -304 -375 -81 219 58 -239 -678
6265 -678 -379 221 -239 -354 -1085 -979 -160 -11 -613 -1263 -1156 -731 12 122 -1041 -1234 -612 121 -17 -406
6285 -406 -806 -452 398 346 206 -150 148 526 675 852 439 487 863 677 728 692 851 432 644 652 631 706 664
$$ packed form
6136H32m86k59J36O46k86j06r26K22O14J71m23o56j5J5O10L0j151J57M44J16j
6157c16o17k3P8N64J68p45j22L17J22L98K72m84k79K96L55mk8K6j04L41J94L7
6179D46j22P2R6K34j59K26k34M6m2K30K30l23l84K29J42j67o3K80l07q45O52j12
6201A25J76l59n54k2Q28K53n79p10l14Q31J47J05p30m86O51P62n18l79j31J90
6221g14Q06q2o22k18q2P69O0K26l46l89O36N93l14j4J56j65J37K15J06m54JK19
6243E24L61j09rl37J39l3J01j83P0k37k30R6L43k08l16k76p1K94L00j61k97m39
6265f78K99O00m60j15p31J06Q19J49o02o50J07M25P43J10j163j93O22P33j38l89
6285d06m00L54Q50n2j40l56K98L78J49J77m13M8L76j86N1l6J59m19K12Qk1P5m2
$$ plain form
6308 664 531 236 313 546 87 -48 -396 -339 122 284 -734 -822 -519 -469 -217 -366 -754 -1214 -640 -198 -513
6329 -513 -947 -1002 -891 -542 -169 -263 -1077 -646 -556 -427 -79 -374 -528 -261 599 404 32 -156 51 652 1137
6350 1137 461 238 805 758 869 808 952 729 551 954 896 715 456 878 387 496 372 226 153 49 -300
6371 -300 -394 65 -355 -588 -818 -1194 -374 -141 -478 -1038 -964 -330 -191 -731 -1172 -845 -454 176 -368 -732 -327
6392 -327 -289 -415 172 -55 -470 15 491 283 -148 176 7 273 593 461 278 89 347 587 540 684 275
6413 275 689 978 615 742 399 430 225 527 161 51 386 -9 34 -117 178 -106 -53 -396 -441 -459 -228 -21
6435 -21 -714 -858 -774 -430 -40 -396 -956 -965 -281 55 -664 -1026 -375 -226 -108 143 -355 -800 65 323 238 -61
6457 -61 -267 -49 309 596 334 1 357 624 498 1096 361 189 824 443 605 790 603 419 407 729 218
$$ packed form
6308F64j33k95P7K33m59j35l48N7M61J62j018q8L03N0K52j49l88m60N74M42l15
6329e13m34n5J11L49L73r4q14M31R0J29L48k95j54K67Q60j95l72j88K07O01M85
6350A137o76k23N67m7J11o1J44k23j78M03n8j81k59M22m91J09j24j46p3j04l49
6371c00r4M59m20k33k30l76Q20K33l37n60P4O34J39n40m41L27L91O30n44l64M05
6392c27L8j26N87k27m15M85M76k08m31L24j69K66L20j32j83j89K58K40m7J44m09
6413B75M14K89l63J27l43L1k05L02l66j10L35l95M3j51K95k84N3l43m5j8K31K07
6435b1o93j44Q4L44L90l56n60rO84L36p19l62O51J49J18K51m98m45Q65K58q5k99
6457f1k06K18L58K87k62l33L56K67j26N98p35j72O35l81J62J85j87j84j2L22n11
$$ plain form
6478 218 313 709 137 74 56 125 -84 -233 -387 -264 -109 -239 -504 -554 -1016 -578 -803 -495 -886 -979 -544 -305
6500 -305 -740 -545 -1005 -503 -641 -16 -229 -559 -494 -104 115 27 -1 4 398 768 645 347 214 633 485 688
6522 688 753 405 760 797 596 403 455 609 639 565 286 74 166 402 -54 205 177 7 -66 -109 -509 -432 -97
6545 -97 -388 -553 -562 -728 -888 -465 -734 -923 -359 -522 -470 -730 -600 -683 -462 33 -191 -429 -392 69 56 -195
6567 -195 26 -131 -73 252 419 135 396 298 668 524 673 603 370 759 703 693 618 382 599 832 327 91
6589 91 509 502 138 234 239 -441 -91 19 -444 -338 -342 -138 -340 -142 -457 -180 -523 -339 -526 -825 -783 -350 -441
6612 -441 -456 -331 -565 -451 -152 -345 -614 -309 -531 -369 203 -63 -104 -56 473 252 -10 251 455 434 419 257
6634 257 508 579 484 443 568 701 321 520 477 535 515 52 435 531 537 326 -120 43 187 -24 -169 -192 -135 -312
$$ packed form
6478B18R5L96n72o3j8O9k09j49j54J23J55j30k65n0m62M38k25L08l91r3M35K39
6500c05m35J95m60N02j38O25k13l30O5L90K19q8k8NL94L70j23k98j33M19j48K03
6522F88O5l48L55L7k01j93N2J54L0p4k79k12R2K36m56K59k8j70p3m3m00P7L35
6545i7k91j65rj66j60M23k69j89N64j63N2k60J30q3K21M95k24k38L7M61j3k51
6567a95K21j57N8L25J67k84K61r8L70j44J49p0k33L89n6j0p5k36K17K33n05k36
6589I1M18pl64R6No80L50J10m63J06mK04k02J98l15K77l43J84j87k99M2M33r1
6612d41j5J25k34J14K99j93k69L05k22J62N72k66m1M8N29k21k62K61K04k1j5j62
6634B57K51P1r5m1J25J33l80J99m3N8k0m63L83R6Ok11m46J63J44k11j45k3N7j77
$$ plain form
6658 -312 -158 -328 -761 -376 -350 -654 -676 -582 -796 -469 -445 -735 -779 -384 -281 -904 -296 -314 -518 23 -490 -226
6680 -226 -6 335 90 413 255 154 254 602 408 74 456 821 550 257 391 438 716 769 329 360 483
6701 483 368 202 244 596 463 50 76 -63 36 -1 -134 -38 -129 -623 -558 -296 -162 -633 -463 -555 -281 -553 -428
6724 -428 -734 -758 -573 -464 -550 -532 -644 -579 -269 -75 -121 -224 -33 86 -74 337 331 -32 264 573 251 400
6746 400 346 571 774 512 562 593 990 614 461 681 850 303 431 623 309 111 260 28 -143 -6 -67
6767 -67 -231 -294 -441 -557 -414 -439 -568 -672 -301 -815 -799 -632 -819 -680 -832 -663 -412 -716 -449 -257 -227 -45
6789 -45 -197 -274 -238 -13 -110 247 465 480 207 509 440 728 629 574 428 639 797 793 640 961 668 686 685 551
6813 551 438 375 139 -8 386 113 -148 -1 2 -234 -471 -216 -251 -723 -436 -554 -842 -475 -662 -963 -1022 -692
$$ packed form
6658c12J54j70m33L85K6l04k2R4k14L27K4k90m4L95J03o23O08j8k04N41n13K64
6680b26K20L41k45L23j58j01J00L48j94l34L82L65k71k93J34M7K78N3m40L1J23
6701D83j15j66M2L52j33m13K6j39R9l7j33R6r1m94O5K62J34m71J70r2K74k72J25
6724d28l06k4J85J09q6J8j12O5L10J94m6j03J91J19j60M11ol63K96L09l22J49
6746D00n4K25K03k62N0L1L97l76j53K20J69n47J28J92l14j98J49k32j71J37o1
6767f7j64o3j47j16J43k5j29j04L71n14J6J67j87J39j52J69K51l04K67J92L0J82
6789d5j52p7L6K25r7L57K18J5k73L02o9K88r9n5j46K11J58mj53L21k93J8jj34
6813E51j13o3k36j47L94k73k61J47Lk36k37K55l5m72K87j18k88L67j87l01n9L30
$$ plain form
6835 -692 -743 -639 -498 -691 -559 -409 -193 -437 252 -174 -108 -36 146 172 33 13 406 291 595 335 376 576
6857 576 644 431 613 957 641 584 780 569 391 259 216 159 482 368 9 79 189 -249 -184 12 -346 -308
6879 -308 -181 -524 -707 -341 -779 -406 -370 -499 -591 -385 -473 -406 -571 -918 -675 -526 -454 -588 -447 -103 -343 -103
6901 -103 -242 19 114 175 262 231 71 364 533 136 475 687 377 404 475 712 688 556 565 432 391 489 113 250
6925 250 280 189 177 159 12 -188 6 -84 -340 -474 -38 -520 -393 -333 -417 -411 -558 -410 -614 -80 -505 -428 -419 -480
6949 -480 -446 -535 -411 -527 -313 5 -87 -136 -219 43 28 114 290 239 45 268 269 392 529 411 61 296 594
6972 594 66 334 277 243 535 353 448 547 228 342 272 -42 335 -258 -15 130 104 -37 58 -137 -40 23 -316
6995 -316 -311 23 -116 -733 -116 -176 -262 -398 -219 -441 -540 -401 -646 -302 -507 -200 -565 -190 107 5 -236 160
$$ packed form
6835f92n1J04J41j93J32J50K16k44O89m26O6P2J82K6j39k0L93j15L04k60M1K00
6857E76O8k13J82L44l16n7J96k11j78j32m3n7L23j14l59P0J10m38O5J96l58L8
6879c08J27l43j83L66m38L73L6j29r2K06q8O7j65l47K43J49P2j34J41L44k40K40
6901a03j39K61R5O1Q7l1j60K93J69l97L39K12l10K7P1K37k4j32Rj33m1R8l76J37
6925B50L0r1j2j8j47k00J94r0k56j34M36m82J27O0q4Oj47J48k04N34m25P7Ro1
6949d80L4q9J24j16K14L18r2m9q3K62j5Q6J76n1j94K23JJ23J37j18l50K35K98
6972E94n28K68n7l4K92j82R5R9l19J14p0l14L77n93K43J45k6j41R5j95R7O3l39
6995c16NL34j39o17O17o0q6j36J79k22r9J39k45L44k05L07l65L75K97j02k41L96
$$ plain form
7017 160 246 337 409 -47 36 346 248 102 118 422 86 173 266 277 459 796 389 344 338 461 211 650 301 241
7041 241 378 237 225 14 203 -220 -149 -81 -44 -368 -263 -58 -637 -480 -146 -434 -648 -331 -680 -363 -249
7062 -249 -236 -383 -644 -154 -473 -393 -451 -549 -145 -278 -264 -245 124 212 -123 194 196 -60 202 585 588 192 577 282
7086 282 675 735 71 525 283 671 75 432 411 186 -46 197 263 281 54 -9 12 127 290 -193 -249 -28
7108 -28 -399 -547 -493 -230 -365 -392 -223 -291 -416 -34 -460 -409 -415 -84 -582 -624 -621 -240 -259 -77 -377 -215 190 113
7132 113 -20 429 -16 316 336 164 256 316 425 332 552 661 711 205 770 332 462 246 274 455 410 305
7154 305 214 183 264 35 36 138 -244 -184 -276 -233 -622 -57 -394 -668 -331 -533 -625 -329 -144 -520 -549 -166 -510
7177 -510 -328 -55 -78 -570 47 83 -290 -53 344 148 -86 476 196 296 368 148 474 476 276 577 627 806
$$ packed form
7017A60Q6R1P2m56Q3L10r8j46J6L04l36Q7R3J1J82L37m07m5oJ23k50M39l49o0
7041B41J37j41j2k11J89m23P1O8L7l24J05K05n79J57L34k88k14L17l49L17J14
7062b49J3j47k61M90l19Q0n8r8M04j33J4J9L69Q8l35L17Kk56K62L83Ll96L85k95
7086B82L93O0o64M54k42L88n96L57k1k25k32K43O6J8k27o3K1J15J63m83n6K21
7108b8l71j48N4K63j35k7J69o8j25L82m26N1oL31m98m2LL81j9J82l00J62M05p7
7132A13j33M49m45L32K0j72R2O0J09r3K20J09N0n06N65m38J30k16K8J81m5j05
7154C05r1l1Q1k29JJ02l82O0r2M3l89N65l37k74L37k02r2K96J85l76k9L83l44
7177e10J82K73k3m92O17L6l73K37L97j96k34N62k80J00P2k20L26Kk00L01N0J79
$$ plain form
7199 806 429 303 614 301 595 596 -118 93 163 340 -184 -46 -62 32 -156 75 -259 -165 -20 2 -347 -456
7221 -456 -202 -424 -40 -293 -311 -370 -213 -467 -461 -365 -122 -296 -230 -135 -553 -268 -196 -4 158 124 -149 9 137
7244 137 -33 181 529 490 58 170 226 212 337 263 368 235 426 188 350 399 459 272 434 20 109 -35
7266 -35 301 283 61 11 -78 -233 -288 -128 75 124 54 -439 -274 46 -642 -149 -507 -260 -182 -265 -204 -512 -314
7289 -314 -428 -289 -235 -224 -552 -147 -315 -274 20 -23 -245 -4 -46 19 364 223 463 185 -26 261 268 95 412
7312 412 410 558 515 979 90 194 638 659 238 312 322 220 142 289 208 3 -284 -118 -136 -134 -519 -680 -396 -76
7336 -76 -249 -740 -552 -526 -212 -56 -884 -892 -483 -373 -444 -319 -725 -663 -15 -267 -320 -230 130 94 -187 18 90
7359 90 192 552 353 304 337 516 358 351 301 567 608 481 139 321 227 911 337 366 160 -199 59 73 -87
$$ packed form
7199H06l77j26L11l13K94Jp14K11P0J77n24J38j6R4j88K31l34R4J45K2l49j09
7221d56K54k22L84k53j8n9J57k54OR6K43j74O6R5m18K85P2J92J62l4k73J58J28
7244A37j70K14L48l9m32J12N6j4J25p4J05j33J91k38J62M9O0j87J62m14Q9j44
7266c5L36j8k22n0q9j55n5J60K03M9p0m93J65L20o88M93l58K47P8q3O1l08J98
7289c14j14J39N4J1l28M05j68M1K94m3k22K41m2O5L45j41K40k78k11K87Pj73L17
7312D12kJ48m3M64q89J04M44K1m21P4J0j02p8J47q1k05k87J66j8Kl85j61K84L20
7336g6j73m91J88K6L14J56q28qM09J10p1J25m06O2O48k52n3R0L60l6k81K05P2
7359I0J02L60j99m9L3J79j58pn0K66M1j27l42J82r4O84n74K9k06l59K58J4j60
$$ plain form
7382 -87 -152 -249 239 -261 226 36 -575 -364 -57 -296 -213 -480 -409 -238 -142 -272 -578 -339 -283 -343 14 -56 -442
7405 -442 -239 -163 -175 -103 -184 -480 -63 24 -6 -136 290 438 319 200 401 368 657 350 377 378 778 415 290
7428 290 287 258 437 385 55 -242 132 454 242 -110 19 -163 -309 173 -173 -192 -225 -332 -235 -4 -289 -438
7450 -438 -61 -216 -236 -360 -464 -328 -622 -270 -428 -252 -432 -422 -179 -80 -166 179 -214 -454 26 145 93 221
7472 221 153 135 260 529 282 560 510 452 452 815 323 355 621 299 551 536 401 131 422 591 525 51 58 -48
7496 -48 217 158 -172 -606 -421 -211 -419 -257 -778 -584 -485 -274 -347 -682 -685 -498 -222 -268 -486 -783 -269 -64
7518 -64 -142 -163 -177 36 -204 238 -33 269 283 -19 63 200 241 183 288 466 397 549 554 51 312 448 402 378
7542 378 388 77 135 66 622 269 -95 133 -147 -454 279 107 -401 -312 -249 -169 -215 -448 -475 -201 -207 -320 -692
$$ packed form
7382h7o5r7M88n00M87j90o11K11L07k39Q3k67P1J71R6j30l06K39N6o0L57p0l86
7405d42K03P6j2P2q1k96M17Q7l0j30M26J48j19j19K01l3K89l07K7JM00l63j25
7428B90lk9J79n2l30k97L74L22k12l52J29j82j46M82l46j9l3j07R7K31k85j49
7450d38L77j55k0j24j04J36k94L52j58J76j80J0K43R9q6L45l93k40M80J19n2J28
7472B21o8j8J25K69k47K78n0n8%L63m92L2K66l22K52j5j35k70K91J69o6m74Pj06
7496d8K65n9l30m34J85K10k08J62n21J94R9K11p3l35lJ87K76m6k18k97N14K05
7518f4p8k1j4K13k40M42k71L02J4l02Q2J37M1n8J05J78o9J52Nn03K61J36m6k4
7542C78J0l11N8o9N56l53l64K28k80l07P33j72n08Q9O3Q0m6k33k7K74oj13l72
$$ plain form
7565 -692 -359 -431 -363 -534 -547 -681 -659 -172 -291 76 -112 7 -194 178 63 -109 318 388 286 271 315 250 233
7588 233 161 132 74 327 610 554 316 357 524 613 728 33 30 248 205 347 -133 119 246 95 184 -270 -115
7611 -115 -135 -460 -308 -120 -213 -381 -287 -351 -592 -400 -397 -214 -420 -423 -327 -637 -307 -500 -313 -294 -108 -268 -241 -98
7635 -98 74 -26 276 -9 80 148 268 282 625 471 41 456 538 392 499 657 524 426 608 397 118 276
7657 276 281 301 163 -31 156 129 131 -23 -174 -395 -149 -53 -127 -249 -370 -222 -237 -22 -130 -337 -502 -305 -295
7680 -295 -463 -131 -145 -284 -16 -257 83 -333 -243 76 -6 -134 -59 1 135 111 294 103 476 247 199 129 357
7703 357 348 418 94 164 68 423 188 404 559 225 142 100 276 135 33 342 122 31 57 -212 -179 76 78 -343
7727 -343 -382 -195 -227 -355 -204 -159 -360 -121 -346 -444 -445 185 -236 -653 -539 -218 -50 -110 3 -219 -329 -229
$$ packed form
7565f92L33p2O8j71j3j34K2M87j19L67j88J19k01L72j15j72M27P0j02j5M4o5j7
7588B33p2k9n8K53K83n6k38M1J67Q9J15o95lK18m3J42m80K52J27j51Q9m54J55
7611a15k0l25J52J88r3j68R4o4k41J92LJ83k06lR6l10L30j93J87J9J86j60K7J43
7635i8J72j00L02k85Q9O8J20J4L43j54m30M15Q2j46J07J58j33r8J82k11k79J58
7657B76NK0j38j94J87k7Kj54j51k21K46R6p4j22j21J48j5K15j08k07j65J97J0
7680b95j68L32j4j39K68k41L40m16R0L19q2j28P5O0J34k4J83j91L73k29m8p0K28
7703C57rP0l24P0r6L55k35K16J55l34q3m2J76j41j02L09k20r1K6k69L3K55Km21
7727c43l9J87l2j28J51M5k01K39k25r8jO30m21m17J14L21J68o0J13k22j10J00
$$ plain form
7749 -229 217 320 63 -59 -87 151 411 553 273 162 136 230 310 252 568 659 309 207 324 537 474 275
7771 275 108 -142 167 136 -2 66 485 -405 -187 -171 -107 -29 -265 -222 -349 -153 -339 -463 -320 -326 -412 -325 -218
7794 -218 -141 -300 -577 -329 -543 26 -36 -175 -274 175 80 -45 -290 103 29 -51 5 465 245 426 237 8
7816 8 469 -41 372 147 445 553 4 426 235 387 605 103 103 77 50 204 83 -176 -186 -174 -343 -246 -19
7839 -19 -291 -336 -307 -270 -228 -296 -68 -632 -395 -292 -202 -324 -172 -101 -230 -152 -114 -27 -207 -78 149 -74 -201 -243
7863 -243 -262 -60 426 116 71 240 341 257 239 532 411 161 349 516 286 75 339 297 401 47 398 129
7885 129 177 297 209 205 158 103 -97 -372 138 -415 -213 -343 -32 -298 -148 -77 -414 -179 -253 -568 -365 -746 -308
7908 -308 -299 -292 -71 -512 209 -353 -138 -82 -150 -136 -68 36 277 351 -9 274 170 224 508 486 324 354 291 178
$$ packed form
7749b29M46J03k57j22k8K38K60J42k80j11k6R4Q0n8L16R1l50j02J17K13o3j99
7771B75j67k50L09l1j38O8M19q90K18J6O4P8k36M3j27J96j86j24J43oq6Q7J07
7794b18P7j59k77K48k14N69o2j39r9M49r5j25k45L93p4q0N6M60k20J81j89k29
7816HM61n10M13k25K98J08n49M22j91J52K18n02%k6k7J54j21k59j0J2j69R7K27
7839a9k72m5K9L7M2o8K28n64K37J03R0j22J52P1j29P8L8Q7j80J29K27k23j27m2
7863b43j9K02M86l10m5J69J01q4j8K93j21k50J88J67k30k11K64m2J04l54L51k69
7885A29M8J20q8mm7n5k00k75N10n53K02j30L11k66J50P1l37K35p4l15K03l81M38
7908c08RPK21m41P21n62K15N6o8J4O8J04K41P4l60K83j04N4K84k2j62L0o3j13
$$ plain form
7932 178 507 506 114 446 322 357 478 431 179 416 -100 40 256 -350 238 -202 -497 -53 -54 -681 -373 6
7954 6 -368 -407 -322 -915 -410 -699 -576 -608 -463 -350 -472 -273 -378 -194 -252 -114 -305 -191 420 206 -99 282
7976 282 558 137 295 270 365 287 608 555 526 415 218 446 478 55 186 188 318 202 77 238 -137 225 342
7999 342 26 -157 -262 60 -226 -123 -337 -466 -230 -220 -348 -247 -59 -235 -558 14 -286 -22 -435 -484 -372
8020 -372 -127 20 -441 -264 -114 -104 272 73 -92 72 240 353 107 160 344 245 520 575 76 417 235
8041 235 259 119 -49 297 537 251 183 155 48 49 26 4 198 76 -157 134 -207 -196 -54 180 -397 -448 -545
8064 -545 -373 -315 -142 -410 -494 -284 -413 -177 1 -70 -424 -159 -586 -396 -228 -245 -142 -153 -37 -167 -25 118
8086 118 151 4 73 204 -189 42 297 389 166 317 466 307 394 532 173 165 130 766 50 208 359 -348
$$ packed form
7932A78L29jl92L32j24L5J21m7k52K37n16J40K16o06N88m40k95M44jo27L08L79
7954Fl74l9Q5n93N05k89J23l2J45J13j22J99j05J84n8J38j91J14O11k14l05L81
7976B82K76m21J58k5R5p8L21n3k9j11j97K28L2m23J31KJ30j16j25J61l75L62J17
7999C42l16j83j05L22k86J03k14j29K36J0j28J01J88j76l23N72l00K64m13m9J12
8020c72K45J47m61J77J50J0L76j99j65J64J68J13k46N3J84r9K75N5m99L41j82
8041B35K4j40j68L46K40k86o8k8j07Jk3k2J94j22k33K91l41J1J42K34n77n1r7
8064e45J72N8J73k68q4K10j29K36J78p1l54K65m27J90J68j7J03j1J16j30J42J43
8086A18L3j47O9J31l93K31K55R2k23J51J49j59Q7J38l59ql5O36p16J58J51p07
$$ plain form
8108 -348 20 112 206 18 49 -214 -327 164 -206 35 -315 -319 -462 -329 -283 -179 -314 -265 -345 -291 -313 -174 -210 -233
8132 -233 -265 -144 -337 -252 -142 313 -105 -301 37 84 134 102 -113 -134 174 -144 473 206 194 255 342 266 468
8155 468 512 307 260 352 154 191 164 147 34 391 60 91 330 114 202 -117 165 19 -360 55 -105 54 99
8178 99 -326 -319 -492 -267 -301 -28 -36 -161 -155 -328 -375 -62 -132
$$ packed form
8108c48L68R2R4j88L1k63j13M91l70K41l50mj43J33M6J04j35M9q0N4k2J39l6k3
8132b33l2J21j93Q5J10M55m18j96L38M7N0l2k15k1L08l18O17k67j2O1Q7p6K02
8155D68M4k05m7R2j98L7k7j7j13L57l31L1K39k16Q8l19K82j46l79M15j60J59M5
8178I9m25Pj73K25l4K73qj25Oj73m7L13p0
8191a32
$$ Imaginary data points
##PAGE= N=2
##DATA TABLE= (X++(I..I)), XYDATA
$$ plain form
0 0 0 0 0 8 -8 0 -8 8 -8 16 -24 24 -32 39 -48 56 -65 80 -92 108 -128 147 -171 198 -223 255 -295 333 -375
29 -375 425 -479 537 -599 671 -749 832 -925 1029 -1138 1260 -1398 1546 -1711 1897 -2104
45 -2104 2335 -2597 2895 -3242 3646 -4128 4709 -5433 6356 -7583 9297 -11877 16173 -24652
59 -24652 47758 -240494 -751927 -164903 354052 147734 -397070 -414970 -58825 79188 -177007
70 -177007 -339935 -181580 62394 73708 -58632 -159847 -160652 -83102 88188 220835 146479
81 146479 -87088 -150604 85741 295217 139811 -113499 -1708 317388 266579 -132070
91 -132070 -249850 124346 419247 185421 -224684 -212837 149855 277855 5591 -199560
101 -199560 -47559 159770 103438 -69543 -97698 -17072 12948 15151 58791 34031 -124789
$$ packed form
0@%%%Qj6QqJ6j6K4m0M8n6P1q7J04j21J45j72K00k36K75l18L69m21M78n50O28p08
29c75Q00r04J016j136J270j420J581j757J954k167K398k658K944l257L608m001
45b104M439m932N492o137O888p774Q837j0142J1789j3939J6880k1174K8050m0825
59b4652P2410k88252n11433N87024N18955k06318n44804j7900L56145J38013k56195
70a77007j62928J58355K43974J1314j32340j01215q05P7550J71290J32647p4356
81A46479k33567o3516K36345K09476j55406k53310J11791L19096n0809l98649
91a32070j17780L74196K94901k33826m10105J1847L62692J28000k72264k05151
101a99560J52001K07329n6332j72981k8155Q0626L0020K203M3640k4760j58820
$$ plain form
112 -124789 -184089 26245 204725 16003 -283630 -219546 116357 208712 -77285 -321464
122 -321464 -182808 122272 149207 -115313 -245712 -54400 131617 34109 -146388 -102960
132 -102960 81643 126825 18617 -36133 6489 29105 42618 120239 147192 22390 -63505
143 -63505 56855 177707 67386 -96465 -19013 195416 179632 -105758 -256529 -28364
153 -28364 248545 152907 -167543 -242591 -9037 147161 17873 -162176 -120693 59554 105647
164 105647 -28506 -136108 -89617 29410 98550 73375 -18405 -84674 -49020 45828 90400
175 90400 44109 -29191 -36476 27453 49710 -28288 -78662 5182 90098 21571 -102498 -93914
187 -93914 16129 46142 -35224 -73744 -3548 44053 -18287 -82370 -43929 36459 63660 28583
$$ packed form
112a24789n9300K10334J78480j88722k99633O4084L35903R2355k85997k44179
122c21464J38656L05080K6935k64520j30399J91312J86017r7508j80497M3428
132a02960J84603M5182j08208n4750M2622K2616J3513P7621K6953j24802q5895
143f3505J20360J20852j10321j63851P7452K14429j5784k85390j50771K28165
153b8364K76909r5638l20450p5048K33554J56198j29288j80049M1483J80247M6093
164A05647j34153j07602M6491J19027O9140k5175r1780o6269L5654R4848M4572
175I0400m6291p3300p285O3929K2257p7998n0374Q3844Q4916o8527j24069Q584
187i3914J10043L0013q1366l8520P0196M7601o2340o4083L8441Q0388K7201l5077
$$ plain form
199 28583 -24619 -41211 2169 52652 52138 29662 21538 10502 1856 26008 52102 30380 -8644
212 -8644 1052 47481 50183 -15231 -61347 -12216 63852 53784 -20294 -57478 -34993 911 20568
225 20568 15188 -9326 -30126 -31558 -13157 5944 -2483 -27700 -15687 19589 3510 -49538 -48146
238 -48146 6494 24479 -7906 -26059 -10523 -3008 -27122 -41843 -5684 46095 36280 -29430
250 -29430 -66397 -28447 40198 63565 14338 -38443 -15298 41474 37192 -9546 -12032 31274
262 31274 57071 38528 -6255 -33086 -5119 50546 60802 14347 -23768 -12474 16505 12384
274 12384 -13066 -3804 33406 24752 -33667 -55112 -9622 33083 21755 -20392 -43236 -18391
286 -18391 20424 12182 -34970 -46450 -2019 38016 19504 -39785 -64550 -12876 46633 25801
$$ packed form
199B8583n3202j6592M3380N0483n14k2476q124j1036q646K4152K6094k1722l9024
212h644R696M6429K702o5414m6116M9131P6068j0068p4078l7184K2485L5904J9657
225B0568n380k4514k0800j432J8401J9101q427k5217J2013L5276j6079n3048J392
238d8146N4640J7985l2385j8153J5536P515k4114j4721L6159N1779r815o5710
250b9430l6967L7950O8645K3367m9227n2781K3145N6772m282m6738k486M3306
262C1274K5797j8543m4783k6831K7967N5665J0256m6455l8115J1294K8979m121
274A2384k5450R262L7210q654n8419k1445M5490M2705j1328m2147k2844K4845
286a8391L8815q242m7152j1480M4431M0035j8512n9289k4765N1674N9509k0832
$$ plain form
298 25801 -39686 -48251 939 28939 5550 -28474 -30720 -4334 16976 13623 -553 -13850 -19675
311 -19675 -6165 14683 12746 3210 14070 18353 -7137 -19563 6648 33761 32529 18066 8121
324 8121 5763 5288 1259 7341 32232 48632 27748 -10076 -28112 -13916 18486 37554 27736
337 27736 8379 -11151 -38370 -46729 -4519 41721 28824 -22105 -48613 -39529 -22035 -15494 -14402
350 -14402 -2264 10679 -6430 -46515 -65198 -40334 8639 45378 30364 -29153 -63729 -35388
362 -35388 13000 30703 22376 13058 9327 1964 -13178 -14684 17500 52356 50315 20053 -6546
375 -6546 -15077 1740 34173 42733 23061 14003 17507 2126 -21583 -12248 28616 49399 17767
388 17767 -31412 -35694 -1144 12405 -5681 -12000 -1695 -3305 -16236 -24856 -26643 -16958 -1942
$$ packed form
298B5801o5487q565M9190K8000k3389l4024k246K6386K1310l353j4176j3297n825
311a9675J3510K0848j937r536J0860M283k5490j2426K6211K7113j232j4463r945
324H121k358m75m029O082K4891J6400k0884l7824j8036J4196L2402J9068r818
337B7736j9357j9530k7219q359M2210M6240j2897n0929k6508R084J7494O541J092
350a4402J2138J2943j7109m0085j8683K4864M8973L6739j5014n9517l4576K8341
362c5388M8388J7703q327r318l731p363j5142j506L2184L4856k041l0262k6599
375f546q531J6817L2433Q560j9672r058L504j5381k3709R335M0864K0783l1632
388A7767m9179m282L4550J3549j8086o319J0305j610j2931q620j787R685J5016
$$ plain form
401 -1942 -409 -10967 -17415 -19528 -20837 -13613 -2915 552 1567 328 -7438 -11088 -3369 5231 8832
416 8832 9422 5236 6702 15234 8872 -13704 -12266 21482 37816 14351 -14962 -18059 23 12603
430 12603 4332 -3515 6620 11725 -5825 -20576 -13259 967 13307 19877 8687 -10525 -12685
443 -12685 623 10671 14931 18528 20792 15669 -1266 -14572 1124 30177 31334 8515 -3158
456 -3158 -5656 -10404 -8509 1841 3976 -3407 -9535 -18411 -29538 -32644 -23249 -6759 587 -15844
470 -15844 -35758 -33754 -20089 -14389 -7468 4190 2516 -9849 -14202 -7012 6507 19880 20254 13157
484 13157 14631 17448 9309 6200 20179 33929 30640 16164 2736 3386 14777 18602 12969 11756
498 11756 10989 1463 -4077 318 2173 1831 7335 7320 -4401 -14184 -11886 -361 7938 -1150 -15531
$$ packed form
401a942J533j0558o448k113j309P224J0698L467J015j239p766l650P719Q600L601
416H832N90m186J466Q532o362k2576J438L3748J6334k3465k9313l097J8082J2580
430A2603q271p847J0135N105j7550j4751P317J4226J2340O570j1190j9212k160
443a2685J3308J0048M260L597K264n123j6935j3306J5696K9053J157k2819j1673
456c158k498m748J895J0350K135p383o128q876j1127l106R395J6490P346j6431
470a5844j9914K004J3665N700O921J1658j674j2365m353P190J3519J3373L74p097
484A3157J474K817q139l109J3979J3750l289j4476j3428O50J1391L825n633j213
498A1756p67r526n540M395J855l42N504j5j1721r783K298J1525Q299r088j4381
$$ plain form
513 -15531 -11310 -333 -9924 -24117 -15533 -1956 -7101 -19666 -24352 -23070 -18031 -13497 -12504 -14557
527 -14557 -17784 -19072 -11084 -2675 -6938 -7984 6576 15559 5767 1959 14099 23837 24559 25592 25619
542 25619 24194 24504 24176 24742 27737 23925 15530 13515 12843 2677 -3507 577 1265 -7324 -15355 -21020
558 -21020 -22222 -17718 -17263 -21663 -20041 -16347 -19568 -20631 -14653 -9754 -6572 940 3357 -1209 -944
573 -944 2947 7940 16657 18720 9524 4777 11496 12136 3393 2508 7980 9048 2048 -8379 -14373 -10629
589 -10629 -4975 -4757 -5281 -9225 -19434 -18403 -4561 -3100 -11981 -5416 9954 7244 -6923 -8861
603 -8861 5003 20467 22346 11718 5920 9775 10794 9742 15316 17229 9594 7521 9954 2366
617 2366 -9499 -5926 9677 15808 1194 -20490 -20662 963 9337 -6647 -14084 -1846 4267 -3880
$$ packed form
513a5531M221J0977r591j4193Q584J3577n145j2565m686J282N039M534R93k053
527a4557l227j288P988Q409m263j046J4560Q983r792l808J2140R738P22J033K7
542B5619j425L10l28N66K995l812q395k015o72j0166o184M084O88q589q031n665
558b1020j202M504M55m400J622L694l221j063N978M899L182P512K417m566K65
573i44L891M993Q717K063r196m747O719O40q743q85N472J068p000j0427n994L744
589a0629N654K18n24l944j0209J031J3842J461q881O565J5370k710j4167j938
603h861J3864J5464J879j0628n798L855J019j052N574J913p635k073K433p588
617B366j1865L573J5603O131j4614k1684j72K1625Q374j5984p437J2238O113q147
$$ plain form
631 -3880 -12897 -13124 -1580 12034 8839 -9757 -18270 -8758 1184 2938 -4627 -14001 -12663 -3898 -5096
646 -5096 -15935 -21085 -13444 156 4214 -12182 -26813 -11477 12455 9924 -6735 -5332 10691
659 10691 21997 21065 8910 3339 18526 38302 35072 16570 9741 19854 30568 24022 7592
672 7592 6057 19464 19636 375 -13414 -14028 -8661 -1620 -710 -15926 -32774 -33558 -22395 -13261 -16663
687 -16663 -26861 -26248 -10308 -9397 -31474 -35419 -4185 19873 8080 -16428 -20521 -3392 12629
700 12629 14823 12088 11613 8596 3512 7128 10349 6533 12029 27364 23332 -2031 -16628 -4196
714 -4196 21080 32931 14459 -14167 -13456 11073 16646 -1072 -6403 10224 20625 5186 -18737
727 -18737 -18531 6780 24705 13292 -9306 -20386 -14219 3603 11600 -3487 -17817 -9311 2208
$$ packed form
631c880r017k27J1544J3614l195j8596q513R512R942J754p565r374J338Q765j198
646e096j0839n150P641J3600M058j6396j4631J5336K3932k531j6659J403J6023
659A0691J1306r32j2155n571J5187J9776l230j8502o829J0113J0714o546j6430
672G592j535J3407J72j9261j3789o14N367P041R10j5216j6848p84J1163R134l402
687a6663j0198O13J5940R11k2077l945L1234K4058j1793k4508m093J7129J6021
700A2629K194k735m75l017n084L616L221l816N496J5335m032k5363j4597J2432
714d196K5276J1851j8472k8626P11K4529N573j7718n331J6627J0401j5439k3923
727a8737K06K5311J7925j1413k2598j1080O167J7822P997j5087j4330Q506J1519
$$ plain form
740 2208 -6356 -20177 -18089 -3426 9795 2624 -21780 -31302 -7777 16109 10827 -11448 -20106
753 -20106 -6315 12175 9541 -8187 -8581 10521 18246 2092 -13880 -6712 17433 27007 4533
766 4533 -16881 -6005 13821 12542 4214 3907 877 -3301 2079 8126 2723 -1581 5519 12588 4793
781 4793 -10347 -10291 10586 24406 10255 -10804 -10390 4373 12228 7349 -1918 -1767 6183 2569 -10874
796 -10874 -9883 3352 5289 -2322 -5406 -10540 -17599 -11939 2616 4386 -9209 -20103 -15917 -3609
810 -3609 -1011 -10536 -12736 -425 4005 -6716 -15624 -10320 5313 15589 7116 -9916 -9532 7066
824 7066 14506 9159 4622 3456 7922 14922 10408 -1313 2818 20732 22804 5876 -4741 1197
838 1197 13566 16879 8320 -1022 -371 4893 6940 3207 -6049 -7977 5932 12629 -7125 -24601
$$ packed form
740B208q564j3821K088J4663J3221p171k4404r522K3525K3886n282k2275q658
753b0106J3791J8490k634j7728l94J9102P725j6154j5972P168K4145R574k2474
766D533k1414J0876J9826j279q328l07l030m178N380O047n403m304P100P069p795
781D793j5140N6K0877J3820j4151k1059M14J4763P855m879r267J51P950l614j3443
796a0874R91J3235J937p611l084n134p059N660J4555J770j3595j0894M186J2308
810c609K598r525k200J2311M430j0721q908N304J5633J0276q473j7032L84J6598
824G066P440n347m537j166M466P000m514j1721M131J7914K072j6928j0617N938
838A197J2369L313q559r342O51N264K047l733r256j928J3909O697j9754j7476
$$ plain form
852 -24601 -11989 8004 4472 -12640 -20878 -13403 -1217 -2643 -16911 -19808 -5261 2066 -7801
865 -7801 -17657 -15948 -5188 3723 1487 -7272 -9871 -4303 2091 5712 3176 -2303 2334 13290 9578
880 9578 -2599 128 13214 18030 13169 5769 648 5255 16103 16661 9188 5899 6372 6766 7625
895 7625 5923 2954 4959 9955 5410 -5365 -10059 -3836 7353 7813 -5960 -16111 -10610 -5328
909 -5328 -7788 -5130 -2075 -10724 -18061 -11889 -7138 -12100 -12543 -3054 1881 -8050 -22460 -20634 1028
924 1028 14476 3861 -11498 -10951 -2217 2462 4164 6186 10391 12104 3959 -5498 -238 13571
938 13571 19001 19200 15336 1350 -8663 2230 20213 23540 14049 2111 -3845 -930 3764 3717
952 3717 6199 11529 7417 -8282 -18858 -15704 312 13289 7484 -11112 -20894 -18039 -11820 -2667
$$ packed form
852b4601J2612J9993l532j7112q238P475J2186j426j4268k897J4547P327r867
865g801r856J709J0760Q911k236q759k599N568O394L621k536n479M637J0956l712
880I578j2177K727J3086M816m861p400n121M607J0848N58p473l289M73L94Q59
895G625j702k969K005M996m545j0775m694O223J1189M60j3773j0151N501N282
909e328k460K658L055q649p337O172M751m962m43R489M935r931j4410J826K1662
924A028J3448j0615j5359N47Q734M679J702K022M205J713q145r457N260J3809
938A3571N430J99l864j3986j0013J0893J7983L327r491j1938n956K915M694m7
952C717K482N330m112j5699j0576L154J6016J2977n805j8596r782K855O219R153
$$ plain form
966 -2667 5617 302 -11698 -15490 -13304 -10894 -3773 3202 3920 1705 -5044 -16165 -16785 4003 22863
981 22863 16137 -7236 -19037 -5706 13257 12505 950 2877 10005 2735 -7223 -3547 7251 12364
995 12364 12367 4234 -8242 -11221 -552 14341 19783 4820 -16490 -14140 9434 18416 2032 -8773
1009 -8773 676 9781 1704 -12139 -8763 11585 20893 3719 -16982 -17549 -2187 14077 18541 2039
1023 2039 -17437 -16303 -309 7081 3057 -2548 -3175 39 -2344 -15303 -20280 -204 21586 14642
1037 14642 -15013 -33906 -21347 9381 22028 4816 -14689 -14535 -4599 -953 -3940 -4678 5463
1050 5463 18556 10044 -18686 -27846 -1367 28456 30549 7016 -16124 -16488 4733 20996 16069
1063 16069 6000 4867 9518 9131 -1776 -10685 4203 31253 30490 -2086 -25918 -14824 14000
$$ packed form
966b667Q284n315j2000l792K186K410P121O975P18k215o749j1121o20K0788J8860
981B2863o726k3373j1801J3331J8963p52j1555J927P128p270r958L676J0798N113
995A2364Lq133j2476k979J0669J4893N442j4963k1310K350K3574Q982j6384j0805
1009h773R449R105q077j3843L376K0348R308j7174k0701n67J5362J6264M464j6502
1023B039j9476J134J5994P390m024n605o27L214k383j2959m977K0076K1790o944
1037A4642k9655j8893J2559L0728J2647j7212j9505J54R936L646k987p38J0141
1050E463J3093q512k8730r160K6479K9823K093k3533k3140l64K1221J6263m927
1063A6069j0069j133M651l87j0907q909J4888K7050p63l2576k3832J1094K8824
$$ plain form
1076 14000 27350 10779 -11424 -11293 579 -212 -8471 -7571 -859 3068 1273 -12590 -28458 -22191
1090 -22191 2172 13491 -2407 -27275 -30884 -9217 8358 -1539 -19244 -15899 406 4518 -5887
1103 -5887 -15646 -9787 10467 20458 5002 -12679 -7427 12487 25542 19958 2098 -5793 10735
1116 10735 29482 23112 2685 -1160 14730 27285 17835 -2422 -5397 14205 25394 10220 -9871
1129 -9871 -11071 3850 16033 8831 -13259 -20884 -4549 7407 -2610 -17730 -18817 -7122 565
1142 565 -9514 -25984 -23165 -4527 1394 -10359 -22404 -23287 -12811 -79 -298 -13317 -19202 -9403
1156 -9403 3187 4110 -7804 -13701 1541 19407 12551 -6386 -4938 13625 23570 20262 12658 8111
1170 8111 12095 20407 24575 21170 15694 11968 15984 23700 18779 3443 1264 14733 21012 7532
$$ packed form
1076A4000J3350j6571k2203J31J1872p91q259R00O712L927j795j3863j5868O267
1090b2191K4363J1319j5898k4868l609K1667J7575r897j7705L345J6305M112j0405
1103e887r759N859K0254R991j5456j7681N252J9914J3055n584j7860p891J6528
1116A0735J8747o370k0427l845J5890J2555r450k0257k975J9602J1189j5174k0091
1129i871j200J4921J2183p202k2090p625J6335J1956j0017j5120j087J1695P687
1142E65j0079j6470K819J8638N921j1753j2045q83J0476J2732k19j3019n885R799
1156i403J2590R23j1914n897J5242J7866o856j8937J448J8563R945l308p604m547
1170H111L984Q312M168l405n476l726M016P716m921j5336k179J3469O279j3480
$$ plain form
1184 7532 -10869 -14528 -434 9222 -2920 -20736 -20554 -11333 -11203 -18273 -22982 -21497 -14535 -11794
1198 -11794 -20510 -30367 -25274 -10872 -2182 -6403 -20014 -24759 -9847 5959 2784 -7261 -4198
1211 -4198 6924 11633 4124 -5325 2420 23872 31667 14678 -2537 -219 15836 30512 29642 14657
1225 14657 6357 12380 16505 12023 11437 17521 18613 13615 5650 -2608 -4835 1599 10819 14524 3304
1240 3304 -18803 -28209 -13864 1503 -1998 -12825 -17882 -21043 -24186 -25274 -22682 -13561 -6090 -11012
1254 -11012 -23288 -27873 -23882 -14256 403 7603 -2264 -15303 -12249 1154 9248 8551 8257 16799
1268 16799 23089 10744 -4982 3888 30497 40053 23364 3662 329 14161 26123 20280 6767
1281 6767 5781 13036 12678 3954 -5213 -6513 3750 13130 4019 -15299 -20205 -7869 2763 -740
$$ packed form
1184G532j8401l659J4094R656j2142j7816J82R221J30p070m709J485O962K741
1198a1794q716r857N093J4402Q690m221j3611m745J4912J5806l175j0045L063
1211d198J1122M709p509r449P745K1452P795j6989j7215K318J6055J4676q70j4985
1225A4657q300O023M125m482n86O084J092m998p965q258k227O434R220L705j1220
1240C304k2107r406J4345J5367l501j0827n057l161l143j088K592R121P471m922
1254a1012j2276m585L991R626J4659P200r867j3039L054J3403Q094o97k94Q542
1268A6799O290j2345j5726Q870K6609R556j6689j9702l333J3832J1962n843j3513
1281F767r86P255l58q724r167j300J0263R380r111j9318m906J2336J0632l503
$$ plain form
1295 -740 -14658 -19894 -10984 -2721 -7579 -14858 -15446 -13226 -8785 -3390 -6202 -12344 -10567 -6231 -7597
1310 -7597 -8446 -3790 1124 2544 -222 -5991 -7711 -1227 6717 10624 12141 5668 -3319 -2068 7935
1325 7935 13627 12349 12486 12691 10153 1914 -5983 1551 23235 30005 10615 -11503 -13090 243
1339 243 13711 15913 5247 -4587 -3723 -1092 -6230 -11648 -5914 7883 14207 139 -25851 -30810
1353 -30810 -7373 14159 12037 -5391 -19023 -16662 -6174 -3839 -7099 -740 8326 2089 -12626
1366 -12626 -17358 -10412 2214 13247 10556 -3181 -10719 -6818 266 3900 5132 7312 9706 5790
1380 5790 -6231 -9309 3301 15562 15084 7810 -657 -5082 -308 8427 9811 5659 2858 818
1394 818 2181 4159 -760 -6760 -350 10480 8790 -2881 -10777 -8560 1799 9199 4850 -5930
$$ packed form
1295g40j3918n236Q910Q263m858p279n88K220M441N395k812o142J777M336j366
1310g597q49M656M914J420k766n769j720O484P944L907J517o473q987J251J0003
1325G935N692j278J37K05k538q239p897P534K1684O770j9390k2118j587J3333
1339B43J3468K202j0666r834Q64K631n138n418N734J3797O324j4068k5990m959
1353c0810K3437K1532k122j7428j3632K361J0488K335l260O359R066o237j4715
1366a2626m732O946J2626J1033k691j3737p538L901P084L634J232K180K394l916
1380E790j2021l078J2610J2261m78p274q467m425M774Q735J384m152k801k040
1394H18J363J978m919o000O410J0830j690j1671p896K217J0359P400m349j0780
$$ plain form
1408 -5930 -9060 -2907 4287 3591 -6999 -12456 -181 12546 4283 -12548 -13788 -1785 6330 4033
1422 4033 -5619 -9364 -2155 2835 -4455 -10455 -5062 3421 4222 -1650 -10365 -10176 -935 5372 1666
1437 1666 -3918 -3270 1511 4599 -1802 -7975 222 15384 13259 -2070 -7954 157 10314 13605
1451 13605 9285 1300 1358 7117 8929 5216 3105 4932 9171 11057 4494 -4489 -3322 5321 8974
1466 8974 4637 -2162 -6952 -6391 -2518 -1694 -2591 -3143 -8027 -12189 -8111 -5235 -11040 -12918 -5389 -2710
1482 -2710 -9466 -14981 -12798 -5398 -540 -3103 -7605 -5589 -1376 -1999 -1748 1174 4387 7012 6945 2173
1498 2173 -140 6811 14491 14917 11113 6069 4499 11131 17472 11660 4640 9162 14766 9798 1385
1513 1385 -1431 3789 11551 10152 -1504 -10166 -8046 -2371 -110 -3097 -9343 -11357 -8706 -11067 -16748
$$ packed form
1408e930l130O153P194o96j0590n457J2275J2727q263j6831j240J2003Q115k297
1422D033r652l745P209M990p290o000N393Q483Q01n872q715J89R241O307l706
1437A666n584O48M781L088o401o173Q197J5162k125j5329n884Q111J0157L291
1451A3605m320p985N8N759J812l713k111J827M239J886o563q983J167Q643L653
1466H974m337o799m790N61L873Q24q97n52m884m162M078K876n805j878P529K679
1482b710o756n515K183P400M858k563m502K016M213o23K51K922L213K625o7m772
1498B173k313O951P680M26l804n044j570O632O341n812p020M522N604m968q413
1513A385k816N220P762j399j1656q662K120N675K261k987o246k014K651k361n681
$$ plain form
1528 -16748 -14238 -6927 -6149 -10048 -13631 -15821 -12714 -5982 -3551 -3390 -910 -1342 -6253 -4986 2331
1543 2331 7179 8495 9278 7998 4070 2435 6066 12747 16294 11120 5766 6821 6998 2097 2804 9937
1559 9937 10746 4440 -817 -3007 -4028 -1737 1110 2333 2945 -904 -9193 -10887 -2813 1779 213
1574 213 -745 -1242 -3040 -5906 -7200 -3672 3334 5355 452 -3189 -5062 -8067 -5640 2714 5067 -130
1590 -130 -3610 -4520 -7538 -7507 -2289 2394 4560 2362 -4962 -9457 -4356 1583 4117 6190 5859 1371
1606 1371 -3251 -3624 -270 5527 9485 7710 3572 -292 -5403 -5330 3777 9637 5265 714 -1331 -5047
1622 -5047 -6558 -1414 4970 6860 5866 -23 -5505 -4512 1466 6749 8800 8122 4469 1058 -562 -1358
1638 -1358 2165 9347 10214 3113 -2923 -6297 -7589 -3960 174 -1393 -4528 -8271 -14301 -16716 -11802
$$ packed form
1528a6748K510P311P78l899l583k190L107O732K431J61K480m32m911J267P317
1543B331M848J316P83j280l928j635L631O681L547n174n354J055J77m901P07P133
1559I937Q09o306n257k190j021K291K847J223O12l849q289j694Q074M592j566
1574B13r58m97j798k866j294L528P006K021m903l641j873l005K427Q354K353n197
1590a30l480r10l018L1N218M683K166k198p324m495N101N939K534K073l31m488
1606A371m622l73L354N797L958j775m138l864n111P3R107N860m372m551k045l716
1622e047j511N144O384J890r94n889n482R93N978N283K051o78l653l411j620p96
1638a358L523P182Q67p101o036l374j292L629M134j567l135l743o030k415M914
$$ plain form
1653 -11802 -8886 -9452 -7617 -5259 -9973 -15450 -12900 -4159 3320 3709 1244 2552 5317 2126 1260
1668 1260 11358 21500 18544 10940 8665 10205 12317 11698 11112 14839 17023 7751 -4704 -3938 3381
1683 3381 3107 -84 1010 178 -8744 -17350 -15663 -4169 2803 -3385 -11446 -10621 -9552 -12114 -8930
1698 -8930 176 3657 -104 -4982 -7219 -6528 -3409 -364 4649 9991 3980 -11149 -14170 -712 9486
1713 9486 6277 -1251 -3391 -598 -840 -5482 -4251 6625 13521 6284 -3543 -3852 2379 8807 10605
1728 10605 7833 8146 9415 4243 -1960 2787 11330 11395 6358 2048 -2289 -4761 -1923 2111 2319 -2483
1744 -2483 -8400 -9362 -4208 -4310 -11245 -10313 -1379 1362 -6340 -13551 -9823 838 4980 -1603 -5339
1759 -5339 2718 5975 -1241 -3143 6485 10412 2769 -2546 1748 7105 4284 -4560 -4650 3731 5965
$$ packed form
1653a1802K916n66J835K358m714n477K550Q741P479L89k465J308K765l191q66
1668A260J0098J0142k956p604k275J540K112o19n86L727K184r272j2455P66P319
1683C381k74l191J094q32q922q606J687J1494O972o188q061Q25J069k562L184
1698h930R106L481l761m878k237O91L119L045N013N342o011j5129l021J3458J0198
1713I486l209p528k140K793k42m642J231J0876O896p237r827l09O231O428J798
1728A0605k772L13J269n172o203M747Q543O5n037m310m337k472K838M034K08m802
1744b483n917r62N154j02o935R32Q934K741p702p211L728J0661M142o583l736
1759e339Q057L257p216j902R628L927p643n315M294N357k821q844r0Q381K234
$$ plain form
1774 5965 -4004 -9401 -4439 -779 -2169 -4182 -4109 -2822 -1750 -2900 -2662 861 2118 658 3995 7439
1790 7439 4213 1697 7289 11812 8514 4803 5911 10391 10178 3419 -1255 4315 10698 5016 -6035
1805 -6035 -7781 -847 3648 -1539 -11383 -12477 -3669 -286 -8935 -14703 -9175 -3290 -3467 -7601 -9910
1820 -9910 -7360 -1310 -866 -4264 -2927 852 -117 -1829 294 2805 4373 3770 1514 985 3452 4394
1836 4394 3432 3974 3778 2526 4881 6043 878 -1839 5169 11017 6591 -722 -1980 3422 8067 5425
1852 5425 -222 3030 7976 2762 -5880 -4009 4947 7407 1231 -6357 -7106 -2308 -1892 -6602 -5897 -806
1868 -806 -429 -6528 -12360 -13761 -7052 3948 4522 -6197 -13877 -9721 -1824 1515 -154 -1547 1546
1883 1546 3973 -2519 -9265 -3029 9618 13978 6710 -2903 -5508 115 6356 6704 6666 8418 5835
$$ packed form
1774E965r969n397M962L660j390k013P3J287J072j150K38L523J257j460L337L444
1790G439l226k516N592M523l298l711J108M480k13o759m674N570O383n682j1051
1805f035j746O934M495n187r844j094Q808L383q649n768N528N885j77m134k309
1820i910K550O050M44l398J337L779r69j712K123K511J568o03k256n29K467R42
1836D394r62N42j96j252K355J162n165k717P008N848m426p313j258N402M645k642
1852E425n647L252M946n214q642J871Q956K460o176p588p49M798M16m710P05N091
1868h06L77o099n832j401O709J1000N74j0719p680M156P897L339j669j393L093
1883A546K427o492o746O236J2647M360p268r613k605N623O241L48l8J752k583
$$ plain form
1898 5835 -1544 -4687 -878 6869 13810 10943 -1378 -7049 -1075 4530 4265 3909 5604 5383 -32
1913 -32 -7562 -7996 3220 10569 4447 -5379 -7456 -5249 -3671 -2854 -2513 -658 298 -5319 -12746 -11084
1929 -11084 -2719 1602 -1145 -6345 -9983 -7264 -652 -846 -6377 -4180 2366 3013 -3064 -6623 -1914
1944 -1914 6956 8382 -783 -4611 3770 10600 7643 954 -262 4681 10737 9843 3132 1967 7942
1959 7942 7935 2232 139 4036 10013 10717 1348 -8608 -5440 5028 6880 241 -4125 -3512 -2961 -7166
1975 -7166 -11912 -6621 4193 4377 -8869 -17578 -13892 -4998 789 208 -4539 -6998 -5169 -6699 -9316
1990 -9316 -3444 6890 10208 3468 -7986 -11154 -546 12334 12044 4066 1643 3666 1997 -1096
2004 -1096 555 10138 17107 9108 -6369 -9270 1657 9190 7590 3406 1052 -778 -2181 -4068
$$ packed form
1898E835p379l143L809P747O941k867j2321n671N974N605k65l56J695k21n415
1913c2p530m34J1216P349o122r826k077K207J578Q17L41J855R56n617p427J662
1929a1084Q365M321k747n200l638K719O612j94n531K197O546O47o077l559M709
1944a914Q870J426r165l828Q381O830k957o689j216M943O056q94o711j165N975
1959G942pn703k093L897N977P04r369r956L168J0468J852o639m366O13N51m205
1975g166m746N291J0814J84j3246q709L686Q894N787n81m747k459J829j530k617
1990i316N872J0334L318o740j1454l168J0608J2880k90p978k423K023j669l093
2004a096J651R583O969p999j5477k901J0927P533j600m184k354j830j403j887
$$ plain form
2018 -4068 -4230 2468 8893 5298 -5307 -10984 -6627 2983 7781 2551 -4330 -3579 -45 -2212 -3999
2033 -3999 -684 5064 5083 -2077 -8620 -5418 4229 4112 -2807 -3950 388 -119 -3845 -5777 -3306 2246
2049 2246 3338 -4298 -10649 -5908 2340 3409 -3403 -8356 -4610 3426 4324 -3690 -6263 1444 7015
2064 7015 3328 -2544 -2131 5909 11375 5937 -3029 -100 10106 11991 5133 973 3145 7930 8918
2079 8918 2485 -2363 3291 10569 6404 -5114 -9027 -676 8446 4374 -8816 -12655 -2290 2410
2093 2410 -5191 -11313 -7647 -1915 -1466 -7659 -12283 -8306 -974 -1222 -5661 -6141 -4311 -4029 -3031 -1374
2109 -1374 -728 954 1560 -790 -2465 634 4965 6107 3949 553 2939 8536 7083 1097 3320
2124 3320 11531 12628 4904 96 3510 10277 12247 4889 -600 4408 8221 2674 -3685 -1884 4077
$$ packed form
2018d068j62O698O425l595j0605n677M357R610M798n230o881P51L534k167j787
2033c999L315N748J9p160o543L202R647j17o919j143M338n07l726j932K471N552
2049B246J092p636o351M741Q248J069o812m953L746Q036Q98q014k573P707N571
2064G015l687n872M13Q040N466n438q966K929J0206J885o858m160K172M785R88
2079H918o433m848N654P278m165j1518l913Q351R122m072j3190l839J0365M700
2093B410p601o122L666N732M49o193m624L977P332k48m439m80J830K82R98J657
2109a374O46J682O06k350j675L099M331J142k158l396K386N597j453n986K223
2124C320Q211J097p724m808L414O767J970p358n489N008L813n547o359J801N961
$$ plain form
2139 4077 4114 -3859 -11949 -10208 -1964 31 -8276 -14497 -12254 -5385 -4054 -11281 -16202 -8455 3614
2154 3614 987 -11550 -13618 -2176 8760 8704 549 -4400 1839 10474 9767 4489 5018 10112 12197
2169 12197 7061 75 -249 8503 12349 5074 -3297 -3941 -566 -32 -2116 -3270 -958 829 -6125
2184 -6125 -13003 -7861 2002 3639 -2311 -5295 -3974 -2225 136 1043 3806 7005 4980 -761 -2264
2199 -2264 2419 6878 8183 5306 -169 -996 1543 417 -2290 56 3725 2660 -3909 -11580 -10481
2214 -10481 1649 8441 -776 -12959 -10139 392 3368 -2172 -6509 -2573 4114 3379 -5210 -8555
2228 -8555 -421 7652 6920 -2146 -9707 -4860 5888 6799 -1674 -5344 -749 2652 889 -3066 -2006
2243 -2006 5017 8403 1353 -5376 -343 10050 11437 6323 2312 3413 7360 9027 7210 6226 7639
$$ packed form
2139D077L7p973q090J741Q244J995q307o221K243O869J331p227m921P747J2069
2154C614k627j2537k068J1442J0936n6q155m949O239Q635p07n278N29N094K085
2169A2197n136o986l24Q752L846p275q371o44L375N34k084j154K312J787o954
2184f125o878N142R863J637n950k984J321J749K361R07K763L199k025n741j503
2199b264M683M459J305k877n475q27K539j126k707K346L669j065o569p671J099
2214a0481J2130O792r217j2183K820J0531K976n540m337L936O687p35q589l345
2228h555Q134Q073p32r066p561M847J0748R11q473l670M595L401j763l955J060
2243b006P023L386p050o729N033J0393J387n114m011J101L947J667j817r84J413
$$ plain form
2258 7639 6638 3028 157 -44 1532 3729 945 -6760 -9921 -8962 -8579 -8480 -6904 -7587 -12929 -17248
2274 -17248 -16835 -11317 -4000 -3444 -10352 -13375 -6981 -1431 -1217 -2020 1218 7536 9186 3076 -1903 4701
2290 4701 16698 19328 12398 3374 1933 10088 16826 12199 4063 5830 10409 6218 -1999 -2843 4533
2305 4533 11073 6099 -6664 -11215 -2999 4381 2039 -3685 -6081 -4783 -2666 -4226 -6988 -5603 -647
2320 -647 -138 -5091 -10610 -12183 -6097 2170 -12 -10068 -12594 -6905 -3598 -4873 -5800 -4180 -2847
2335 -2847 -3330 -5444 -3911 1092 3502 2674 3020 4367 4058 3904 6838 10767 12870 10225 5014 4742
2351 4742 11078 14411 10235 5717 5563 6352 6703 4591 682 612 4599 3768 -4324 -9073 -5493 695
2367 695 483 -6715 -12783 -10047 -3262 -3271 -8471 -10425 -7430 -3704 -3692 -8861 -11410 -4741 2879 -24 -8067
$$ packed form
2258G639j001l610k871k01J576K197k784p705l161R59L83R9J576o83n342m319
2274a7248M13N518P317N56o908l023O394N550K14q03L238O318J650o110m979O604
2290D701J1997K630o930r024j441Q155O738m627q136J767M579m191q217q44P376
2305D533O540m974j2763m551Q216P380k342n724k396J298K117j560k762J385M956
2320f47N09m953n519j573O086Q267k182j0056k526N689L307j275r27J620J333
2335b847m83k114J533N003K410q28L46J347l09j54K934L929K103k645n211k72
2351D742O336L333m176m518j54P89L51k112l909p0L987q31q092m749L580O188
2367F95k12p198o068K736O785rn200j954K995L726J2n169k549O669P620k903q043
$$ plain form
2384 -8067 -9979 -4077 3615 4117 -2952 -6222 95 6203 2617 -2871 -260 5975 8139 4248 -325
2399 -325 1676 7700 9381 6963 5339 4512 4994 7763 8418 5642 4246 6536 6216 3598 2455 1902
2415 1902 2046 3208 2060 -1566 -3133 -2312 -3138 -3206 -3085 -4774 -7976 -7581 -5533 -5298 -6885 -8912 -7821
2432 -7821 -4050 -3616 -8621 -8935 -3572 -461 -2047 -3837 -4627 -2961 1744 3639 32 -1982 1433 5376
2448 5376 5976 2548 -73 3480 9574 8612 1634 455 6096 9731 7201 1871 659 5747 8487
2463 8487 3080 -900 1772 4679 3084 149 -1043 -2141 -587 1796 -582 -3647 -4428 -3067 -1829
2478 -1829 -1958 -3993 -5455 -3574 -1346 -3534 -5037 -3997 -2708 -1595 -2009 -4406 -4152 -705 -257 -1750
2494 -1750 -1670 -463 -1281 -1382 245 1273 969 586 -1121 -1083 2149 2342 -372 -630 2587 3693 713
$$ packed form
2384h067j912N902P692N02p069l270O317O108l586n488K611O235K164l891m573
2399c25K001O024J681k418j624q27M82K769O55k776j396K290l20k618j143n53
2415A902J44J162j148l626j567Q21q26o8J21j689l202L95K048K35j587k027J091
2432g821L771M34n005l14N363L111j586j790p90J666M705J895l607k014L415L943
2448E376O00l428k621L553O094r62o978j179N641L635k530n330j212N088K740
2463H487n407l980K672K907j595k935j192j098J554K383k378l065p81J361J238
2478a829j29k035j462J881K228k188j503J040J289J113m14k397K54L447M48j493
2494a750Q0J207q18j01J627J028l04l83j707L8L232J93k714k58L217J106k980
$$ plain form
2511 713 -1831 202 5367 6664 1093 -1970 2343 5327 3631 1678 2977 4013 3531 1717 541
2526 541 1169 3689 3285 2010 1136 -1491 -3324 173 4190 905 -4228 -4348 -1225 77 -3628 -6387
2542 -6387 -2903 1484 -1872 -8637 -7848 -2138 -416 -2641 -3832 -4389 -4185 -3197 -3129 -2080 151 -780 -2306
2559 -2306 -1051 547 -660 -1308 2256 4530 3227 1013 -446 2226 6005 5687 2449 3237 5512 4920
2575 4920 4071 3176 3016 4338 6481 4381 1154 1011 2325 2077 2212 1604 -1022 -1784 -226 -687 -3026
2592 -3026 -4032 -3455 -1679 -982 -4725 -8373 -6214 -1368 -2344 -5380 -5934 -4614 -2264 -3138 -5949 -5364
2608 -5364 34 1634 -2180 -3825 -1836 -224 922 2910 2239 1011 1844 2621 2888 2683 2411 3567
2624 3567 6487 5947 957 -436 3724 6720 5063 2830 1513 1926 3379 1990 -267 1613 2959
$$ packed form
2511G13k544K033N165J297n571l063M313K984j696j953J299J036m82j814j176
2526E41O28K520m04j275q74k627j833L497M017l285n133j20L123J302l705k759
2542f387L484M387l356o765P89N710J722k225j191n57K04R88O8J049K231r31j526
2559b306J255J598j207o48L564K274j303k214j459K672L779l18l238P88K275n92
2575D920q49q95j60J322K143k100l227j43J314k48J35o08k626p62J558m61k339
2592c026j006N77J776O97l743l648K159M846r76l036n54J320K350q74k811N85
2608e364N398J600l814j645J989J612J146J988o71j228Q33P77K67k05k72J156
2624C567K920n40m990j393M160K996j657k233j317M13J453j389k257J880J346
$$ plain form
2639 2959 1666 -367 -1204 -2556 -1965 1040 1266 -1810 -3375 -2821 -1878 -1940 -2745 -3133 -741 246 -2976
2656 -2976 -4935 -2966 -877 -1216 -1267 -1697 -2835 -2439 -1680 -2443 -1915 -1076 -1087 -559 -321 -2134 -3571 -233
2674 -233 2774 1586 -1186 -685 940 2151 1633 713 2325 5168 4134 1547 1536 3023 4342 5347
2690 5347 5464 3381 2106 2623 3006 2426 3037 2900 1860 1160 347 -2293 -1851 679 505 -1512 -3553
2707 -3553 -4814 -4264 -2202 -3270 -4489 -4326 -2782 -3360 -5206 -5981 -4682 -921 436 -3177 -5748 -2931
2723 -2931 -357 -364 -693 -13 -310 132 821 490 157 1356 2291 3152 3716 945 -405 2917 6584 4552
2741 4552 1743 2136 4195 5573 3720 1289 2933 6544 4723 -200 240 3278 3404 1659 780 -701
2757 -701 -1308 -731 -1272 -2150 -2528 -3139 -3480 -2577 -4605 -7408 -5710 -2124 -1990 -5180 -6980 -5726 -2611
$$ packed form
2639B959j293k033q37j352N91L005K26l076j565N54R43o2q05l88K392R87l222
2656b976j959J969K089l39n1m30j138L96P59p63N28Q39j1N28K38j813j437L338
2674b33L007j188k772N01J625J211n18r20J612K843j034k587j1J487J319J005
2690E347J17k083j275N17L83n80O11j37j040p00q13k640M42K530j74k017k041
2707c553j261N50K062j068j219J63J544n78j846p75J299L761J357l613k571K817
2723b931K574pl29O80k97M42O89l31l33J199R35Q61N64k771j350L322L667k032
2741D552k809L93K059J378j853k431J644L611j821m923M40L038J26j745q79j481
2757g01o07N77n41q78l78o11l41R03k028k803J698L586J34l190j800J254L115
$$ plain form
2774 -2611 -163 -2389 -4055 -1871 416 -167 -886 32 1495 3164 4542 2219 -90 1590 4054 4990
2790 4990 4644 3180 1283 1897 2885 2627 2444 2815 1923 1258 1953 65 -1073 1515 3990 1717 -866
2807 -866 -1673 -575 1174 1836 -315 -946 1027 1049 -1941 -2206 -764 389 243 -717 -2984 -3746 -2478
2824 -2478 -1002 -795 -1693 -4456 -4341 -1012 -22 -3862 -5143 -1263 531 -659 -2104 -3212 -1333 1107
2840 1107 835 -1078 -366 1902 1982 1810 1304 -107 1329 4040 5131 3025 869 562 1847 3046 3209
2857 3209 1820 2601 3206 992 -1131 36 1914 3044 3985 1368 -2380 -3125 -178 1339 2426 1271
2873 1271 -802 -1921 -1858 -3122 -2881 325 2150 199 -3570 -6231 -6040 -2404 1578 1012 -2433 -5112
2889 -5112 -6191 -4571 -840 -262 -1260 -204 224 -3178 -5384 -2481 2330 5192 4223 -141 -3416 -807
$$ packed form
2774b611K448k226j666K184K287n83p19R18J463J669J378k323k309J680K464R36
2790D990l46j464j897O14R88k58j83L71q92o65O95j888j138K588K475k273k583
2807h66q07J098J749O62k151o31J973K2k990k65J442J153j46r60k267p62J268
2824b478J476K07q98k763J15L329R90l840j281L880J794j190j445j108J879K440
2840A107k72j913P12K268Q0j72n06j411J436K711J091k106k156l07J285J199J63
2857C209j389P81O05k214k123J167J878J130R41k617l748p45K947J517J087j155
2873A271k073j119O3j264K41L206J825j951l769k661J91L636L982n66l445k679
2889e112j079J620L731N78r98J056M28l402k206K903M811K862r69m364l275K609
$$ plain form
2905 -807 2480 4758 5465 4015 1731 1383 2169 1568 2338 5318 6395 4243 483 -2156 -536 4377
2921 4377 5762 1500 -928 -731 -399 -876 -310 -344 -517 -258 -1074 -3446 -4481 -3063 -1370 -79 -1777
2938 -1777 -5464 -5167 -1549 -811 -3358 -4455 -3332 -1525 -785 -1696 -3550 -2883 -503 -127 -857 -792 -225
2955 -225 674 1677 891 -1252 -214 3985 5487 3609 599 -437 2302 5114 4655 3119 3143 2803 1407
2972 1407 977 2192 2496 4106 5042 1603 -2827 -2795 280 2944 3831 445 -3199 -3425 -1919 -1851 -1452
2989 -1452 45 -302 -2244 -4200 -5466 -5303 -1842 389 -181 -2632 -5974 -6782 -2688 1333 -168 -2023
3005 -2023 -1033 -564 -2593 -2704 -713 1893 3835 2609 -1029 -2222 253 3348 4780 4627 1946 294
3021 294 1427 3385 2578 2139 3185 4188 3923 1118 -1145 577 5012 4590 577 -1069 -450 -162 703
$$ packed form
2905h07L287K278P07j450k284l48P86o01P70K980J077k152l760k639J620M913
2921D377J385m262k428J97L32m77N66l4j73K59q16k372j035J418J693J291j698
2938a777l687K97L618P38k547j097J123J807P40r11j854O67K380L76p30O5N67
2955b25Q99J003p86k143J038M199J502j878l010j036K739K812m59j536K4l40j396
2972A407m30J215L04J610R36l439m430L2L075K664Q87l386l644k26J506O8L99
2989a452J497l47j942j956j266J63L461K231n70k451l342q08M094M021j501j855
3005b023R90M69k029j11J991K606J942j226l638j193K475L095J432j53k681j652
3021B94J133J958q07m39J046J003k65k805k263J722M435m22m013j646O19K88Q65
$$ plain form
3038 703 937 -784 -920 -16 -1596 -2481 -2760 -2102 -1247 -371 -2108 -4515 -3966 -2086 -1804 -1967 -2012 -2781 -2833
3057 -2833 -1705 -2096 -2074 -930 -829 -1188 -705 -392 -1554 -555 1924 1880 124 273 768 1448 2135 2402 1564
3076 1564 2077 2489 2061 1964 2622 1862 2766 4458 2636 -118 921 3306 3807 2283 325 -96 1727
3093 1727 2208 -532 -1926 341 1591 -730 -2393 -2694 -2455 -982 -652 -2508 -3598 -3493 -2900 -2264 -2031
3110 -2031 -3382 -3578 -1744 -1661 -3638 -3597 -1047 -560 -1188 -1716 -1545 -689 935 244 -767 969 2084 1468
3128 1468 833 2262 2699 2578 2406 2066 2233 4011 3862 2630 2076 2250 2010 3072 2622 1704 2009 2663
3146 2663 26 -2046 765 3142 1564 -599 -2104 -2237 -1582 -510 -1281 -1370 -719 -2221 -4606 -4302 -3373
3163 -3373 -1666 429 -586 -4289 -5810 -4271 -1645 -89 -33 -1681 -2341 -1569 -2755 -3141 821 4540
$$ packed form
3038G03K34j721j36R04j580q85k79O58Q55Q76j737k407N49J880K82j63m5p69n2
3057b833J128l91K2J144J01l59M83L13j162R99K479m4j756J49M95O80O87K67q38
3076A564N13M12m28r7O58p60R04J692j822k754J039K385N01j524j958m21J823
3093A727M81k740j394K267J250k321j663l01K39J473L30j856j090J05N93O36K33
3110b031j351j96J834Q3j977M1K550M87o28n28J71Q56J624o91j011J736J115o16
3128A468o35J429M37j21j72l40J67J778j49j232n54J74k40J062m50r18L05O54
3146B663k637k072K811K377j578k163j505j33O55J072p71q9O51j502k385L04R29
3163c373J707K095j015l703j521J539K626J556N6j648o60P72j186l86L962L719
$$ plain form
3179 4540 2719 -779 -2209 -1259 1487 3808 4265 3755 2509 278 -1185 1309 4368 5546 4844 2832
3195 2832 -109 -1060 1785 3056 3964 4107 2071 -958 -1951 -1198 228 2991 3469 -934 -4356 -3301
3211 -3301 -1380 -828 -987 -738 -984 -1696 -4164 -5625 -3108 647 232 -2119 -3799 -3986 -2663 -22 -601
3228 -601 -1845 -858 512 -519 -2252 -1772 -13 2128 2635 -750 -2213 1174 4065 1902 -398 176
3244 176 2346 3795 2808 411 578 2850 2743 1426 2457 2595 2631 2826 1529 -690 533 3203 3182
3261 3182 1226 -113 -803 -1578 -461 129 489 721 -1029 -4245 -4778 -2542 -1060 -1047 -1153 -3280 -4890
3278 -4890 -4344 -3750 -2729 -415 378 -1732 -2975 -3404 -3344 -54 3310 2350 -768 -918 318 -334 688
3295 688 3101 4925 4244 724 -2286 -397 4534 5051 2006 1227 1692 1479 277 80 1222 4133 3811
$$ packed form
3179D540j821l498j430R50K746K321M57n10j246k231j463K494L059J178p02k012
3195B832k941r51K845J271R08J43k036l029r93P53J426K763M78m403l422J055
3211c301J921N52j59K49k46p12k468j461K517L755m15k351j680j87J323K641n79
3228f01j244R87J370j031j733M80J759K141N07l385j463L387K891k163k300N74
3244A76K170J449r87k397J67K272j07j317J031J38L6J95j297k219J223K670k1
3261C182j956j339o90p75J117N90L60K32j750l216n33K236J482J3j06k127j610
3278d890N46N94J021K314P93k110j243m29O0L290L364r60l118j50J236o52J022
3295F88K413J824o81l520l010J889M931N17l045p79M65k13j202j97J142K911l22
$$ plain form
3312 3811 -85 -2389 -1117 272 2129 2762 1203 -1558 -1346 -122 -392 -642 -16 171 -345 -1800 -3492
3329 -3492 -2673 244 226 -2721 -3460 -1625 -1585 -2818 -3386 -2301 -17 153 -3131 -4604 -1485 1522 408
3346 408 -1331 -1185 -90 1646 1646 -292 71 2680 3513 1424 591 1738 2560 2671 1371 788 2035 2955
3364 2955 1391 480 1001 1392 1307 1230 377 -898 468 1827 1245 -1030 -1461 224 2196 1976 -1144 -2616
3382 -2616 640 3126 411 -2251 -1717 318 673 -1540 -2594 -1167 -206 -2153 -3480 -1601 -1212 -3600
3398 -3600 -4041 -1875 -1442 -2104 -3077 -3117 -1404 492 -519 -2422 -519 1054 903 810 1461 1530 1838 2846
3416 2846 2626 2512 2897 3121 3421 3645 2401 1553 3085 4281 1598 318 1869 2934 1917 -196 -1487
3433 -1487 -540 2759 2297 -2697 -4142 -1095 1464 146 -3096 -4139 -1253 1342 -1631 -5294 -4002
$$ packed form
3312C811l896k304J272J389J857O33j559k761K12J224k70k50O26J87n16j455j692
3329c492Q19K917j8k947p39J835M0j233n68J085K284J70l284j473L119L007j114
3346D08j739J46J095J736%j938L63K609Q33k089q33J147Q22J11j300n83J247R20
3364B955j564r11N21L91q5p7q53j275J366J359n82k275m31J685J972k20l120j472
3382b616L256K486k715k662N34K035L55k213j054J427R61j947j327J879L89k388
3398c600m41K166M33o62r73m0J713J896j011j903J903J573j51r3O51O9L08J008
3416B846k20j14L85K24L00K24j244q48J532J196k683j280J551J065j017k113j291
3433a487R47L299m62m994j445L047K559j318l242j043K886K595k973l663J292
$$ plain form
3448 -4002 -759 -34 -1843 -3960 -4452 -2747 -798 -1353 -2066 -1681 -2105 -2521 -1374 -1230 -1221 268 1781 590
3466 590 -1154 -614 1732 3522 3084 1883 2170 4077 3150 1011 2671 5493 5482 2985 1315 1218 2733
3483 2733 3870 2559 2018 2252 871 -1740 -1033 1431 1229 -1075 -1787 -1512 -1888 -2646 -3584 -3102 -816
3500 -816 -738 -3246 -5156 -4709 -3405 -1250 -1092 -2854 -4607 -3364 -1765 -1496 -2139 -1780 -1289 135 777
3517 777 -2069 -2098 804 2948 2537 1261 737 1742 3229 3003 2063 2813 4291 4048 2707 2150 2610 4161
3535 4161 4182 2292 1271 2991 3363 1552 -145 649 1182 961 618 -1085 -2201 -1354 -1406 -1663 -1120 -1962
3553 -1962 -3489 -3165 -2580 -3396 -3776 -3119 -2491 -2379 -3177 -3543 -3775 -2680 -1903 -2049 -705 -581 -3058 -2922
3571 -2922 345 1720 767 163 699 1391 2168 1549 1227 3562 5007 3818 2454 2287 3006 3725 4658 3668
$$ packed form
3448d002L243P25j809k117m92J705J949n55p13L85m24m16J147J44RJ489J513j191
3466E90j744N40K346J790m38j201K87J907r27k139J660K822j1k497j670r7J515
3483B733J137j311n41K34j381k611P07K464k02k304p12K75l76p58r38M82K286
3500h16P8k508j910M47J304K155J58j762j753J243J599K69o43L59M91J424O42
3517G77k846k9K902K144m11j276n24J005J487k26r40P50J478k43j341n57M60J551
3535D161K1j890j021J720L72j811j697P94N33k21l43j703j116Q47n2k57N43q42
3553a962j527L24N85q16l80O57O28J12p98l66k32J095P77j46J344J24k477J36
3571b922L267J375r53o04N36O92P77o19l22K335J445j189j364j67P19P19R33r90
$$ plain form
3589 3668 2602 2526 2720 1567 926 1403 1596 1359 680 -1790 -2564 -428 -34 -1406 -2586 -2592 -2535 -2579 -2869
3608 -2869 -3911 -2989 -1828 -1505 -3114 -3343 -3349 -2031 72 -579 -2196 -1942 -437 -520 -808 -380 181 626
3626 626 956 428 -39 446 1177 772 1463 2025 913 330 1537 2112 1979 1419 1564 1933 1962 1507 830 1878
3646 1878 2618 1719 1365 1262 935 176 1127 1442 539 350 266 -489 -541 -501 -1488 -1185 188 -1066 -2756 -2273
3666 -2273 -1131 -1297 -2000 -1865 -1951 -1567 -1077 -2259 -2249 -848 -824 -1106 -731 -1158 -1255 -246 603 -434 -518 34
3686 34 -34 316 734 244 72 1481 1324 469 996 1380 1514 1794 1604 1221 1282 2493 2220 1752 2116 2034 1914
3707 1914 2183 1846 681 1413 2287 885 34 439 521 -314 -226 -701 -953 -1135 -1452 -2211 -2365 -2263 -2470 -2307
3727 -2307 -1870 -2867 -3444 -2483 -1880 -2600 -3147 -2667 -2011 -1076 -1441 -2250 -1573 853 429 -982 -80 1045 1069
$$ packed form
3589C668j066p6J94j153o41M77J93k37o79k470p74K136L94j372j180oN7m4k90
3608b869j042R22J161L23j609k29oJ318K103o51j617K54J505q3k88M28N61M45
3626F26L30n28m67M85P31m05O91N62j112n83J207N75j33n60J45L69K9m55o77J048
3646A878P40q99l54j03l27p59R51L15r03j89q4p55n2M0r87L03J373j254j690M83
3666b273J142j66p03J35q6L84M90j182J0J401K4k82L75m27r7J009Q49j037q4N52
3686C4o8L50M18m90j72J409j57q55N27L84J34K80j90l83O1J211k73m68L64q2j20
3707A914K69l37j165P32Q74j402q51M05Q2q35Q8m75k52j82l17p59j54J02k07J63
3727b307M37r97n77R61O03p20n47M80O56R35l65q09O77K426m24j411R02J125K4
$$ plain form
3746 1069 1771 2142 1791 2268 2689 2558 2529 2943 2715 2462 3088 2830 1951 2303 3071 2121 1258 1072 1088 709
3766 709 908 -47 -1038 167 -227 -1535 -1479 -1115 -1677 -2023 -1794 -2188 -2640 -2035 -1896 -2257 -1674 -2307 -2384 -1823
3786 -1823 -807 -1626 -1655 -1335 -1511 -950 -41 -307 -1233 -258 368 396 278 93 33 1588 2251 542 -273 1410
3806 1410 2701 2817 2084 1350 1424 2202 2866 1982 1511 2308 2646 2086 1122 10 653 2628 2241 -431 -1204
3825 -1204 99 171 -636 -1200 -1450 -1037 -617 -2090 -3597 -2256 -906 -1416 -1828 -2795 -2925 -2398 -617 -1125
3843 -1125 -1400 -1530 -1406 -971 -624 -613 -727 608 1062 -535 -814 -51 550 429 889 1460 315 -12 272
3862 272 947 2069 2123 85 589 1711 2007 1545 1220 1579 2413 2483 1519 172 1490 3011 2232 1142
3880 1142 303 155 1193 2108 447 -1678 -1187 264 -1238 -2390 -3220 -1912 -713 -1883 -4167 -4628
$$ packed form
3746A069P02L71l51M77M21j31k9M14k28k53O26k58q79L52P68r50q63j86J6l79
3766G09J99r55r91J205l94j308N6L64n62l46K29l94m52O05J39l61N83o33p7N61
3786a823J016q19k9L20j76N61R09k66r26R75O26K8j18j85o0J555O63j709q15J683
3806A410J291J16p33p34P4P78O64q84m71P97L38n60r64j112O43J975l87k672p73
3825a204J303P2q07n64k50M13M20j473j507J341J350n10m12r67j30N27J781n08
3843a125k75j30J24M35L47J1j14J335M54j597k79P63O01j21M60N71j145l27K84
3862B72O75J122N4k038N04J122K96m62l25L59Q34P0r64j347J318J521p79j090
3880A142q39j48J038R15j661k125M91J451j502j152q30J308J199j170k284m61
$$ plain form
3896 -4628 -2688 -722 -1763 -3187 -3892 -2733 -448 171 -1593 -1989 374 1124 35 -839 -116 1796
3912 1796 3208 2086 -201 331 2456 2825 2044 1552 1677 1371 1715 1751 1413 1643 1601 1297 1039 445 -107
3931 -107 580 1975 1281 -58 -161 -86 -38 565 921 -59 -643 -1056 -479 -39 -393 -1587 -2123 -436 -145
3950 -145 -2838 -3974 -2348 -61 -436 -2979 -4934 -2894 560 -492 -2605 -2493 -886 190 166 -993
3966 -993 -1553 573 2545 1863 -603 -276 1640 3090 3266 1195 -100 2027 3803 2543 605 827
3982 827 2181 3232 1777 -943 -729 2399 3297 435 -1479 -986 921 1904 537 -1618 -1548 504 607
3999 607 -1469 -1783 -559 -514 -647 -1082 -1950 -1925 -1546 -1658 -1031 -706 -2292 -3273 -1181 -360 -1013 -2155 -2284
4018 -2284 -1216 -31 -51 -1349 -982 655 985 214 339 82 373 1675 2989 1762 103 1103 3259
$$ packed form
3896d628J940J966j041j424p05J159K285O19j764l96K363P50j089q74P23J912
3912A796J412j122k287N32K125L69p81m92J25l06L44L6l38K30m2l04k58n94n52
3931a07O87J395o94j339j03P5M8O03L56r80n84m13N77M40l54j194n36J687K91
3950a45k693j136J626K287l75k543j955K040L454j052k113J12J607J076k4j159
3966i93n60K126J972o82k466L27J916J450J76k071j295K127J776j260j938K22
3982H27J354J051j455k720K14L128Q98k862j914M93J907R83j367k155P0K052J03
3999F07k076l14J224M5j33m35q68K5L79j12O27L25j586r81K092Q21o53j142j29
4018b284J068J185k0j298L67J637L30p71J25k57K91J302J314j227j659J000K156
$$ plain form
4035 3259 2915 1667 196 2160 4227 2740 -686 -824 2882 3948 1712 -1326 -1427 1866 2810 -128
4051 -128 -2474 -1200 1065 544 -1258 -2643 -2575 -248 1000 -1237 -3542 -3183 -1227 -48 -721 -2557
4067 -2557 -3263 -1518 -326 -1116 -2343 -1362 -279 328 -309 -1479 -1116 832 1173 67 489 940 738
4084 738 574 1142 1620 2342 2156 648 461 2086 1948 1192 1331 1816 1347 344 34 675 2228 2356 -173
4103 -173 -1243 1083 1987 179 -1100 -330 580 1034 -37 -2342 -1850 577 1308 -479 -2680 -3197 -1793
4120 -1793 936 65 -2982 -3899 -1727 385 -1193 -3075 -3295 -633 598 -1097 -3553 -1993 913 957
4136 957 -397 -962 -407 856 2007 1198 424 1502 2638 1598 746 1554 2594 3133 2626 360 233
4153 233 1965 2729 1775 1171 520 556 760 410 23 -65 813 -570 -1286 -412 -837 -914 -407 396 -592 -1734
$$ packed form
4035C259l44j248j471J964K067j487l426j38L706J066k236l038j01L293R44k938
4051a28k346J274K265n21j802j385O8K327J248k237k305L59J956J179o73j836
4067b557p06J745J192p90j227R81J083O07o37j170L63J948L41j106M22M51k02
4084G38j64N68M78P22j86j508j87J625j38p56J39M85m69j003l10O41J553J28k529
4103a73j070K326R04j808j279P70R10M54j071k305M92K427P31j787k201n17J404
4120a793K729q71l047r17K172K112j578j882k20K662J231j695k456J560K906M4
4136I57j354n65N55J263J151q09p74J078J136j040q52Q08J040N39n07k266j27
4153B33J732P64r54o04o51L6K04l50l87q8Q78j383p16Q74m25p7N07Q03r88j142
$$ plain form
4173 -1734 -2553 -2477 -931 408 -220 -2317 -3875 -2948 -393 97 -1768 -3366 -1582 68 -1434 -2416 -2372
4190 -2372 -272 1595 659 -1453 -2370 556 2985 2245 962 799 1366 2248 2545 1700 2051 3724 3151
4207 3151 1438 393 1397 3194 3515 1483 -732 206 2024 787 -836 -508 -176 319 -380 -1905
4223 -1905 -2679 -1064 -159 -1170 -2262 -2499 -2310 -1401 -769 -919 -1781 -2114 -1540 -1226 -462 -261 -1256 -1219 -474
4242 -474 -419 -17 287 -989 -855 1076 1344 -391 -1082 417 1843 2051 556 -670 30 2640 2350 853
4260 853 545 1621 1794 1744 1257 990 1633 2540 1276 -453 184 1309 1954 1298 -640 -1433 490 1617
4278 1617 -630 -2158 -476 902 83 -1731 -2960 -2167 10 439 -1855 -3300 -2141 -968 -542 -800
4294 -800 -2225 -1976 -444 -300 -1269 -1369 -498 76 -44 25 -458 -333 658 694 591 1386 1169 37 357 1722
$$ packed form
4173a734q19P6J546J339o28k097j558R27K555M90j865j598J784J650j502r82M4
4190b372K100J867r36k112r17K926K429p40j283j63N67Q82K97q45L51J673n73
4207C151j713j045J004J797L21k032k215R38J818j237j623L28L32M95o99j525
4223a905p74J615R05j011j092k37J89R09O32j50q62l33N74L14P64K01r95L7P45
4242d74N5M02L04j276J34J931K68j735o91J499J426K08j495j226P00K610k90j497
4260H53l08J076J73n0m87k67O43R07j264j729O37J125O45o56j938p93J923J127
4278A617k247j528J682J378q19j814j229P93K177M29k294j445J159J173M26k58
4294h00j425K49J532J44r69j00Q71N74j20O9m83J25R91L6j03P95k17j132L20J365
$$ plain form
4314 1722 2323 1668 1509 1053 1093 2076 1602 970 1757 1780 1187 1350 840 564 1102 1533 119 -348 558 203
4334 203 -351 -539 -833 -345 422 -665 -2468 -2119 65 38 -1570 -2513 -2425 -1112 -618 -1515 -3142 -1978
4352 -1978 -249 -921 -1491 -2005 -1953 -128 1135 -379 -1795 -673 1106 1047 698 65 785 2277 2263 697
4370 697 650 2505 2930 1838 1706 1744 1915 2305 1726 955 1123 1783 986 411 344 89 348 552 -193 -1528
4390 -1528 -961 -377 -991 -1234 -872 -1376 -1756 -1361 -1798 -1260 -858 -1283 -1695 -1548 -754 -958 -1603 -906 -992 -864
4410 -864 -495 -1394 -1204 3 194 -107 -364 -375 -228 635 872 96 -484 1385 1703 882 680 1264 1732 1872
4430 1872 1607 898 1550 2237 1860 1053 1428 1352 1533 1340 793 323 396 622 -356 -635 -259 -60 -791 -541
4450 -541 -1959 -2086 -1143 -473 -1461 -1787 -1706 -1535 -1540 -1416 -1560 -810 -142 -1148 -1785 -1380 -146 -260 -156 125
$$ packed form
4314A722O01o55j59m56M0R83m74o32P87K3n93J63n10k76N38M31j414m67R06l55
4334B03n54j88k94M88P67j087j803L49K184k7j608r43Q8J313M94q97j627J164
4352a978J729o72n70n14N2J825J263j514j416J122J779n9l49o33P20J492j4j566
4370F97m7J855M25j092j32L8J71L90n79p71J68O60p97n75o7k55K59K04p45j335
4390a528N67N84o14k43L62n04l80L95m37N38M02m25m12J47P94k04o45O97q6J28
4410h64L69q99J90J207J91l01k57j1J47Q63K37p76n80J869L18q21k02N84M68J40
4430A872k65p09O52O87l77q07L75p6J81j93n47m70P3K26r78k79L76J99p31K50
4450e41j418j27R43O70r88l26Q1J71nJ24j44P50O68j006o37M05J234j14J04K81
$$ plain form
4470 125 -548 -101 -185 -437 69 1022 1234 315 141 55 825 1485 1895 782 781 1354 1184 453 997 1580 2101
4491 2101 1225 750 271 922 1356 1037 794 1206 296 -206 256 54 -458 -180 -163 -1036 -1014 -1337 -1478 -1130
4511 -1130 -657 -1677 -1836 -1736 -1634 -2173 -1968 -868 -1169 -1136 -1483 -1355 -475 -394 -636 -597 382 56 -340 10
$$ packed form
4470A25o73M47q4k52N06R53K12r19j74q6P70O60M10j113jN73j70p31N44N83N21
4491B101q76m75m79O51M34l19k43M12r10n02M62k02n12K78J7q73K2l23j41L48
4511a130M73j020j59J00J02n39K05J100l01L3l47J28Q80Q1k42L9R79l26l96L50
$$ [...]
8191d0
##END NTUPLES=NMR FID
##END=
