##TITLE=1H_EC-3032x-2
 DMSO, 8 sc, 
 13.05.2021
##JCAMPDX= 6.0         $$ Bruker NMR JCAMP-DX V2.0
##DATA TYPE= NMR SPECTRUM
##DATA CLASS= NTUPLES
##ORIGIN= UXNMR, Bruker Analytische Messtechnik GmbH
##OWNER= root
$$ XWIN-NMR		Version 3.5
$$ Thu May 13 10:19:11 2021 Russian Standard Time (UT+4h)  she@DPX200
##.OBSERVE FREQUENCY= 200.131506
##.OBSERVE NUCLEUS= ^1H
##.ACQUISITION MODE= SIMULTANEOUS
##.ACQUISITION SCHEME= undefined
##.AVERAGES= 8
##.DIGITISER RES= 18
##SPECTROMETER/DATA SYSTEM= spect
##.PULSE SEQUENCE= zg30
##.SOLVENT NAME= DMSO
##.SHIFT REFERENCE= (INTERNAL, DMSO, 0, 15.9948)
##AUDIT TRAIL= $$ (NUMBER, WHEN, WHO, WHERE, WHAT)
$$ ##TITLE= Audit trail, XWIN-NMR		Version 3.5
$$ ##JCAMPDX= 5.01
$$ ##ORIGIN= Bruker BioSpin GmbH
$$ ##OWNER= she
$$ F:/spectra/data/she/nmr/H-F/1/pdata/1/auditp.txt
$$ ##AUDIT TRAIL=  $$ (NUMBER, WHEN, WHO, WHERE, WHAT)
(   1,<2021-05-13 10:18:00.15 +0400>,<she>,<DPX200>,
      <created by zg, POWCHK disabled, PULCHK disabled
       configuration hash MD5:
       00 E9 B6 7A A2 85 ED C7 34 08 36 98 17 FE 4E 26
       data hash MD5: 16K
       52 8B C0 D1 30 98 EA 30 86 07 D6 60 68 AF 4A 01>)
(   2,<2021-05-13 10:18:04.03 +0400>,<she>,<DPX200>,
      <Start of raw data processing
       efp BC_mod = 2 LB = 0.24 FT_mod = 6 PKNL = 1 PHC0 = -11123.85 PHC1 = 11.601 SI = 16K 
       data hash MD5: 16K
       A1 39 C4 76 C6 C4 D4 93 56 75 9A 90 D1 63 2B 26>)
(   3,<2021-05-13 10:18:23.32 +0400>,<she>,<DPX200>,
      <pk PHC0 = 1.114108 PHC1 = -1.8 
       data hash MD5: 16K
       E5 3B BD 83 41 D0 10 C7 58 73 9D C9 EC 8F 4B ED>)
(   4,<2021-05-13 10:18:26.90 +0400>,<she>,<DPX200>,
      <abs ABSG = 5 
       data hash MD5: 16K
       73 7F 99 73 61 E5 A3 E7 95 FF 44 7C 7E 4A B5 B6>)
$$ ##END=
$$ 
$$ hash MD5
$$ AD 84 4A D7 44 E5 E2 8D 9D BF 57 17 7B 82 85 99
##$RELAX= 
##$RELAX= 
##$RELAX= 
##$RELAX= 
##$RELAX= 
##$RELAX= 
$$ Bruker specific parameters
$$ --------------------------
##$DU= <F:/spectra>
##$EXPNO= 1
##$NAME= <H-F>
##$PROCNO= 1
##$TYPE= <nmr>
##$USER= <she>
##$AMP= (0..31)
100 100 100 100 100 100 100 100 100 100 100 100 100 100 100 100 100 100 
100 100 100 100 100 100 100 100 100 100 100 100 100 100 
##$AQSEQ= 0
##$AQ_mod= 1
##$AUNM= <au_zg>
##$AUTOPOS= <>
##$BF1= 200.13
##$BF2= 200.13
##$BF3= 200.13
##$BF4= 200.13
##$BF5= 200.13
##$BF6= 200.13
##$BF7= 200.13
##$BF8= 200.13
##$BYTORDA= 1
##$CFDGTYP= 0
##$CFRGTYP= 5
##$CHEMSTR= <none>
##$CNST= (0..31)
1 1 145 1 1 1 1 1 1 1 1 1 1 1 1 1 1 1 1 1 1 1 1 1 1 1 1 1 1 1 1 1 
##$CPDPRG= <>
##$CPDPRG1= <>
##$CPDPRG2= <>
##$CPDPRG3= <>
##$CPDPRG4= <mlev>
##$CPDPRG5= <mlev>
##$CPDPRG6= <mlev>
##$CPDPRG7= <mlev>
##$CPDPRG8= <mlev>
##$CPDPRGB= <>
##$CPDPRGT= <>
##$D= (0..31)
0 1.2 0 0 0 0 0 0 0 0.06 0 0.03 0 0 0 0 0.0002 0 0 0 0 0 0 0 0 0 0 0 0 
0 0 0 
##$DATE= 1620886679
##$DBL= (0..7)
120 120 120 120 120 120 120 120 
##$DBP= (0..7)
150 150 150 150 150 150 150 150 
##$DBP07= 0
##$DBPNAM0= <>
##$DBPNAM1= <>
##$DBPNAM2= <>
##$DBPNAM3= <>
##$DBPNAM4= <>
$$ [...]
##$SUBNAM3= <"">
##$SUBNAM4= <"">
##$SUBNAM5= <"">
##$SUBNAM6= <"">
##$SUBNAM7= <"">
##$SUBNAM8= <"">
##$SUBNAM9= <"">
##$SW= 16.9725357007746
##$SWIBOX= (0..15)
0 0 2 0 0 0 0 0 0 0 0 0 0 0 0 0 
##$SW_h= 3396.73913043478
##$TD= 16384
##$TD0= 1
##$TE= 0
##$TE2= 300
##$TE3= 300
##$TEG= 300
##$TL= (0..7)
0 120 120 120 120 120 120 120 
##$TP= (0..7)
150 150 150 150 150 150 150 150 
##$TP07= 0
##$TPNAME0= <>
##$TPNAME1= <>
##$TPNAME2= <>
##$TPNAME3= <>
##$TPNAME4= <>
##$TPNAME5= <>
##$TPNAME6= <>
##$TPNAME7= <>
##$TPOAL= (0..7)
0.5 0.5 0.5 0.5 0.5 0.5 0.5 0.5 
##$TPOFFS= (0..7)
0 0 0 0 0 0 0 0 
##$TUNHIN= 0
##$TUNHOUT= 0
##$TUNXOUT= 0
##$USERA1= <user>
##$USERA2= <user>
##$USERA3= <user>
##$USERA4= <user>
##$USERA5= <user>
##$V9= 5
##$VALIST= <valist>
##$VCLIST= <CCCCCCCCCCCCCCC>
##$VD= 0
##$VDLIST= <DDDDDDDDDDDDDDD>
##$VPLIST= <PPPPPPPPPPPPPPP>
##$VTLIST= <TTTTTTTTTTTTTTT>
##$WBST= 1024
##$WBSW= 4
##$XGAIN= (0..3)
0 0 0 0 
##$XL= 0
##$YL= 0
##$YMAX_a= 99802
##$YMIN_a= -128727
##$ZGOPTNS= <>
##$ZL1= 120
##$ZL2= 120
##$ZL3= 120
##$ZL4= 120
##$ABSF1= 15.99475
##$ABSF2= -0.9779139
##$ABSG= 5
##$ABSL= 3
##$ALPHA= 0
##$AQORDER= 0
##$ASSFAC= 0
##$ASSFACI= 0
##$ASSFACX= 0
##$ASSWID= 0
##$AUNMP= <proc_1d>
##$AZFE= 0.1
##$AZFW= 0.1
##$BCFW= 0
##$BC_mod= 2
##$BYTORDP= 0
##$COROFFS= 0
##$CY= -3
##$DATMOD= 1
##$DC= 0
##$DFILT= <>
##$DTYPP= 0
##$F1P= 0
##$F2P= 0
##$FCOR= 1
##$FTSIZE= 16384
##$FT_mod= 6
##$GAMMA= 0
##$GB= 0
##$INTBC= 1
##$INTSCL= 1.334414e-10
##$ISEN= 128
##$LB= 0.24
##$LEV0= 0
##$LPBIN= 0
##$MAXI= 10000
##$MC2= 0
##$MEAN= 0
##$ME_mod= 0
##$MI= 1.114404
##$NCOEF= 0
##$NC_proc= -8
##$NLEV= 6
##$NOISF1= 3.799351
##$NOISF2= 2.8
##$NSP= 0
##$NTH_PI= 0
##$NZP= 0
##$OFFSET= 15.99475
##$PC= 1
##$PHC0= -11122.74
##$PHC1= 9.801
##$PH_mod= 1
##$PKNL= yes
##$PPARMOD= 0
##$PSCAL= 0
##$PSIGN= 0
##$REVERSE= no
##$SF= 200.130003340949
##$SI= 16384
##$SIGF1= 3
##$SIGF2= 2
##$SINO= 5.538805
##$SIOLD= 16384
##$SREGLST= <1H.CDCl3>
##$SSB= 0
##$STSI= 16384
##$STSR= 0
##$SW_p= 3396.73913043479
##$SYMM= 0
##$S_DEV= 0
##$TDeff= 16384
##$TDoff= 0
##$TI= <>
##$TILT= no
##$TM1= 0
##$TM2= 0
##$TOPLEV= 0
##$USERP1= <user>
##$USERP2= <user>
##$USERP3= <user>
##$USERP4= <user>
##$USERP5= <user>
##$WDW= 1
##$XDIM= 16384
##$YMAX_p= 318906907
##$YMIN_p= -3452155
$$ End of Bruker specific parameters
$$ ---------------------------------
##NTUPLES= NMR SPECTRUM
##VAR_NAME=  FREQUENCY,     SPECTRUM/REAL,   SPECTRUM/IMAG
##SYMBOL=    X,             R,               I
##VAR_TYPE=  INDEPENDENT,   DEPENDENT,       DEPENDENT
##VAR_FORM=  AFFN,          ASDF,            ASDF
##VAR_DIM=   16384,         16384,           16384
##UNITS=     HZ,            ARBITRARY UNITS, ARBITRARY UNITS
##FACTOR=    0.207333158178282, 1,           1
##FIRST=     3201.02937551826, 0,            0
##LAST=      -195.709754916533, 0,           0
##MIN=       -195.709754916533, -3452155,    0
##MAX=       3201.02937551826, 318906907,    0
$$ Real data points
##PAGE= N=1
##DATA TABLE= (X++(R..R)), XYDATA
$$ [...]
7123G3443l03068k3099M7151j93725K20328k3250K09050k26660j7924l42218q0851
$$ 73443 -229625 -252724 -205573 -399298 -178970 -202220 6830 -219830 -237754 -579972 -660823
7112f60823J37893J65425l58230P62890L49634m94560K93609j40018J95974p753
$$ -660823 -522930 -357505 -715735 47155 396789 -97771 195838 55820 251794 244041
7102B44041n43301J14500L72695m61899K51003K2924r7656J066j94293K3827L57415
$$ 244041 -299260 -184760 187935 -273964 -22961 -37 -97693 -96627 -290920 -267093 90322
7091I0322k49672J54608K41580q13453M51176J05963J41158m6758j35405M2693
$$ 90322 -159350 -4742 236838 -576615 -125439 -19476 121682 74924 -60481 -17788
7081a7788M34927n81267M6705M03877n13100j63132j0801J43421J74934k96245
$$ -17788 417139 -164128 -117423 286454 -226646 -389778 -400579 -257158 -82224 -378469
7071c78469k8812M58272k12834J8581K34682R293k07249l05243l20397O0352N2494
$$ -378469 -407281 50991 -161843 -143262 91420 100713 -106536 -411779 -732176 -671824 -619330
7060f19330L48879M56052m74299J82658n0073k72941L94736n3064k10202Q9089
$$ -619330 -270451 185601 -288698 -106040 -156113 -429054 -34318 -87382 -297584 -208495
7050b08495j20066l2682J03892j55146N79059L52944k68463K157l07428k09516
$$ -208495 -328561 -361243 -257351 -412497 166562 519506 251043 253200 -54228 -263744
7040b63744L19948o30434L61381j321j1333j44531J67849k18182J17815K07681
$$ -263744 56204 -574230 -212849 -214170 -225503 -370034 -202185 -420367 -302552 -94871
7030i4871j21602K84947k57388j10118N85060Q8796j15735l17992l13349N12509
$$ -94871 -216473 68474 -188914 -299032 286028 374824 259089 -58903 -372252 140257
7020A40257j86272m94465K34048K39215m14761p9648j7602K26447J14113k05477
$$ 140257 -46015 -540480 -306432 -67217 -481978 -561626 -579228 -352781 -238668 -444145
7010d44145K9130L9849n8838K08967J3758j35233J94857o6955K24434j91971m53137
$$ -444145 -415015 -375166 -434004 -225037 -211279 -346512 -151655 -218610 5824 -186147 -639284
6999f39284K21826p019K69813j11000o8918P0146L40629n03909O36709n9567j46348
$$ -639284 -417458 -424477 -154664 -265664 -334582 -264436 76193 -427716 208993 149426 3078
6988C078J79829j87515l90343k00108j37760Q3023J26669k28955R3121J50727
$$ 3078 182907 -4608 -394951 -595059 -732819 -649796 -523127 -752082 -658961 -508234
6978e08234J88855O9548r489J04932K65788n73418K68911K18515J11747O1785
$$ -508234 -319379 -249831 -259320 -154388 111400 -462018 -193107 25408 137155 198940
6968A98940k8503m82040j44831K88364j02959n0689r2613L36500J99148k74112
$$ 198940 170437 -311603 -456434 -168070 -271029 -321718 -414331 -77831 121317 -152795
6958a52795M21066n8283j78916k40573k56255j06547K64293j22428j83128L80898
$$ -152795 268271 209988 31072 -209501 -465756 -572303 -308010 -430438 -613566 -232668
6948b32668J91738k16481j63554l22370L60121j19998J48414N49986l15571j47740
$$ -232668 -40930 -257411 -420965 -743335 -383214 -503212 -354798 195188 -120383 -268123
6938b68123M83293k58306j77844j71318N6854N74060m93769j88265j68932J99301
$$ -268123 215170 -43136 -220980 -392298 -335444 238616 -255153 -443418 -612350 -413049
6928d13049K26874k73103J53009M38782k48362k5982n1685M08034k23965j28823
$$ -413049 -186175 -459278 -306269 132513 -115849 -141831 -193516 214518 -9447 -138270
6918a38270L9353J21966j85116l58877M00312l3469L7187N0620o4832j09825k09015
$$ -138270 -98917 23049 -162067 -520944 -120632 -154101 -116914 -66294 -131126 -240951 -449966
6907d49966N7482N7703k00934L2434L32710l14953K08479p0033J30559l10169
$$ -449966 -392484 -334781 -535715 -503281 -170571 -485524 -277045 -347078 -216519 -526688
6897e26688O5730M66336O5507l90908K12523J85981K22197J16900r9686J00750
$$ -526688 -460958 5378 70885 -320023 -107500 78481 300678 417578 317892 418642
6887D18642k72223l74325j96940M01819p8516k5372k0940k75655k54891L48195
$$ 418642 146419 -227906 -424846 -23027 -101543 -126915 -147855 -423510 -678401 -330206
6877c30206K54495L3307j75590K51603j25737k01053O4054J65499L5338M7521
$$ -330206 -75711 -42404 -217994 33609 -92128 -293181 -229127 -63628 -28290 19231
6867A9231P4744J72801k39136j59649j59379L22724m80470Q9824L35737l7017
$$ 19231 93975 266776 27640 -132009 -291388 31336 -449134 -359310 -23573 -60590
6857f0590J26865l37496m1885L05149N2929J8441j27414l2077j47235l45325J62772
$$ -60590 66275 -271221 -313106 -7957 44972 63413 -64001 -96078 -243313 -588638 -425866
6846d25866j3935q5413Q5258N35691l68022M59992J24460m03721R5281M4820j37489
$$ -425866 -439801 -525214 -439956 95735 -272287 187705 312165 -91556 3725 48545 -88944
6835h8944j44480P9954P9682J33742k05226Q797J13664o7817P7485k9455J15981
$$ -88944 -233424 -153470 -73788 59954 -145272 -136475 -22811 -90628 -13143 -42598 73383
6824G3383k32418k83904L74386k33412j75409L37716K64330l41289m15495K00192
$$ 73383 -159035 -442939 -68553 -301965 -477374 -139658 124672 -216617 -632112 -431920
6814d31920K92215M4146k90939p7445M8254j00903K86221R3789J06591P6373R4484
$$ -431920 -139705 -95559 -386498 -463943 -415689 -516592 -230371 -136582 -29991 46382 140866
6803A40866Q665J24878K6373L2489k36804j28661j12799J44440j30223J57622
$$ 140866 149531 274409 300782 333271 96467 -32194 -144993 -553 -130776 26846
6793B6846k34026k96837N4861K38048M7887J70630N85915q8914j75512k68664
$$ 26846 -207180 -504017 -449156 -211108 -163221 7409 593324 504410 328898 60234
6783F0234L01025k32154l86358j43800r1444J12553m527K63438K87667l23234
$$ 60234 361259 129105 -257253 -401053 -492497 -379944 -384471 -121033 166634 -156600
6773a56600J78925K4153K9569J26620L24415j07553n94018l17765l8977L58894
$$ -156600 22325 46478 76047 202667 527082 419529 -174489 -492254 -531231 -172337
6763a72337n5439q2852K52221j60767K46047k24837K16553l5400K17884l02680
$$ -172337 -227776 -310628 -58407 -219174 26873 -197964 18589 -16811 201073 -101607
6753a01607P2660j40605N7816o7978k5869K17332o3764p28528L46683J63934j74837
$$ -101607 -28947 -169552 -111736 -179714 -205583 11749 -52015 -780543 -433860 -269926 -444763
6742d44763N37103l41426J45022k98075O5345K04065L20255n87915K43382L17227
$$ -444763 92340 -249086 -104064 -402139 -336794 -132729 187526 -400389 -157007 160220
6732A60220K17809k8342j68774k27532J24715o27569J67774M24617p5583K17583
$$ 160220 378029 349687 180913 -46619 78096 -549473 -381699 42918 -32665 184918
6722A84918J71446k477n17593m3517K82692J57812j36087O829j11387L8217K03928
$$ 184918 356364 353887 -163706 -207223 75469 233281 97194 104023 -7364 30853 234781
6711B34781k79627L43292k54715m10305M98654J07497n31267J39387q8925j09457
$$ 234781 -44846 298446 43731 -366574 132080 239577 -291690 -152303 -241228 -350685
6701c50685M88620j05806N5102O7438j72531J0533K93823j87920m58686J22939
$$ -350685 137935 32129 87231 154669 -17862 -7329 286494 98574 -360112 -237173
6691b37173L1983j93829q9135J22658M10869l55368m5184N07968j82655p8512
$$ -237173 -205190 -399019 -488154 -365496 45373 -309995 -355179 152789 -29866 -108378
6681a08378J74555r8408L36043k56910l94792M82886K76764j93276j92635k69665
$$ -108378 66177 -32231 303812 46902 -347890 134996 411760 218484 25849 -243816
6671b43816j80762N44703j5066m70484J2883j53330J33952P530K50430j54402
$$ -243816 -424578 120125 105059 -365425 -352542 -505872 -371920 -364390 -113960 -268362
6661b68362K53807K99289j10836j07930J70696n1262m72094J23917j09509k87533
$$ -268362 -14555 284734 173898 65968 236664 185402 -286692 -162775 -272284 -559817
6651e59817J76122L25669N2907n8105J30791j71869L19874l66244J71508j58906
$$ -559817 -383695 -58026 -5119 -63224 67567 -104302 215572 -150672 20836 -138070
6641a38070r370j1178K62694J73661n81585J31250k17551M20525N961K80773m19606
$$ -138070 -147440 -158618 104076 277737 -303848 -172598 -390149 30376 36337 317110 -102496
6630a02496M977K87328j10450k88519j44185N81j39294P02950m45645J21918J76706
$$ -102496 -97519 189809 79359 -209160 -353345 -352764 -492058 210892 -234753 -112835 63871
6619F3871n7791J18357k65983Q7304L60207m43202k75588K96888j90777J87750
$$ 63871 6080 124437 -141546 -54242 305965 -137237 -412825 -115937 -306714 -118964
6609a18964K13562q2572M536K71542J7823k48128R313L95873K18168j37566l43266
$$ -118964 94598 12026 16562 288104 305927 57799 67112 462985 681153 543587 200321
6598B00321L37025l79797L3188n18073K33117K90092R5928l99527J33622K77300
$$ 200321 537346 157549 190737 -327336 -94219 195873 291801 -107726 25896 303196
6588C03196m87639j96004p514L70980L87074j07752k84120p2307r1471K63831
$$ 303196 -184443 -380447 -387961 -16981 370093 262341 -21779 -94086 -185557 78274
6578G8274J61270j5285Q3395k70439m5309K6604l15189J97962K49856j17837k03537
$$ 78274 239544 224259 307654 37215 -8094 18510 -296679 -98717 151139 33302 -170235
6567a70235q5395P5251M94579k65572J89685K23088O2281l8158l49978k04966
$$ -170235 -255630 -180379 314200 48628 238313 461401 523682 485524 135546 -69420
6557f9420r9397J56686k39350L71043j54790r0020K87359K8007j9875j33528L63390
$$ -69420 -168817 -12131 -251481 119562 -35228 -125248 162111 190118 170243 36715 400105
6546D00105j65294K29859l8963q2512K8976o59525K0207K0899l0403K62054k46364
$$ 400105 234811 464670 425707 343195 372171 -287354 -267147 -246248 -276651 -14597 -260961
6535b60961J07079J12631o89452L34306P06296L109K68927m82636j00188L07106
$$ -260961 -153882 -41251 -730703 -396397 309899 313008 581935 99299 -889 306217
6525C06217l21580K35194L97754m30525j62691L01213l11037K62912j38511J56644
$$ 306217 -15363 219831 617585 187060 24369 325582 14545 277457 138946 295590
6515B95590m67777l56168O34798M4433L11825o8694k82222l89616Q3573J35843
$$ 295590 -172187 -528355 106443 150876 462701 394007 111785 -277831 -194258 -58415
6505e8415K80691O0522J70982l49972k08849J00460K05889j16543L74006j47924
$$ -58415 222276 282798 453780 103808 -105041 -4581 201308 84765 458771 310847
6495C10847L82455o7241m84286R6247K3609Q0849k08251k89276J57814k11762
$$ 310847 693302 626061 141775 238022 261631 342480 134229 -155047 2767 -208995
6485b08995L9487J52538j27756k30214l82070N76819k8905k03526J48890J00536
$$ -208995 -169508 -16970 -144726 -374940 -757010 -180191 -209096 -412622 -263732 -163196
6475a63196L0451L30691m8467l13242L28798j43189L66796M8944l37430M8604
$$ -163196 -132745 197946 149479 -163763 165035 21846 388642 437586 100156 148760
6465A48760J25649M21395n55986k59810J46040J39385k55938j88075K82971N9434
$$ 148760 274409 695804 139818 -119992 26048 165433 -90505 -278580 4391 63825
6455F3825n2067M8341P9270j40741L49121r1957k80510L73270j77115k19572P7203
$$ 63825 11758 60099 139369 -1372 347749 255792 -24718 348552 171437 -48135 29068
6444B9068j01998l4645K63684k47215J79446K06090r0217J59009k26476J1683
$$ 29068 -72930 -107575 156109 -91106 88340 294430 204213 363222 136746 148429
6434A48429n5278r0759L40972l87901j93778L88979K34841l82870K8535l14433
$$ 148429 93151 2392 343364 -44537 -238315 150664 385505 2635 31170 -283263
6424b83263L58796l1931j26921K00401n8486K75686m15908j45550K79208J14386
$$ -283263 75533 43602 -83319 117082 58596 334282 -81626 -227176 52032 166418
6414A66418l32927P06402j16816j68169n9498p6607L3827m06818J98394Q2029
$$ 166418 -166509 539893 423077 254908 195410 118803 152630 -254188 -55794 26235
6404B6235P1636J38983K11611l61938J82506k32884K28379l17887l21400M3289
$$ 26235 97871 236854 448465 86527 269033 36149 264528 -53359 -374759 -331470
6394c31470Q589M58791m9954l70711K72252J28044R4189J95838k47212J67188
$$ -331470 -322881 135910 85956 -284755 -12503 115541 209730 405568 158356 325544
6384C25544j39143J88K52154l9843j00247K14901N2799j99179k79783j02463L89657
$$ 325544 186401 186589 438743 398900 298653 513554 566353 367174 87391 -15072 374585
6373C74585k55277j0643K76531j56475m78329M01941j52099q3538O18451l14338
$$ 374585 119308 108665 385196 228721 -249608 152333 234 -83304 535147 220809
6363B20809n8233j41757R4846J09978L78789j38923n99324L15038r1299m3850
$$ 220809 162576 20819 115665 225643 604432 465509 -133815 181223 89924 46074
6353D6074J60094j25188R8896j10399L47283K72539M380k47757l78679k39092
$$ 46074 206168 80980 179876 69477 416760 689299 693679 445922 67243 -171849
6343a71849M06446K81714l48882J56046k81589k23520L33235m1055J50098j7208
$$ -171849 234597 516311 167429 323475 41886 -181634 151601 110546 260644 243436
6333B43436J99474j70220J53250K02303l48807l9690m8533k15220L04588L01006
$$ 243436 442910 272690 425940 628243 279436 239746 191213 -24007 280581 581587
6323E81587o1335k22016J67818K70235m59569Q8834o8936k5539L3756k08698k58010
$$ 581587 520252 298236 466054 736289 276720 365554 296618 271079 304835 96137 -161873
6312a61873J45244J68536m24708L89993j30323J8859J50681K06064m68481k21873
$$ -161873 -16629 151907 -272801 117192 -13131 5728 156409 362473 -106008 -327881
6302c27881O84801M4393n27832J65879O59727j12384k49707l91748o902N42755
$$ -327881 356920 401313 -126519 39360 699087 586703 336996 -54752 -61654 481101
6292D81101l53481J14871N82867k85774q8819O8493j12367j23271q2042l85227
$$ 481101 127620 242491 825358 539584 450765 519258 406891 283620 201578 -183649
6282a83649K98447j2179l93505J92616M02218M013k19378K52938m8222N2850j53594
$$ -183649 114798 102619 -290886 -98270 303948 307961 88583 341521 293299 346149 192555
6271A92555k41652J74817r2855k498j02889Q6655N70451j77282l87311M1311p235
$$ 192555 -49097 125720 32865 30367 -72522 14133 584584 407302 19991 61302 54067
6260E4067j08503m9928J15416j86291r4236P9885Q4861L17517j65437L66806K49188
$$ 54067 -54436 -104364 11052 -175239 -269475 -189590 -104729 212788 47351 414157 663345
6249F63345j37102m52589q1511L78849j8742J95573m41704j85606K23064N79696
$$ 663345 526243 73654 -7857 370992 352250 547823 106119 -79487 143577 723273
6239G23273m28715R1349Q9044m27142L68417j03271N475J25279j48782l63071
$$ 723273 294558 385907 474951 47809 416226 312955 318430 443709 294927 -68144
6229f8144L0080L36839K7710k8186j36919L534j00948K00052O1952p45137n9194
$$ -68144 -38064 298775 326485 298299 161380 164914 63966 264018 325970 -419167 -478361
6218d78361M69618k36500L7456L86644l60131N51226n590J43467J00182k25186
$$ -478361 -8743 -245243 -207787 178857 -181274 369952 364362 507829 608011 382825
6208C82825j46525R494j07120j17666J09521k28636N89663k40664k14691M93524
$$ 382825 236300 245794 138674 21008 130529 -98107 491556 250892 36201 529725
6198E29725N3011m26478m0882j059L3071K69545j34236M50253L295l17359j67705
$$ 529725 582736 156258 115376 114317 147388 416933 282697 732950 736245 418886 251181
6187B51181O404j30890j25857j45898M0058O46901k9925m51383K15693R7650j7263
$$ 251181 257585 126695 838 -145060 -105002 541899 511974 60591 276284 373934 356671
6176C56671l08660O5952p8036l83140L47341K99925J62905j90963K1132r8150
$$ 356671 48011 113963 35927 -347213 128 300053 462958 271995 293127 194977
6166A94977L47216n34945K74089k8583m7119J03708J06052j73734j20462J25803
$$ 194977 542193 7248 281337 252754 205635 309343 415395 241661 121199 247002
6156B47002j88843k5025o365K48068M05273k1454n79459L08966J25942l08308
$$ 247002 58159 33134 26769 274837 680110 658656 79197 388163 514105 205797
6146B05797k5765o1287O19268j08463n5685n7914m58643j89897P2402l48485J35936
$$ 205797 180032 118745 738013 629550 573865 515951 57308 -132589 -60187 -408672 -272736
6135b72736J2125k60604Q88558m03714p0142K27357K8721J78027J42503P194l23124
$$ -272736 -260611 -521215 367343 -36371 -106513 120844 149565 327592 470095 477289 154165
6124A54165j48136j39424N95704k36613l93187J62960k68014N66201J07655j71356
$$ 154165 6029 -133395 462309 225696 -167491 -4531 -272545 293656 401311 229955
6114B29955J39949K9721l74947l3232L62877j61543j26987K23830N514l27739
$$ 229955 369904 399625 24678 -8554 354323 192780 65793 289623 295137 -32602
6104c2602j30332L09238M94828m34767P9987N2910r0068J67621K66252k84457
$$ -32602 -162934 146304 641132 206365 286352 339262 249194 416815 683067 398610
6094C98610j14889K09322k68416M8399m07284L79733l03206J80320J29061j38115
$$ 398610 283721 493043 224627 273026 -134258 245475 -57731 122589 251650 113535
6084A13535p5161M4860j01350R1894O45099j53754l17005M2915l47361J10125
$$ 113535 38374 83234 -18116 73778 718877 565123 248118 291033 -56328 53797
6074E3797p1606l5671L06407L28827o8317m40633L13817p1460m69826K79271M20440
$$ 53797 -17809 -53480 252927 581754 513437 72804 386621 315161 -154665 124606 545046
6063E45046o61464N9721K67560K70659M08244k99916j93055k78021K37022K59638
$$ 545046 -116418 -56697 210863 481522 889766 589850 396795 118774 355796 615434
6053F15434k4645J4637L17031l25583J6903k14167j89755M60396j96232n15937
$$ 615434 590789 605426 922457 596874 613777 399610 209855 670251 474019 -41918
6043d1918K38917J25776m63803r1778K82008l7683p0586q8306N52760K09233l14295
$$ -41918 196999 322775 -141028 -232806 49202 11519 -59067 -147373 405387 614620 300325
6032C00325j54847m3952M96716m05718p0747K09558J6294J10993M9503j56119
$$ 300325 145478 101526 598242 192524 121777 331335 347629 458622 508125 352006
6022C52006j97559K27238n0915L04976j68465m3563q4806N6786j77585o191j8578
$$ 352006 154447 381685 330770 635746 467281 423718 338912 395698 218113 211922 193344
6011A93344k43642M4091j20544M55348l36919P1687K93279k01514n39372Q71186
$$ 193344 -50298 -6207 -126751 328597 -8322 63365 356644 155130 -384242 486944
6001D86944j86611J6068J39911p9537K05667k79996L8002l6762K89417k14862
$$ 486944 300333 316401 456312 376775 582442 302446 340448 303686 593103 378241
5991C78241k09610L21499R7729M0457o53625J05029O3635n5137N52955j67249
$$ 378241 168631 490130 587859 628316 -25309 79720 143355 88218 641173 473924
5981D73924l11705M6079j0455J11984J66155l48197K7267L78354l33023J59756
$$ 473924 162219 208298 197843 309827 475982 127785 155052 533406 200383 360139
5971C60139j95513K56431j89248q9621L68591l87583Q4602j4658p5954Q3027L97079
$$ 360139 164626 421057 231809 142188 510779 123196 207798 193140 117186 200213 597292
5960E97292k36397N35171j65316l33178J68372j59658L8772K88325j81239O6791
$$ 597292 360895 896066 730750 397572 565944 406286 445058 733383 552144 618935
5950F18935k7182p33383K58615J49521P3564J18179j50219j22510K03643J95658
$$ 618935 591753 -141630 116985 266506 340070 458249 308030 185520 389163 584821
5940E84821j05183j41153k72467R1692M68327k49344j01049l4164j65686J84208
$$ 584821 479638 338485 66018 157710 626037 376693 275644 241480 75794 260002
5930B60002L54508P9297K65224l81658n11978O35422m51297J14280P9954k25297
$$ 260002 614510 693807 959031 577373 65395 700817 249520 363800 443754 218457
5920B18457M10222l77592k36575L41280m39189n5889O86015n1711p297k45525
$$ 218457 628679 251087 14512 355792 -83397 -139286 546729 495018 487721 242196
5910B42196J33055M63809k78066k81044L06975J6971O6130m94700J37486L03976
$$ 242196 375251 839060 560994 279950 586925 603896 670026 175326 312812 616788
5900F16788k4441k07689J28213m69505r3669J86862k5633K39499Q3336Q2615l44543
$$ 616788 592347 384658 512871 43366 -50303 136559 110926 350425 433761 516376 171833
5889A71833K62464k7935K65324k96004j65530K86607j7617j43739K14043L01516
$$ 171833 434297 406362 671686 375682 210152 496759 479142 335403 549446 850962
5879H50962l10541L56762k72096k06258K4864j59103J28229l96408J7757J06428
$$ 850962 540421 897183 625087 418829 443693 284590 412819 16411 34168 140596
5869A40596L59666K49556L17436j87266j51941N2908m39480L52146J33474n36423
$$ 140596 500262 749818 1067254 879988 728047 780955 341475 693621 827095 290672
5859B90672K55133l25271M74470k76703n10818M92171K0611j08243O21849j59616
$$ 290672 545805 220534 695004 418301 -92517 399654 420265 312022 933871 774255
5849G74255k69389K81529J61805l49195M40917k61062k91428K7692j37826K85144
$$ 774255 504866 786395 948200 599005 1039922 778860 487432 515124 377298 662442
5839F62442j36204J3507J47207k967j83527j56468N07868o4864n770m49541K9704
$$ 662442 526238 539745 686952 683985 500458 343990 851858 786994 781224 331683 361387
5828C61387L32640j9902K62875m90727K10997o2531r3029j38748L03091j02292
$$ 361387 694027 674125 937000 446273 657270 594739 501710 362962 666053 563761
5818E63761k7615m3970N1807r1453O6603Q4326K30861k28446k23676L08747K18246
$$ 563761 536146 492176 543983 452530 519133 603459 834320 605874 382198 690945 909191
5807I09191N4294j84334k20492J87514Q1106r3417J03687K00100p2375J47271
$$ 909191 963485 779151 558659 746173 827279 733862 837549 1037649 965274 1112545
5797A112545R6720l10790r549m3443L96400m79237r2583n5064O3627M89562M0227
$$ 1112545 1209265 898475 888926 845483 1241883 762646 670063 614999 678626 1168188 1208415
5786A208415j04028n8894L52211q52951L19156j99588O439J31549O9028K08633
$$ 1208415 1104387 1045493 1397704 544753 863909 664321 670760 802309 871337 1079970
5776A079970l74161K56249J43685M9521j56585J4366l26532p5062K27058N971
$$ 1079970 705809 962058 1105743 1155264 998679 1013045 686513 611451 838509 844480
5766H44480M02881J01622l16312j53785j35460P8857J94687K02903j49444Q8973
$$ 844480 1247361 1348983 1032671 878886 743426 822283 1016970 1219873 1070429 1159402
5756A159402J31694j58571j35467q8386J31840j5987j2946K5058J64112j61639
$$ 1159402 1291096 1132525 997058 908672 1040512 1024525 1011579 1036637 1200749 1039110
5746A039110j40813k74067K1566J63119J02185L605j86762K49500R653K33258
$$ 1039110 898297 624230 645796 808915 911100 914705 727943 977443 987096 1220354
5736A220354P7508J57115l87962l4859q5461k1479L06481r5568L4311k18573K61351
$$ 1220354 1297862 1454977 1067015 1032156 946695 925216 1231697 1136129 1170440 951867 1213218
5725A213218R055J71444n20394k0570M34913K8265J73433m18823L37274N3691
$$ 1213218 1222273 1393717 873323 852753 1287666 1315931 1489364 1070541 1407815 1461506
5715A461506q996q5921L43056k06842k68839p7025K35313q5553m79676K31584
$$ 1461506 1452510 1366589 1709645 1502803 1233964 1156939 1392252 1306699 827023 1058607
5705A058607K58327J85258o6882L58177p69591L6926j5810j85476J46619J08918
$$ 1058607 1316934 1502192 1435310 1793487 1023896 1060822 1045012 859536 1006155 1115073
5695A115073K4530Q528J90947k32515M60690j53972k89121N3283J81041L67816
$$ 1115073 1139603 1148131 1339078 1106563 1567253 1413281 1124160 1177443 1358484 1726300
5685A726300m56903Q2999J80108m17526L13940j92733L64541j88522J83053K00244
$$ 1726300 1269397 1352396 1532504 1114978 1428918 1236185 1600726 1412204 1595257 1795501
5675A795501l62945j7476m13603N77734M554Q5344l6335K07916j09850Q9740k36971
$$ 1795501 1432556 1415080 1001477 1579211 1583765 1669109 1632774 1840690 1730840 1820580 1583609
5664A583609K26574k4434l92563K43744m0945Q4050j81712L47075M8618k10308
$$ 1583609 1810183 1785749 1393186 1636930 1595985 1680035 1498323 1845398 1894016 1683708
5654A683708o10129M03093R359Q9224K06205j75589N56870l96367k08969K43003
$$ 1683708 1073579 1476672 1486031 1575255 1781460 1605871 2162741 1766374 1557405 1800408
5644A800408J9695l61767J59461L40314l58253j54961K40632J07649N8735l26835
$$ 1800408 1820103 1458336 1617797 1958111 1599858 1444897 1685529 1793178 1851913 1525078
5634A525078K90410k42019j9891O9218J20029K30002l01447l5648O67836K05991
$$ 1525078 1815488 1573469 1553578 1622796 1742825 1972827 1671380 1635732 2303568 2509559
5624B509559r83267N36937R9178l27151J23269R6281J7009K84141m67670K6347
$$ 2509559 1526292 2063229 2162407 1835256 1958525 2054806 2071815 2355956 1888286 1914633
5614A914633M46535k58256j55833J68297N45556P5869j03831m1388j11140j08873
$$ 1914633 2361168 2102912 1947079 2115376 2660932 2736801 2632970 2591582 2480442 2371569
5604B371569k34813J60349K33395L02211m43319L61371m5036r1386l44686L12413
$$ 2371569 2136756 2297105 2530500 2832711 2389392 2750763 2705727 2614341 2269655 2582068
5594B582068R9099n91848K02056L9709O0956l5214P5816L43839J30144j03726
$$ 2582068 2681167 2089319 2291375 2331084 2392040 2356826 2432642 2776481 2906625 2802899
5584B802899m47850J87540L64167k54192J06452P6584j25912n43565M502K98488
$$ 2802899 2355049 2542589 2906756 2652564 2759016 2835600 2709688 2166123 2170625 2469113
5574B469113M73469j56895l75530J34539K0506J08760K16567J07381k25242K1133
$$ 2469113 2942582 2785687 2410157 2544696 2565202 2673962 2890529 2997910 2772668 2793801
5564B793801K2388J38704m85637j71862M39555k75267J37675Q5474L05483L38606
$$ 2793801 2816189 2954893 2469256 2297394 2736949 2461682 2599357 2684831 2990314 3328920
5554C328920L4893o70425M2402J12585J1190K18070L5970K66153k70209k62859
$$ 3328920 3363813 2693388 2735790 2848375 2859565 3077635 3113605 3379758 3109549 2846690
5544B846690O8472q5434L77693j37673L40663k5015J82111J29071J77053k0689
$$ 2846690 2915162 2829728 3207421 3069748 3410411 3385396 3567507 3696578 3873631 3852942
5534C852942k09862j22827j58372l2214j60251J43218q530L10161M3256o4053
$$ 3852942 3643080 3520253 3361881 3329667 3169416 3312634 3304104 3614265 3657521 3593468
5524C593468J29253O8190N4183J80700M33413J6839n71121K73344J2210k5387
$$ 3593468 3722721 3790911 3845094 4025794 4459207 4476046 3904925 4178269 4190479 4165092
5514D165092J3625k73294k9031K20684J05253n0334K59045k08693j30059L35771
$$ 4165092 4178717 3905423 3876392 4097076 4202329 4151995 4411040 4202347 4072288 4408059
5504D408059k06549O5562J13904l14614Q4407L02322O07780Q1032l41047M4740
$$ 4408059 4201510 4267072 4380976 4066362 4150769 4453091 5060871 5141903 4800856 4845596
5494D845596J22260k14735N5307J10035O1964M01385J84276m9047L5471J22345
$$ 4845596 4967856 4753121 4808428 4918463 4980427 5381812 5566088 5517041 5552512 5674857
5484E674857L00169J22571m22045M9112L02850J69338J00231L89906J81266o02802
$$ 5674857 5975026 6097597 5675552 5724664 6027514 6196852 6297083 6686989 6868255 6265453
5474F265453K2168N27661l66662M33511M35519k38812K77583j11778J61759L83621
$$ 6265453 6287621 6815282 6448620 6882131 7317650 7078838 7356421 7244643 7406402 7790023
5464G790023n2831N3169M91812K58552j87170J02197j21638L67571M01165l24487
$$ 7790023 7737192 7790361 8282173 8540725 8353555 8455752 8334114 8701685 9102850 8778363
5454H778363M94051M93496K19820J36668L28209J82154K43888K4182M03352N39007
$$ 8778363 9272414 9765910 9985730 10122398 10450607 10632761 10876649 10900831 11304183 11843190
5444A1843190L26170K54778J05878L58747N62362J38543N55770O51169J73242
$$ 11843190 12169360 12424138 12530016 12888763 13451125 13589668 14145438 14796607 14969849
5435A4969849L69138J64501J68828J27561J83796M95122K49465k20454L38823
$$ 14969849 15338987 15503488 15672316 15799877 15983673 16478795 16728260 16507806 16846629
5426A6846629O57059J76787J98539K40211J54294M37602j62067K43427K09565
$$ 16846629 17503688 17680475 17879014 18119225 18273519 18711121 18549054 18792481 19002046
5417A9002046k85244j72308N99274N06585K64388J47478J56555K32195J30468
$$ 19002046 18716802 18544494 19143768 19650353 19914741 20062219 20218774 20450969 20581437
5408B0581437K84393O96380J27075l670R18683K84710J8230M88517M21565K07356
$$ 20581437 20865830 21562210 21689285 21685615 22604298 22889008 22907238 23395755 23817320 24024676
5398B4024676j11004K41024M93708M71643K83852Q3640K31160J25983K3881o0003
$$ 24024676 23913672 24154696 24648404 25120047 25403899 25487539 25718699 25844682 25868563 25808560
5388B5808560j3356J45996j49942k3627N12227j91520n66909o0652m36935o1794
$$ 25808560 25795204 25941200 25791258 25767631 26279858 26088338 25521429 25460777 25023842 24962048
5378B4962048m85792K80650O85991k78954j48861j88270p7356l87795N06981M6408
$$ 24962048 24476256 24756906 25442897 25163943 25015082 24826812 24749456 24361661 24868642 24915050
5368B4915050n30249r4147K85L77889K52375L79007m44038J73899l77n80160K83078
$$ 24915050 24384801 24290654 24290939 24668828 24921203 25300210 24856172 25030071 25029694 24449534 24732612
5357B4732612M02117j5504k89077j9628j72889p34476j68681J77865m4003m42811
$$ 24732612 25134729 25119225 24830148 24810520 24637631 23903155 23734474 23912339 23868336 23425525
5347B3425525o16973k226l4273n41673q26010k77940k52824k92353l36411n18198
$$ 23425525 22808552 22806326 22772053 22230380 21404370 21126430 20873606 20581253 20244842 19726644
5337A9726644q86380n04758j13504m51850q65003k78648k47114k45362j64892
$$ 19726644 18840264 18335506 18222002 17770152 16905149 16626501 16379387 16134025 15969133
5328A5969133p39736J0541j49820K22757l97299m54248l47689l56921m21088J8707
$$ 15969133 15229397 15239938 15090118 15312875 14915576 14461328 14113639 13756718 13335630 13354337
5318A3354337J75919n68772J2078L4391L8194J3507J06258J54411J18184l54245
$$ 13354337 13530256 12961484 12973562 13007953 13046147 13059654 13165912 13320323 13438507 13084262
5308A3084262K10573J76543J5261L34967J77852L31734k73866R5453L18165M15016
$$ 13084262 13294835 13471378 13486639 13821606 13999458 14331192 14057326 14152779 14470944 14885960
5298A4885960O4017J31086L69880J71024m9221M6823K40196K4353j4853K40130
$$ 14885960 14949977 15081063 15450943 15621967 15572746 15619569 15859765 15884118 15869265 16109395
5288A6109395M08581J2332L823o8660K94195j61881j34746m45056O3399o25235
$$ 16109395 16517976 16530308 16534131 16465471 16759666 16597785 16463039 16017983 16081382 15456147
5278A5456147n5499j20026l05693k48571j86935l58122j60129m35932j071451
$$ 15456147 15400648 15280622 14974929 14726358 14539423 14181301 14021172 13585240 12513789
5269A2513789j51289k89090j26228m61727o63019M51927k08842n36433m59118
$$ 12513789 12362500 12073410 11947182 11485455 10822436 11274363 11065521 10529088 10069970
5260A0069970k60505n29614K8825n88665J25783J62341n93488k63205N9815o33800
$$ 10069970 9809465 9279851 9308676 8720011 8845794 9008135 8414647 8151442 8211257 7577457
5250G577457l66054k81414j03269L73621l78569k20324m99938J02236q654j39139
$$ 7577457 7211403 6929989 6826720 7200341 6821772 6601448 6101510 6203746 6195092 6055953
5240F055953j9322J4832k36653j70282J41766L21687m14286l52039k68326K66447
$$ 6055953 6036631 6051463 5814810 5644528 5786294 6107981 5693695 5341656 5073330 5339777
5230E339777k27426l29744K00232l67911J70207J2166n50763K17839j09797j78426
$$ 5339777 5112351 4782607 4982839 4614928 4785135 4797301 4246538 4464377 4354580 4176154
5220D176154k64181M0247q5339J44863n26692Q5774K00931k38179o8763J35907
$$ 4176154 3911973 3952220 3866881 4011744 3485052 3570826 3771757 3533578 3464815 3600722
5210C600722m1216l3312N7335j95797K21777K8349j8024J88256l66538K0561J20082
$$ 3600722 3559506 3526194 3583529 3387732 3609509 3637858 3619834 3808090 3441552 3462113 3582195
5199C582195Q588K47551k26611m88223K34161N0415l66316J54123k25488l25170
$$ 3582195 3590783 3838334 3611723 3123500 3357661 3408076 3041760 3195883 2970395 2645225
5189B645225L09945M3454K84460k10612m23951M22863j85699m0877L16617J45362
$$ 2645225 2955170 2998624 3283084 3072472 2648521 3071384 2885685 2844808 3161425 3306787
5179C306787n49742j28180K24667k89168K68304l26291K52995q0933m5724K09424
$$ 3306787 2757045 2628865 2853532 2564364 2832668 2506377 2759372 2678439 2632715 2842139
5169B842139m6029J63270K05853m01890k14341L19573J02134j50369N4377n1686
$$ 2842139 2796110 2959380 3165233 2763343 2549002 2868575 2970709 2820340 2874717 2823031
5159B823031J23745k24369j90666J27284P176N1224j5884J84108l52078K48567
$$ 2823031 2946776 2722407 2531741 2659025 2666201 2717425 2701541 2885649 2533571 2782138
5149B782138n3205r206k75878J6677K60614K17061j38455J48735M73646k55692
$$ 2782138 2728933 2719727 2443849 2460526 2721140 2938201 2799746 2948481 3422127 3166435
5139C166435l20292n665L30019J06053N3735N31624m55762k75976P6154Q6156
$$ 3166435 2846143 2840478 3170497 3276550 3330285 3861909 3406147 3130171 3206325 3292481
5129C292481M8346k41848K89818K97107J89531J63432K3881n5406j68432q36K51589
$$ 3292481 3340827 3098979 3388797 3685904 3875435 4038867 4062748 4007342 3838910 3838074 4089663
5118D089663K00918j02250K20046m74544k9074L59075J39039J10267j05161Q1352
$$ 4089663 4290581 4188331 4408377 3933833 3904759 4263834 4402873 4513140 4407979 4489331
5108D489331M55542K38229J0204N3923K33070P64674j74038k79385J94409K00668
$$ 4489331 4944873 5183102 5193306 5247229 5480299 6244973 6070935 5791550 5985959 6186627
5098F186627N86408r6220J4929M42072M9724P9550N50785M27193J61746q5387
$$ 6186627 6773035 6676815 6691744 7133816 7183540 7263090 7813875 8241068 8402814 8317427
5088H317427N21940L20501J5168J54677N1127j03229K93362R8934L46488L80406
$$ 8317427 8839367 9159868 9175036 9329713 9380840 9277611 9570973 9669907 10016395 10396801
5078A0396801r7073J97066j04700M44440J95964J56277j44910K22768l42809q6346
$$ 10396801 10299728 10496794 10392094 10836534 11032498 11188775 11043865 11266633 10923824 10837478
5068A0837478J18398J79100k6549K59873O1735l84407K70896l31202M17054J1630
$$ 10837478 10955876 11134976 11108427 11368300 11430035 11045628 11316524 10985322 11402376 11414006
5058A1414006p51855N079N85962j89432J08627j89182k37270M37192j08217K32463
$$ 11414006 10662151 10667230 11253192 11063760 11172387 10983205 10745935 11183127 11074910 11307373
5048A1307373q9714k39450j1034o3231l27360k46655L06765j31371K06156m85104
$$ 11307373 11217659 10978209 10967175 10903944 10576584 10329929 10636694 10505323 10711479 10226375
5038A0226375j73157N6326k03626N2172j70438R0447k16584l79200o7371L49100
$$ 10226375 10053218 10109544 9905918 9958090 9787652 9878099 9661515 9282315 9214944 9564044
5028I564044j07901k98174n079K448K92377k98548J11609k91484k11150K69160
$$ 9564044 9456143 9157969 9152890 9155338 9447715 9149167 9260776 8969292 8758142 9027302
5018I027302M29269j9688k23711K76099o167J28619l41972M35928k04687l19862
$$ 9027302 9456571 9436883 9213172 9489271 9483104 9611723 9269751 9705679 9500992 9181130
5008I181130q6014M47981j093m16255J99584k53012l93073l64619M77479Q9916
$$ 9181130 9095116 9543097 9542004 9125749 9325333 9072321 8679248 8314629 8792108 8882024
4998H882024j24268k60887k0735k18294k36319M91749n26749N53177k53451j27932
$$ 8882024 8757756 8496869 8476134 8257840 8021521 8513270 7986521 8539698 8286247 8158315
4988H158315k5242j99493Q2115L17888k0408n68292K41549m09588p6826N7411
$$ 8158315 8133073 7933580 8015695 8333583 8313175 7744883 7986432 7576844 7500018 7557429
4978G557429k81055M67521j14027l07462L1605k18467J62715J89027k31459J73449
$$ 7557429 7276374 7743895 7629868 7322406 7354011 7135544 7298259 7487286 7255827 7429276
4968G429276j88008p56006l94850J70318l6641j22486O36384l01888o59119k3306
$$ 7429276 7241268 6485262 6090412 6260730 6224089 6101603 6737987 6436099 5776980 5753674
4958E753674k69975J13907L8379k08895M7357k29835q25765L28484M4072k01106
$$ 5753674 5483699 5597606 5635985 5427090 5474447 5244612 4418847 4747331 4791403 4590297
4948D590297j23451k20254L26439q04315K3852K45682K32900l26294L514k01931
$$ 4590297 4466846 4246592 4573031 3768716 3792568 4038250 4271150 3944856 3948370 3746439
4938C746439r6983O3650q8349k5283o0054K7433k38993M23019l01539l96764O2798
$$ 3746439 3649456 3713106 3624757 3599474 3539420 3566853 3327860 3750879 3449340 3052576 3115374
4927C115374L16730n84239k34312N18625m8017m03906n6692N00453L33085k69865
$$ 3115374 3432104 2847865 2613553 3132178 3084161 2680255 2623563 3124016 3457101 3187236
4917C187236k42322L33380n1644n54800N1304R2010k73611J06653K97051J57011
$$ 3187236 2944914 3278294 3226650 2671850 2723154 2815164 2541553 2648206 2945257 3102268
4907C102268m15376J9358j90767N3859j69358P281J08059j00699R5343l06167
$$ 3102268 2686892 2706250 2515483 2569342 2399984 2407265 2515324 2414625 2509968 2203801
4897B203801J31565J06372l64404j12363M23533j07072o4209J29492l43892M05469
$$ 2203801 2335366 2441738 2077334 1964971 2388504 2281432 2217223 2346715 2002823 2408292
4887B408292j28291l47458L92729L12936k84849l36724J37615J34893L69737k1239
$$ 2408292 2280001 1932543 2325272 2638208 2353359 2016635 2154250 2289143 2658880 2637641
4877B637641J833n08555K2509P0829J44434k91099j94005J98231j03365O2764
$$ 2637641 2639474 2130919 2153428 2224257 2368691 2077592 1883587 2081818 1978453 2041217
4867B041217m13133O26061J48616J17539k90067K1839k50588m77968N98799n1523
$$ 2041217 1628084 2254145 2402761 2520300 2230233 2252072 2001484 1523516 2122315 2070792
4857B070792K47149r1312j48586K5597J84165l13090j35173K82029l62106L0324
$$ 2070792 2317941 2226629 2078043 2103640 2287805 1974715 1839542 2121571 1759465 1789789
4847A789789K61707J81126n04388P183L94294l57432K43923L41230l74801L65935
$$ 1789789 2051496 2232622 1728234 1735417 2129711 1772279 2016202 2357432 1982631 2348566
4837B348566n411l720Q8516j28397K28628p2507p40323N14892l0613k59660J7494
$$ 2348566 2343155 2339435 2427951 2299554 2528182 2455675 1715352 2230244 2199631 1939971 1957465
4826A957465M50963J1173P7579m65581N0517N9771m34615J81576l41370K12715
$$ 1957465 2408428 2419601 2497180 2031599 2082116 2141887 1707272 1888848 1547478 1760193
4816A760193J44091L37026M5297j46442l97691O43975l7046k98843L02079J73285
$$ 1760193 1904284 2241310 2286607 2140165 1742474 2386449 2349403 2050560 2352639 2525924
4806B525924m78986j59217k5759k32180N35807K06949m42879J19939n07633n9876
$$ 2525924 2046938 1887721 1861962 1629782 2165589 2372538 1929659 2049598 1541965 1482089
4796A482089N10699J23822J58862m6660j23035n9225j76276l38581L79707Q4084
$$ 1482089 1992788 2116610 2275472 2228812 2105777 2046552 1870276 1531695 1911402 1995486
4786A995486k583k11771p4533N50564j4615L07467l76670j45367k9576l32041
$$ 1995486 1992903 1781132 1706599 2257163 2242548 2550015 2173345 2027978 1998402 1666361
4776A666361p5224M91126P4667k49371m6498j63681M98179j74990k31254j95948
$$ 1666361 1591137 2082263 2156930 1907559 1861061 1697380 2195559 2020569 1789315 1593367
4766A593367J59674J03818P70339J48433n25579L50832o39212K96919l74328L6846
$$ 1593367 1753041 1856859 2627198 2775631 2250052 2600884 1961672 2258591 1884263 1921109
4756A921109K0356K50686j22384K55236K17632J3596j99767L23671N87006k95686
$$ 1921109 1941465 2192151 2069767 2325003 2542635 2556231 2356464 2680135 3267141 2971455
4746B971455n21672j72926K01711k98860l17291K32201M00340k26277L01722n29207
$$ 2971455 2449783 2276857 2478568 2179708 1862417 2094618 2494958 2268681 2570403 2041196
4736B041196L34476j91734j96196J69109L64762o10326m7227M61911K21533k37440
$$ 2041196 2375672 2183938 1987742 2156851 2521613 1911287 1864060 2325971 2547504 2310064
4726B310064K19226J29593l65582M71965j79218K52857o67611O7297J32412R6239
$$ 2310064 2529290 2658883 2293301 2765266 2586048 2838905 2171294 2238591 2371003 2467242
4716B467242k41911l3470N70677q5644k86449k76803P62077Q6695k40384j53001
$$ 2467242 2225331 2191861 2762538 2676894 2390445 2113642 2875719 2962414 2722030 2569029
4706B569029K82505m54061N64896J26961j63602K57811j93273N4854j00890O0763
$$ 2569029 2851534 2397473 2962369 3089330 2925728 3183539 2990266 3045120 2944230 3004993
4696C004993J42680o2932k23693K89969k71063L66308k66682n4747L29082j74149
$$ 3004993 3147673 3084741 2861048 3151017 2879954 3246262 2979580 2924833 3253915 3079766
4686C079766k7959r7035J31015J16643K13263m13559k29797L26123M89831k51348
$$ 3079766 3051807 2954772 3085787 3202430 3415693 3002134 2772337 3098460 3588291 3336943
4676C336943j88409j33174O5697m82951N44556J90247N8386r7272n9118K73444
$$ 3336943 3148534 3015360 3081057 2598106 3142662 3332909 3391295 3294023 3234905 3508349
4666C508349j3500K12987L10091q9904k87132r4745j15605M17010j04610J67130
$$ 3508349 3494849 3707836 4017927 3928023 3640891 3546146 3430541 3847551 3742941 3910071
4656C910071R3517k3131j85817j20424P12250j58114m20281K68963L58366m86687
$$ 3910071 4003588 3980457 3794640 3674216 4386466 4228352 3808071 4077034 4435400 3948713
4646C948713K76583k56189j31703P91118j0985K99276m8875J46515j71323J51299
$$ 3948713 4225296 3969107 3837404 4628522 4617537 4916813 4867938 5014453 4843130 4994429
4636D994429k1383M59645l97586K54152J20856J45439j21212J70649M99024P9493
$$ 4994429 4973046 5432691 5035105 5289257 5410113 5555552 5434340 5604989 6104013 6183506
4626F183506j8998j81916k48080K1238N6771K14687O45356M9387j56839N86837
$$ 6183506 6164508 5982592 5734512 5755750 5812521 6027208 6672564 6721951 6565112 7151949
4616G151949j99169J30792K54783l12646L79475K25337j11178j53557L76557J11504
$$ 7151949 6952780 7083572 7338355 7025709 7405184 7630521 7519343 7365786 7742343 7853847
4606G853847L14104N8359K84033N3531k39103L19763R3859m1477K05506N33244
$$ 7853847 8167951 8226310 8510343 8563874 8324771 8644534 8738393 8696916 8902422 9435666
4596I435666k58169M69663L85391p0156K53459j1066J656Q7690N8649Q0177L38960
$$ 9435666 9177497 9647160 10032551 9962395 10215854 10204788 10206444 10294134 10352783 10432960 10771920
4585A0771920l98667Q5501L56773J8403M13122k34050K963J63744j04015p5468
$$ 10771920 10373253 10458754 10815527 10833930 11247052 11013002 11015965 11179709 11075694 11000226
4575A1000226J47346j03630l28594j01105K70383O71397l53275K00200L53278
$$ 11000226 11147572 11043942 10715348 10614243 10884626 11556023 11202748 11402948 11756226
4566A1756226L72907k64420q2746R6868N9164N0074N7996K08197K36071J84622
$$ 11756226 12129133 11864713 11781967 11878835 11937999 11988073 12046069 12254266 12490337 12674959
4556A2674959K81177p5491r4298k93658N28434K68571j56240L60468K76233m92990
$$ 12674959 12956136 12880645 12786347 12492689 13021123 13289694 13133454 13493922 13770155 13277165
4546A3277165M7M89109k72437l7319K6197p3225M6384L30735l79075K76672K03476
$$ 13277165 13277212 13766321 13493884 13456565 13482762 13409537 13455921 13786656 13407581 13684253 13887729
4535A3887729L9128M31189k85690j82817K15235Q3588m74595k33983J58704N02700
$$ 13887729 13926857 14358046 14072356 13889539 14104774 14188362 13713767 13479784 13638488 14141188
4525A4141188J19915k85373N7416k28444m32963l79483p8869K56657l36474J38
$$ 14141188 14261103 13975730 14033146 13804702 13371739 12992256 12913387 13170044 12833570 12833708
4515A2833708m52529l8495k17787K004j21295j2102l91520k50388L77495m36418
$$ 12833708 12381179 12342684 12124897 12126901 12005606 11993504 11601984 11351596 11729091 11292673
4505A1292673m8936l48498K94014K12184j62304m58340j72677l49232l8296q1197
$$ 11292673 11243737 10895239 11189253 11401437 11239133 10780793 10608116 10258884 10220588 10139391
4495A0139391m72574l1522l27424l88551q7321m6062K57116k70610j81847K41837
$$ 10139391 9666817 9635295 9307871 8919320 8831999 8785937 9043053 8772443 8590596 8832433
4485H832433j81287J22742J38973k62606m1935k57912M095o58628J03387l30650
$$ 8832433 8651146 8773888 8912861 8650255 8608320 8350408 8354503 7695875 7799262 7468612
4475G468612k22004L39770k54911m9062O04640P5948j71435l5236j00721n35340
$$ 7468612 7246608 7586378 7331467 7282405 7887045 7962993 7791558 7756322 7655601 7120261
4465G120261J64096m7302k5926J07613n8902j64343J49478k81557j49643N68491
$$ 7120261 7284357 7237055 7211129 7318742 7259840 7095497 7244975 6963418 6813775 7382266
4455G382266l11379L28350j61820L53749j99462j07947p8473k59115j4681q2315
$$ 7382266 7070887 7399237 7237417 7591166 7391704 7283757 7205284 6946169 6931488 6849173
4445F849173N0372j45709N29683k20821j13805K77890L34504n1403j64378O0163
$$ 6849173 6899545 6753836 7283519 7062698 6948893 7226783 7561287 7509884 7345506 7405669
4435G405669L37546J24101j1819N56000k56683j55131n16429k0492K08117K50369
$$ 7405669 7743215 7867316 7855497 8411497 8154814 7999683 7483254 7462762 7670879 7921248
4425G921248R669O80059K4121n30156J84344j15286J90386J40444o98283M29512
$$ 7921248 7930917 8610976 8635097 8104941 8289285 8173999 8364385 8504829 7806546 8236058
4415H236058L28164j75961K20286K36076J81016n6283M73530p3728J12793m59220
$$ 8236058 8564222 8388261 8608547 8844623 9025639 8969356 9442886 9369158 9481951 9022731
4405I022731K58630j12218L8757J62709K42224N30918l89348K24855K25804K38907
$$ 9022731 9281361 9169143 9207900 9370609 9612833 10143751 9754403 9979258 10205062 10443969
4395A0443969j96969J95658L03655o7654o0004M36229J00477J78393Q883j08305
$$ 10443969 10247000 10442658 10746313 10678659 10618655 11054884 11155361 11333754 11342637 11234332
4385A1234332M89595k81818q8795J09484N9686p2040M31474M03143K06628L12580
$$ 11234332 11723927 11442109 11353314 11462798 11522484 11450444 11881918 12285061 12491689 12804269
4375A2804269J92795K34135j26199L11491L05841j0336J00591L5201L12055K60740
$$ 12804269 12997064 13231199 13105000 13416491 13722332 13711996 13812587 13847788 14159843 14420583
4365A4420583j01718L34672K02844M66856k53029M23136j38092R1051K19046J3202
$$ 14420583 14318865 14653537 14856381 15323237 15070208 15493344 15355252 15446303 15665349 15678551
4355A5678551J51417L87298O96128j37921M39809K9593k83515l7895N93246j76097
$$ 15678551 15829968 16217266 16913394 16775473 17215282 17244875 16961360 16923465 17516711 17340614
4345A7340614k80853K47967M45535O4509K80442K73330k21060J7145L66711N20389
$$ 17340614 17059761 17307728 17753263 17817772 18098214 18371544 18150484 18167629 18534340 19054729
4335A9054729J71335L60390m38943J64269L19440K25282M97956L10974J53137
$$ 19054729 19226064 19586454 19147511 19311780 19631220 19856502 20354458 20665432 20818569
4326B0818569J71938J53263J41114K68780j2449K39994O30069N59028J70128j82929
$$ 20818569 20990507 21143770 21284884 21553664 21541215 21781209 22411278 22970306 23140434 22957505
4316B2957505O04364L33246k02014J66805K04927K94351J33822K56332M96759
$$ 22957505 23561869 23895115 23693101 23859906 24064833 24359184 24493006 24749338 25246097
4307B5246097K27903m4420O18668O71145J63301M38980K61891K52038J84458L98180
$$ 25246097 25474000 25429580 26048248 26719393 26882694 27321674 27583565 27835603 28020061 28418241
4297B8418241L98952J26252M86373O36496P27572K63384O86617M39331K40344
$$ 28418241 28817193 28943445 29429818 30066314 30793886 31057270 31743887 32183218 32423562
4288C2423562Q40426P09951j37749J037978M36359L92578O95990M01455O58460
$$ 32423562 33263988 33973939 33836190 34874168 35310527 35703105 36399095 36800550 37459010
4279C7459010N06526O46794R38333M40888Q42607O75458P72838R09313N17595
$$ 37459010 37965536 38612330 39550663 39991551 40834158 41509616 42282454 43191767 43709362
4270D3709362N82973O81613J021587J399809J489031J180955J766635J253060
$$ 43709362 44292335 44973948 45995535 47395344 48884375 50065330 51831965 53085025
4262E3085025J542527J708846J636364K005690J922069K522055J895593K509383
$$ 53085025 54627552 56336398 57972762 59978452 61900521 64422576 66318169 68827552
4254F8827552L039324L609524L152875L251376L868116M224379M620946N233061
$$ 68827552 71866876 75476400 78629275 81880651 85748767 89973146 94594092 99827153
4246I9827153N732382N709366O629398O973797P634487Q748417R324880J0239141
$$ 99827153 105559535 111268901 117898299 124872096 132506583 141255000 150579880 160819021
4238A60819021J1294922J2471675J3798532J4921763J5634611J7576007J7147383
$$ 160819021 172113943 184585618 198384150 213305913 228940524 246516531 263663914
4231B63663914J6401781J5508429J2191362Q289956K851465k240003p257557j0745582
$$ 263663914 280065695 295574124 307765486 316055442 318906907 316666904 309409347 298663765
4223B98663765j3585173j4731622j5866484j5464830j5083923j5090402j3803331
$$ 298663765 285078592 270346970 254480486 239015656 223931733 208841331 195038000
4216A95038000j3417490j2440180j1355584j0709605r684739r035818p927804
$$ 195038000 181620510 169180330 157824746 147115141 137430402 128394584 120466780
4209A20466780p584398o362216o384366n878367m993655m363412m128318l665713
$$ 120466780 112882382 106520166 100135800 94257433 89263778 84900366 80772048 77106335
4201G7106335k770286l193569k985247k356441k462184k300054k394458k080243
$$ 77106335 74336049 71142480 68157233 65800792 63338608 61038554 58644096 56563853
4193E6563853k091602j934956j648687j247863j483046j824259j469596j067121
$$ 56563853 54472251 52537295 50888608 49640745 48157699 46333440 44863844 43796723
4185D3796723j371017r95175j359888j283101k80339j165963p61260q65163j055377
$$ 43796723 42425706 41430531 40070643 38787542 38507203 37341240 36579980 35714817 34659440
4176C4659440j188815p57017q00748n12767n91898r26446l71115r41468l16006
$$ 34659440 33470625 32713608 31912860 31400093 30808195 29881749 29510634 28569166 28253160
4167B8253160n93287k08492m28569k03300m33261q45642p38287m38022k51543
$$ 28253160 27659873 27451381 27022812 26819512 26386251 25540609 24802322 24364300 24112757
4158B4112757l92549m23144p073j23092l11281k39026p71127k88329k95705k87415
$$ 24112757 23720208 23297064 23289991 23166899 22855618 22616592 21845465 21557136 21261431 20974016
4148B0974016n37668R3994l36203J30023l7901k88057k10509l56686J36978r8855
$$ 20974016 20436348 20530342 20194139 20324162 20286261 19998204 19787695 19431009 19567987 19469132
4138A9469132m45112K1611J83433k14200R1129l66038J3507n5712m08475J91885
$$ 19469132 19024020 19045631 19229064 19014864 19105993 18739955 18753462 18697750 18289275 18481160
4128A8481160p8222l91368J61824M3313k27065N92474k42770n08472J25447J35873
$$ 18481160 18402938 18011570 18173394 18216707 17989642 18582116 18339346 17830874 17956321 18092194
4118A8092194l17153J10590j96169L16337N4499m03585L82518m2006K90649O17785
$$ 18092194 17775041 17885631 17689462 18005799 18060298 17656713 18039231 17997225 18287874 18905659
4108A8905659j83227L19120j0913k83061L92099M06111J07452M18317N01240k0069
$$ 18905659 18722432 19041552 19030639 18747578 19139677 19545788 19653240 20071557 20572797 20552728
4098B0552728L30223J36553K38113L21463O09462M84094K03731K14061L12801
$$ 20552728 20882951 21019504 21257617 21579080 22188542 22672636 22876367 23090428 23403229
4089B3403229O6728O21256O30760K79423M99748j7569N36368J51443L08289J77482
$$ 23403229 23469957 24091213 24721973 25001396 25501144 25483575 26019943 26171386 26479675 26657157
4079B6657157L87943O58924R4408L41076M99106K69497K71680J98512K60195J96173
$$ 26657157 27045100 27704024 27798432 28139508 28638614 28908111 29179791 29378303 29638498 29834671
4069B9834671K06016J94549L3138l2442M47908O97025K38473N4893j48670J78630
$$ 29834671 30040687 30235236 30268374 30235932 30683840 31380865 31619338 31674231 31525561 31704191
4059C1704191P78683j58110J20215L0342p1765q8724k6290J6466m11523k01621
$$ 31704191 32482874 32324764 32444979 32475321 32403556 32314832 32288542 32305008 31893485 31691864
4049C1691864j44184j59130j34129j16962n10349l09200o22465K28336L27504
$$ 31691864 31547680 31388550 31254421 31137459 30627110 30317910 29695445 29923781 30251285
4040C0251285l96521q45002n12908l09618j43680k85328j77157k61580n92515
$$ 30251285 29854764 29009762 28496854 28187236 28043556 27758228 27581071 27319491 26726976
4031B6726976j87530m24241k42348k37246l02710m03548k12875l61371K26291
$$ 26726976 26539446 26115205 25872857 25635611 25332901 24929353 24716478 24355107 24581398
4022B4581398m90973p66527J41127m08302m51738n30352J0349j18387l67416p96366
$$ 24581398 24090425 23323898 23465025 23056723 22604985 22074633 22084982 21966595 21599179 20802813
4012B0802813n17476l08356m4706J81283l94353o57623J2047N230n64017K73161
$$ 20802813 20285337 19976981 19932275 20113558 19719205 19061582 19073629 19078859 18514842 18788003
4002A8788003q1991o30925l09992k66985j23391K62605l03239j18288p4477k08230
$$ 18788003 18706012 18075087 17765095 17498110 17374719 17637324 17334085 17215797 17141320 16933090
3992A6933090K36054j00775J3979q8308m6342J32483J42363k55593l20261l88569
$$ 16933090 17169144 17068369 17082348 16994040 16947698 17080181 17222544 16966951 16646690 16258121
3982A6258121K85063j91688k14718L15965M36964o4545j77440N0325J4428O5915
$$ 16258121 16543184 16351496 16136778 16452743 16889707 16825162 16647722 16698047 16712475 16778390
3972A6778390L02857j0121k27178m4210L14609n7597l72979k92793p3849K98128
$$ 16778390 17081247 17071126 16843948 16799738 17114347 17056750 16683771 16390978 16317129 16615257
3962A6615257J72068l67360M0337J47807J31342k51227K24171K14219p8995m86791
$$ 16615257 16787325 16419965 16460302 16608109 16739451 16488224 16712395 16926614 16847619 16360828
3952A6360828J70383n1733k58171K65154R0643N4606P1004J08770o4145N14869
$$ 16360828 16531211 16479478 16221307 16486461 16577104 16631710 16702714 16811484 16747339 17262208
3942A7262208k48558p23597M74285O21212m00106J00351k25557J90512M6728k09853
$$ 17262208 17013650 16290053 16764338 17385550 16985444 17085795 16860238 17050750 17097478 16887625
3932A6887625L64313L64519m36034l10759M73946N66243l90457m95991J21374
$$ 16887625 17251938 17616457 17180423 16869664 17343610 17909853 17519396 17023405 17144779
3923A7144779K06262j87282L21976j2303J09508j75246J50690K948n3465K13432
$$ 17144779 17351041 17163759 17485735 17473432 17582940 17407694 17558384 17561332 17507867 17721299
3913A7721299M3565l6079o1718j17239M3567L04054m65555P22M94978J25797k06843
$$ 17721299 17764864 17728785 17667067 17549828 17593395 17897449 17431894 17432616 17927594 18053391 17846548
3902A7846548q242J70555J608q469k86444J52917M28868M7716m10032L42156j53892
$$ 17846548 17838306 18008861 18010469 18002000 17715556 17868473 18297341 18345057 17935025 18277181 18123289
3891A8123289j40994K40114L85511m31566j64224j31359N51747m54987N9896P41182
$$ 18123289 17982295 18222409 18607920 18176354 18012130 17880771 18432518 17977531 18037427 18778609
3881A8778609M1395j31594l09168l59404j28679J24223j61194R68669l10407k50134
$$ 18778609 18820004 18688410 18379242 18019838 17891159 18015382 17854188 18822857 18512450 18262316
3871A8262316q3677J62342K61306M02903K19732j44994l26166J88752j25898L77970
$$ 18262316 18178639 18340981 18602287 19005190 19224922 19079928 18753762 18942514 18816616 19194586
3861A9194586L27879j44160L44530J61539q8266J65032M16875N19368m9726m43830
$$ 19194586 19522465 19378305 19722835 19884374 19796108 19961140 20378015 20897383 20847657 20403827
3851B0403827J85481J88438J54181L02230M64664P0263J99024J14115j16886N84807
$$ 20403827 20589308 20777746 20931927 21234157 21698821 21769084 21968108 22082223 21965337 22550144
3841B2550144Q1751M88979r5530K3571L8267L32994N65834J93638L42820j68248
$$ 22550144 22631895 23120874 23025344 23048915 23087182 23420176 23986010 24179648 24522468 24354220
3831B4354220O27574N30626L25361K53881P30254M20087M01549P77898O43594
$$ 24354220 24981794 25512420 25837781 26091662 26821916 27242003 27643552 28421450 29065044
3822B9065044M26393O79482J063472N24220R00700J029370P93544P84877J162548
$$ 29065044 29491437 30170919 31234391 31758611 32659311 33688681 34482225 35267102 36429650
3813C6429650J017685J029313J287626R40256J048176K097275J612804J457300
$$ 36429650 37447335 38476648 39764274 40704530 41752706 43849981 45462785 46920085
3805D6920085J805810J589737J807832J905410J485416J713663J878301J086822
$$ 46920085 48725895 50315632 52123464 54028874 55514290 57227953 59106254 60193076
3797F0193076R73170J061239J262412M17506N00745O50024J23515J16143m61703
$$ 60193076 61166246 62227485 63489897 63907403 64408148 65058172 65181687 65297830 64836127
3788F4836127P1792K27992J86448q21612l60875M6757j45161j71023k51356j026412
$$ 64836127 64907919 65135911 65322359 64500747 64139872 64186629 64041468 63870445 63619089 62592677
3778F2592677l88604o54066j490754j066932j284396j616330j802291j768790
$$ 62592677 62204073 61550007 60059253 58992321 57707925 56091595 54289304 52520514
3770E2520514j261788j580681k176196j205368k008992k249994j187942j669136
$$ 52520514 51258726 49678045 47501849 46296481 44287489 42037495 40849553 39180417
3762C9180417j457170j411364j511264j292147j299175j619954j042783j079153
$$ 39180417 37723247 36311883 34800619 33508472 32209297 30589343 29546560 28467407
3754B8467407j656625o68384n62005p64941o65321o34520o59697n76746r47734
$$ 28467407 26810782 26142398 25580393 24815452 24150131 23515611 22855914 22279168 21331434
3745B1331434o53004o96093n00422r25820p1155n23340n55797o47894k64727l78013
$$ 21331434 20678430 19982337 19481915 18556095 18484940 17961600 17405803 16757909 16493182 16115169
3735A6115169o02843j05839k41128k27208o52400o4640M0489j17137n52003l55535
$$ 16115169 15512326 15406487 15165359 14938151 14285751 14221111 14261600 14144463 13592460 13236925
3725A3236925j6911j18333o25361j64255J04775m85618o95724j2739P31534m20160
$$ 13236925 13220014 13101681 12476320 12312065 12416840 11931222 11235498 11222759 11954293 11534133
3715A1534133m95862j83881J6236l57557n10587L6064L79699p77895n27315M00448
$$ 11534133 11038271 10854390 10870626 10513069 10002482 10038546 10418245 9640350 9113035 9513483
3705I513483L42287p30046m14676J30918L77334o77908m02504K64600K15746l30237
$$ 9513483 9855770 9125724 8711048 8841966 9219300 8541392 8138888 8403488 8619234 8288997
3695H288997o20713O77675P1778k44566k60589K37527k98049n47987j21025k28779
$$ 8288997 7668284 8345959 8417737 8173171 7912582 8150109 7852060 7304073 7183048 6954269
3685F954269k94756P3276M81457j30496o4046j30847l67627J55698o05424l33128
$$ 6954269 6659513 6732789 7214246 7083750 7019704 6888857 6521230 6676928 6071504 5738376
3675E738376n4826o517l76421K01570N74490J12051m01392k29288l71315M03094
$$ 5738376 5683550 5677033 5300612 5502182 6076672 6188723 5787331 5558043 5186728 5589822
3665E589822j69010r0476K24994j85407l82784k30088K80561m09459K37104J28760
$$ 5589822 5420812 5330336 5555330 5369923 4987139 4757051 5037612 4628153 4865257 4994017
3655D994017l26454m10909N5607K97632l84783k71288N03366k8704j8821R0315
$$ 4994017 4667563 4256654 4312261 4609893 4225110 3953822 4457188 4428484 4409663 4499978
3645D499978O5328R763j25796o64230L15963J44122j32238j14683L41747r9745
$$ 4499978 4565306 4575069 4449273 3785043 4101006 4245128 4112890 3998207 4339954 4240209
3635D240209n16637j58907L53353p3307k59013K88165k07242J27299M31529R9743
$$ 4240209 3723572 3564665 3918018 3844711 3585698 3873863 3666621 3793920 4225449 4325192
3625D325192n32021Q3148l50204L41619k26268j62101k24720J48091m3699n46876
$$ 4325192 3793171 3876319 3526115 3867734 3641466 3479365 3254645 3402736 3359037 2812161
3615B812161M11974K1355K95056k11358J64653J32829j41612L66667l36889m31804
$$ 2812161 3224135 3245490 3540546 3329188 3493841 3626670 3485058 3851725 3514836 3083032
3605C083032k71951K42532K40474j03986m01387N29814J30292m96816Q5544J13388
$$ 3083032 2811081 3053613 3294087 3190101 2788714 3318528 3448820 2952004 3037548 3150936
3595C150936l57233M830J3236K82053K80665l48899l14496M24598J52685J37577
$$ 3150936 2793703 2798533 2811769 3093822 3374487 3025588 2711092 3135690 3288375 3425952
3585C425952n67980K72952p5314k91470M48391J41457l25808k57L55794k06351
$$ 3425952 2857972 3130924 3055610 2764140 3212531 3353988 3028180 3027923 3383717 3177366
3575C177366k10181p3646M64119L0827k67494k02851K24230k31505l95883M33533
$$ 3177366 2967185 2893539 3357658 3388485 3120991 2918140 3142370 2910865 2514982 2948515
3565B948515J61066j65174O0899P0382j34995j24j71058N3181J63092M1828R4683
$$ 2948515 3109581 2944407 3005306 3075688 2940693 2940569 2769511 2822692 2985784 3027612 3122295
3554C122295k14961R5769k40563j77155J77653J73583k51139K37225L4956K7627
$$ 3122295 2907334 3003103 2762540 2585385 2763038 2936621 2685482 2922707 2957663 2985290
3544B985290l79889j52047K91379M39833k11089K02082J18990O2161l82035J59323
$$ 2985290 2605401 2453354 2744733 3184566 2973477 3175559 3294549 3356710 2974675 3133998
3534C133998M10812n48384R4016O76907p37295n58353M67269N61735O1344n46626
$$ 3133998 3544810 2996426 3090442 3767349 3030054 2471701 2938970 3500705 3562049 3015423
3524C015423p2945P18361l59024l30013L38047M02169m32492J4166K99822J49664
$$ 3015423 2942478 3660839 3301815 2971802 3309849 3712018 3279526 3293692 3593514 3743178
3514C743178r66791K41832N31108n54727J22362K14907M18508k23854j89812j05890
$$ 3743178 2776387 3018219 3549327 2994600 3116962 3331869 3750377 3526523 3336711 3230821
3504C230821L00822M83042l35570j98217L96458j84859k830L0478M84659l42175
$$ 3230821 3531643 4014685 3679115 3480898 3877356 3692497 3689667 3720145 4204804 3862629
3494C862629k583J9633L05229k69149N2108q6980N4203J65j00608J72670j3965
$$ 3862629 3860046 3879679 4184908 3915759 3967867 3880887 3935090 3935255 3834647 4007317 3993352
3483C993352L11387J77963K43113p66794M48323K39598r454k50255l65396N08440
$$ 3993352 4304739 4482702 4725815 3959021 4407344 4646942 4637488 4387233 4021837 4530277
3473D530277l94162M56768J73845K00550j38721J30535m69932J90446J17727k28783
$$ 4530277 4136115 4592883 4766728 4967278 4828557 4959092 4489160 4679606 4797333 4568550
3463D568550N05961o3595k80028L79476K55835l34584k6268K80481O75118j91285
$$ 4568550 5074511 5010916 4730888 5110364 5366199 5031615 5005347 5285828 5960946 5769661
3453E769661J78942j97788J66444M69897L42937K929K07995K34929p24685K93319
$$ 5769661 5948603 5750815 5917259 6387156 6730093 6733022 6941017 7175946 6451261 6744580
3443F744580O6187O2773R4357J71704N51161L2987j85402j23328J43013L60381
$$ 6744580 6810767 6873540 6967897 7139601 7690762 7723749 7538347 7415019 7558032 7918413
3433G918413Q2242L73610K45213L87334K34203P47744K08747J14580M86732j34983
$$ 7918413 8000655 8374265 8619478 9006812 9241015 9988759 10197506 10312086 10798818 10663835
3423A0663835n0799k9760N35811O35669K27679p67M05050L02483J23561K73393
$$ 10663835 10613036 10583276 11119087 11754756 11982435 11981668 12386718 12689201 12812762 13086155
3413A3086155O13874k12267L10171N15181J73090N01058M02547J047709O12448
$$ 13086155 13700029 13487762 13797933 14313114 14486204 14987262 15389809 16437518 17049966
3404A7049966N29665N87282P08321N66629Q26349P04696Q76543J621653Q18472
$$ 17049966 17579631 18166913 18875234 19441863 20268212 20972908 21849451 23471104 24289576
3395B4289576J121330J527853J482559J517412K476700J968109K227184J969687
$$ 24289576 25410906 26938759 28421318 29938730 32415430 34383539 36610723 38580410
3387C8580410K880299K934995L223302L437709L147401L123765K775723L344286
$$ 38580410 41460709 44395704 47619006 51056715 54204116 57327881 60103604 63447890
3379F3447890L320234L559057L509375L599157L739922L715618K344736K394448
$$ 63447890 66768124 70327181 73836556 77435713 81175635 84891253 87235989 89630437
3371H9630437K400760J895642K476736K138787J978319J621104J200481J66534
$$ 89630437 92031197 93926839 96403575 98542362 100520681 102141785 103342266 103508800
3363A03508800J05575r85566j347322j646737j307494j526358k085057k085829
$$ 103508800 103614375 102628809 101281487 99634750 98327256 96800898 94715841 92630012
3355I2630012k547514k843231l211615l539788l873424l121453l691081k944940
$$ 92630012 90082498 87239267 84027652 80487864 76614440 73492987 69801906 66856966
3347F6856966k963864l360834l687595k810922l017959l347926l152590k801452
$$ 66856966 63893102 60532268 56844673 54033751 51015792 47667866 44515276 41713824
3339D1713824k263729k639627k297200k262877k107624j465065j532963j655811
$$ 41713824 39450095 36810468 34513268 32250391 30142767 28677702 27144739 25488928
3331B5488928j209867j015534p33089q50131p98488j026170q06357n65592j018845
$$ 25488928 24279061 23263527 22530438 21680307 20881819 19855649 19049292 18483700 17464855
3322A7464855l21584q26659o83757o72142k72652k34344l18926q16719k52767
$$ 17464855 17143271 16316612 15632855 14960713 14688061 14453717 14134791 13318072 13065305
3313A3065305l59035l43841j93866m96019O6170l98622o52902m75714M79020k36936
$$ 13065305 12706270 12362429 12168563 11672544 11738714 11340092 10687190 10211476 10690496 10453560
3303A0453560n39790j73667j11979j60166o1707l05559p92182m54148L78469K59866
$$ 10453560 9913770 9740103 9628124 9467958 9406251 9100692 8308510 7854362 8232831 8492697
3293H492697l34998j13017l59544l36793K6718l1101k66860k06776k75062K10281
$$ 8492697 8157699 8044682 7685138 7348345 7375063 7343962 7077102 6870326 6595264 6805545
3283F805545p0438l02174J27520j32011o27603P845L483J75449M35098m99074
$$ 6805545 6735107 6432933 6560453 6428442 5800839 5808684 5812167 5987616 6422714 5923640
3273E923640M1861o8801m43408p8653L3106k02786J18838p8422o7845p6028J03458
$$ 5923640 5965501 5896700 5453292 5374639 5407745 5204959 5323797 5245375 5177530 5101502 5204960
3262E204960J5192J25465n31780J04944M288n78560N02769l41784m10481L32387
$$ 5204960 5220152 5345617 4813837 4918781 4923069 4344509 4847278 4505494 4095013 4427400
3252D427400k39957l94805J93291j24844K97685L04891l67062J9135k63742R3121
$$ 4427400 4187443 3792638 3985929 3861085 4158770 4463661 4096599 4115734 3851992 3945113
3242C945113J43810l66408q064K03536l77366K26510K958j76894J80581j06006
$$ 3945113 4088923 3722515 3714451 3917987 3540621 3767131 3770089 3593195 3773776 3667770
3232C667770o33246Q7393R570J59901L15374l58944K3232n0033q6589M86553j98131
$$ 3667770 3034524 3121917 3131487 3291388 3606762 3247818 3271050 3221017 3134428 3620981 3422850
3221C422850k67971j0944j21926Q0198k29804l24785L25862O4378m69292J52139
$$ 3422850 3154879 3143935 3022009 3102207 2872403 2547618 2873480 2937858 2468566 2620705
3211B620705k23258R3949O5522L75855J36468J53842m64839l1695P7171j30583
$$ 2620705 2397447 2491396 2556918 2932773 3069241 3223083 2758244 2726549 2803720 2673137
3201B673137K0485N6236L1458K62627m81613j18240R1530j53547N39942j13179
$$ 2673137 2693622 2749858 2781316 3043943 2562330 2444090 2535620 2382073 2922015 2808836
3191B808836K4390K15914r6428r0177L11865j02823m7093J26877j00310K3293
$$ 2808836 2833226 3049140 2952712 2862535 3174400 3071577 3024484 3151361 3051051 3074344
3181C074344k44314k0315m7051O3157j88123J35636J43503n4051K23177j54295
$$ 3074344 2830030 2809715 2762664 2825821 2637698 2773334 2916837 2862786 3085963 2931668
3171B931668K02237j1307l11578k53061K46339j58430L46326r362P0471J92733
$$ 2931668 3133905 3122598 2811020 2557959 2804298 2645868 2992194 2982832 3053303 3246036
3161C246036J49543J76880N8998o20945j95670L67640m153j56581J29008m01688
$$ 3246036 3395579 3572459 3631457 3010512 2814842 3182482 3178329 3021748 3150756 2749068
3151B749068N5364N42082k38216J66928j8329j22742n8336j03375M9973L91677
$$ 2749068 2804432 3346514 3108298 3275226 3256897 3134155 3075819 2972444 3022417 3414094
3141C414094k31440L29816l69847L8774N13924N6080N9793k80381k82900J14032
$$ 3414094 3182654 3512470 3142623 3181397 3695321 3751401 3811194 3530813 3247913 3361945
3131C361945J26721K07941M64202N2471j03035r0448l62276M53870J08425k61071
$$ 3361945 3488666 3696607 4160809 4213280 4110245 4019797 3657521 4111391 4219816 3958745
3121C958745J31888k58160J36510P70503J57436m49032l02183K75352L57227J68116
$$ 3958745 4090633 3832473 3968983 4739486 4896922 4447890 4145707 4421059 4778286 4946402
3111D946402l15330O4756J73638K14522N3455L15022l48062J54104J74727o3239
$$ 4946402 4631072 4695828 4869466 5083988 5137443 5452465 5104403 5258507 5433234 5369995
3101E369995L23248k40846J31014L89657J55931k90234J24977k27579j8547L05815
$$ 5369995 5693243 5452397 5583411 5973068 6128999 5838765 5963742 5736163 5717616 6023431
3091F023431M48335M24062O688M17812J55986m60477J02864K07941K95111J33862
$$ 6023431 6471766 6895828 6902516 7320328 7476314 7015837 7118701 7326642 7621753 7755615
3081G755615R7278L65506M86966M11479O2797o7627L73002M2107K94707L69338
$$ 7755615 7852893 8218399 8705365 9116844 9179641 9112014 9485016 9527123 9821830 10191168
3071A0191168N56936N02324K09461M02385M48113k1778P14924K06354N62310L62160
$$ 10191168 10748104 11250428 11459889 11862274 12310387 12288609 13003533 13209887 13772197 14134357
3061A4134357Q01200J99101L90723K20100J058984L20405L30575P38302M23678
$$ 14134357 14935557 15134658 15525381 15745481 16804465 17124870 17455445 18193747 18617425
3052A8617425P43130M35341M90400N28702Q70735J42863R75215P47163N87831
$$ 18617425 19360555 19795896 20286296 20814998 21685733 21828596 22803811 23550974 24138805
3043B4138805N78930Q85879M40443K23208n2452N68943N63349M23745P41892N71803
$$ 24138805 24717735 25603614 26044057 26267265 26214813 26783756 27347105 27770850 28512742 29084545
3033B9084545O07054J27875L79107M36967N77162K38866q9947N80386M35798J24637
$$ 29084545 29691599 29819474 30198581 30635548 31212710 31451576 31361629 31942015 32377813 32502450
3023C2502450j19760Q4634J20304J53266M7431J2770k40433K69845j3018N55913
$$ 32502450 32382690 32467324 32587628 32740894 32788325 32801095 32560662 32830507 32817489 33373402
3013C3373402k87225k40234j59071k51385k16040n38353l28668q9909p52064m39724
$$ 33373402 33086177 32845943 32686872 32435487 32219447 31681094 31352426 31262517 30510453 30070729
3003C0070729J88780o29662o16611l08410P1940O994j56143m69248m99705o1880
$$ 30070729 30259509 29629847 29013236 28704826 28776766 28783760 28627617 28158369 27658664 27596784
2993B7596784n44237Q7661o04698m22418k78050J21163K49047j18281j88155Q1355
$$ 27596784 27052547 27140208 26535510 26113092 25835042 25956205 26205252 26086971 25898816 25980171
2983B5980171j97685J28016N68855K75405P58072L31228L23203Q03371J241923
$$ 25980171 25782486 25910502 26479357 26754762 27512834 27844062 28167265 28970636 30212559
2974C0212559N65945J221002J179732J593880J506357K214516K460712K632966
$$ 30212559 30778504 31999506 33179238 34773118 36279475 38493991 40954703 43587669
2966D3587669K962267M100105M119057M942106N687229O130923M829045L023773
$$ 43587669 46549936 50650041 54769098 59711204 65398433 71529356 76358401 79382174
2958G9382174j3977k592040l348524n083222m898584m880589m435001m168377
$$ 79382174 79368197 76776157 73427633 68344411 63445827 58565238 54130237 49961860
2950D9961860l767079l601988l031156l153138k830867k182547k489603k012034
$$ 49961860 46194781 42592793 39561637 36408499 33577632 31395085 28905482 26893448
2942B6893448j957122j559557j912959j031528q60246q73521j054641p09445k71135
$$ 26893448 24936326 23376769 21463810 20432282 19572036 18698515 17643874 16934429 16663294
2933A6663294r17378l68611m51169r06983o15064J27754q65858l34819j01853
$$ 16663294 15745916 15377305 14926136 14019153 13404089 13531843 12665985 12331166 12229313
2924A2229313l81663j12732l00607j23792m98197n56314m64405m68707R7255j14854
$$ 12229313 11847650 11734918 11434311 11310519 10812322 10256008 9791603 9322896 9420151 9305297
2914I305297l88693J92158j64464n01100N2828l91533n13830l13060K66496M44713
$$ 9305297 8916604 9108762 8944298 8443198 8496026 8104493 7590663 7277603 7544099 7988812
2904G988812m50825m06502J75447k66659o522l53039P6741J33099k20055j23315
$$ 7988812 7537987 7131485 7306932 7040273 7033751 6680712 6757453 6890552 6670497 6547182
2894F547182L29069J61473n16147l01847L00989k16572k57579J1137n32895N24448
$$ 6547182 6876251 7037724 6521577 6219730 6520719 6304147 6046568 6057705 5524810 6049258
2884F049258m97353j04085r5679O6046m47301R9711L84959k66731N07317k8124
$$ 6049258 5551905 5447820 5352141 5418187 4970886 5070597 5455556 5188825 5696142 5668018
2874E668018P1443o09335J21503K7620j89768P6455L83734P2159P5548l63799
$$ 5668018 5739461 5130126 5251629 5279249 5089481 5165936 5549670 5621829 5697377 5333578
2864E333578j94570M45293n08423j56648J48481j40239q3607k60L83219j662p85669
$$ 5333578 5139008 5584301 5075878 4919230 5067711 4927472 4843865 4843605 5226824 5225162 4439493
2853D439493J825J85120M63718J99832p6578j11046k526q03875M970O9003l59638
$$ 4439493 4441318 4626438 5090156 5289988 5213410 5102364 5099838 4295963 4300933 4369936 4010298
2842D010298M23995K60490M01887m80463m03746N11428N57312n94472j01184J78602
$$ 4010298 4434293 4694783 5096670 4616207 4212461 4723889 5281201 4686729 4585545 4764147
2832D764147J79847J29642m22270p7439r2551j60865p1675L66024k44200n7794
$$ 4764147 4943994 5073636 4651366 4573927 4481376 4320511 4248836 4614860 4370660 4312866
2822D312866L82825K25883l21632M6905J19159k64857N18477l33994k45936L18529
$$ 4312866 4695691 4921574 4599942 4646847 4766006 4501149 5019626 4685632 4439696 4758225
2812D758225K89894k67553N9464K75134K4668k41928K54301j94247k56722N28173
$$ 4758225 5048119 4780566 4840030 5115164 5139832 4897904 5152205 4957958 4701236 5229409
2802E229409j48080j4360l1440k54681J86684K15749l74980K42891O0090n43754
$$ 5229409 5081329 5066969 5035529 4780848 4967532 5183281 4808301 5051192 5111282 4567528
2792D567528k48424P36192P0548j95567j58742N94494l70787o12957L37007K65095
$$ 4567528 4319104 5055296 5125844 4930277 4771535 5366029 4995242 4382285 4719292 4984387
2782D984387L74066j49809M31767j37926p0990k69562N01988m43606k3999K87880
$$ 4984387 5358453 5208644 5640411 5502485 5431495 5161933 5663921 5220315 5196316 5484196
2772E484196K28532J05845j20884M87104j99136j31498m08159R3250N26332K93806
$$ 5484196 5712728 5818573 5697689 6184793 5985657 5854159 5446000 5539250 6065582 6359388
2762F359388m43253J98127Q6278L58343L12371N4235j26907n3222M05072M86671
$$ 6359388 5916135 6114262 6200540 6558883 6871254 6925489 6798582 6745360 7150432 7637103
2752G637103n03304q4979j460O9804M77774l24409Q1454O0091J53110L39268N564
$$ 7637103 7133799 7048820 7047360 7117164 7594938 7270529 7351983 7412074 7565184 7904452 7910016
2741G910016R6998M92126r6999N80887J65750l68331R1002J62072L82258J34524
$$ 7910016 8007014 8499140 8402141 8983028 9148778 8780447 8871449 9033521 9415779 9550303
2731I550303j62069P483P76605j97945N50920K00102j0349O66786M2071j04312
$$ 9550303 9388234 9395717 10172322 9974377 10525297 10725399 10715050 11381836 11423907 11319595
2721A1319595j8913k96718J11131Q92200N6452O79291L42464Q1296O03762K56855
$$ 11319595 11300682 11003964 11115095 12007295 12063747 12743038 13085502 13166798 13770560 14027415
2711A4027415L91070R6464K1881P76597k3340M76498P45216L47818J30779M18035
$$ 14027415 14418485 14514949 14536830 15313427 15290087 15766585 16511801 16859619 16990398 17408433
2701A7408433J028818L01441L64046Q13019J35455R43653Q15873O87229R05099
$$ 17408433 18437251 18738692 19102738 19915757 20051212 20994865 21810738 22497967 23403066
2692B3403066L77910Q93110J297423J285832M77383M80605R49894J033573P35354
$$ 23403066 23780976 24674086 25971509 27257341 27734724 28215329 29165223 30198796 30934150
2683C0934150J043407J458309N00482R27646N07835L30135R55177N91433l4241
$$ 30934150 31977557 33435866 33936348 34863994 35371829 35701964 36657141 37248574 37214333
2674C7214333K96734L22201k10395J54594K26071L74228j02560j85215p0878k73625
$$ 37214333 37511067 37833268 37622873 37777467 38003538 38377766 38275206 38089991 38019113 37745488
2664C7745488j71637n50687l11454l60963q07116r41869p07304l31482q58688
$$ 37745488 37573851 37023164 36711710 36350747 35543631 34601762 33894458 33562976 32704288
2655C2704288p36274r47331m42372n96155r29000r67457o30956j492029p80056
$$ 32704288 31968014 31020683 30578311 29982156 29053156 28085699 27454743 25962714 25182658
2646B5182658M15338j259663j345380m06512l39783r27743n31202n97746L1983
$$ 25182658 25597996 24338333 22992953 22586441 22246658 21318915 20787713 20189967 20221950
2637B0221950m90538o94489k02069n34672m77651p33930m53414o50318L42826
$$ 20221950 19731412 19036923 18834854 18300182 17822531 17088601 16635187 15984869 16327695
2628A6327695k91754j50500K83166l66244l31050k03646J21025j31562m63854
$$ 16327695 16035941 15885441 16168607 15802363 15471313 15267667 15388692 15257130 14793276
2619A4793276j31443M96564J21969k69731p5537k03606m72132j80083P39556n96087
$$ 14793276 14661833 15158397 15280366 15010635 14935098 14731492 14259360 14079277 14818833 14222746
2609A4222746j67350L71736L1201j6412m57244K29698J17906J48057j55091R8193
$$ 14222746 14055396 14427132 14458333 14441921 13984677 14214375 14332281 14480338 14325247 14423440
2599A4423440J97504k94232k95542M33749M17105k31764o1128k20364j0215O09714
$$ 14423440 14620944 14326712 14031170 14464919 14882024 14650260 14589132 14368768 14358553 14968267
2589A4968267O3680J43373J90133j33905K50394Q11690P6359n4307o2069L95336
$$ 14968267 15031947 15175320 15365453 15231548 15481942 16293632 16369991 16315684 16253615 16648951
2579A6648951j27290J44982N56431L88100K63719L48776L30149M59821N70339
$$ 16648951 16521661 16666643 17223074 17611174 17874893 18223669 18553818 19013639 19583978
2570A9583978m04261Q51339P92583n4554M68948J047576Q4900O95155J000629
$$ 19583978 19179717 20031056 20823639 20769085 21238033 22285609 22370509 23065664 24066293
2561B4066293O47943P57717J232245J047204J174216J143027P05399J229146J284350
$$ 24066293 24714236 25471953 26704198 27751402 28925618 30068645 30774044 32003190 33287540
2552C3287540J443890J235942J724286J570504J668128J094884J706240J594594
$$ 33287540 34731430 35967372 37691658 39262162 40930290 42025174 43731414 45326008
2544D5326008J403707J517331J157238J118272J303985R54299L82636R57944j21700
$$ 45326008 46729715 48247046 49404284 50522556 51826541 52780840 53163476 54121420 53999720
2535E3999720O16507N00529N23652k92314M8958J64821M3500K41714p48111K1230
$$ 53999720 54616227 55116756 55640408 55348094 55397052 55561873 55605373 55847087 55098976 55120206
2525E5120206j61239j62226j267241k74514l48203p57649r25769q28026o64197
$$ 55120206 54958967 54796741 53529500 53254986 52906783 52149134 51223365 50395339 49731142
2516D9731142n77769n65141k82606l55271p72369J34998o95562L43212K55467
$$ 49731142 49153373 48588232 48305626 47950355 47177986 47312984 46617422 46960634 47216101
2507D7216101K70470Q89385J31818N09643P33580J175775P57507P31113J468357
$$ 47216101 47486571 48375956 48507774 49017417 49750997 50926772 51684279 52415392 53883749
2498E3883749J077002J235206J112946J537708J118335J238535J279285J186534
$$ 53883749 54960751 56195957 57308903 58846611 59964946 61203481 62482766 63669300
2490F3669300J707124Q17497J126655M74502J083609R02417R81165P55243J12210
$$ 63669300 65376424 66193921 67320576 67795078 68878687 69781104 70762269 71517512 71629722
2481G1629722L34897l94217M36080j07301j04574o77705k99298j004198p12129
$$ 71629722 71964619 71570402 72006482 71899181 71794607 71116902 70817604 69813406 69101277
2472F9101277p58143j138873q17154j166833q53165j627214r10062j454369j676755
$$ 69101277 68343134 67204261 66387107 65220274 64367109 62739895 61829833 60375464 58698709
2463E8698709j260775j481195k135892j851373r36552j625432j459208j198492
$$ 58698709 57437934 55956739 53820847 51969474 51032922 49407490 47948282 46749790
2455D6749790j158543j751445j500650j048232j033969j058079j361320q50908
$$ 46749790 45591247 43839802 42339152 41290920 40256951 39198872 37837552 36986644
2447C6986644j029696j030051r66535q21152n93223r95970r04232l25142l5489
$$ 36986644 35956948 34926897 33960362 33139210 32545987 31550017 30645785 30320643 30285154
2438C0285154r76505j27065m88469r27544j27851m61067P44o42632J4591n45236
$$ 30285154 29308649 29181584 28693115 27765571 27637720 27176653 27177397 26534765 26549356 26004120
2428B6004120o0962L1676j64285K92355j90905K3724k40063M59218k029L10191
$$ 26004120 25943158 25974834 25810549 26102904 25911999 25935723 25695660 26154878 26152849 26463040
2418B6463040L3335K64203M49386j77711M01153O6624n5754q5333L21445K6574
$$ 26463040 26496375 26760578 27209964 27032253 27433406 27500030 27444276 27358943 27680388 27706962
2408B7706962k3990p39026J37909L49121k20452j92751j15031j04876m5917l34981
$$ 27706962 27682972 26943946 27081855 27430976 27210524 27017773 26902742 26797866 26751949 26416968
2398B6416968l01340o06014r36023k30675K57037J80283m08624j33132M25978
$$ 26416968 26115628 25509614 24573591 24342916 24599953 24780236 24371612 24238480 24664458
2389B4664458K9656j24999N2599p9280L07461K20309Q1579J29387J16270K38868
$$ 24664458 24694114 24569115 24621714 24542434 24849895 25070204 25151783 25281170 25397440 25636308
2379B5636308J84396Q64397Q79188J05096Q71174R89562N71543P43093M77059
$$ 25636308 25820704 26685101 27564289 27669385 28540559 29530121 30101664 30844757 31321816
2370C1321816J001399J672934J154275J135944J641372J200193J847891J871234
$$ 31321816 32323215 33996149 35150424 36286368 37927740 39127933 40975824 42847058
2362D2847058J420389K280434J897014K514395K115859K097926K529606J543867
$$ 42847058 44267447 46547881 48444895 50959290 53075149 55173075 57702681 59246548
2354E9246548J389269K090303J571786J103902R40814P91381J147538P02342P18787
$$ 59246548 60635817 62726120 64297906 65401808 66342622 67134003 68281541 68983883 69702670
2345F9702670N15688k15472L11347j16321m84026o47643n42079l85089m65060
$$ 69702670 70218358 70002886 70314233 70197912 69713886 69066243 68524164 68139075 67674015
2336F7674015p01849r95417j190969j285872j633839j628226j369459j752357
$$ 67674015 66972166 65976749 64785780 63499908 61866069 60237843 58868384 57116027
2328E7116027j848803k163712j866871j696201k556132k032349j484126k046002
$$ 57116027 55267224 53103512 51236641 49540440 46984308 44951959 43467833 41421831
2320D1421831j455870j212135j782059j599659j333854r87707j355863j253310
$$ 41421831 39965961 38753826 36971767 35372108 34038254 33050547 31694684 30441374
2312C0441374p68934j010906r91028l06767o15085n39333m57445r07348m63019
$$ 30441374 29672440 28661534 27670506 27363739 26748654 26209321 25751876 24844528 24381509
2303B4381509m40996q39147O4547j49804m61742j50739j85089o7706l29681l48367
$$ 24381509 23940513 23101366 23165913 23016109 22554367 22403628 22218539 22150833 21821152 21472785
2293B1472785J12288J08466n97471Q78344K86983k06814J93520j09564Q6555K45915
$$ 21472785 21585073 21693539 21096068 21974412 22261395 22054581 22248101 22138537 22225092 22471007
2283B2471007M791K96909N26552n42549R2920L06903K93151j45673p9428K00535
$$ 22471007 22475798 22772707 23299259 22756710 22849630 23156533 23449684 23304011 23224583 23425118
2273B3425118n5577n8588l91632N3181j17891j41844R2988O1719N3427N0467k71572
$$ 23425118 23369541 23310953 22919321 22972502 22854611 22712767 22805755 22867474 22920901 22971368 22699796
2262B2699796l3574J71573k02885Q3520q893K04370N79073j80551L61761J46561
$$ 22699796 22666222 22837795 22634910 22718430 22709537 22913907 23492980 23312429 23674190 23820751
2252B3820751P7760N21476J51561K98781K46950L25583N99467j89512q9099R32113
$$ 23820751 23898511 24419987 24571548 24870329 25117279 25442862 26042329 25852817 25763718 26695831
2242B6695831K20472L13431P13648L20856P68590L53308Q30978N28530K41037
$$ 26695831 26916303 27229734 27943382 28264238 29032828 29386136 30217114 30745644 30986681
2233C0986681L29214J183747O92117N09201N26517J102503R94143P05110J221697
$$ 30986681 31315895 32499642 33191759 33700960 34227477 35329980 36324123 37029233 38250930
2224C8250930R57677J173606Q78162J709265J500771J416151J437801J678951
$$ 38250930 39208607 40382213 41260375 42969640 44470411 45886562 47324363 49003314
2216D9003314J676981J759573J698249K039595K357813K249060K546050K883633
$$ 49003314 50680295 52439868 54138117 56177712 58535525 60784585 63330635 66214268
2208F6214268K907521K732522K920771L781932L626043L814045M030385L629629
$$ 66214268 69121789 71854311 74775082 78557014 82183057 85997102 90027487 93657116
2200I3657116M429315M372520M167697M495146M118976L619421M790405L800068
$$ 93657116 98086431 102458951 106626648 111121794 115240770 118860191 123650596 127450664
2192A27450664L468686L943269K717146K395492J935412J719387Q22562N17694
$$ 127450664 130919350 134862619 137579765 139975257 141910669 143630056 144452618 144970312
2184A44970312K8777K52732m55140n81889o22219j416849j318997j782458k173459
$$ 144970312 144999089 145251821 144796681 144214792 143592573 142175724 140856727 139074269 136900810
2175A36900810k571116k603288l491920l677441m286931l923346m156759m172256
$$ 136900810 134329694 131726406 128234486 124557045 120270114 116346768 112190009 108017753
2167A08017753l930942m315361m696730l992029l903129m216086l703264l595617
$$ 108017753 104086811 99771450 95074720 91082691 87179562 82963476 79260212 75664595
2159G5664595l206597l358144l363524k646827k279605k376940j971463k126904
$$ 75664595 72457998 69099854 65736330 63089503 60809898 58432958 56461495 54334591
2151E4334591k324977j686296j745109j672594j437347j748082j061463j679912
$$ 54334591 52009614 50323318 48578209 46905615 45468268 43720186 42658723 40978811
2143D0978811j381685r06903p42820q42143j279584p15982n99004p98368j021907
$$ 40978811 39597126 38690223 37947403 37105260 35825676 35109694 34510690 33712322 32690415
2134C2690415q72348n20415r74022l59377o72679k46184k44605p13549k25191
$$ 32690415 31818067 31297652 30323630 29964253 29291574 29045390 28800785 28087236 27862045
2125B7862045l12533o86319m22690o75877j6889j66534o20702j50628l63289j23745
$$ 27862045 27549512 26863193 26440503 25764626 25747737 25581203 24960501 24809873 24446584 24322839
2115B4322839O8518o1497j33197k56829l69133j11114o4678l1779L27525r9450
$$ 24322839 24391357 24329860 24196663 23939834 23570701 23459587 23394909 23363130 23690655 23591205
2105B3591205J09067l33251J0191J72130Q7020j42246j19733O27910M3385J49141
$$ 23591205 23700272 23367021 23377212 23549342 23636362 23494116 23374383 24002293 24045678 24194819
2095B4194819K06232l42825J10223M4161J53816M56667m55318j91221K21703k42156
$$ 24194819 24401051 24058226 24168449 24212610 24366426 24823093 24367775 24176554 24398257 24156101
2085B4156101l33047r9223o05287q9478O7938J21776j78292k72045k76270j75156
$$ 24156101 23823054 23723831 23118544 23029066 23097004 23218780 23040488 22768443 22492173 22317017
2075B2317017K62801Q4574J06521k64206O46506K2009p0050P75754N9119k3746
$$ 22317017 22579818 22664392 22770913 22506707 23153213 23175222 23105172 23880926 23940045 23916299
2065B3916299M42531N78993N06668N73948J08024P65220M65932R83305K29052
$$ 23916299 24358830 24937823 25444491 26018439 26126463 26891683 27357615 28340920 28569972
2056B8569972O08426P78820Q88377P64164J176885J317129O20395J272865J254912
$$ 28569972 29178398 29957218 30845595 31609759 32786644 34103773 34724168 35997033 37251945
2047C7251945J280686J025509J864974J248539J403965J804914J316061J679391
$$ 37251945 38532631 39558140 41423114 42671653 44075618 45880532 47196593 48875984
2039D8875984J612854J206510J119126J827386J105065J021591Q73803R71439
$$ 48875984 50488838 51695348 52814474 54641860 55746925 56768516 57642319 58613758
2031E8613758K42276L64741K69406m919j16749k12235j26417J24782n77057j55403
$$ 58613758 58856034 59220775 59490181 59485262 59368513 59156278 59029861 59154643 58577586 58422183
2021E8422183j11781j015235m19573j74886l94283k79224n05926m27132K5539
$$ 58422183 58310402 57295167 56875594 56700708 56306425 56027201 55521275 55094143 55119682
2012E5119682l89548o2247q73376n50056q03867j083885j138510l37332j047892
$$ 55119682 54730134 54667887 53794511 53244455 52440588 51356703 50218193 49880861 48832969
2003D8832969j833575p54427j534720j230209j338296j119587j697319j618438
$$ 48832969 46999394 46244967 44710247 43480038 42141742 41022155 39324836 37706398
1995C7706398j533151j719959o64218j190548j531463j166618q27095j203100
$$ 37706398 36173247 34453288 33789070 32598522 31067059 29900441 29073346 27870246
1987B7870246p56362r34046j136609r93286o80353m48788n90261l54205o25973
$$ 27870246 27113884 26179838 25043229 24049943 23369590 22920802 22330541 21976336 21350363
1978B1350363r24944l2336n32713q29510j30709p2638l02373m80160J87834j41269
$$ 21350363 20425419 20393083 19860370 19030860 18900151 18827513 18525140 18044980 18232814 18091545
1968A8091545m70478k2110m31325K1118N62098k04784o38397M37178n8824M4847
$$ 18091545 17621067 17598957 17167632 17188750 17750848 17546064 16907667 17344845 17286021 17330868
1958A7330868j32787L55691m00593J04770L31641n50325J9034K15076J560m1280
$$ 17330868 17198081 17553772 17153179 17257949 17589590 17039265 17058299 17273375 17274935 17233655
1948A7233655m72004l63780l50767j61263O5735j42595j21293l04033n27070q1556
$$ 17233655 16761651 16397871 16047104 15885841 15951576 15808981 15687688 15383655 14856585 14775029
1938A4775029J56676o00827J476o50337n21072P6793j34895l80080J48954l63914
$$ 14775029 14931705 14330878 14332354 13682017 13160945 13237738 13102843 12722763 12871717 12507803
1928A2507803j27660j00148m66185j3656k68911l72176L7169R6579m22732K35456
$$ 12507803 12380143 12279995 11813810 11800154 11531243 11159067 11196236 11292815 10870083 11105539
1918A1105539O2783j89050m29692k64482K81572j14279k01912M66288q5771m33938
$$ 11105539 11168322 10979272 10549580 10285098 10566670 10452391 10250479 10716767 10630996 10197058
1908A0197058K17408K97737P8096k07288j07403k60461O0256J82638j43914M4032
$$ 10197058 10414466 10712203 10790299 10583011 10475608 10215147 10275403 10458041 10314127 10358159
1898A0358159O2066o3339j40160J74327J24177l80711J01185M39880k25269J36400
$$ 10358159 10420225 10356886 10216726 10391053 10515230 10134519 10235704 10675584 10450315 10586715
1888A0586715j511J10795K9171l59291K39036J41629k17165L78269K1674k0033
$$ 10586715 10585204 10695999 10725170 10365879 10604915 10746544 10529379 10907648 10929322 10909289
1878A0909289J60944j45136J65219O4928j19747K86390K89777N6043K22607m37693
$$ 10909289 11070233 10925097 11090316 11155244 11035497 11321887 11611664 11667707 11890314 11452621
1868A1452621M13697Q5371J41961j8535L80735m21936N89027J52639r5276J38019
$$ 11452621 11866318 11951689 12093650 12075115 12455850 12033914 12622941 12775580 12680304 12818323
1858A2818323m78854L84514O95290j27055n0742M32230K82984Q494L60854K98885
$$ 12818323 12339469 12723983 13419273 13292218 13241476 13673706 13956690 13965184 14326038 14624923
1848A4624923j04947K00749M36678L77521k4378K82565N08657M68204O78773K15133
$$ 14624923 14519976 14720725 15157403 15534924 15510546 15793111 16301768 16769972 17448745 17663878
1838A7663878R3268M77791J18955J31647N23980L59079M77548N06158Q92152L11762
$$ 17663878 17757146 18234937 18353892 18485539 19009519 19368598 19846146 20352304 21244456 21556218
1828B1556218o0060L44613Q18170P44957J23296N90786L53080N41813L14991J423473
$$ 21556218 21496158 21840771 22658941 23403898 23527194 24117980 24471060 25012873 25327864 26751337
1818B6751337R51510O23534N03086M80757M13087O01754O68900R06869J093381
$$ 26751337 27702847 28326381 28829467 29310224 29723311 30325065 30993965 31900834 32994215
1809C2994215M66107J000137J462706J069272L01421P99225J101373J102010J256156
$$ 32994215 33460322 34460459 35923165 36992437 37293858 38093083 39194456 40296466 41552622
1800D1552622R93523J769603Q41083J219437J389801J887477J763754J717345
$$ 41552622 42546145 44315748 45156831 46376268 47766069 49653546 51417300 53134645
1792E3134645K262908K115170K598863K369316K795549K935896K867114L307574
$$ 53134645 55397553 57512723 60111586 62480902 65276451 68212347 71079461 74387035
1784G4387035L500407M154488L779902M511383N005366N258016N134012N998405
$$ 74387035 77887442 82041930 85821832 90333215 95338581 100596597 105730609 111729014
1776A11729014O787885O812421P271599Q038204Q974999Q830177J0143959J0469849
$$ 111729014 118516899 125329320 132600919 140639123 149614122 158444299 168588258 179058107
1768A79058107J1429718J1914563J2340699J2695164J3054481J3142033J2291249
$$ 179058107 190487825 202402388 214743087 227438251 240492732 253634765 265926014
1761B65926014J1785979R887277O784798M158005M83290l017405o389684q880156
$$ 265926014 277711993 287599270 294384068 298542073 299025363 296007958 289618274 280738118
1753B80738118j0447853j1993953j2947171j2848903j2617008j2417504j2388314
$$ 280738118 270290265 258296312 245349141 232500238 219883230 207465726 195077412
1746A95077412j2029820j0785869j0441319r698268r325583q157402q185006p476016
$$ 195077412 183047592 172261723 161820404 152122136 142796553 134639151 126454145 118978129
1738A18978129o431618o008570n205584n432125m500400m190368l975339l702953
$$ 118978129 112546511 106537941 101332357 95900232 91399832 87209464 83234125 79531172
1730G9531172l049230l053017l466285k806660k361319k218826l014736j870146
$$ 79531172 76481942 73428925 69962640 67155980 64794661 62575835 59561099 57690953
1722E7690953j863710j874252j777759j822939j888264j561722j188611j971887
$$ 57690953 55827243 53952991 52175232 50352293 48464029 46902307 45713696 43741809
1714D3741809j371412j825063r62652j200288p95277j244806j331576j214627
$$ 43741809 42370397 40545334 39582682 38382394 37587117 36342311 35010735 33796108
1706C3796108n53963j311741j098860l76537r67925p71752j011243p86938m45557
$$ 33796108 33242145 31930404 30831544 30455007 29487082 28715330 27704087 26917149 26471592
1697B6471592q75005j009185j03624l44481q30943k39373n95417m30313m75471
$$ 26471592 25596587 24587402 24483778 24139297 23308354 23068981 22473564 22043251 21567780
1688B1567780j098258k21365o06419o43376l55803l53567p14331m10178k75923
$$ 21567780 20469522 20248157 19641738 18998362 18642559 18288992 17574661 17164483 16888560
1679A6888560l42355k58025k86806j91475l94314j00436j36855p75158o5491k5866
$$ 16888560 16546205 16288180 16001374 15809899 15415585 15315149 15178294 14403136 14337645 14311779
1669A4311779l58986q50004K06603m95944k59223k64535j13352j92581m03085
$$ 14311779 13952793 13102789 13309392 12813448 12554225 12289690 12176338 11983757 11580672
1660A1580672J1460k94689K6664n74857l85568l32657L37295p22409k90128L92606
$$ 11580672 11592132 11297443 11324107 10749250 10363682 10031025 10368320 9645911 9355783 9748389
1650I748389k88596m10779R8370J70075k78303k78420n35069J13478k27526p27643
$$ 9748389 9459793 9049014 9147384 9317459 9039156 8760736 8225667 8339145 8111619 7383976
1640G383976P8374k56633m30494J12795K6113J41843m69767m99958O9403k89957
$$ 7383976 7462350 7205717 6775223 6888018 6914131 7055974 6586207 6086249 6155652 5865695
1630E865695j93303K09908r7258O9706m21722k27025L62754l57124Q3531M52655
$$ 5865695 5672392 5882300 5785042 5854748 5433026 5206001 5568755 5211631 5295162 5747817
1620E747817p4551p50441k36358J04837L10356m42760m47989Q4173j00900o3858
$$ 5747817 5673266 4922825 4686467 4791304 5101660 4658900 4210911 4295084 4194184 4130326
1610D130326k38308J17162L77310l91234k75531j03618K34256o71098L5185N08922
$$ 4130326 3892018 4009180 4386490 3995256 3719725 3616107 3850363 3179265 3214450 3723372
1600C723372l72710O8071k9905m67280P5983j17261j79668L73032k60448L53131
$$ 3723372 3350662 3418733 3388828 2921548 2997531 2880270 2700602 3073634 2813186 3166317
1590C166317m34060L24649l94771n69083O77408q3418p10674K8172M84388Q6027
$$ 3166317 2732257 3056906 2662135 2093052 2770460 2687042 1976368 2004540 2488928 2574955
1580B574955j67176k23966j67346P49630l83467m67942K31520j53087o9036K63257
$$ 2574955 2407779 2183813 2016467 2766097 2382630 1914688 2146208 1993121 1924085 2187342
1570B187342m04718n56543N21107J39546l03923K08741K83149n69276K6165l8940
$$ 2187342 1782624 1226081 1747188 1886734 1582811 1791552 2074701 1505425 1531590 1492650
1560A492650j26994o8632l7793Q39j23117P49552l2411n18072k320K39158k01937
$$ 1492650 1365656 1297024 1259231 1260070 1136953 1886505 1854094 1336022 1333702 1572860 1370923
1549A370923k68248P06184l0241J46379m97105k20476L33967K40814k40469j70601
$$ 1370923 1102675 1808859 1778618 1924997 1427892 1207416 1541383 1782197 1541728 1371127
1539A371127J63997k8632l63172Q1993K38161m60980J83324K96401P5596m96492
$$ 1371127 1535124 1506492 1143320 1225313 1463474 1002494 1185818 1482219 1557815 1061323
1529A061323R6045K87477Q8610n00520k9166J80031l97473j13071J55926J70649
$$ 1061323 1157368 1444845 1533455 1032935 1003769 1183800 786327 673256 829182 999831
1519I99831J64500J00333k44866k3828r333K12401m07323k8365J1357Q8839K74624
$$ 999831 1164331 1264664 1019798 995970 986637 1199038 791715 763350 774707 863546 1138170
1508A138170K0879j18262k49943L77049L62428l80037l11205m6631L46503J25867
$$ 1138170 1159049 1040787 790844 1167893 1530321 1150284 839079 792448 1138951 1264818
$$ [...]
##END NTUPLES=NMR SPECTRUM
##END=
