##TITLE=1H_EC-3032(II-23)
 CDCl3, 8 sc, 
 12.05.2021
##JCAMPDX= 6.0         $$ Bruker NMR JCAMP-DX V2.0
##DATA TYPE= NMR SPECTRUM
##DATA CLASS= NTUPLES
##ORIGIN= UXNMR, Bruker Analytische Messtechnik GmbH
##OWNER= root
$$ XWIN-NMR		Version 3.5
$$ Wed May 12 10:21:16 2021 Russian Standard Time (UT+4h)  she@DPX200
##.OBSERVE FREQUENCY= 200.131506
##.OBSERVE NUCLEUS= ^1H
##.ACQUISITION MODE= SIMULTANEOUS
##.ACQUISITION SCHEME= undefined
##.AVERAGES= 8
##.DIGITISER RES= 18
##SPECTROMETER/DATA SYSTEM= spect
##.PULSE SEQUENCE= zg30
##.SOLVENT NAME= CDCl3
##.SHIFT REFERENCE= (INTERNAL, CDCl3, 0, 15.9792)
##AUDIT TRAIL= $$ (NUMBER, WHEN, WHO, WHERE, WHAT)
$$ ##TITLE= Audit trail, XWIN-NMR		Version 3.5
$$ ##JCAMPDX= 5.01
$$ ##ORIGIN= Bruker BioSpin GmbH
$$ ##OWNER= she
$$ F:/spectra/data/she/nmr/H-F/1/pdata/1/auditp.txt
$$ ##AUDIT TRAIL=  $$ (NUMBER, WHEN, WHO, WHERE, WHAT)
(   1,<2021-05-12 10:20:07.42 +0400>,<she>,<DPX200>,
      <created by zg, POWCHK disabled, PULCHK disabled
       configuration hash MD5:
       00 E9 B6 7A A2 85 ED C7 34 08 36 98 17 FE 4E 26
       data hash MD5: 16K
       7B 82 2A F1 BD CA 53 FB EA FC D4 D3 61 C4 88 EB>)
(   2,<2021-05-12 10:20:10.34 +0400>,<she>,<DPX200>,
      <Start of raw data processing
       efp BC_mod = 2 LB = 0.24 FT_mod = 6 PKNL = 1 PHC0 = -11130.93 PHC1 = 12.201 SI = 16K 
       data hash MD5: 16K
       B7 72 B6 3F A6 B3 21 A9 A1 68 69 46 6C 68 91 01>)
(   3,<2021-05-12 10:20:26.03 +0400>,<she>,<DPX200>,
      <pk PHC0 = -5.030124 PHC1 = 7.6 
       data hash MD5: 16K
       93 FF 42 72 D6 8B D3 9C 7C 1E B4 73 9F 78 2B 2C>)
(   4,<2021-05-12 10:20:29.50 +0400>,<she>,<DPX200>,
      <abs ABSG = 5 
       data hash MD5: 16K
       8A 8B 11 E3 DB E0 3C 7F CD 2F 9E C0 C7 A7 08 11>)
$$ ##END=
$$ 
$$ hash MD5
$$ 22 FA 16 3E D6 72 A3 94 FB B8 35 F2 BA 02 1A EB
##$RELAX= 
##$RELAX= 
##$RELAX= 
##$RELAX= 
##$RELAX= 
##$RELAX= 
$$ Bruker specific parameters
$$ --------------------------
##$DU= <F:/spectra>
##$EXPNO= 1
##$NAME= <H-F>
##$PROCNO= 1
##$TYPE= <nmr>
##$USER= <she>
##$AMP= (0..31)
100 100 100 100 100 100 100 100 100 100 100 100 100 100 100 100 100 100 
100 100 100 100 100 100 100 100 100 100 100 100 100 100 
##$AQSEQ= 0
##$AQ_mod= 1
##$AUNM= <au_zg>
##$AUTOPOS= <>
##$BF1= 200.13
##$BF2= 200.13
##$BF3= 200.13
##$BF4= 200.13
##$BF5= 200.13
##$BF6= 200.13
##$BF7= 200.13
##$BF8= 200.13
##$BYTORDA= 1
##$CFDGTYP= 0
##$CFRGTYP= 5
##$CHEMSTR= <none>
##$CNST= (0..31)
1 1 145 1 1 1 1 1 1 1 1 1 1 1 1 1 1 1 1 1 1 1 1 1 1 1 1 1 1 1 1 1 
##$CPDPRG= <>
##$CPDPRG1= <>
##$CPDPRG2= <>
##$CPDPRG3= <>
##$CPDPRG4= <mlev>
##$CPDPRG5= <mlev>
##$CPDPRG6= <mlev>
##$CPDPRG7= <mlev>
##$CPDPRG8= <mlev>
##$CPDPRGB= <>
##$CPDPRGT= <>
##$D= (0..31)
0 1.2 0 0 0 0 0 0 0 0.06 0 0.03 0 0 0 0 0.0002 0 0 0 0 0 0 0 0 0 0 0 0 
0 0 0 
##$DATE= 1620800406
##$DBL= (0..7)
120 120 120 120 120 120 120 120 
##$DBP= (0..7)
150 150 150 150 150 150 150 150 
##$DBP07= 0
##$DBPNAM0= <>
##$DBPNAM1= <>
##$DBPNAM2= <>
##$DBPNAM3= <>
##$DBPNAM4= <>
$$ [...]
##$SUBNAM3= <"">
##$SUBNAM4= <"">
##$SUBNAM5= <"">
##$SUBNAM6= <"">
##$SUBNAM7= <"">
##$SUBNAM8= <"">
##$SUBNAM9= <"">
##$SW= 16.9725357007746
##$SWIBOX= (0..15)
0 0 2 0 0 0 0 0 0 0 0 0 0 0 0 0 
##$SW_h= 3396.73913043478
##$TD= 16384
##$TD0= 1
##$TE= 0
##$TE2= 300
##$TE3= 300
##$TEG= 300
##$TL= (0..7)
0 120 120 120 120 120 120 120 
##$TP= (0..7)
150 150 150 150 150 150 150 150 
##$TP07= 0
##$TPNAME0= <>
##$TPNAME1= <>
##$TPNAME2= <>
##$TPNAME3= <>
##$TPNAME4= <>
##$TPNAME5= <>
##$TPNAME6= <>
##$TPNAME7= <>
##$TPOAL= (0..7)
0.5 0.5 0.5 0.5 0.5 0.5 0.5 0.5 
##$TPOFFS= (0..7)
0 0 0 0 0 0 0 0 
##$TUNHIN= 0
##$TUNHOUT= 0
##$TUNXOUT= 0
##$USERA1= <user>
##$USERA2= <user>
##$USERA3= <user>
##$USERA4= <user>
##$USERA5= <user>
##$V9= 5
##$VALIST= <valist>
##$VCLIST= <CCCCCCCCCCCCCCC>
##$VD= 0
##$VDLIST= <DDDDDDDDDDDDDDD>
##$VPLIST= <PPPPPPPPPPPPPPP>
##$VTLIST= <TTTTTTTTTTTTTTT>
##$WBST= 1024
##$WBSW= 4
##$XGAIN= (0..3)
0 0 0 0 
##$XL= 0
##$YL= 0
##$YMAX_a= 254811
##$YMIN_a= -292324
##$ZGOPTNS= <>
##$ZL1= 120
##$ZL2= 120
##$ZL3= 120
##$ZL4= 120
##$ABSF1= 15.97506
##$ABSF2= -0.9976015
##$ABSG= 5
##$ABSL= 3
##$ALPHA= 0
##$AQORDER= 0
##$ASSFAC= 0
##$ASSFACI= 0
##$ASSFACX= 0
##$ASSWID= 0
##$AUNMP= <proc_1d>
##$AZFE= 0.1
##$AZFW= 0.1
##$BCFW= 0
##$BC_mod= 2
##$BYTORDP= 0
##$COROFFS= 0
##$CY= -3
##$DATMOD= 1
##$DC= 0
##$DFILT= <>
##$DTYPP= 0
##$F1P= 0
##$F2P= 0
##$FCOR= 1
##$FTSIZE= 16384
##$FT_mod= 6
##$GAMMA= 0
##$GB= 0
##$INTBC= 1
##$INTSCL= 1.334414e-10
##$ISEN= 128
##$LB= 0.24
##$LEV0= 0
##$LPBIN= 0
##$MAXI= 10000
##$MC2= 0
##$MEAN= 0
##$ME_mod= 0
##$MI= 1.114404
##$NCOEF= 0
##$NC_proc= -7
##$NLEV= 6
##$NOISF1= 3.799351
##$NOISF2= 2.8
##$NSP= 0
##$NTH_PI= 0
##$NZP= 0
##$OFFSET= 15.97921
##$PC= 1
##$PHC0= -11135.96
##$PHC1= 19.801
##$PH_mod= 1
##$PKNL= yes
##$PPARMOD= 0
##$PSCAL= 0
##$PSIGN= 0
##$REVERSE= no
##$SF= 200.130006450887
##$SI= 16384
##$SIGF1= 3
##$SIGF2= 2
##$SINO= 5.538805
##$SIOLD= 16384
##$SREGLST= <1H.CDCl3>
##$SSB= 0
##$STSI= 16384
##$STSR= 0
##$SW_p= 3396.73913043479
##$SYMM= 0
##$S_DEV= 0
##$TDeff= 16384
##$TDoff= 0
##$TI= <>
##$TILT= no
##$TM1= 0
##$TM2= 0
##$TOPLEV= 0
##$USERP1= <user>
##$USERP2= <user>
##$USERP3= <user>
##$USERP4= <user>
##$USERP5= <user>
##$WDW= 1
##$XDIM= 16384
##$YMAX_p= 436824021
##$YMIN_p= -533650
$$ End of Bruker specific parameters
$$ ---------------------------------
##NTUPLES= NMR SPECTRUM
##VAR_NAME=  FREQUENCY,     SPECTRUM/REAL,   SPECTRUM/IMAG
##SYMBOL=    X,             R,               I
##VAR_TYPE=  INDEPENDENT,   DEPENDENT,       DEPENDENT
##VAR_FORM=  AFFN,          ASDF,            ASDF
##VAR_DIM=   16384,         16384,           16384
##UNITS=     HZ,            ARBITRARY UNITS, ARBITRARY UNITS
##FACTOR=    0.207333158178282, 1,           1
##FIRST=     3197.91938034753, 0,            0
##LAST=      -198.819750087256, 0,           0
##MIN=       -198.819750087256, -533650,     0
##MAX=       3197.91938034753, 436824021,    0
$$ Real data points
##PAGE= N=1
##DATA TABLE= (X++(R..R)), XYDATA
$$ [...]
$$ plain form
4490 11794164 12249602 12479170 12723193 12688026 12703261 12803180 13173800 13604024 13898284 14205877
4480 14205877 14768552 15337849 15882194 16359482 16873999 17427216 18156327 18957111 19922993
4471 19922993 20862283 21772404 22889262 24128337 25668492 27170164 28948709 31003943
4463 31003943 33146854 35691816 38857357 42265709 46067279 50375639 55015532 60009138
4455 60009138 65483245 70785623 76197039 81517599 86434355 91213860 95452053 99184279
4447 99184279 101924774 103208777 102712060 100085109 95732851 90492160 85273988 80238056
4439 80238056 75510836 70861855 65984706 60905876 55919017 51295770 47085572 43224329
4431 43224329 40084502 37033215 34705984 32467434 30456108 28642766 27182436 25967036
$$ packed form
4490A1794164M55438K29568K44023l5167J5235R9919L70620M30224K94260L07593
4480A4205877N62675N69297N44345M77288N14517N53217P29111Q00784R65882
4471A9922993R39290R10121J116858J239075J540155J501672J778545K055234
4463C1003943K142911K544962L165541L408352L801570M308360M639893M993606
4455F0009138N474107N302378N411416N320560M916756M779505M238193L732226
4447I9184279K740495J284003m96717k626951m352258n240691n218172n035932
4439H0238056m727220m648981m877149n078830m986859m623247m210198l861243
4431D3224329l139827l051287k327231k238550k011326j813342j460330j215400
$$ plain form
4423 25967036 24692811 23478493 22310608 21318797 20467736 19514051 18748991 17951045 17177920
4414 17177920 16542066 15671078 15003484 14476776 13735049 12964510 12479641 11955806 11461686
4405 11461686 11195427 10708769 10328679 10002025 9579153 9258201 8985076 8667289 8452255
4396 8452255 7881595 7762361 7589393 7437772 7339333 7097830 6995636 6731772 6473848 6428613
4386 6428613 6308760 6052188 5924595 5803175 5898467 5772880 5618747 5477386 5303015 5113080
4376 5113080 5082802 4845937 4701062 4801070 4816728 4644885 4426881 4346312 4213381 3917309
4366 3917309 4041062 4332294 4046949 3679586 3648509 3689164 3615794 3449401 3327838 3286862
4356 3286862 3317355 3221792 3133554 3117924 3005353 2952413 2836565 2813103 2878828 2799434 2663072
$$ packed form
4423B5967036j274225j214318j167885r91811q51061r53685p65060p97946p73125
4414A7177920o35854q70988o67594n26708p41727p70539m84869n23835m94120
4405A1461686k66259m86658l80090l26654m22872l20952k73125l17787k15034
4396H452255n70660j19234j72968j51621r8439k41503j02194k63864k57924m5235
4386F428613j19853k56572j27593j21420R5292j25587j54133j41361j74371j89935
4376E113080l0278k36865j44875J00008J5658j71843k18004q0569j32931k96072
4366C917309J23753K91232k85345l67363l1077M0655p3370j66393j21563m0976
4356C286862L0493r5563q8238j5630j12571n2940j15848k3462O5725p9394j36362
$$ plain form
4345 2663072 2668534 2710137 2579022 2714236 2621022 2484057 2581904 2549954 2516332 2318468 2327535
4334 2327535 2230951 2101861 2086583 2078143 2192055 2180393 2154166 2156093 2260496 2010895 2091130
4323 2091130 2039312 1894458 2010546 2090360 2021432 2112365 2119396 2206705 2089325 1952261 2060413
4312 2060413 1989193 1917905 1949637 2000127 1900416 1733811 1911926 1838095 1698240 1625727 1764162
4301 1764162 1771162 1778975 1663726 1660263 1738654 1634464 1720544 1848828 1733112 1701727 1569652
4290 1569652 1650407 1914739 1991827 1986718 1917505 1994814 1984254 1930168 2078755 2055804 1888287
4279 1888287 1899248 2007614 2085199 2087641 2113776 2048514 2210356 2244389 2185497 2265545 2182162
4268 2182162 2295922 2376360 2694116 2975128 3377912 3776173 3967199 4359651 4834541 4814143
$$ packed form
4345B663072N462M1603j31115J35214r3214j36965R7847l1950l3622j97864R067
4334B327535r6584j29090j5278q440J13912j1662k6227J927J04403k49601Q0235
4323B091130n1818j44854J16088P9814o8928R0933P031Q7309j17380j37064J08152
4312B060413p1220p1288L1732N0490r9711j66605J78115p3831j39855p2513J38435
4301A764162P000P813j15249l463P8391j04190Q6080J28284j15716l1385j32075
4290A569652Q0755K64332P7088n109o9213P7309j0560n4086J48587k2951j67517
4279A888287J0961J08366P7585K442K6135o5262J61842L4033n8892Q0048q3383
4268B182162J13760Q0438L17756K81012M02784L98261J91026L92452M74890k0398
$$ plain form
4258 4814143 3960414 3392347 2987833 2722738 2291148 2059598 2026576 2043068 1889152 1925375
4248 1925375 1793643 1727213 1702563 1688425 1666348 1691849 1583435 1441760 1395945 1498307 1407792
4237 1407792 1291406 1371928 1360190 1156377 1142577 1338589 1455556 1384089 1217770 1245841
4227 1245841 1201525 1050680 1050152 1119832 1124319 1037968 1020102 917975 893310 1033190 1152533
4216 1152533 1057708 1045312 1053274 1033824 1121147 1109883 1171105 1145846 957055 949134 876343 896245
4204 896245 956087 884771 970594 986125 750987 898358 952737 623536 772501 858855 920356
4193 920356 1023371 886943 997554 814247 845604 860437 760934 835882 868334 737821 892653
4182 892653 868097 754958 873269 867808 857472 754589 834877 841984 621340 713253 791754
$$ packed form
4258D814143q53729n68067m04514k65095m31590k31550l3022J6492j53916L6223
4248A925375j31732o6430k4650j4138k2077K5501j08414j41675m5815J02362r0515
4237A407792j16386Q0522j1738k03813j3800J96012J16967p1467j66319K8071
4227A245841m4316j50845n28O9680M487q6351j7866j02127k4665J39880J19343
4216A152533r4825j2396P962j9450Q7323j1264O1222k5259j88791p921p2791J9902
4204H96245N9842p1316Q5823J5531k35138J47371N4379l29201J48965Q6354O1501
4193I20356J03015j36428J10611j83307L1357J4833r9503P4948L2452j30513J54832
4182H92653k4556j13139J18311n461j0336j02883Q0288P107k20644R1913P8501
$$ plain form
4171 791754 782595 782093 742450 911425 873727 842687 879633 730263 613844 790368 894027
4160 894027 968224 875274 619237 442025 624160 640445 818235 850963 739026 689152 817669
4149 817669 845000 911881 862174 959965 886701 811336 729603 909134 950426 949103 1004280 935778
4137 935778 983301 898885 997901 971612 1016196 1142332 1065589 1001177 967560 967323 1024389 974003
4125 974003 1062231 1231929 1300278 1257280 1245870 1131144 1042472 1002629 1022187 969822 976235
4114 976235 987769 1053508 1182895 1302215 1146083 1031058 927580 850765 1122248 1242415
4104 1242415 1208295 1059340 1026648 1086126 1179810 1192066 1234605 1055942 1130057 1093858 916311
4093 916311 1110656 1190149 1018346 1203387 1131197 1185801 1195746 1256164 1264090 1264473 1266927 1179553
$$ packed form
4171G91754r159n02l9643J68975l7698l1040L6946j49370j16419J76524J03659
4160H94027P4197r2950k56037j77212J82135J6285J77790L2728j11937m9874J28517
4149H17669K7331O6881m9707R7791p3264p5365q1733J79531M1292j323N5177o8502
4137I35778M7523q4416R9016k6289M4584J26136p6743o4412l3617k37N7066n0386
4125I74003Q8228J69698O8349m2998j1410j14726q8672l9843J9558n2365O413
4114I76235J1534O5739J29387J19320j56132j15025j03478p6815K71483J20167
4104A242415l4120j48955l2692N9478R3684J2256M2539j78663P4115l6199j77547
4093I16311J94345P9493j71803J85041p2190N4604R945O0418P926L83K454q7374
$$ plain form
4081 1179553 1222109 1048606 1065296 1171957 1123173 1173797 1300020 1266471 1233102 1036234 1058881
4070 1058881 1187184 1335511 1177766 1297683 1485666 1368973 1410865 1425811 1447438 1689598
4060 1689598 1765355 1799929 1832222 1741391 1871688 2015369 2084969 2137178 2331976 2422074 2279252
4049 2279252 2190373 2121133 1981651 1738973 1849835 1862259 1883435 1753244 1795213 1705339 1682267
4038 1682267 1809309 1670681 1566265 1662049 1669267 1726247 1672631 1734039 1794591 1884839 1897169
4027 1897169 1873425 2102717 2165437 2085943 2021736 2068740 2070836 1981062 1955246 1949579 1884530 1944509
4015 1944509 2032450 2154801 2088130 2160036 2393206 2326257 2267132 2445356 2375102 2147643 2079902
4004 2079902 1967890 1764361 1837697 1898681 1762653 1670318 1705465 1756719 1811624 1910378 2012831
$$ packed form
4081A179553M2556j73503J6690J06661m8784N0624J26223l3549l3369j96868K2647
4070A058881J28303J48327j57745J19917J87983j16693M1892J4946K1627K42160
4060A689598P5757L4574L2293r0831J30297J43681O9600N2209J94798R0098j42822
4049B279252q8879o9240j39482k42678J10862J2424K1176j30191M1969q9874k3072
4038A682267J27042j38628j04416R5784P218N6980n3616O1408O0552R0248J2330
4027A897169k3744K29292O2720p9494o4207M7004K096q9774k5816n667o5049N9979
4015A944509Q7941J22351o6671P1906K33170o6949n9125J78224p0254k27459o7741
4004B079902j12012k03529P3336O0984j36028r2335L5147N1254N4905R8754J02453
$$ plain form
3993 2012831 1981494 1923661 1877203 1778538 1794545 1871143 2032113 2016258 1932893 1933572 1934774 2017564
3981 2017564 2087483 2060473 2210326 2074952 2000045 2162538 2248910 2166728 2019781 2143637
3971 2143637 2267799 2178832 2359245 2304841 2334503 2471923 2448844 2477527 2388968 2230300 2278850
3960 2278850 2379111 2423377 2467763 2278023 2322337 2274679 2298799 2403090 2552327 2500768 2480595
3949 2480595 2446199 2451623 2575452 2697405 2866627 2859787 2893759 2875773 2856062 2945746 2939359
3938 2939359 3049080 3139091 3198738 2984263 3116810 3146111 3189520 3263014 3372984 3345406 3325849
3927 3325849 3514620 3618778 3668048 3731894 3750425 3654759 3901371 3942074 3903787 3888608 3881633
3916 3881633 3904901 3986224 4051745 4015127 3961016 4022815 4016609 4106831 4332031 4313956 4234979
$$ packed form
3993B012831l1337n7833m6458r8665J6007P6598J60970j5855q3365O79J202Q2790
3981B017564O9919k7010J49853j35374p4907J62493Q6372q2182j46947J23856
3971B143637J24162q8967J80413n4404K9662J37420k3079K8683q8559j58668M8550
3960B278850J00261M4266M4386j89740M4314m7658K4120J04291J49237n1559k0173
3949B480595l4396N424J23829J21953J69222o840L3972j7986j9711Q9684o387
3938B939359J09721R0011N9647k14475J32547K9301M3409P3494J09970k7578j9557
3927C325849J88771J04158M9270O3846J8531r5666K46612M0703l8287j5179o975
3916C881633K3268Q1323O5521l6618n4111O1799o206R0222K25200j8075p8977
$$ plain form
3905 4234979 4223271 4358814 4548404 4535647 4482079 4480675 4537948 4588366 4605788 4650281 4655231
3894 4655231 4700317 4658932 4896034 4935954 4913381 4871961 4822553 4947003 4838393 4862233 4968259
3883 4968259 5111859 5235467 5288464 5304286 5206730 5207359 5262268 5384350 5480319 5559998 5652351
3872 5652351 5534154 5579736 5646434 5437279 5327777 5341366 5325140 5428359 5449547 5434882 5256652
3861 5256652 5292079 5457392 5418238 5462032 5611750 5751445 5774799 5618799 5813115 5926247
3851 5926247 5934862 6058442 6147711 6148598 6385559 6663973 6549277 6789236 6878547 6845776 6988925
3840 6988925 7138782 7237848 7387980 7610979 7837414 7982286 8058687 8080074 8120020 8197720
3830 8197720 8514573 8639635 8735212 9092933 9513878 9734308 9819291 10058740 10183931 10391034
$$ packed form
3905D234979j1708J35543J89590j2757n3568j404N7273N0418J7422M4493M950
3894D655231M5086m1385K37102L9920k2573m1420m9408J24450j08610K3840J06026
3883D968259J43600J23608N2997J5822r7556O29N4909J22082R5969P9679R2353
3872E652351j18197M5582O6698k09155j09502J3589j6226J03219K1188j4665j78230
3861E256652L5427J65313l9154M3794J49718J39695K3354j56000J94316J13132
3851E926247Q615J23580Q9269Q87K36961K78414j14696K39959Q9311l2771J43149
3840F988925J49857R9066J50132K22999K26435J44872P6401K1387L9946P7700
3830H197720L16853J25062R5577L57721M20945K20430Q4983K39449J25191K07103
$$ plain form
3820 10391034 10677182 11003647 11382750 11528379 11789169 12271746 12559336 12754328 13125778
3811 13125778 13454366 14000131 14607260 14990514 15587375 16090813 16543629 16967609 17348493
3802 17348493 17595772 17761789 18003288 18574754 18988032 19565459 20024484 20729636 21510888
3793 21510888 22243151 23057238 24127657 24885882 25735229 26844850 27820249 28873591 30043905
3784 30043905 31171891 32562954 34089081 35741726 37449439 38994620 40811161 42887888
3776 42887888 45315050 48065496 50900744 53927487 57089692 60001068 62713041 64786291
3768 64786291 65836961 65607653 64711527 63243082 61863386 60707051 59719411 59003151 58765414
3759 58765414 59013332 59338829 59873810 61025246 62741135 64723124 66949826 69606637 72360048
$$ packed form
3820A0391034K86148L26465L79103J45629K60790M82577K87590J94992L71450
3811A3125778L28588N45765O07129L83254N96861N03438M52816M23980L80884
3802A7348493K47279J66017K41499N71466M13278N77427M59025P05152P81252
3793B1510888P32263Q14087J070419P58225Q49347J109621R75399J053342J170314
3784C0043905J127986J391063J526127J652645J707713J545181J816541K076727
3776D2887888K427162K750446K835248L026743L162205K911376K711973K073250
3768F4786291J050670k29308q96126j468445j379696j156335r87640p16260k37737
3759E8765414K47918L25497N34981J151436J715889J981989K226702K656811K753411
$$ plain form
3750 72360048 75290683 78351081 81665466 85050033 88752287 92531521 96905081 101399253
3742 101399253 105978399 110975789 116226465 121145678 125792062 130153361 133999096 136503069
3734 136503069 137053838 135990380 133271801 129967501 126808371 124360382 122609183 121522206
3726 121522206 121081933 120931413 120743202 120619485 120416047 120323604 120273504 120414582 120673286 121264246
3716 121264246 122342120 123659761 124694954 125677830 126405428 126570636 125834524 124115808 121705432
3707 121705432 118671900 115485735 112197980 109325090 106973939 105082123 103247690 101435716
3699 101435716 99471288 97498491 96023301 95160148 94670542 94107913 93021145 90697483
3691 90697483 86705494 81227244 75411969 69981410 65077246 60964910 57769256 54991662
$$ packed form
3750G2360048K930635L060398L314385L384567L702254L779234M373560M494172
3742A01399253M579146M997390N250676M919213M646384M361299L845735K503973
3734A36503069N50769j063458k718579l304300l159130k447989j751199j086977
3726A21522206m40273j50520j88211j23717k03438r2443n0100J41078K58704N90960
3716A21264246J077874J317641J035193R82876P27598J65208p36112j718716k410376
3707A21705432l033532l186165l287755k872890k351151j891816j834433j811974
3699A01435716j964428j972797j475190q63153m89606n62629j086768k323662
3691I0697483l991989n478250n815275n430559m904164m112336l195654k777594
$$ plain form
3683 54991662 52638285 50505830 48882361 47689591 46476875 45279227 44370697 43460570
3675 43460570 42672070 42150502 41740911 41362213 40942720 40522505 39782513 38897830 37932261
3666 37932261 36798169 35588486 34414721 33022805 31740504 30898773 29803599 28971892
3658 28971892 28380579 27804396 27321293 26662611 26416496 26180797 25758571 25185715 24563790
3649 24563790 23854691 23231368 22569147 21945173 21228836 20754507 20564229 20213422 20050706
3640 20050706 19953631 19751454 19595638 19281258 18884140 18497856 18057391 17589995 16972580 16592439
3630 16592439 16432059 16000418 15385942 14943683 14529344 14088715 13827667 13613391 13190947
3621 13190947 12878732 12561927 12333403 12104927 11840431 11712554 11518413 11279845 11005853
$$ packed form
3683E4991662k353377k132455j623469j192770j212716j197648r08530r10127
3675D3460570p88500n21568m09591l78698m19493m20215p39992q84683r65569
3666C7932261j134092j209683j173765j391916j282301q41731j095174q31707
3658B8971892n91313n76183m83103o58682k46115k35699m22226n72856o21925
3649B4563790p09099o23323o62221o23974p16337m74329j90278l50807j62716
3640B0050706r7075k02177j55816l14380l97118l86284m40465m67396o17415l80141
3630A6592439j60380m31641o14476m42259m14339m40629k61048k14276m22444
3621A3190947l12215l16805k28524k28476k64496j27877j94141k38568k73992
$$ plain form
3612 11005853 10759898 10637959 10532336 10431762 10465796 10269238 9995495 9757667 9681769 9724706
3602 9724706 9765196 9688208 9660740 9545647 9464018 9300114 9308896 9336429 9215519 9191184 9185355
3591 9185355 9169144 9137308 9022607 9074119 9061822 8994895 9063407 9147260 9446899 9640589 9722788
3580 9722788 9571236 9641820 9608309 9804789 9940997 9998154 9965914 9882121 9715329 9825043
3570 9825043 9747043 9754464 9797023 9866857 9753459 9623161 9680896 9819635 9855647 9748455 9694680
3559 9694680 9696218 9794186 9807262 10081316 10171196 10253417 10227761 10260606 10378255 10454738 10343451
3548 10343451 10328637 10352227 10349098 10381439 10447425 10455049 10422453 10341352 10522608 10677380 10621036
3537 10621036 10783555 10803870 10722490 10854366 10795414 10955572 10981536 11085606 11188987 11070565
$$ packed form
3612A1005853k45955j21939j05623j00574L4034j96558k73743k37828p5898M2937
3602I724706M0490p6988k7468j15093q1629j63904Q782K7533j20910k4335n829
3591I185355j6211l1836j14701N1512j2297o6927O8512Q3853K99639J93690Q2199
3580I722788j51552P0584l3511J96480J36208N7157l2240q3793j66792J09714
3570I825043p8000P421M2559O9834j13398j30298N7735J38739L6012j07192n3775
3559I694680J538R7968J3076K74054Q9880Q2221k5656L2845J17649P6483j11287
3548A0343451j4814K3590l129L2341O5986P624l2596q1101J81256J54772n6344
3537A0621036J62519K0315q1380J31876n8952J60158K5964J04070J03381j18422
$$ plain form
3527 11070565 11177746 11163799 11162149 11286691 11384958 11377952 11242241 11195154 11283670 11596985 11577350
3516 11577350 11636642 11783009 11914535 11987268 12087882 12279300 12429704 12693440 12841824 13096121
3506 13096121 13230299 13347147 13504662 13741463 14230029 14684024 14975729 15076155 14778861
3497 14778861 14588089 14254977 14184304 14147359 14174988 14308512 14323822 14326899 14330824 14553967 14817091
3486 14817091 14972621 15138904 15456923 15720633 15804806 16203447 16529737 16812828 17305893 17702616
3476 17702616 17899083 18261775 18642287 18897493 19146390 19463420 19783556 20345204 20999982
3467 20999982 21315809 21883441 22510023 23033012 23716829 24540905 25280884 26103367 26999795
3458 26999795 27912762 28791132 29765895 30820358 31909427 33365963 34990259 36520691 38225347
$$ packed form
3527A1070565J07181j3947j650J24542R8267p006j35711m7087Q8516L13315j9635
3516A1577350N9292J46367J31526P2733J00614J91418J50404K63736J48384K54297
3506A3096121J34178J16848J57515K36801M88566M53995K91705J00426k97294
3497A4778861j90772l33112p0673l6945K7629J33524J5310L077L925K23143K63124
3486A4817091J55530J66283L18019K63710Q4173L98641L26290K83091M93065L96723
3476A7702616J96467L62692L80512K55206K48897L17030L20136N61648O54778
3467B0999982L15827N67632O26582N22989O83817Q24076P39979Q22483Q96428
3458B6999795R12967Q78370R74763J054463J089069J456536J624296J530432J704656
$$ plain form
3449 38225347 39956710 41999999 44411766 47225170 50255646 53897741 57971398 62330570
3441 62330570 66975229 72190109 77879008 84410297 91839525 100740462 111557971 124339379
3433 124339379 139470944 156697341 175008616 192980703 208766909 218477083 216806431
3426 216806431 201192505 177653472 154331190 134891193 119347257 107017794 96923902
3419 96923902 88674525 81851429 76397530 71933724 68116680 64777717 61540526 58669434
3411 58669434 56215197 53909096 52028301 50598975 49302829 47556766 45265993 42641470
3403 42641470 39913179 37727002 35702002 34032446 32626616 31342736 30003102 28465446
3395 28465446 27182450 26161629 25084156 23952297 23083382 22175609 21219773 20478514 19738771
$$ packed form
3449C8225347J731363K043289K411767K813404L030476L642095M073657M359172
3441F2330570M644659N214880N688899O531289P429228Q900937J0817509J2781408
3433A24339379J5131565J7226397J8311275J7972087J5786206R710174j670652
3426B16806431j5613926k3539033k3322282j9439997j5543936j2329463j0093892
3419I6923902q249377o823096n453899m463806l817044l338963l237191k871092
3411E8669434k454237k306101j880795j429326j296146j746063k290773k624523
3403D2641470k728291k186177k025000j669556j405830j283880j339634j537656
3395B8465446j282996j020821j077473j131859q68915r07773r55836p41259p39743
$$ plain form
3386 19738771 19052323 18445653 18094728 17815227 17321848 16792305 16424749 15922594 15431702
3377 15431702 15133841 14842110 14589494 14131575 13817356 13459389 12994003 12739046 12525827
3368 12525827 12278100 12202411 12020576 11729144 11630333 11472275 11434002 11153917 11102055 10997849
3358 10997849 10716988 10732829 10677063 10671110 10594144 10346502 10311586 10282801 10110360 10073378 10042191
3347 10042191 10001599 9877633 9718877 9548667 9332698 9271859 9410123 9177367 9193080 9114990
3337 9114990 9057435 9085281 8877662 8606101 8493137 8406676 8343312 8192051 8172364 8216831 8185683
3326 8185683 8210363 8165037 8193525 8338347 8497203 8619358 8799789 8831445 8897224 9073842
3316 9073842 9204350 9158488 9288384 9468396 9574899 9856804 10122227 10500578 10903606 11149617
$$ packed form
3386A9738771o86448o06670l50925k79501m93379n29543l67556n02155m90892
3377A5431702k97861k91731k52616m57919l14219l57967m65386k54957k13219
3368A2525827k47727p5689j81835k91432r8811j58058l8273k80085n1862j04206
3358A0997849k80861J5841n5766n953p6966k47642l4916k8785j72441l6982l1187
3347A0042191m0592j23966j58756j70210k15969o0839J38264k32756J5713p8090
3337I114990n7555K7846k07619k71561j12964q6461o3364j51261j9687M4467l1148
3326H185683K4680m5326K8488J44822J58856J22155J80431L1656O5779J76618
3316I073842J30508m5862J29896J80012J06503K81905K65423L78351M03028K46011
$$ plain form
3306 11149617 11541946 12243685 12912715 13459209 14123988 14743289 15390618 15744830 15904837
3297 15904837 16100073 16357660 16662157 16928599 17054932 17001297 16712329 15861408 15148487 14300510
3287 14300510 13813426 13604559 13579551 13412652 13036407 13011477 12917805 12933196 13143936 13341213
3277 13341213 13426353 13764617 14090820 14410858 14580782 14301158 13044740 11786158 10868464
3268 10868464 10196644 9784382 9313295 9039373 8969157 8816171 8652679 8541117 8543861 8267884
3258 8267884 8095273 7850211 7695950 7356435 7067200 6951894 6752451 6501551 6267396 6196949
3248 6196949 6222757 6026499 5877507 5671669 5613183 5572107 5396333 5388928 5382238 5494447 5515317
3237 5515317 5625087 5446517 5125632 5111489 5108614 4897931 4852422 4753661 4513921 4370818
$$ packed form
3306A1149617L92329P01739O69030N46494O64779O19301O47329L54212J60007
3297A5904837J95236K57587L04497K66442J26333n3635k88968q50921p12921q47977
3287A4300510m87084k08867k5008j66899l76245k4930r3672J5391K10740J97277
3277A3341213Q5140L38264L26203L20038J69924k79624j256418j258582r17694
3268A0868464o71820m12262m71087k73922p0216j52986j63492j11562K744k75977
3258H267884j72611k45062j54261l39515k89235j15306j99443k50900k34155p0447
3248F196949K5808j96258j48992k05838n8486m1076j75774p405o690J12209K0870
3237E515317J09770j78570l20885j4143k875k10683m5509r8761k39740j43103
$$ plain form
3227 4370818 4490500 4563144 4480931 4433747 4404283 4375218 4386036 4361723 4428218 4443720 4360455
3216 4360455 4231647 4149778 4086829 3976324 3903946 3837962 3895586 3999649 3855391 3626665
3206 3626665 3552260 3578299 3514963 3407004 3337076 3323463 3322370 3328561 3300975 3198177 3244484
3195 3244484 3345591 3270379 3339240 3275058 3253387 3225070 3243498 3264138 3194089 3168601 3032773
3184 3032773 2979632 2999097 3033481 3170318 3231145 3247535 3077630 3001273 3113861 3067618 3043795
3173 3043795 3022844 3018638 2986015 2860763 2881941 2929946 2991018 2938477 2854833 2811040 2791029
3162 2791029 2814370 2914157 2823200 2706733 2632827 2736460 2775880 2771678 2739511 2878762 2912070
3151 2912070 2914640 2965651 3032531 3017319 2953581 2915042 2968801 3009560 3057920 3059041 2807582 2721663
$$ packed form
3227D370818J19682P2644q2213m7184k9464k9065J0818k4313O6495J5502q3265
3216D360455j28808q1869o2949j10505p2378o5984N7624J04063j44258k28726
3206C626665p4405K6039o3336j07959o9928j3613j093O191k7586j02798M6307
3195C244484J01107p5212O8861o4182k1671k8317J8428K0640p0049k5488j35828
3184C032773n3141J9465L4384J36837O0827J6390j69905p6357J12588m6243k3823
3173C043795k0951m206l2623j25252K1178M8005O1072n2541q3644m3793k0011
3162B791029K3341R9787r0957j16467p3906J03633L9420m202l2167J39251L3308
3151B912070K570N1011O6880j5212o3738l8539N3759M0759M8360J121k51459q5919
$$ plain form
3139 2721663 2932859 3051835 3022439 3056029 3023413 2970325 3059059 3216556 3102443 3108868 3067138
3128 3067138 3087346 3293813 3380299 3288512 3526288 3577686 3588807 3515398 3679526 3726295 3989433
3117 3989433 3992341 3830453 3768187 3698579 3638232 3683558 3851902 3954596 4109834 4143532 4180244
3106 4180244 4209294 4350493 4330634 4438940 4396883 4334064 4335153 4126321 3942266 3890032 3947528
3095 3947528 4027506 4093389 4143333 4095929 4032039 4180856 4155656 4070658 4051585 3981010 4059107
3084 4059107 4197692 4192664 4180270 4214450 4393837 4260111 4229267 4237472 4363413 4335178 4380122
3073 4380122 4471387 4470376 4686102 4566649 4746206 4792600 4834205 5103596 5191744 5180409 5287827
3062 5287827 5440011 5533762 5625537 5687785 5861811 5968029 6131604 6337894 6395074 6480034
$$ packed form
3139B721663K11196J18976k9396L3590l2616n3088Q8734J57497j14113O425m1730
3128C067138K0208K06467Q6486r1787K37776N1398J1121p3409J64128M6769K63138
3117C989433K908j61888o2266o9608o0347M5326J68344J02694J55238L3698L6712
3106D180244K9050J41199j9859J08306m2057o2819J089k08832j84055n2234N7496
3095C947528P9978O5883M9944m7404o3890J48817k5200q4998j9073p0575P8097
3084D059107J38585n028j2394L4180J79387j33726l0844Q205J25941k8235M4944
3073D380122R1265j011K15726j19453J79557M6394M1605K69391Q8148j1335J07418
3062E287827J52184R3751R1775O2248J74026J06218J63575K06290N7180Q4960
$$ plain form
3052 6480034 6587663 7005291 7113226 7210629 7296421 7578635 7835507 8088613 8293514 8489153
3042 8489153 8776057 9012253 9259062 9557655 9931805 10331391 10953928 11267751 11870906 12489258
3032 12489258 12974252 13690470 14376539 14991746 15355931 15763786 16161204 16663011 17366457
3023 17366457 17796851 18429266 19393982 20199641 21194622 22438184 23768258 25008650 26107971
3014 26107971 27052192 27760459 28289385 28754192 29150728 29457009 29855879 30458365 31132721
3005 31132721 31776513 32757285 34051282 35608930 37110149 38708584 39938779 40804529 41384223
2996 41384223 41441826 41276976 40979519 40478232 39874218 39511143 39300384 39350832 39779526 40379864
2986 40379864 41194742 42265273 43140198 43710737 44009779 43963391 43348678 42415179 41137906
$$ packed form
3052F480034J07629M17628J07935R7403Q5792K82214K56872K53106K04901J95639
3042H489153K86904K36196K46809K98593L74150L99586O22537L13823O03155O18352
3032A2489258M84994P16218O86069O15207L64185M07855L97418N01807P03446
3023A7366457M30394O32415R64716Q05659R94981J243562J330074J240392J099321
3014B6107971R44221P08267N28926M64807L96536L06281L98870O02486O74356
3005C1132721O43792R80772J293997J557648J501219J598435J230195Q65750N79694
2996D1384223N7603j64850k97457n01287o04014l63075k10759N0448M28694O00338
2986D0379864Q14878J070531Q74925N70539K99042m6388o14713r33499j277273
$$ plain form
2977 41137906 39737555 38283940 36929650 35704030 34937362 34349269 33918639 33985824 34061074
2968 34061074 34033139 33841945 33469463 32888333 31875531 30594930 29133030 27423355 25989016
2959 25989016 24401980 23178231 22213520 21248717 20684801 20299775 19848835 19345754 18951819
2950 18951819 18566193 18110619 17423164 16573773 15593865 14821908 14006457 13220997 12498768
2941 12498768 11923037 11452781 10951691 10618987 10353148 10114045 9841463 9426921 9109793
2932 9109793 8587578 8413344 8397332 8108815 7820366 7581014 7331829 7010931 6794460 6740183
2922 6740183 6536977 6529352 6662258 6336998 6160605 6037947 6046798 5935384 5893097 5788200
2912 5788200 5479686 5520813 5782722 5723597 5596528 5580628 5576051 5416336 5432865 5233737 5104756
$$ packed form
2977D1137906j400351j453615j354290j225620p66668n88093m30630O7185P5250
2968C4061074k7935j91194l72482n81130j012802j280601j461900j709675j434339
2959B5989016j587036j223749r64711r64803n63916l85026m50940n03081l93935
2950A8951819l85626m55574o87455q49391r79908p71957q15451p85460p22229
2941A2498768n75731m70256n01090l32704k65839k39103k72582m14542l17128
2932I109793n22215j74234j6012k88517k88449k39352k49185l20898k16471n4277
2922F740183k03206p625J32906l25260j76393j22658Q851j11414m2287j04897
2912E788200l08514M1127K61909n9125j27069j5900m577j59715J6529j99128j28981
$$ plain form
2901 5104756 5208891 5226247 5117139 4938568 4863152 4872903 4758502 4680584 4661102 4559135 4642808
2890 4642808 4474951 4428434 4301555 4394939 4499764 4283537 4182989 4148104 4195207 4405570
2880 4405570 4331203 4101010 4146739 4260832 4228888 4239117 4081239 3788815 3791074 3785793 3779739
2869 3779739 3826180 3813345 3726475 3755241 3545114 3500738 3384436 3294443 3179091 3099958 3043061
2858 3043061 2963400 2796455 2663975 2656358 2702109 2679925 2487418 2370148 2264911 2291222 2210649
2847 2210649 2336036 2451857 2590116 2416072 2233716 2393396 2338536 2453330 2363562 2518270
2837 2518270 2541938 2393650 2230654 2079203 2228883 2257462 2072445 1986798 2136309 2198124
2827 2198124 2220498 2175190 2049600 1940288 1944729 2088855 2182045 2161313 2156574 1927100 1788968
$$ packed form
2901E104756J04135J7356j09108j78571p5416R751j14401p7918j9482j01967Q3673
2890D642808j67857m6517j26879R3384J04825k16227j00548l4885M7103K10363
2880D405570p4367k30193M5729J14093l1944J0229j57878k92424K259n281o054
2869C779739M6441j2835q6870K8766k10127m4376j16302q9993j15352p9133n6897
2858C043061p9661j66945j32480p617M5751k2184j92507j17270j05237K6311q0573
2847B210649J25387J15821J38259j74044j82356J59680n4860J14794q9768J54708
2837B518270K3668j48288j62996j51451J49680K8579j85017q5647J49511O1815
2827B198124K2374m5308j25590j09312M441J44126R3190k0732m739k29474j38132
$$ plain form
2816 1788968 1755887 1786704 1761310 1822012 1816030 1866336 1894844 2010035 2046068 1908661 1783311
2805 1783311 1820082 1677180 1771068 1982463 1879462 1718682 1633526 1679242 1545844 1474938
2795 1474938 1687138 1806039 1707705 1595905 1708892 1723631 1614416 1750192 1891192 1810861
2785 1810861 1661792 1787995 1824987 1706159 1785184 1891267 1859001 1652158 1544492 1705100
2775 1705100 1958329 1913077 1976888 1900455 1906671 1965246 1825617 1787825 1755156 1692942 1596696
2764 1596696 1560928 1587137 1665206 1548542 1618817 1757908 1809737 1799323 1642208 1401247 1553173
2753 1553173 1688731 1668238 1573080 1666885 1783435 1782726 1860472 1774516 1664205 1656960 1736743
2742 1736743 1890094 1887925 1793163 1853037 2062196 2053445 2101722 2171045 2088186 2213051 2221215
$$ packed form
2816A788968l3081L0817k5394O0702n982N0306K8508J15191L6033j37407j25350
2805A783311L6771j42902R3888K11395j03001j60780q5156M5716j33398p0906
2795A474938K12200J18901r8334j11800J12987J4739j09215J35776J41000q0331
2785A810861j49069J26203L6992j18828P9025J06083l2266k06843j07666J60608
2775A705100K53229m5252O3811p6433O216N8575j39629l7792l2669o2214r6246
2764A596696l5768K6209P8069j16664P0275J39091N1829j0414j57115k40961J51926
2753A553173J35558k0493r5158R3805J16550p09P7746q5956j10311p245P9783
2742A736743J53351k169r4762N9874K09159q751M8277O9323q2859J24865Q164
$$ plain form
2731 2221215 2304212 2352951 2263656 2379794 2433272 2712444 2936697 3025814 3129585 3316055
2721 3316055 3404847 3712109 3962626 3997042 4237648 4423833 4404018 4638843 4806248 4726526
2711 4726526 4826194 4882332 4976678 4817498 4665376 4612923 4541376 4464258 4563485 4658024 4495268
2700 4495268 4473514 4578606 4478598 4495939 4379375 4132290 3737459 3636213 3429866 3193907
2690 3193907 3180397 2971837 2842670 2842873 2914662 2768952 2605430 2476140 2450052 2345450 2387910
2679 2387910 2342219 2298275 2431156 2419865 2349161 2315526 2401525 2452315 2338328 2252113 2350559
2668 2350559 2199706 2233961 2283560 2210636 2224485 2352076 2412648 2390763 2333389 2356802 2429845
2657 2429845 2364881 2363639 2325096 2194301 2222397 2218919 2268810 2318095 2305599 2518375 2601519
$$ packed form
2731B221215Q2997M8739q9295J16138N3478K79172K24253Q9117J03771J86470
2721C316055Q8792L07262K50517L4416K40606J86185j9815K34825J67405p9722
2711D726526R9668N6138R4346j59180j52122n2453p1547p7118R9227R4539j62756
2700D495268k1754J05092j00008J7341j16564k47085l94831j01246k06347k35959
2690C193907j3510k08560j29167K03P1789j45710j63522j29290k6088j04602M2460
2679B387910m5691m3944J32881j1291p0704l3635Q5999N0790j13987q6215R8446
2668B350559j50853L4255M9599p2924J3849J27591O0572k1885n7374K3413P3043
2657B429845o4964j242l8543j30795K8096l478M9891M9285j2496K12776Q3144
$$ plain form
2646 2601519 2428231 2354248 2319304 2166616 2424268 2512361 2496985 2493847 2540558 2623101 2637802
2635 2637802 2717886 2727681 2607956 2581525 2573951 2468255 2553519 2650486 2561363 2497986 2531249
2624 2531249 2658501 2606996 2679130 2609792 2522341 2723864 2858917 2796474 2687835 2834332
2614 2834332 2865335 2657653 2703874 2792997 2816885 2907068 2821031 2901448 2989884 3005630 3244153
2603 3244153 3180544 3235277 3337167 3407618 3417544 3332032 3305818 3392265 3439369 3428359 3331664
2592 3331664 3220764 3406980 3544361 3656535 3652630 3827685 3851624 3992027 3726767 3710684
2582 3710684 3818118 3821947 3998332 3978285 3816543 3763766 3641503 3453988 3602158 3703118
2572 3703118 3632777 3465892 3506681 3602421 3670924 3577107 3558240 3690746 3544254 3595748 3640411
$$ packed form
2646B601519j73288p3983l4944j52688K57652Q8093j5376l138M6711Q2543J4701
2635B637802Q0084R795j19725k6431p574j05696Q5264R6967q9123o3377L3263
2624B531249J27252n1505P2134o9338q7451K01523J35053o2443j08639J46497
2614B834332L1003k07682M6221Q9123K3888R0183q6037Q0417Q8436J5746K38523
2603C244153o3609N4733J01890P0451R926q5512k6214Q6447M7104j1010r6695
2592C331664j10900J86216J37381J12174l905J75055K3939J40403k65260j6083
2582C710684J07434L829J76385k0047j61742n2777j22263j87515J48170J00960
2572C703118p0341j66885M0789R5740O8503r3817j8867J32506j46492N1494M4663
$$ plain form
2561 3640411 3462904 3425027 3527726 3628743 3776174 3870765 3805494 3773457 3834532 3953889
2551 3953889 3914095 3898975 3837129 3919742 4180173 4078959 3969097 3972113 4133659 4412749 4453799
2540 4453799 4563444 4615800 4815626 5060769 5225982 5447794 5388383 5493946 5771813 5890666
2530 5890666 6075948 6250329 6215678 6246764 6293072 6416135 6533885 6581008 6688902 7016410
2520 7016410 7152519 7087915 7225915 7358569 7473733 7480076 7410273 7373962 7217021 7239475 7322878
2509 7322878 7194480 7126710 7070817 7147831 7104762 7132568 7195373 7418419 7430610 7291796 7276995
2498 7276995 7196552 7102324 7163172 7162508 7008412 6980146 6865501 7026034 7122734 6875160 6722948
2487 6722948 6672145 6754377 6799008 6831904 7016907 6899821 6835097 6997443 7071225 7037557 6943443
$$ packed form
2561C640411j77507l7877J02699J01017J47431R4591o5271l2037O1075J19357
2551C953889l9794j5120o1846Q2613K60431j01214j09862L016J61546K79090M1050
2540D453799J09645N2356J99826K45143J65213K21812n9411J05563K77867J18853
2530E890666J85282J74381l4651L1086M6308J23063J17750M7123J07894L27508
2520G016410J36109o4604J38000J32654J15164O343o9803l6311j56941K2454Q3403
2509G322878j28398o7770n5893P7014m3069K7806O2805K23046J2191j38814j4801
2498G276995q0443r4228O0848o64j54096k8266j14645J60533R6700k47574j52212
2487F722948n0803Q2232M4631L2896J85003j17086o4724J62346P3782l3668r4114
$$ plain form
2476 6943443 6962422 7105325 7107230 7017943 7027997 6969139 6908540 6969565 6998186 7027707 6969969
2465 6969969 7082557 7086925 7118865 7087331 6915202 7182831 7250096 7144489 7298800 7407708
2455 7407708 7184786 7288690 7480978 7501922 7604215 7654730 7515726 7560039 7740507 7743338
2445 7743338 7692019 7727522 7769686 7752192 7918238 8082934 8192670 8270938 8381795 8374069 8432315
2434 8432315 8516486 8644438 8745322 8706202 8874700 8899036 9053306 9240335 9318227 9361714
2424 9361714 9463673 9616222 9812028 9794842 9850709 10064672 10254618 10168885 10257605 10457893
2414 10457893 10654026 10656385 10673387 10763711 10891202 11131371 11346590 11578841 11608478 11623341
2404 11623341 11850924 12006152 12296103 12528383 12555696 12794575 13025412 13218764 13505277 13666845
$$ packed form
2476F943443J8979J42903J905q9287J0054n8858o0599O1025K8621K9521n7738
2465F969969J12588M368L1940l1534j72129K67629O7265j05607J54311J08908
2455G407708k22922J03904J92288K0944J02293N0515j39004M4313J80468K831
2445G743338n1319L5503M2164j7494J66046J64696J09736P8268J10857p726N8246
2434H432315Q4171J27952J00884l9120J68498K4336J54270J87029P7892M3487
2424I361714J01959J52549J95806j7186N5867K13963J89946q5733Q8720K00288
2414A0457893J96133K359J7002R0324J27491K40169K15219K32251K9637J4863
2404A1623341K27583J55228K89951K32280K7313K38879K30837J93352K86513J61568
$$ plain form
2394 13666845 13576272 13730732 13936907 14219562 14308561 14716522 14786594 14971861 15361919 15679465
2384 15679465 15673710 15791146 16051095 16333254 16589818 16779247 16986892 17284822 17485108 17768818
2374 17768818 18102595 18324369 18588345 18844183 19292974 19554451 19873571 20231004 20592729
2365 20592729 21117039 21584460 22058937 22607214 23272419 23937555 24463331 25136300 26029748
2356 26029748 27038640 27959026 28862382 29880481 31139803 32607231 34109889 35767445
2348 35767445 37956503 40277490 42772168 45655957 48699879 52074580 55702757 59452894
2340 59452894 63148401 66508691 69501686 72021200 74045319 75347532 76227796 76344327
2332 76344327 76222603 75947916 75722917 75552038 75742403 76418983 77202740 78190667 79573945
$$ packed form
2394A3666845r0573J54460K06175K82655Q8999M07961P0072J85267L90058L17546
2384A5679465n755J17436K59949K82159K56564J89429K07645K97930K00286K83710
2374A7768818L33777K21774K63976K55838M48791K61477L19120L57433L61725
2365B0592729N24310M67421M74477N48277O65205O65136N25776O72969Q93448
2356B6029748J008892R20386R03356J018099J259322J467428J502658J657556
2348C5767445K189058K320987K494678K883789L043922L374701L628177L750137
2340E9452894L695507L360290K992995K519514K024119J302213Q80264J16531
2332G6344327j21724k74687k24999j70879J90365O76580P83757R87927J383278
$$ plain form
2323 79573945 80876313 81792067 82401997 82360025 82079079 81389841 80433421 79115479 77437306
2314 77437306 75801009 74687289 74071669 73725637 73812497 74659319 76095485 78118996 80668506
2305 80668506 83430462 86573234 89661431 92291196 94684683 96458267 97403541 97744668
2297 97744668 97917875 97418381 96410796 95499740 94624546 94109156 93920827 93969004 94110038
2288 94110038 94566791 94998022 94971520 94793346 94028090 92693888 90947257 88583056 85714444
2279 85714444 82386265 78834366 75197342 71850594 68637419 65677939 62920200 60571944
2271 60571944 58880621 57214686 55768066 54563235 53481696 52640097 51754474 51109117 50517159
2262 50517159 50094730 49650693 49268057 49046648 48741709 48480199 48345447 48165532 48138475 48081719
$$ packed form
2323G9573945J302368R15754O09930m1972k80946o89238r56420j317942j678173
2314G7437306j636297j113720o15620l46032Q6860Q46822J436166K023511K549510
2305H0668506K761956L142772L088197K629765K393487J773584R45274L41127
2297I7744668J73207m99494j007585r11056q75194n15390j88329M8177J41034
2288I4110038M56753M31231k6502j78174p65256j334202j746631k364201k868612
2279H5714444l328179l551899l637024l346748l213175k959480k757739k348256
2271F0571944j691323j665935j446620j204831j081539q41599q85623o45357n91958
2262E0517159m22429m44037l82636k21409l04939k61510j34752j79915k7057n6756
$$ plain form
2252 48081719 48148534 48173219 48153877 48003452 47977577 48120526 47946410 48031776 48033937 48116914 48066735
2241 48066735 48258757 48651183 48993914 49078030 49405255 49659721 49877307 50070521 50389921 50979244
2231 50979244 51393398 51675131 52019045 52552140 52857232 53133496 53770570 54459715 54999685
2222 54999685 55859905 56737320 57533017 58414964 59481796 60500586 61587610 63042055 64606576
2213 64606576 66340876 68287672 70175410 72241583 75002153 77690238 80768123 84331933
2205 84331933 88260120 92628218 97249050 102681062 108793291 115256025 122191896 129671113
2197 129671113 137200361 144636284 151975887 158554228 164364873 169474965 173779870 177320665
2189 177320665 179945904 181998123 183824763 185923535 188351523 191687002 195854558 201333880
$$ packed form
2252D8081719O6815K4685j9342j50425k5875J42949j74116Q5366K161Q2977n0179
2241D8066735J92022L92426L42731Q4116L27225K54466K17586J93214L19400N89323
2231E0979244M14154K81733L43914N33095L05092K76264O37074O89145N39970
2222E4999685Q60220Q77415P95697Q81947J066832J018790J087024J454445J564521
2213F4606576J734300J946796J887738K066173K760570K688085L077885L563810
2205H4331933L928187M368098M620832N432012O112229O462734O935871P479217
2197A29671113P529248P435923P339603O578341N810645N110092M304905L540795
2189A77320665K625239K052219J826640K098772K427988L335479M167556N479322
$$ plain form
2181 201333880 207775815 214674359 222214548 230013335 237665181 245007536 251396444 256346813
2173 256346813 259669463 260759161 259877540 257300916 253351173 248448942 242700070 236602988
2165 236602988 230840234 225947649 222260007 219873962 218998527 218954237 219312420 219741326 219826988
2156 219826988 218999646 217369804 214930895 211473459 207628348 203276618 198960355 194745314
2148 194745314 191214465 188683681 186935699 185750794 184697772 183183557 181413639 179787661
2140 179787661 178333080 177099863 175824304 174406743 172773568 170943110 168843136 166625141
2132 166625141 164220988 161473828 158616873 155938851 153797581 152001617 150324429 148935893
2124 148935893 147664709 146287336 144908161 143665281 142553753 141315188 139661310 137724050
$$ packed form
2181B01333880O441935O898544P540189P798787P651846P342355O388908M950369
2173B56346813L322650J089698q81621k576624l949743m902231n748872o097082
2165B36602988n762754m892585l687642k386045q75435m4290L58183M28906Q5662
2156B19826988q27342j629842k438909l457436l845111m351730m316263m215041
2148A94745314l530849k530784j747982j184905j053022j514215j769918j625978
2140A79787661j454581j233217j275559j417561j633175j830458k099974k217995
2132A66625141k404153k747160k856955k678022k141270j795964j677188j388536
2124A48935893j271184j377373j379175j242880j111528j238565j653878j937260
$$ plain form
2116 137724050 135696056 133218387 130378346 127199830 123843364 120982426 118665661 116927838
2108 116927838 115763971 115360372 115471023 116540400 118218671 120753884 124094658 127901250
2100 127901250 131818616 136019612 139801709 142943237 145835360 148114065 150102018 151812010
2092 151812010 152725055 153041774 152624925 151451990 149960436 148553847 147328089 145905568
2084 145905568 144911741 144117163 143621330 143481625 143575304 143938158 144248626 144581105 144687981
2075 144687981 144469360 143856469 142486044 140725738 138590585 135847747 132596398 128923756
2067 128923756 124811291 120332516 115660310 111127978 106610877 102131031 97806882 93650609
2059 93650609 89544834 85715237 82049207 78468520 75421330 72473505 69854983 67531665
$$ packed form
2116A37724050k027994k477669k840041l178516l356466k860938k316765j737823
2108A16927838j163867m03599J10651J069377J678271K535213L340774L806592
2100A27901250L917366M200996L782097L141528K892123K278705J987953J709992
2092A51812010R13045L16719m16849j172935j491554j406589j225758j422521
2084A45905568r93827p94578m95833j39705R3679L62854L10468L32479J06876
2075A44687981k18621o12891j370425j760306k135153k742838l251349l672642
2067A28923756m112465m478775m672206m532332m517101m479846m324149m156273
2059I3650609m105775l829597l666030l580687l047190k947825k618522k323318
$$ plain form
2051 67531665 65469286 63507236 61861183 60297136 58939967 57838427 56836664 55961979
2043 55961979 55333054 54883287 54475876 54184190 54092027 53949623 53934980 54209832 54759909 55417362
2033 55417362 55936172 56865611 57608272 58579397 59859937 61418853 63083207 65253753 67638583
2024 67638583 70559203 73872676 77373172 81265905 85228977 89281065 93426076 97434101
2016 97434101 101236533 104755485 108400174 112376267 115908787 119294026 122154382 124350176
2008 124350176 126022496 127011700 127504200 127436565 126616040 125232724 123545551 121292135 118552081
1999 118552081 115487820 111991267 108001021 103811057 99521345 95573677 91850212 88352810
1991 88352810 85229800 82036999 78887086 76433766 74715607 73665251 73123251 72992381
$$ packed form
2051F7531665k062379j962050j646053j564047j357169j101540j001763q74685
2043E5961979o28925m49767m07411k91686r2163j42404j4643K74852N50077O57453
2033E5417362N18810R29439P42661R71125J280540J558916J664354K170546K384830
2024F7638583K920620L313473L500496L892733L963072M052088M145011M008025
2016I7434101L802432L518952L644689L976093L532520L385239K860356K195794
2008A24350176J672320R89204M92500o7635q20525j383316j687173k253416k740054
1999A18552081l064261l496553l990246m189964m289712l947668l723465l497402
1991H8352810l123010l192801l149913k453320j718159j050356n42000j30870
$$ plain form
1983 72992381 72888154 73102254 73483576 73739165 73842231 73687990 73181782 72284005 70782722
1974 70782722 68940409 66846580 64248805 61455422 58672317 55800608 53091527 50364418
1966 50364418 47860987 45786411 43854741 42285279 40705385 38781678 36845617 35140326
1958 35140326 33603193 32440411 31543892 30891918 29955986 29249580 28563652 28055403 27455069
1949 27455069 26989838 26592000 26156130 25713586 25333910 24926080 24531381 24059551 23596028
1940 23596028 23175488 22909076 22405110 22005917 21670035 21380406 21239827 20998136 20921000 20927297
1930 20927297 21015441 21023197 21100257 21203778 21275109 21358405 21556589 21934318 22045455 22053481 22139493
1919 22139493 22197365 22131578 21986222 21789209 21605552 21346338 20927613 20556431 20129370 19522484
$$ packed form
1983G2992381j04227K14100L81322K55589J03066j54241n06208q97777j501283
1974G0782722j842313k093829k597775k793383k783105k871709k709081k727109
1966E0364418k503431k074576j931670j569462j579894j923707j936061j705291
1958C5140326j537133j162782q96519o51974r35932p06406o85928n08249o00334
1949B7455069m65231l97838m35870m42544l79676m07830l94699m71830m63523
1940B3596028m20540k66412n03966l99193l35882k89629j40579k41691p7136O297
1930B0927297Q8144P756P7060J03521P1331Q3296J98184L77729J11137Q026Q6012
1919B2139493N7872o5787j45356j97013j83657k59214m18725l71182m27061o06886
$$ plain form
1909 19522484 18941504 18549844 18121304 17847948 17564871 17350373 17120090 17038888 16913197 16642593
1899 16642593 16491925 16222887 16185424 16277766 16168780 16171107 16222472 16284616 16317239 16351316 16296147
1888 16296147 16252565 16129521 16051384 15814741 15682065 15529188 15101119 14996154 15102298 15004633
1878 15004633 14965775 14877805 14864972 15083371 15171793 15194660 15149300 15248787 15381235 15377881 15442500
1867 15442500 15451910 15528094 15527532 15549161 15709443 15986218 15950852 16062511 16338362 16342179 16510898
1856 16510898 16724753 16795047 16815905 16902982 17105249 17590962 17805394 17903149 18174362 18220130
1846 18220130 18365596 18585929 18764940 19001364 19269603 19628560 19854736 20112099 20413747
1837 20413747 20811319 21281140 21710215 22001374 22390294 23017162 23453616 23871306 24381794
$$ packed form
1909A9522484n80980l91660m28540k73356k83077k14498k30283q1202j25691k70604
1899A6642593j50668k69038l7463R2342j08986K327N1365O2144L2623L4077n5169
1888A6296147m3582j23044p8137k36643j32676j52877m28069j04965J06144r7665
1878A5004633l8858q7970j2833K18399Q8422K2867m5360R9487J32448l354O4619
1867A5442500R410P6184n62K1629J60282K76775l5366J11659K75851L817J68719
1856A6510898K13855P0294K0858Q7077K02267M85713K14432R7755K71213M5768
1846A8220130J45466K20333J79011K36424K68239L58957K26176K57363L01648
1837B0413747L97572M69821M29075K91159L88920O26868M36454M17690N10488
$$ plain form
1828 24381794 24839055 25316574 25748027 26119330 26693281 27114253 27682617 28362732 28898063
1819 28898063 29561816 30103382 30459313 30711153 31097355 31537700 31870081 32596163 33339918
1810 33339918 33830080 34502006 35481550 36540321 37317015 38377241 39387107 40355348 41240532
1801 41240532 42054332 43071175 43999214 44849729 45950300 47266634 48611892 49927146 51209912
1792 51209912 52803334 54499165 56354238 58391827 60716228 62997785 65640785 68401647
1784 68401647 71377159 74760637 78523328 83099513 88279122 94480135 101654959 109617013
1776 109617013 118471955 128318018 139138904 150799046 163602125 179057634 198633615
1769 198633615 223515542 254236167 289870825 328406428 367197544 400573597 415323646
$$ packed form
1828B4381794M57261M77519M31453L71303N73951M20972N68364O80115N35331
1819B8898063O63753N41566L55931K51840L86202M40345L32381P26082P43755
1810C3339918M90162O71926R79544J058771P76694J060226J009866R68241Q85184
1801D1240532Q13800J016843R28039Q50515J100571J316334J345258J315254J282766
1792E1209912J593422J695831J855073K037589K324401K281557K643000K760862
1784F8401647K975512L383478L762691M576185N179609O201013P174824P962054
1776A09617013Q854942R846063J0820886J1660142J2803079J5455509J9575981
1769A98633615K4881927L0720625L5634658L8535603L8791116L3376053J4750049
$$ plain form
1762 415323646 397349105 350412493 296755665 252959876 221962370 200687748 186386520
1755 186386520 176682094 170464700 167161545 165678839 166084934 167774218 170918899 175711313
1747 175711313 182317594 190624111 200715916 212716866 227275897 245156352 267309393
1740 267309393 294168793 324857705 358095802 391287549 419829378 436824021 433397843
1733 433397843 406097358 362669345 316327391 275431111 242106275 215708857 195184636
1726 195184636 178836883 165369549 153944307 143463431 133607090 124507628 116149322
1719 116149322 108563046 101730995 95738514 90386521 85551497 81329398 77439098 73766095
1711 73766095 70429989 67266476 64376977 61859668 59468076 57235604 55186799 53189362
$$ packed form
1762D15323646j7974541m6936612n3656828m3795789l0997506k1274622j4301228
1755A86386520r704426o217394l303155j482706M06095J689284L144681M792414
1747A75711313O606281Q306517J0091805J2000950J4559031J7880455K2153041
1740B67309393K6859400L0688912L3238097L3191747K8541829J6994643l426178
1733D33397843k7300485m3428013m6341954m0896280l3324836k6397418k0524221
1726A95184636j6347753j3467334j1425242j0480876r856341r099462q358306
1719A16149322p586276o832051n992481n351993m835024m222099l890300l673003
1711G3766095l336106l163513k889499k517309k391592k232472k048805j997437
$$ plain form
1703 53189362 51163548 49384916 47581015 45697364 44058409 42598771 41171940 39751946
1695 39751946 38730504 37600947 36584456 35564075 34425836 33740532 32935671 32129592 31201284
1686 31201284 30332677 29749564 29028298 28430935 27669784 26989375 26342057 25779994 25424712
1677 25424712 24938911 24388330 23839544 23462029 23055661 22482184 22001067 21705429 21479131
1668 21479131 21107168 20539035 20209823 19567377 19047852 18746618 18421602 18139760 17912455
1659 17912455 17499463 17164901 16695805 16418408 16178330 15763876 15494805 15306658 15118267
1650 15118267 14856171 14483969 14142405 13850732 13630790 13445539 13149213 12815978 12656439
1641 12656439 12557005 12436050 12252953 12017424 11670093 11505613 11370737 11155175 11093707 11041770
$$ packed form
1703E3189362k025814j778632j803901j883651j638955j459638j426831j419994
1695C9751946j021442j129557j016491j020381j138239o85304q04861q06079r28308
1686C1201284q68607n83113p21266n97363p61151o80409o47318n62063l55282
1677B5424712m85801n50581n48786l77515m06368n73477m81117k95638k26298
1668B1479131l71963n68133l29212o42446n19525l01234l25016k81842k27305
1659A7912455m12992l34562m69096k77397k40078m14454k69071j88147j88391
1650A5118267k62096l72202l41564k91673k19942j85251k96326l33235j59539
1641A2656439r9434j20955j83097k35529l47331j64480j34876k15562o1468n1937
$$ plain form
1631 11041770 10740063 10642522 10600857 10315883 10171125 10167169 10019574 9859604 9621978 9470170
1621 9470170 9385500 9236221 9204943 9092685 9004535 8911906 8990195 8814227 8559972 8290106
1611 8290106 8100604 8007885 7839569 7872140 7892007 7725485 7601615 7442914 7384380 7138674
1601 7138674 7110288 7066430 6756009 6741641 6673669 6695425 6693354 6801908 6693325 6609445 6527306
1590 6527306 6575751 6697908 6642265 6560410 6390403 6353704 6301074 6135557 5942438 5944279 5737168
1579 5737168 5647996 5636969 5697827 5525478 5459800 5561929 5448568 5465479 5565964 5367187
1569 5367187 5365549 5519505 5543856 5507058 5347597 5168405 5179202 5203613 5385064 5371115 5254454
1558 5254454 5122934 5092019 5007927 4903380 5024758 5019083 4896757 4748649 4859046 4898256
$$ packed form
1631A1041770l01707r7541m1665k84974j44758l956j47595j59970k37626j51808
1621I470170q4670j49279l1278j12258q8150r2629P8289j75968k54255k69866
1611H290106j89502r2719j68316L2571J9867j66522j23870j58701n8534k45706
1601G138674k8386m3858l10421j4368o7972K1756k071J08554j08583q3880q2139
1590F527306M8445J22157n5643q1855j70007l6699n2630j65517j93119J841k07111
1579E737168q9172j1027O0858j72349o5678J02129j13361J6911J00485j98777
1569E367187j638J53956K4351l6798j59461j79192J0797K4411J81451j3949j16661
1558E254454j31520l0915q4092j04547J21378n675j22326j48108J10397L9210
$$ plain form
1548 4898256 4834543 4678231 4560927 4530776 4460747 4451134 4682871 4782941 4701343 4394320 4243146
1537 4243146 4235374 4295928 4415190 4332799 4336880 4176131 4096541 4129202 4140192 4205631 4234512
1526 4234512 4240496 4108665 4023893 3977364 3760822 3746237 3830514 3864328 3842476 3806883 3717987
1515 3717987 3821433 3838204 3708501 3676618 3802198 3789357 3563737 3468419 3500977 3526256 3679618
1504 3679618 3617315 3599033 3542183 3567066 3697691 3747874 3617237 3599950 3586362 3469621 3588468
1493 3588468 3636992 3564042 3543159 3648796 3502326 3603144 3660240 3661938 3629067 3622757 3562779
1482 3562779 3645392 3748075 3783511 3759600 3761364 3719865 3675694 3650945 3673463 3839585 3893845
1471 3893845 3876269 3894847 4016370 4241477 4236857 4386806 4618442 4832590 5051639 4999772
$$ packed form
1548D898256o3713j56312j17304l0151p0029r613K31737J00070q1598l07023j51174
1537D243146p772O0554J19262q2391M081j60749p9590L2661J0990O5439K8881
1526D234512N984j31831q4772m6529k16542j4585Q4277L3814k1852l5593q8896
1515C717987J03446J6771j29703l1883J25580j2841k25620r5318L2558K5279J53362
1504C679618o2303j8282n6850K4883J30625N0183j30637j7287j3588j16741J18847
1493C588468M8524p2950k0883J05637j46470J00818N7096J698l2871o310n9978
1482C562779Q2613J02683L5436k3911J764m1499m4171k4749K2518J66122N4260
1471C893845j7576J8578J21523K25107m620J49949K31636K14148K19049n1867
$$ plain form
1461 4999772 4948418 4843221 4496846 4198911 4017791 4028090 3876272 3718895 3660990 3723127
1451 3723127 3666309 3540006 3618322 3718268 3715198 3669518 3547354 3518097 3667293 3791304 3864420
1440 3864420 3851163 3978320 4040517 4118732 4225174 4381794 4417292 4591216 4395736 4346980
1430 4346980 4433200 4069010 3818644 3668798 3425815 3222133 3351429 3422742 3325959 3177433
1420 3177433 3204724 3128861 3154691 3022358 3006360 2721271 2771171 2787516 2722068 2808146 2845330
1409 2845330 2632105 2565076 2554104 2534864 2677981 2631015 2644936 2443853 2396721 2311086 2379361
1398 2379361 2539509 2594670 2519187 2395216 2373220 2366893 2412100 2378411 2362912 2499196 2373929
1387 2373929 2290861 2390021 2406388 2274031 2287348 2211085 2211279 2304297 2295059 2205778 2208399 2215552
$$ packed form
1461D999772n1354j05197l46375k97935j81120J0299j51818j57377n7905O2137
1451C723127n6818j26303P8316R9946l070m5680j22164k9257J49196J24011P3116
1440C864420j3257J27157O2197P8215J06442J56620L5498J73924j95480m8756
1430D346980Q6220l64190k50366j49846k42983k03682J29296P1313r6783j48526
1420C177433K7291p5863K5830j32333j5998k85089M9900J6345o5448Q6078L7184
1409B845330k13225o7029j0972j9240J43117m6966J3921k01083m7132q5635O8275
1398B379361J60148N5161p5483j23971k1996o327M5207l3689j5499J36284j25267
1387B373929q3068R9160J6367j32357J3317p6263J94R3018r238q9281K621P153
$$ plain form
1375 2215552 2294875 2190384 2154956 2089401 2111116 2136287 2195884 2117917 1992934 2085326 2297032
1364 2297032 2102732 2214549 2309315 2145777 2073536 2175327 2181728 2054594 1970351 2161375
1354 2161375 2114499 2097736 2143392 2137592 2125437 2099483 2047923 2013910 2244432 2176231 2087863
1343 2087863 1888223 1983802 1889617 2016576 1963157 2029875 2106153 2049887 2116973 2052529 1963313
1332 1963313 2057030 1972374 1862147 1859316 1788609 1854854 1831160 1761498 1799940 1900897 1853105
1321 1853105 1862410 1793016 1724673 1789443 1931961 1993608 2050057 1873492 1862588 2074787 2079018
1310 2079018 1998321 1949325 1869476 1918321 1799430 1592339 1591146 1599538 1844828 1937055 1776184
1299 1776184 1741165 1866881 1787847 1767970 1775201 1771878 1796552 1630857 1663633 1745530 1757847
$$ packed form
1375B215552P9323j04491l5428o5555K1715K5171N9597p7967j24983R2392K11706
1364B297032j94300J11817R4766j63538p2241J01791O401j27134q4243J91024
1354B161375m6876j6763M5656n800j2155k5954n1560l4013K30522o8201q8368
1343B087863j99640R5579r4185J26959n3419O6718P6278n6266O7086o4444q9216
1332A963313R3717q4656j10227k831p0707O6245k3694o9662L8442J00957m7792
1321A853105R305o9394o8343O4770J42518O1647N6449j76565j0904K12199M231
1310B079018q0697m8996p9849M8845j18891k07091j193Q392K45290R2227j60871
1299A776184l5019J25716p9034j9877P231l323K4674j65695L2776Q1897J2317
$$ plain form
1288 1757847 1791391 1690772 1632177 1647557 1488349 1614589 1828723 1740637 1680073 1670008 1498560
1277 1498560 1519025 1616995 1733599 1683050 1631735 1682290 1785716 1769591 1702966 1720666 1629503
1266 1629503 1756699 1739947 1667512 1574772 1529370 1606791 1587929 1546443 1547827 1454176 1542865
1255 1542865 1528386 1448257 1468532 1488279 1290593 1374033 1522085 1803150 1817123 1824976 1862450
1244 1862450 2020356 1929746 1817752 1891761 1859086 1757941 1735715 1674378 1550689 1479570 1407418
1233 1407418 1436938 1395631 1407086 1408748 1380993 1404965 1497618 1481801 1548162 1748303 1720866
1222 1720866 1561155 1565289 1484311 1564666 1563261 1415479 1400253 1431963 1456864 1452529 1354783 1296652
1210 1296652 1441041 1516451 1615416 1554120 1364521 1442757 1462025 1371030 1221868 1371479 1178393
$$ packed form
1288A757847L3544j00619n8595J5380j59208J26240K14134q8086o0564j0065j71448
1277A498560K0465R7970J16604n0549n1315N0555J03426j6125o6625J7700r1163
1266A629503J27196j6752p2435r2740m5402P7421j8862m1486J384r3651Q8689
1255A542865j4479q0129K0275J9747j97686Q3440J48052K81065J3973P853L7474
1244A862450J57906r0610j11994P4009l2675j01145k2226o1337j23689p1119p2152
1233A407418K9520m1307J1455J662k7755K3972R2653j5817O6361K00141k7437
1222A720866j59711M134q0978Q0355j405j47782j5226L1710K4901m335r7746n8131
1210A296652J44389P5410R8965o1296j89599P8236J9268r0995j49162J49611j93086
$$ plain form
1199 1178393 1023608 1242060 1262807 1331220 1364651 1393664 1515541 1583620 1557314 1465101 1472216
1188 1472216 1474212 1419623 1597827 1547406 1572460 1616998 1434399 1485146 1327968 1381122 1446751
1177 1446751 1524101 1517560 1545141 1580767 1524825 1554375 1294222 1194605 1398072 1453771 1282565
1166 1282565 1339988 1305441 1413231 1473331 1394242 1394052 1407336 1310045 1363371 1383805 1334989 1341495
1154 1341495 1279035 1313546 1207631 1156133 1126284 1254900 1298767 1329727 1373988 1444886 1394101
1143 1394101 1376856 1330437 1386314 1324029 1312602 1493597 1553003 1493200 1549275 1361673 1313289
1132 1313289 1345544 1472444 1464018 1363164 1447038 1541248 1570915 1454175 1318129 1301175 1410920
1121 1410920 1411496 1528572 1506127 1547727 1334447 1278634 1561744 1517382 1345064 1216178 1279771
$$ packed form
1199A178393j54785K18452K0747O8413L3431K9013J21877O8079k6306r2213P115
1188A472216J996n4589J78204n0421K5054M4538j82599N0747j57178N3154O5629
1177A446751P7350o541K7581L5626n5942K9550k60153r9617K03467N5699j71206
1166A282565N7423l4547J07790O0100p9089j90J3284r7291N3326K0434m8816O506
1154A341495o2460L4511j05915n1498k9849J28616M3867L0960M4261P0898n0785
1143A394101j7245m6419N5877o2285j1427J80995N9406n9803N6075j87602m8384
1132A313289L2255J26900q426j00854Q3874R4210K9667j16740j36046j6954J09745
1121A410920N76J17076k2445M1600k13280n5813K83110m4362j72318j28886O3593
$$ plain form
1110 1279771 1309418 1296320 1367513 1338377 1368186 1457949 1384399 1449700 1433698 1337948 1379672
1099 1379672 1327590 1229648 1317938 1538240 1594209 1407453 1485526 1499246 1537849 1389359 1294777
1088 1294777 1393223 1581631 1618215 1538100 1589413 1628355 1744999 1684143 1621260 1554212 1530231
1077 1530231 1444662 1529371 1483700 1632876 1774323 1660862 1424303 1532255 1556294 1535992
1067 1535992 1589158 1785238 1924246 1912160 1858743 1857686 1879385 1880621 2006418 2109301 2334269
1056 2334269 2400186 2324245 2512334 2695326 2389512 2326922 2218671 2086430 2053865 2156088
1046 2156088 2117399 1947474 2009986 2187958 2091059 1964779 2122991 2073382 2165259 2021191
1036 2021191 1992476 2137781 2246965 2290586 2411291 2359274 2398334 2410682 2404388 2340945 2254988
$$ packed form
1110A279771K9647j3098P1193k9136K9809Q9763p3550O5301j6002r5750M1724
1099A379672n2082r7942Q8290K20302N5969j86756P8073J3720L8603j48490r4582
1088A294777R8446J88408L6584q0115N1313L8942J16644o0856o2883o7048k3981
1077A530231q5569Q4709m5671J49176J41447j13461k36559J07952K4039k0302
1067A535992N3166J96080J39008j2086n3417j057K1699J236J25797J02883K24968
1056B334269O5917p5941J88089J82992l05814o2590j08251j32241l2565J02223
1046B156088l8689j69925O2512J77972r6899j26280J58212m9609R1877j44068
1036B021191k8715J45305J09184M3621J20705n2017L9060J2348o294o3443q5957
$$ plain form
1025 2254988 2369256 2475407 2428115 2352866 2481669 2548456 2629166 2671575 2695749 2702446 2708328
1014 2708328 2768288 2763533 2904911 2852686 2976308 3084818 2993990 2957924 3146628 3099524 3186207
1003 3186207 3267459 3481623 3591488 3654250 3834043 3988936 3977314 4037166 4141043 4335666
993 4335666 4553061 4856972 5032862 5301184 5443224 5407851 5540645 5993086 6259969 6659532
983 6659532 6996662 7496881 7827232 8063319 8751825 9504995 10251866 11155796 12172555 12830316
973 12830316 13390491 14268072 15622689 17229792 18824578 20895978 23651094 27165553 31962927
964 31962927 37748723 43734589 50343294 57387388 64783743 66513431 53606167 40010339
956 40010339 31881211 26417785 22479111 19571114 17368575 15723936 14271343 13181303
$$ packed form
1025B254988J14268J06151m7292p5249J28803O6787Q0710M2409K4174O697N882
1014B708328N9960m755J41378n2225J23622J08510r0828l6066J88704m7104Q6683
1003C186207Q1252K14164J09865O2762J79793J54893j1622N9852J03877J94623
993D335666K17395L03911J75890K68322J42040l5373J32794M52441K66883L99563
983F659532L37130N00219L30351K36087O88506P53170P46871R03930J016759O57761
973A2830316N60175Q77581J354617J607103J594786K071400K755116L514459M797374
964C1962927N785796N985866O608705P044094P396355J729688j2907264j3595828
956D0010339q129128n463426l938674k907997k202539j644639j452593j090040
$$ plain form
948 13181303 12488460 11886466 11224493 10666158 10424541 10057674 9367062 8663295 8039422 7715458
938 7715458 7435289 7074870 6730702 6465265 6101212 5850720 5510135 5363862 5211975 5017586
928 5017586 4983067 4838678 4701431 4465314 4256196 3957093 3840097 3698501 3693208 3538797
918 3538797 3530688 3360850 3327687 3346683 3140299 3036247 2995562 3007065 3189411 2870898 2619982
907 2619982 2590354 2635423 2649500 2462140 2379967 2472990 2362471 2449756 2300086 2452503 2412206
896 2412206 2442822 2375261 2302039 2179957 2084477 2043571 2176448 2209997 2141081 2091930 2224423
885 2224423 2189116 2170222 2048376 1972571 1965186 1848830 1829929 1907550 1895531 1983806 1914831
874 1914831 1934098 1825392 1761167 1661034 1582768 1539279 1624078 1462167 1358417 1344047 1487758
$$ packed form
948A3181303o92843o01994o61973n58335k41617l66867o90612p03767o23873l23964
938G715458k80169l60419l44168k65437l64053k50492l40585j46273j51887j94389
928E017586l4519j44389j37247k36117k09118k99103j16996j41596n293j54411
918C538797q109j69838l3163J8996k06384j04052m0685J1503J82346l18513k50916
907B619982k9628M5069J4077j87360q2173R3023j10519Q7285j49670J52417m0297
896B412206L0616o7561p3222j22082r5480m0906J32877L3549o8916m9151J32493
885B224423l5307j8894j21846p5805p385j16356j8901P7621j2019Q8275o8975
874A914831J9267j08706o4225j00133p8266m3489Q4799j61911j03750j4370J43711
$$ plain form
863 1487758 1635891 1628832 1601691 1606310 1548934 1486274 1576932 1586406 1635106 1503867 1535508 1495487
851 1495487 1479025 1480883 1441155 1501398 1408451 1271184 1300503 1297562 1331575 1223517 1258917 1273764
839 1273764 1296282 1457720 1435571 1151511 1137063 1293302 1216243 1265184 1428014 1194356 1132277
828 1132277 1268602 1338661 1261631 1025856 1119129 1212962 1013003 1059138 1017298 1021698 946681
817 946681 1099421 1243716 1299073 1304597 1104187 1062750 1047515 1101869 1135769 999830 900184
806 900184 895001 964467 1070742 1168081 1005405 1026264 1023821 1018756 1022091 1019501 902837 803871
794 803871 811109 965653 948985 969506 1238951 1178371 1206629 1146031 1039212 1101039 1014221
783 1014221 958676 1021088 965300 802313 959404 966095 1034571 1133661 1090774 1084640 916293
$$ packed form
863A487758J48133p059k7141M619n7376o2660R0658R474M8700j31239L1641m0021
851A495487j6462J858l9728O0243r2947j37267K9319k941L4013j08058L5400J4847
839A273764K2518J61438k2149k84060j4448J56239p7059M8941J62830k33658o2079
828A132277J36325P0059p7030k35775R3273R3833j99959M6135m1840M400p5017
817I46681J52740J44295N5357N524k00410m1437j5235N4354L3900j35939r9646
806I00184n183O9466J06275R7339j62676K0859k443n065L335k590j16664r8966
794H03871P238J54544j6668K0521K69445o0580K8258o0598j06819O1827q6818
783A014221n5545O2412n5788j62987J57091O691O8476R9090m2887o134j68347
$$ plain form
772 916293 875162 1042654 917187 936857 988223 801795 897892 968383 911872 1101872 1116458
761 1116458 988645 904940 1100304 1016382 990729 941595 1048272 1108529 927223 942936 1026195
750 1026195 1044113 863841 1043918 913486 865754 759020 715530 649143 693442 766491 807827
739 807827 787766 735134 851099 864707 840382 820147 898052 902878 953466 880181 817517 777843
727 777843 631100 745481 794880 791083 886736 852875 772903 746073 668604 848276 910774
716 910774 884823 852821 811998 837022 707854 913637 1002943 876888 849010 985852 995866
705 995866 1063090 984622 827865 800506 817234 847202 944165 842717 511571 628998 769923
694 769923 819888 741223 797079 686222 720633 736342 869583 941134 887573 898645 1013610
$$ packed form
772I16293m1131J67492j25467J9670N1366j86428R6097P0491n6511J90000J4586
761A116458j27813q3705J95364q3922k5653m9134J06677O0257j81306J5713Q3259
750A026195J7918j80272J80077j30432m7732j06734m3490o6387M4299P3049M1336
739H07827k0061n2632J15965J3608k4325k0235P7905M826N0588p3285o2664l9674
727G77843j46743J14381M9399l797R5653l3861p9972k6830p7469J79672O2498
716I10774k5951l2002m0823K5024j29168K05783Q9306j26055k7878J36842J0014
705I95866O7224p8468j56757k7359J6728K9968R6963j01448l31146J17427J40925
694G69923M9965p8665N5856j10857L4411J5709J33241P1551n3561J1072J14965
$$ plain form
683 1013610 895744 944631 864813 1001284 1021218 1044998 1056270 1046469 1050119 1126824 1176025 1233418
671 1233418 1273089 1133231 958867 716962 719153 997643 1095452 1007048 959859 864029 782728
660 782728 590067 640199 819166 848987 760041 831065 876493 904734 702827 722661 667652
649 667652 572228 520526 681410 590213 478002 467342 712883 807973 651820 550860 698127
638 698127 846890 849944 817462 801524 648041 816907 829737 752568 769296 823844 647967
627 647967 687653 733079 710861 683422 553101 657390 712788 688674 680270 705606 739264 766542
615 766542 772111 736713 755679 787120 736036 768063 748458 783668 691060 800209 871215 869207
603 869207 697696 637652 601343 639925 749245 746778 514665 710677 780865 763586 796844
$$ packed form
683A013610j17866M8887p9818J36471J9934K3780J1272r801L650P6705M9201N7393
671A233418L9671j39858j74364k41905K191K78490R7809q8404m7189r5830q1301
660G82728j92661N0132J78967K9821q8946P1024M5428K8241k01907J9834n5009
649F67652r5424n1702J60884r1197j12211j0660K45541R5090j56153j00960J47267
638F98127J48763L054l2482j5938j53483J68866J2830p7169J6728N4548j75877
627F47967L9686M5426k2218k7439j30321J04289N5398k4114q404K5336L3658K7278
615G66542N569l5398J8966L1441n1084L2027j9605L5210r2608J09149P1006k008
603H69207j71511o0044l6309L8582J09320k467k32113J96012P0188j7279L3258
$$ plain form
592 796844 748692 757545 682385 593825 640083 811651 791801 732229 830524 723299 591037
581 591037 690349 681512 739622 717089 804331 907798 797622 880461 769509 746553 869754
570 869754 858406 694591 555072 475744 610865 670569 688812 822629 840292 789920 735377
559 735377 886795 867247 705710 685756 656645 693061 734246 804910 686972 554545 495273
548 495273 473490 595203 732621 922847 939627 899559 689109 690259 650621 468230 553224
537 553224 747849 749120 764847 702720 635355 552408 536511 616935 732746 756496 830320 787883
525 787883 688877 697666 543514 452137 695846 848551 898030 989883 836674 720901 808875
514 808875 829608 685059 624413 652994 647892 557434 560262 506697 674557 769192 638756 708825
$$ packed form
592G96844m8152Q853p5160q8560M6258J71568j9850n9572R8295j07225j32262
581E91037R9312q837N8110k2533Q7242J03467j10176Q2839j10952k2956J23201
570H69754j1348j63815j39519p9328J35121N9704J8243J33817J7663n0372n4543
559G35377J51418j9548j61537j9954k9111L6416M1185P0664j17938j32427n9272
548D95273k1783J21713J37418J90226J6780m0068k10450J150l9638j82391Q4994
537E53224J94625J271J5727o2127o7365q2947j5897Q0424J15811K3750P3824m2437
525G87883r9006Q789j54152r1377K43709J52705M9479R1853j53209j15773Q7974
514H08875K0733j44549o0646K8581n102r0458K828n3565J67860R4635j30436P0069
$$ plain form
502 708825 625801 559381 575578 486062 511756 546146 360186 248954 428983 590818 682646
491 682646 596702 562113 613042 626999 724723 600943 586366 611191 398982 470725 504206
480 504206 364315 440219 511265 439504 465233 507672 409802 377869 566803 622886 662956
469 662956 537457 505836 603590 549765 637616 614534 629706 612370 539405 348822 578763
458 578763 687504 649550 560631 599391 529811 568964 646142 508750 507120 719052 597869
447 597869 648908 675505 500459 566779 618678 530869 600013 545899 424104 529428 688726
436 688726 794200 609949 511595 477786 699084 678821 750165 565944 675767 787674 560215
425 560215 416690 425124 371868 467826 635792 684584 777382 727368 641834 492153 480421
$$ packed form
502G08825q3024o6420J6197q9516K5694L4390j85960j11232J80029J61835R1828
491F82646q5944l4589N0929J3957R7724j23780j4577K4825k12209P1743L3481
480E04206j39891P5904P1046p1761K5729M2439r7870l1933J88934N6083M0070
469F62956j25499l1621R7754n3825Q7851k3082J5172j7336p2965j90583K29941
458E78763J08741l7954q8919L8760o9580L9153P7178j37392j630K11932j21183
447E97869N1039K6597j75046O6320N1899q7809O9144n4114j21795J05324J59298
436F88726J05474j84251r8354l3809K21298k0263P1344j84221J09823J11907k27459
425E60215j43525Q434n3256R5958J67966M8792R2798n0014q5534j49681j1732
$$ plain form
414 480421 724953 758425 505517 321828 542623 501239 441337 466623 513783 612400 649875
403 649875 624309 582756 560746 578170 690485 744698 685175 517361 446995 603043 639399
392 639399 600652 639306 625176 597514 574241 603315 485407 450221 704010 670906 724924
381 724924 817102 786207 613575 449982 382143 596638 708907 511959 450182 379347 373008
370 373008 395404 547339 498160 407217 550267 555590 509998 430372 467876 494176 361066
359 361066 411293 500621 476215 453816 530273 630629 751109 710204 534219 489865 686445
348 686445 726513 757895 576567 565146 484922 510529 587902 602794 535432 528272 547643 587660
336 587660 388962 278608 493960 751049 758999 759821 533604 556206 542174 573517 777154
$$ packed form
414D80421K44532L3472k52908j83689K20795m1384n9902K5286M7160R8617L7475
403F49875k5566m1553k2010J7424J12315N4213n9523j67814p0366J56048L6356
392F39399l8747L8654j4130k7662k3273K9074j17908l5186K53789l3104N4018
381G24924R2178l0895j72632j63593o7839K14495J12269j96948o1777p0835o339
370C73008K2396J51935m9179r0943J43050N323m5592p9626L7504K6300j33110
359C61066N0227Q9328k4406k2399P6457J00356J20480m0905j75985m4354J96580
348F86445M0068L1382j81328j1421q0224K5607P7373J4892o7362p160J9371M0017
336E87660j98698j10354K15352K57089P950Q22k26217K2602j4032L1343K03637
$$ plain form
325 777154 658514 644197 504163 532700 592647 610128 467120 513470 536273 462156 501817
314 501817 473661 399510 395358 467297 648890 590767 510790 366193 355225 413685 547517
303 547517 561576 305836 261511 284705 348315 584256 472136 430448 453902 325871 415285
292 415285 297521 287499 273196 338673 401191 374094 400584 357566 377120 319442 210090
281 210090 404885 513426 445994 412203 516765 654008 536205 485241 408335 466653 432798
270 432798 398189 567472 615658 487596 419075 477623 416393 497653 573843 479942 545172
259 545172 575227 441692 385078 516549 488500 527405 544330 358001 374870 385131 193113
248 193113 230419 357271 260905 305396 320854 405065 351823 442121 565889 438441 484095
$$ packed form
325G77154j18640j4317j40034K8537N9947J7481j43008M6350K2803p4117L9661
314E01817k8156p4151m152P1939J81593n8123p9977j44597j0968N8460J33832
303E47517J4059k55740m4325K3194O3610K35941j12120m1688K3454j28031Q9414
292D15285j17764j0022j4303O5477O2518k7097K6490m3018J9554n7678j09352
281B10090J94795J08541o7432l3791J04562J37243j17803n0964p6906N8318l3855
270D32798l4609J69283M8186j28062o8521N8548o1230Q1260P6190r3901O5230
259E45172L0055j33535n6614J31471k8049L8905J6925j86329J6869J0261j92018
248A93113L7306J26852r6366M4491J5458Q4211n3242R0298J23768j27448M5654
$$ plain form
237 484095 374795 185616 196289 360335 381816 383483 332525 515585 299960 233285 341927
226 341927 297684 430188 458605 522821 443518 444263 443829 487334 379952 237487 324068 375960
214 375960 337372 344233 394361 301830 362286 482180 297541 328312 223297 303062 420020
203 420020 383510 342353 275638 464249 609810 457186 385427 407705 419800 413652 353250
192 353250 395885 327784 190594 191500 370815 587164 389767 377327 321056 283070 342718
181 342718 269065 291219 248633 271171 301741 399360 255191 136241 202314 266121 257833 302955
169 302955 331086 220763 168675 98264 182284 415689 248164 132171 99454 42252 138745
158 138745 161375 219710 271431 119184 187209 279896 253365 166970 259549 236471 192390 222563
$$ packed form
237D84095j09300j89179J0673J64046K1481J667n0958J83060k15625o6675J08642
226C41927m4243J32504K8417O4216p9303P45m34M3505j07382j42465Q6581N1892
214C75960l8588O861N0128r2531O0456J19894j84639L0771j05015P9765J16958
203D20020l6510m1157o6715J88611J45561j52624p1759K2278J2095o148o0402
192C53250M2635o8101j37190R06J79315K16349j97397j2440n6271l7986N9648
181C42718p3653K2154m2586K2538L0570R7619j44169j18950O6073O3807q288M5122
169C02955K8131j10323n2088p0411Q4020K33405j67525j15993l2717n7202R6493
158A38745K2630N8335N1721j52247O8025R2687k6531q6395R2579k3078m4081L0173
$$ plain form
146 222563 266742 176189 79923 140434 269196 249367 147263 130923 204400 197383 231709 241789
134 241789 212432 102035 206526 379963 246706 133387 -36523 95586 180539 193343
124 193343 186478 90242 151137 155690 124274 98090 215750 207541 78075 97032 109060 153658
112 153658 61556 -39298 152 86409 45781 128487 24372 -90198 -117365 -82673 30113
101 30113 -30590 -109739 -152135 -154237 -88631 -99110 -162792 -167086 -37264 14424 -7630 -102587
89 -102587 -206778 -121437 -104975 5478 61127 -174541 -159645 -135333 -53533 54289 75195
78 75195 40242 -32905 31504 168390 28493 -152178 -209510 -222580 -61522 40974 -7888
67 -7888 -14687 -78642 2808 -48996 -157186 -226426 -270003 -187220 -177909 -278830 -278434 -231636 -214393
$$ packed form
146B22563M4179r0553r6266O0511J28762j9829j02104j6340P3477p017L4326J0080
134B41789k9357j10397J04491J73437j33257j13319j69910J32109Q4953J2804
124A93343o865r6236O0895M553l1416k6184J17660q209j29466J8957J2028M4598
112A53658r2102j00854L9450Q6257m0628Q2706j04115j14570k7167L4692J12786
101C0113o0703p9149m2396k102O5606j0479o3682m294J29822N1688k2054r4957
89a02587j04191Q5341J6462J10453N5649k35668J4896K4312Q1800J07822K0906
78G5195l4953p3147O4409J36886j39897j80671n7332j3070J61058J02496m8862
67g888o799o3955Q1450n1804j08190o9240m3577Q2783R311j00921L96M6798J7243
$$ plain form
54 -214393 -223035 -220957 -221701 -221587 -352883 -364686 -314541 -321729 -225139 -216321 -228585 -68544 7569
41 7569 -15396 -259147 -280016 -223626 -214057 -232099 -203231 -291587 -331151 -341008 -269990 -232933 -468965
28 -468965 -433711 -383974 -480237 -457433 -320901 -435073 -378448 -389921 -292597 -323093 -301297 -217034
16 -217034 -277715 -510113 -454455 -379636 -437675 -503814 -533650 -473829 -448277 -450537 -376062 -459621
4 -459621 -399926 -401077 -348312 -451574
0 -451574
$$ packed form
54b14393q642K078p44J14j31296j1803N0145p188R6590Q818j2264J60041P6113
41G569k2965k43751k0869N6390R569j8042K8868q8356l9564r857P1018L7057k36032
28d68965L5254M9737r6263K2804J36532j14172N6625j1473R7324l0496K1796Q4263
16b17034o0681k32398N5658P4819n8039o6139k9836N9821K5552k260P4475q3559
4d59621N9695j151N2765j03262
0d51574
$$ Imaginary data points
##PAGE= N=2
##DATA TABLE= (X++(I..I)), XYDATA
$$ plain form
16383 -5382462 -5227487 -5167520 -5192910 -5127515 -5089979 -4978554 -4863003 -4923260 -4973922 -4902376 -4758794
16372 -4758794 -4583834 -4526483 -4443000 -4563133 -4456901 -4339366 -4222123 -4290300 -4246999 -4189139
16362 -4189139 -4124682 -4038613 -4046181 -3985664 -4012919 -3955218 -3838402 -3720137 -3687130 -3650391 -3559814
16351 -3559814 -3568979 -3444338 -3412196 -3321104 -3439297 -3343476 -3156541 -3076458 -3051237 -3059123 -3149001
16340 -3149001 -3175597 -3054884 -2960590 -2837944 -2835197 -2838816 -2668625 -2615040 -2561928 -2567377 -2549070
16329 -2549070 -2517260 -2366382 -2363501 -2400886 -2298869 -2283226 -2223269 -2208009 -2183027 -2147466 -2116264
16318 -2116264 -2067986 -2013681 -1919647 -1798240 -1772449 -1633574 -1638654 -1635622 -1571954 -1532399 -1603323
16307 -1603323 -1610722 -1456706 -1312344 -1251117 -1314640 -1365540 -1271682 -1158473 -1058319 -1002548 -1041956
$$ packed form
16383e382462J54975N9967k5390O5395L7536J11425J15551o0257n0662P1546J43582
16372d758794J74960N7351Q3483j20133J06232J17535J17243o8177M3301N7860
16362d189139O4457Q6069p568O0517k7255N7701J16816J18265L3007L6739R0577
16351c559814r165J24641L2142R1092j18193R5821J86935Q0083K5221p886q9878
16340c149001k6596J20713R4294J22646K747l619J70191N3585N3112n449J8307
16329b549070L1810J50878K881l7385J02017J5643N9957J5260K4982L5561L1202
16318b116264M8278N4305R4034J21407K5791J38875n080L032O3668L9555p0924
16307a603323p399J54016J44362O1227o3523n0900R3858J13209J00154N5771l9408
$$ plain form
16296 -1041956 -1049201 -986243 -945927 -829068 -771596 -703603 -609448 -617469 -641418 -586967 -623496
16285 -623496 -642145 -587843 -543498 -435664 -362700 -319996 -431650 -354850 -234768 -271524 -180882
16274 -180882 -130198 -199500 -133480 20320 42055 128759 86804 -13894 106275 78439 123847
16263 123847 215196 102714 170770 253520 316294 386598 498450 458834 397839 453375 521493
16252 521493 417245 517539 599440 650142 688443 761185 855249 869326 838664 852241 937927
16241 937927 942814 907221 896685 1006513 957983 980035 1077176 1139434 1151195 1100573 1113556
16230 1113556 1245107 1192279 1243164 1255159 1207948 1278657 1398642 1512190 1422758 1353053 1368975
16219 1368975 1329312 1364883 1515355 1608047 1558220 1631553 1417248 1374488 1593886 1699248
$$ packed form
16296a041956p245O2958M0316J16859N7472O7993R4155q021k3949N4451l6529
16285f23496j8649N4302M4345J07834P2964M2704j11654P6800J20082l6756R0642
16274a80882N0684o9302O6020J53800K1735Q6704m1955j00698J20169k7836M5408
16263A23847R1349j12482O8056Q2750O2774P0304J11852l9616o0995N5536O8118
16252E21493j04248J00294Q1901N0702L8301P2742R4064J4077l0662J3577Q5686
16241I37927M887l5593j0536J09828m8530K2052R7141O2258J1761n0622J2983
16230A113556J31551n2828N0885J1995m7211P0709J19985J13548q9432o9705J5922
16219A368975l9663L5571J50472R2692m9827P3333k14305m2760K19398J05362
$$ plain form
16209 1699248 1721375 1723279 1624763 1609325 1645860 1838149 1788999 1580908 1708047 1804008 1953124
16198 1953124 1987830 1859866 1836487 2130400 2144569 2079073 2027550 1933616 1819432 1928520
16188 1928520 2038285 2038479 1882583 1963758 2108504 2145377 2180700 2202652 2192716 2131483 2032738
16177 2032738 2073749 2129325 2137497 2187788 2221118 2365084 2375028 2402082 2282034 2167686 2402384
16166 2402384 2369878 2333715 2282897 2341174 2177273 2168642 2312047 2205897 2343437 2376606 2341620
16155 2341620 2401938 2507888 2449478 2438358 2270031 2308687 2526762 2608565 2731367 2605880
16145 2605880 2494174 2694018 2731371 2654431 2575330 2507336 2562012 2486992 2557066 2633847 2700311
16134 2700311 2662490 2547437 2718020 2749038 2735726 2791253 2767445 2597661 2513201 2489068 2601476
$$ packed form
16209A699248K2127J904r8516j5438L6535J92289m9150k08091J27139R5961J49116
16198A953124L4706j27964k3379K93913J4169o5496n1523r3934j14184J09088
16188A928520J09765J94j55896Q1175J44746L6873L5323K1952r936o1233r8745
16177B032738M1011N5576Q172N0291L3330J43966R944K7054j20048j14348K34698
16166B402384l2506l6163n0818N8277j63901q631J43405j06150J37540L3169l4986
16155B341620O0318J05950n8410j1120j68327L8656K18075Q1803J22802j25487
16145B605880j11706J99844L7353p6940p9101o7994N4676p5020P0074P6781O6464
16134B700311l7821j15053J70583L1018j3312N5527k3808j69784q4460k4133J12408
$$ plain form
16123 2601476 2671523 2505592 2870760 2883856 2740110 2932459 2799246 2749182 2827453 2824482
16113 2824482 2769640 2731549 2680342 2896776 2858440 2839764 2894269 2863948 2644754 2652453 2706130
16102 2706130 2652182 2677597 2909909 2829665 2759198 2587479 2739246 2867171 3008080 2905155
16092 2905155 2878580 2916321 2836485 2932545 2932973 2906995 3007248 2983744 2921620 2841382 2783620
16081 2783620 2932368 2972575 2857005 2851326 3032136 2974049 2956389 2856424 3050100 3074225 3036451
16070 3036451 2956050 2947779 3066643 3077352 2949158 3035941 2959269 2855365 2771276 2752974 2900825
16059 2900825 2939580 2844433 2943326 3065330 3024021 3005545 2991622 2855334 2868086 2985379 3049274
16048 3049274 3030542 3022689 3095993 3164662 3084864 3068274 2880737 2845302 2880887 2794677 2933919
$$ packed form
16123B601476P0047j65931L65168J3096j43746J92349j33213n0064P8271k971
16113B824482n4842l8091n1207K16434l8336j8676N4505l0321k19194P699N3677
16102B706130n3948K5415K32312q0244p0467j71719J51767J27925J40909j02925
16092B905155k6575L7741p9836R6060M28k5978J00253k3504o2124q0238n7762
16081B783620J48748M0207j15570n679J80810n8087j7660r9965J93676K4125l7774
16070C036451q0401q271J18864J0709j28194Q6783p6672j03904q4089j8302J47851
16059B900825L8755r5147R8893J22004m1309j8476j3923j36288J2752J17293O3895
16048C049274j8732p853P3304O8669p9798j6590j87537l5435L5585q6210J39242
$$ plain form
16037 2933919 3067730 2976820 2924421 2951173 2987157 2795123 2879542 3037745 2985171 2852678
16027 2852678 2950652 2951101 2913574 2963339 2981519 3103818 2959853 2992354 3017102 2923806 3018917
16016 3018917 3072380 3007663 3032622 2981108 2716938 2799020 2935044 2923174 2755182 2732283 2824307
16005 2824307 2912311 2943827 2955528 2904228 2884466 2955917 2996579 2885010 2842568 3004062 3079375
15994 3079375 3133879 3020199 3056768 3123958 3198445 3240710 3259417 3139935 3083702 2849220 2907370
15983 2907370 3011739 3019009 3018742 3084343 2970398 2939273 2901125 2948228 2991208 2874799 2876749
15972 2876749 3016990 3154785 3051114 3100410 3034430 2882362 2721783 2837044 3122811 3063285
15962 3063285 3127700 3166509 3100177 3042009 2986008 2963957 2926974 2929539 2957755 2897070 2902537 3187415
$$ packed form
16037B933919J33811r0910n2399K6752L5984j92034Q4419J58203n2574j32493
16027B852678R7974M49l7527M9765J8180J22299j43965L2501K4748r3296R5111
16016C018917N3463o4717K4959n1514k64170Q2082J36024j1870j67992k2899R2024
16005B824307Q8004L1516J1701n1300j9762P1451M0662j11569m2442J61494P5313
15994C079375N4504j13680L6569O7190P4487M2265J8707j19482n6233k34482N8150
15983B907370J04369P270k67O5601j13945l1125l8148M7103M2980j16409J950
15972B876749J40241J37795j03671M9296o5980j52068j60579J15261K85767n9526
15962C063285O4415L8809o6332n8168n6001k2051l6983K565K8216o0685N467K84878
$$ plain form
15950 3187415 3081237 3010565 2914329 2904018 3015750 2902263 2971733 3007341 2961863 2933942 3012919
15939 3012919 3169038 3228911 3115985 3098604 3059969 3105361 2980461 2750061 2738933 2935124
15929 2935124 2885238 2896019 2827208 2881268 2954547 3002619 2952916 2841398 2853328 2890547 2981609
15918 2981609 3049165 2966015 2916556 2912999 2776678 2825266 2891822 2870733 2885899 3007463 2888492
15907 2888492 2801736 2933852 3011618 2916710 2914764 2824599 3065500 2993827 2926837 2990766 2861142
15896 2861142 2862484 3035540 3076178 3088757 3050235 3027513 3077381 3021842 3027457 2948871 2825494
15885 2825494 2823829 2902892 2827316 2963269 3109423 3162817 2998625 2892247 2934438 2834490 3010930
15874 3010930 2982201 2705887 2791771 2877769 3033336 3098421 3056293 3080437 2953889 2923839 2971733
$$ packed form
15950C187415j06178p0672r6236j0311J11732j13487O9470L5608m5478k7921P8977
15939C012919J56119N9873j12926j7381l8635M5392j24900k30400j1128J96191
15929B935124m9886J0781o8811N4060P3279M8072m9703j11518J1930L7219R1062
15918B981609O7556q3150m9459l557j36321M8588O6556k1089J5166J21564j18971
15907B888492q6756J32116P7766r4908j946r0165K40901p1673o6990O3929j29624
15896B861142J342J73056M0638J2579l8522k2722M9868n5539N615p8586j23377
15885B825494j665P9063p5576J35953J46154N3394j64192j06378M2191r9948J76440
15874C010930k8729k76314Q5884Q5998J55567O5085m2128K4144j26548l0050M7894
$$ plain form
15863 2971733 3075237 2910946 2929695 3001765 3063945 3177715 2967644 2924350 2958642 3107527
15853 3107527 3104953 2910454 2706971 2760677 2718380 2744630 2888383 2852721 2902627 2922566 2914336
15842 2914336 2849109 2972614 2961477 2864623 3043798 3117433 2950340 2972415 3069873 3061803 3067245
15831 3067245 2852297 2784912 3020722 3031610 2881117 3008969 2955058 2991919 2942356 2877328
15821 2877328 3168738 3147776 3172489 3076376 2892701 3118296 3082246 2960837 3061470 3183685
15811 3183685 3309706 3035080 2921607 2955008 2922989 2880642 2975472 3010128 3091484 2955680
15801 2955680 3044671 2995942 2882156 2938508 2981472 2956573 3018711 3023169 2863378 2849128 2782252
15790 2782252 2799854 2869869 3033189 3143269 3016745 2948947 2883701 2831389 2759932 2877191
$$ packed form
15863B971733J03504j64291J8749P2070O2180J13770k10071m3294L4292J48885
15853C107527k574j94499k03483N3706m2297K6250J43753l5662M9906J9939q230
15842B914336o5227J23505j1137r6854J79175P3635j67093K2075R7458q070N442
15831C067245k14948o7385K35810J0888j50493J27852n3911L6861m9563o5028
15821B877328K91410k0962K4713r6113j83675K25595l6050j21409J00633J22215
15811C183685J26021k74626j13473L3401l2019m2347R4830L4656Q1356j35804
15801B955680Q8991m8729j13786N6352M2964k4899O2138M458j59791j4250o6876
15790B782252J7602P0015J63320J10080j26524o7798o5246n2312p1457J17259
$$ plain form
15780 2877191 3047174 3009224 2860639 2977827 3129831 3045517 2973845 3040506 3128414 2978999
15770 2978999 2948389 2948042 3043315 3157095 3140582 3080506 2983198 2825401 2829506 2965705 2970279
15759 2970279 2879961 2983186 2876575 2983254 3077805 3040123 3079211 3020532 2892612 2935792
15749 2935792 3051419 3085887 3094005 3055386 3222062 3154821 2984821 3108705 3004491 2993428
15739 2993428 3002156 2947987 3100983 3233175 3010641 3029495 3008630 2920166 2920177 2898600 2936353
15728 2936353 2873386 2961935 3202269 3018951 2833815 2897136 2998860 3120964 3155787 3039612
15718 3039612 3142148 3137994 3159790 3131013 3118538 2976737 2893190 2939883 2979538 3113305 3026248
15707 3026248 2964938 3009716 2977655 3041896 3044128 2909347 2988313 2978785 2993514 3037797 3087759
$$ packed form
15780B877191J69983l7950j48585J17188J52004q4314p1672O6661Q7908j49415
15770B978999l0610l47R5273J13780j6513o0076r7308j57797M105J36199M574
15759B970279r0318J03225j06611J06679R4551l7682L9088n8679j27920M3180
15749B935792J15627L4468Q118l8619J66676o7241j70000J23884j04214j1063
15739B993428Q728n4169J52996J32192k22534J8854k0865q8464J1k1577L7753
15728B936353o2967Q8549K40334j83318j85136O3321J01724J22104L4823j16175
15718C039612J02536m154K1796k8777j2475j41801q3547M6693L9655J33767q7057
15707C026248o1310M4778l2061O4241K232j34781P8966r528J4729M4283M9962
$$ plain form
15696 3087759 2969230 2969994 2919827 2888680 3020981 2990401 2992608 2988542 2896706 2904182 2945881 3035574
15684 3035574 3078856 3085578 3062954 3063761 3109512 3097288 3001010 2988262 2927082 3021177 3065071 3059550
15672 3059550 3096409 2947980 2905740 2990437 3052426 2929838 2859914 2891913 2907308 3043142 2984176
15661 2984176 3115153 3211192 3248632 3242585 2974801 2876789 2983656 2937886 2937288 3020038 3082972
15650 3082972 3002202 3137068 3002802 2714494 2781695 2730157 2858040 3011183 3111765 3204227
15640 3204227 3081381 3014893 2940883 3039201 3238018 3160628 3140317 3063456 3191268 3207510 3088936
15629 3088936 3047777 2979230 2958831 3036789 3101511 3102642 3072325 2977961 3159814 3110232 3108474
15618 3108474 3175749 3083127 2932760 3082236 2996008 2987001 3060237 3122907 3107275 3093652 3097580
$$ packed form
15696C087759j18529P64n0167l1147J32301l0580K207m066r1836P476M1699Q9693
15684C035574M3282O722k2624Q07M5751j2224r6278j2748o1180R4095M3894n521
15672C059550L6859j48429m2240Q4697O1989j22588o9924L1999J5395J35834n8966
15661B984176J30977R6039L7440o047k67784r8012J06867m5770n98Q2750O2934
15650C082972q0770J34866j34266k88308O7201n1538J27883J53143J00582R2462
15640C204227j22846o6488p4010R8318J98817p7390k0311p6861J27812J6242j18574
15629C088936m1159o8547k0399P7958O4722J131l0317r4364J81853m9582j758
15618C108474O7275r2622j50367J49476q6228r007P3236O2670j5632j3623L928
$$ plain form
15607 3097580 2956614 2958577 3144905 3146909 3053580 3063906 3004220 2963371 3082730 3014068 3088316
15596 3088316 3188520 2933356 2959851 2964624 2976780 2965948 2882330 2967060 3089828 2973010 3095132
15585 3095132 3080701 3081462 3076304 3000750 2976867 2982995 2853875 2850133 2937881 3110337 3163459 3010599
15573 3010599 2872983 2956332 3159503 3133535 3069430 3061032 2893009 2963690 3027536 3001758 2965056
15562 2965056 2992484 2945923 3063577 3046431 3028674 3068660 3025506 2978211 3140114 3214988 3178017
15551 3178017 3085494 3074402 3052523 2869969 2912502 2914577 2880586 2905984 3152948 3186666 3191740
15540 3191740 3202992 3355479 3248436 3171211 3119555 3039762 3138275 3084222 3113094 2989739 3033951
15529 3033951 3173285 3150531 3163325 3167239 3205609 3091869 3075064 3205590 3273916 3165283 3082163
$$ packed form
15607C097580j40966J963J86328K004r3329J0326n9686m0849J19359o8662P4248
15596C088316J00204k55164K6495M773J2156j0832q3618Q4730J22768j16818J22122
15585C095132j4431P61n158p5554k3883O128j29120l742Q7748J72456N3122j52860
15573C010599j37616Q3349K03171k5968o4105q398j68023P0681O3846k5778l6702
15562B965056K7428m6561J17654j7146j7757L9986m3154m7295J61903P4874l6971
15551C178017r2523j1092k1879j82554M2533K075l3991K5398K46964L3718N074
15540C191740J1252J52487j07043p7225n1656p9793R8513n4053K8872j23355M4212
15529C033951J39334k2754J2794L914L8370j13740j6805J30526O8326j08633q3120
$$ plain form
15518 3082163 3089404 3154782 3046254 3011757 3026963 3117739 3106021 3127963 3298780 3343804 3149036
15507 3149036 3091091 3097330 2978676 3038825 2973569 3015596 3033995 3107483 3017915 2889181 2982416
15496 2982416 2973100 3047629 3085997 3081292 3046724 3013217 3118251 3101717 2996215 2984409 3154576
15485 3154576 2976718 2876624 2879231 2921386 3172452 3155601 3134534 3055322 2908330 3030881
15475 3030881 3041413 3090464 3096311 3033409 3184185 3258832 3233031 3036632 3000642 3088983 3236818
15464 3236818 3328079 3248920 3176651 3222407 3084581 3099251 3128681 3172920 3047233 3080969 3134054
15453 3134054 3072328 3259052 3231078 3141377 3231172 3269917 3280244 3202421 3191293 3246869 3177188
15442 3177188 3181138 3086481 2991103 3022082 3132945 3240005 3251513 3155611 3151345 3054123 3073039
$$ packed form
15518C082163P241O5378j08528l4497J5206R0776j1718K1942J70817M5024j94768
15507C149036n7945O239j18654O0149o5256M2027J8399P3488q9568j28734R3235
15496B982416r316P4529L8368m705l4568l3507J05034j6534j05502j1806J70167
15485C154576j77858j00094K607M2155K51066j6851k1067p9212j46992J22551
15475C030881J0532M9051N847o2902J50776P4647k5801j96399l5990Q8341J47835
15464C236818R1261p9159p2269M5756j37826J4670K9430M4239j25687L3736N3085
15453C134054o1726J86724k7974q9701Q9795L8745J0327p7823j1128N5576o9681
15442C177188L950r4657r5378L0979J10863J07060J1508r5902m266r7222J8916
$$ plain form
15431 3073039 3207708 3202034 3122713 2986392 3028909 3276898 3251034 3217719 3142054 3084120 3225811
15420 3225811 3236738 3192568 3059938 3011332 3039704 2954114 3089179 3139227 3178394 3058948 3045440
15409 3045440 3275490 3194369 3156488 3114918 3161235 3177686 3046112 3135362 3253332 3156679 3233709
15398 3233709 3165976 3134883 3109408 3071890 3115966 3144880 3197605 3104978 3241717 3208509 3253467
15387 3253467 3170323 3215688 3247054 3167071 3236084 2995444 2872959 3073728 3065852 2971740 3166025
15376 3166025 3156235 3059477 3176161 3166175 3064864 3019377 3185512 3351411 3141764 3041416
15366 3041416 3106502 3016404 3019509 3025418 2975507 3073597 3068688 3094254 2996513 2954021 3109454 3222912
15354 3222912 3222976 3132332 3068507 3091517 2979339 2952051 3144174 3243154 3223079 3331132 3294694
$$ packed form
15431C073039J34669n674p9321j36321M2517K47989k5864l3315p5665n7934J41691
15420C225811J0927m4170j32630m8606K8372q5590J35065N0048L9167j19446j3508
15409C045440K30050q1121l7881m1570M6317J6451j31574Q9250J17970r6653P7030
15398C233709o7733l1093k5475l7518M4076K8914N2725r2627J36739l3208M4958
15387C253467q3144M5365L1366p9983O9013k40640j22485K00769p876r4112J94285
15376C166025r790r6758J16684r986j01311m5487J66135J65899k09647j00348
15366C041416O5086r0098L105N909m9911R8090m909K5566r7741m2492J55433J13458
15354C222912O4r0644o3825K3010j12178k7288J92123R8980k0075J08053l6438
$$ plain form
15343 3294694 3104710 3131635 3204584 3145264 3048479 3034742 3025059 3050913 2957202 2916195 2878722
15332 2878722 3003684 3098764 3043250 3120622 3091086 2997523 3004946 3198951 3206515 3194698 3073622
15321 3073622 3116540 3183963 3086774 2994742 2977759 3035570 3131177 3180738 3228827 3050879 3052428
15310 3052428 3139486 3123277 3105787 2957037 3011209 3063491 3003823 3113194 3146206 3113674 3166629
15299 3166629 3007452 3055809 3094500 3205719 3208184 3098822 2893582 2949145 2980181 2927111 2960686
15288 2960686 3022426 3079130 3070299 3198732 3021472 2886831 3025782 3086336 2871872 2983327
15278 2983327 2975185 2916569 3105567 3149532 3227928 3104035 3174263 3281903 3283553 3100546 2943021
15267 2943021 3028259 3096682 3196063 3065968 3143567 3239120 3282859 3378360 3231617 3052170 2987211
$$ packed form
15343C294694j89984K6925P2949n9320r6785j3737r683K5854r3711m1007l7473
15332B878722J24962R5080n5514P7372k9536r3563P423J94005P564j1817j21076
15321C073622M2918O7423r7189r2032j6983N7811R5607M9561M8089j77948J549
15310C052428Q7058j6209j7490j48750N4172N2282n9668J09371L3012l2532N2955
15299C166629j59177M8357L8691J11219K465j09362k05240N5563L1036n3070L3575
15288B960686O1740N6704q831J28433j77260j34641J38951O0554k14464J11455
15278B983327q142n8616J88998M3965P8396j23893P0228J07640J650j83007j57525
15267B943021Q5238O8423R9381j30095P7599R5553M3739R5501j46743j79447o4959
$$ plain form
15256 2987211 3019183 3021871 3165056 3160592 3160811 3068420 3269305 3321136 3185193 3154129 3088735
15245 3088735 3063144 3162715 3195949 3230338 3267184 3250544 3280490 3204571 3105386 3081119 3122245
15234 3122245 3153149 3189902 3206732 3262828 3169944 3021535 2948794 2962295 3145153 3179336 3224454
15223 3224454 3291201 3177686 3221263 3328483 3271856 3247810 3244082 3216654 3162594 3159190 3250717
15212 3250717 3281279 3194591 3135160 3211530 3264836 3199251 3132114 3280274 3210140 3303576 3225499
15201 3225499 3305869 3384046 3325585 3274478 3296740 3232570 3184474 3244408 3306285 3427731 3356129
15190 3356129 3301597 3155753 3148762 3205359 3139659 3011654 2991477 3042801 3164740 3206742 2990634
15179 2990634 3062628 3181585 3156550 3374900 3454963 3277506 3214979 3257195 3072071 2965123
$$ packed form
15256B987211L1972K688J43185m464K19r2391K00885N1831j35943l1064o5394
15245C088735k5591R9571L3234L4389L6846j6640K9946p5919r9185k4267M1126
15234C122245L0904L6753J6830N6096r2884j48409p2741J3501J82858L4183M5118
15223C224454O6747j13515M3577J07220n6627k4046l728k7428n4060l404R1527
15212C250717L0562q6688n9431P6370N3306o5585o7137J48160p0134R3436p8077
15201C225499Q0370P8177n8461n1107K2262o4170m8096N9934O1877J21446p1602
15190C356129n4532j45844o991N6597o5700j28005k0177N1324J21939M2002k16108
15179B990634P1994J18957k5035K18350Q0063j77457o2527M2216j85124j06948
$$ plain form
15169 2965123 3140668 3113073 3021024 3145796 3228835 3277837 3149657 3112827 3013742 3051892 3065897
15158 3065897 3093244 3172965 3092456 3304408 3369434 3355180 3268853 3219922 3211519 3178476 3185788
15147 3185788 3176381 3178081 3241851 3118162 3157326 3244650 3223827 3266748 3249736 3186160 3199959
15136 3199959 3369224 3155452 3108653 3146465 3304372 3417127 3209482 3290013 3281576 3139001
15126 3139001 3137038 3111732 3114795 3107491 3139646 3142245 3116868 3151872 3107172 3123193 3221927 3300472
15114 3300472 3182405 3019397 3139267 3238157 3187494 3305070 3224026 3308939 3188076 3311127
15104 3311127 3262543 3289651 3223133 3217357 3186293 3008516 2885652 2821556 3035180 3108664 3285323
15093 3285323 3304425 3177156 3190212 3225657 3188127 3262173 3058319 3090016 3136398 3154574 3107717
$$ packed form
15169B965123J75545k7595r2049J24772Q3039M9002j28180l6830r9085L8150J4005
15158C065897K7347P9721q0509K11952O5026j4254q6327m8931q403l3043P312
15147C185788r407J700O3770j23689L9164Q7324k0823M2921j7012o3576J3799
15136C199959J69265k13772m6799L7812J57907J12755k07645Q0531q437j42575
15126C139001j963k5306L063p304L2155K599k5377L5004m4700J6021R8734P8545
15114C300472j18067j63008J19870R8890n0663J17576q1044Q4913j20863J23051
15104C311127m8584K7108o6518n776l1064j77777j22864o4096K13624P3484J76659
15093C285323J9102j27269J3056L5445l7530P4046k03854L1697M6382J8176m6857
$$ plain form
15082 3107717 2974162 2928265 3195448 3161033 3056657 3276492 3373260 3452475 3459378 3325528
$$ packed form
15082C107717j33555m5897K67183l4415j04376K19835R6768P9215O903j33850
$$ [...]
##END NTUPLES=NMR SPECTRUM
##END=
