##TITLE=1H_EC-3032(II-22)
 CDCl3, 8 sc, 
 12.05.2021
##JCAMPDX= 6.0         $$ Bruker NMR JCAMP-DX V2.0
##DATA TYPE= NMR SPECTRUM
##DATA CLASS= NTUPLES
##ORIGIN= UXNMR, Bruker Analytische Messtechnik GmbH
##OWNER= root
$$ XWIN-NMR		Version 3.5
$$ Wed May 12 10:28:23 2021 Russian Standard Time (UT+4h)  she@DPX200
##.OBSERVE FREQUENCY= 200.131506
##.OBSERVE NUCLEUS= ^1H
##.ACQUISITION MODE= SIMULTANEOUS
##.ACQUISITION SCHEME= undefined
##.AVERAGES= 8
##.DIGITISER RES= 18
##SPECTROMETER/DATA SYSTEM= spect
##.PULSE SEQUENCE= zg30
##.SOLVENT NAME= CDCl3
##.SHIFT REFERENCE= (INTERNAL, CDCl3, 0, 15.9689)
##AUDIT TRAIL= $$ (NUMBER, WHEN, WHO, WHERE, WHAT)
$$ ##TITLE= Audit trail, XWIN-NMR		Version 3.5
$$ ##JCAMPDX= 5.01
$$ ##ORIGIN= Bruker BioSpin GmbH
$$ ##OWNER= she
$$ F:/spectra/data/she/nmr/H-F/1/pdata/1/auditp.txt
$$ ##AUDIT TRAIL=  $$ (NUMBER, WHEN, WHO, WHERE, WHAT)
(   1,<2021-05-12 10:25:10.14 +0400>,<she>,<DPX200>,
      <created by zg, POWCHK disabled, PULCHK disabled
       configuration hash MD5:
       00 E9 B6 7A A2 85 ED C7 34 08 36 98 17 FE 4E 26
       data hash MD5: 16K
       D7 1F 3D E3 26 7A 27 94 50 BC 77 32 64 16 3A 66>)
(   2,<2021-05-12 10:25:12.87 +0400>,<she>,<DPX200>,
      <Start of raw data processing
       efp BC_mod = 2 LB = 0.24 FT_mod = 6 PKNL = 1 PHC0 = -11135.96 PHC1 = 19.801 SI = 16K 
       data hash MD5: 16K
       4B 5C AB DF 2F 51 C1 49 87 52 FE F7 27 92 B9 63>)
(   3,<2021-05-12 10:25:31.04 +0400>,<she>,<DPX200>,
      <pk PHC0 = 3.858752 PHC1 = -4.2 
       data hash MD5: 16K
       4C 8D 2D D2 AF E9 A4 B2 C4 11 31 95 F1 3B C4 8C>)
(   4,<2021-05-12 10:25:34.23 +0400>,<she>,<DPX200>,
      <abs ABSG = 5 
       data hash MD5: 16K
       4F 30 AA 0F D4 2B 3D 86 E0 AD FA 8D B6 B6 87 F5>)
(   5,<2021-05-12 10:25:57.32 +0400>,<she>,<DPX200>,
      <pk PHC0 = 3.070274 PHC1 = -5 
       data hash MD5: 16K
       C7 22 92 C4 98 AD 09 88 39 95 C2 80 11 28 FF FB>)
(   6,<2021-05-12 10:26:00.54 +0400>,<she>,<DPX200>,
      <abs ABSG = 5 
       data hash MD5: 16K
       7F C4 9E F9 C4 DC EC 81 AD 69 94 CB BA 76 E7 6B>)
$$ ##END=
$$ 
$$ hash MD5
$$ 94 E7 56 C2 FF E1 A4 39 A7 9C 4B BB 5C 4B 87 3A
##$RELAX= 
##$RELAX= 
##$RELAX= 
##$RELAX= 
##$RELAX= 
##$RELAX= 
$$ Bruker specific parameters
$$ --------------------------
##$DU= <F:/spectra>
##$EXPNO= 1
##$NAME= <H-F>
##$PROCNO= 1
##$TYPE= <nmr>
##$USER= <she>
##$AMP= (0..31)
100 100 100 100 100 100 100 100 100 100 100 100 100 100 100 100 100 100 
100 100 100 100 100 100 100 100 100 100 100 100 100 100 
##$AQSEQ= 0
##$AQ_mod= 1
##$AUNM= <au_zg>
##$AUTOPOS= <>
##$BF1= 200.13
##$BF2= 200.13
##$BF3= 200.13
##$BF4= 200.13
##$BF5= 200.13
##$BF6= 200.13
##$BF7= 200.13
##$BF8= 200.13
##$BYTORDA= 1
##$CFDGTYP= 0
##$CFRGTYP= 5
##$CHEMSTR= <none>
##$CNST= (0..31)
1 1 145 1 1 1 1 1 1 1 1 1 1 1 1 1 1 1 1 1 1 1 1 1 1 1 1 1 1 1 1 1 
##$CPDPRG= <>
##$CPDPRG1= <>
##$CPDPRG2= <>
##$CPDPRG3= <>
##$CPDPRG4= <mlev>
##$CPDPRG5= <mlev>
##$CPDPRG6= <mlev>
##$CPDPRG7= <mlev>
##$CPDPRG8= <mlev>
$$ [...]
##$SUBNAM3= <"">
##$SUBNAM4= <"">
##$SUBNAM5= <"">
##$SUBNAM6= <"">
##$SUBNAM7= <"">
##$SUBNAM8= <"">
##$SUBNAM9= <"">
##$SW= 16.9725357007746
##$SWIBOX= (0..15)
0 0 2 0 0 0 0 0 0 0 0 0 0 0 0 0 
##$SW_h= 3396.73913043478
##$TD= 16384
##$TD0= 1
##$TE= 0
##$TE2= 300
##$TE3= 300
##$TEG= 300
##$TL= (0..7)
0 120 120 120 120 120 120 120 
##$TP= (0..7)
150 150 150 150 150 150 150 150 
##$TP07= 0
##$TPNAME0= <>
##$TPNAME1= <>
##$TPNAME2= <>
##$TPNAME3= <>
##$TPNAME4= <>
##$TPNAME5= <>
##$TPNAME6= <>
##$TPNAME7= <>
##$TPOAL= (0..7)
0.5 0.5 0.5 0.5 0.5 0.5 0.5 0.5 
##$TPOFFS= (0..7)
0 0 0 0 0 0 0 0 
##$TUNHIN= 0
##$TUNHOUT= 0
##$TUNXOUT= 0
##$USERA1= <user>
##$USERA2= <user>
##$USERA3= <user>
##$USERA4= <user>
##$USERA5= <user>
##$V9= 5
##$VALIST= <valist>
##$VCLIST= <CCCCCCCCCCCCCCC>
##$VD= 0
##$VDLIST= <DDDDDDDDDDDDDDD>
##$VPLIST= <PPPPPPPPPPPPPPP>
##$VTLIST= <TTTTTTTTTTTTTTT>
##$WBST= 1024
##$WBSW= 4
##$XGAIN= (0..3)
0 0 0 0 
##$XL= 0
##$YL= 0
##$YMAX_a= 403278
##$YMIN_a= -483517
##$ZGOPTNS= <>
##$ZL1= 120
##$ZL2= 120
##$ZL3= 120
##$ZL4= 120
##$ABSF1= 15.97921
##$ABSF2= -0.9934521
##$ABSG= 5
##$ABSL= 3
##$ALPHA= 0
##$AQORDER= 0
##$ASSFAC= 0
##$ASSFACI= 0
##$ASSFACX= 0
##$ASSWID= 0
##$AUNMP= <proc_1d>
##$AZFE= 0.1
##$AZFW= 0.1
##$BCFW= 0
##$BC_mod= 2
##$BYTORDP= 0
##$COROFFS= 0
##$CY= -3
##$DATMOD= 1
##$DC= 0
##$DFILT= <>
##$DTYPP= 0
##$F1P= 0
##$F2P= 0
##$FCOR= 1
##$FTSIZE= 16384
##$FT_mod= 6
##$GAMMA= 0
##$GB= 0
##$INTBC= 1
##$INTSCL= 1.334414e-10
##$ISEN= 128
##$LB= 0.24
##$LEV0= 0
##$LPBIN= 0
##$MAXI= 10000
##$MC2= 0
##$MEAN= 0
##$ME_mod= 0
##$MI= 1.114404
##$NCOEF= 0
##$NC_proc= -6
##$NLEV= 6
##$NOISF1= 3.799351
##$NOISF2= 2.8
##$NSP= 0
##$NTH_PI= 0
##$NZP= 0
##$OFFSET= 15.96885
##$PC= 1
##$PHC0= -11129.03
##$PHC1= 10.601
##$PH_mod= 1
##$PKNL= yes
##$PPARMOD= 0
##$PSCAL= 0
##$PSIGN= 0
##$REVERSE= no
##$SF= 200.130008524705
##$SI= 16384
##$SIGF1= 3
##$SIGF2= 2
##$SINO= 5.538805
##$SIOLD= 16384
##$SREGLST= <1H.CDCl3>
##$SSB= 0
##$STSI= 16384
##$STSR= 0
##$SW_p= 3396.73913043479
##$SYMM= 0
##$S_DEV= 0
##$TDeff= 16384
##$TDoff= 0
##$TI= <>
##$TILT= no
##$TM1= 0
##$TM2= 0
##$TOPLEV= 0
##$USERP1= <user>
##$USERP2= <user>
##$USERP3= <user>
##$USERP4= <user>
##$USERP5= <user>
##$WDW= 1
##$XDIM= 16384
##$YMAX_p= 374705452
##$YMIN_p= -849904
$$ End of Bruker specific parameters
$$ ---------------------------------
##NTUPLES= NMR SPECTRUM
##VAR_NAME=  FREQUENCY,     SPECTRUM/REAL,   SPECTRUM/IMAG
##SYMBOL=    X,             R,               I
##VAR_TYPE=  INDEPENDENT,   DEPENDENT,       DEPENDENT
##VAR_FORM=  AFFN,          ASDF,            ASDF
##VAR_DIM=   16384,         16384,           16384
##UNITS=     HZ,            ARBITRARY UNITS, ARBITRARY UNITS
##FACTOR=    0.207333158178282, 1,           1
##FIRST=     3195.84611380804, 0,            0
##LAST=      -200.893016626754, 0,           0
##MIN=       -200.893016626754, -849904,     0
##MAX=       3195.84611380804, 374705452,    0
$$ Real data points
##PAGE= N=1
##DATA TABLE= (X++(R..R)), XYDATA
$$ [...]
6602 1755084 1644609 1552309 1554749 1609148 1664032 1623140 1489258 1358520 1196080 1039555 889126
6591 889126 841557 750465 698418 649075 574006 517367 448795 448779 429949 414205 325462 320779
6579 320779 329471 373514 350417 372443 351309 246356 269825 322500 321057 272591 180582 172783
6567 172783 210555 321031 297226 244189 318443 346230 315799 347836 405850 363222 420344
6556 420344 468297 488602 580052 475102 404695 507191 576981 594587 631441 787908 794632
6545 794632 747674 818623 878150 847882 903997 975759 932564 935229 1010974 1008558 1088586 1212001
6533 1212001 1281811 1340479 1311259 1316839 1396206 1430797 1370455 1415412 1515384 1548328 1574771 1635551
6521 1635551 1645807 1528685 1374226 1253389 1191730 1252538 1222607 1182742 1184322 1212232 1164807
6510 1164807 1029640 978389 955874 887679 809418 745410 732833 540001 516044 559432 534680
6499 534680 511236 466506 451791 454953 471693 455296 423746 290550 277719 307877 353401 385633
6487 385633 378125 372410 368768 328692 293677 335034 404507 428736 405991 436437 458536 408681
6475 408681 389877 304799 330258 430936 376045 385394 420788 464647 439581 401022 395160 418779
6463 418779 456429 441518 448159 461161 495248 528379 497459 537227 531789 614104 608321 640360
6451 640360 714218 697602 712243 651881 607395 660310 658380 569189 527661 464682 422543 385174
6439 385174 341982 351898 384531 461175 462763 364150 380047 408661 391934 359244 329394 326193
6427 326193 331182 416520 477732 406079 515277 533492 545060 532740 458293 386671 357824 409213
6415 409213 354992 371382 369689 361299 354681 382676 422908 469638 510784 480142 433358 502261
6403 502261 520455 529837 708618 721078 698102 719724 870157 880756 936538 1017855 1130074
6392 1130074 1212355 1301835 1354615 1449487 1473606 1439295 1471496 1427723 1350849 1255168 1216482
6381 1216482 1281163 1338948 1387891 1321437 1220996 1045269 970824 1033609 987387 892516 903205
6370 903205 869710 836843 799315 787274 878888 837872 770001 771827 804073 863853 869799 902009
6358 902009 971160 1014203 1163281 1255620 1347642 1326921 1358526 1425447 1469497 1514127 1443463
6347 1443463 1344871 1359143 1397590 1528448 1527511 1534622 1481809 1475014 1416794 1404755 1521819 1575468
6335 1575468 1565927 1503265 1554444 1579300 1627622 1653564 1597821 1557621 1543425 1561004 1622851 1621227
6323 1621227 1559973 1547997 1514687 1332697 1236348 1205164 1181736 1170292 1069764 994575 889883
6312 889883 918270 999585 1026242 998818 1038225 1083136 1097716 1107332 1057399 1118853 1213944 1174173
6300 1174173 1182518 1246148 1343910 1398026 1448236 1493172 1494034 1472572 1447362 1406953 1461570 1393698
6288 1393698 1329030 1324371 1280276 1199911 1112865 1025210 953245 846212 821643 732972 711442
6277 711442 672282 587710 631732 608163 522815 533703 612851 592298 512427 387220 398214
6266 398214 397681 448566 444163 451317 454439 441421 405805 400932 445183 449750 369771 369396 380975
6253 380975 389557 451159 409509 415178 444484 453261 472924 475750 460213 475408 577956 695486
6241 695486 662082 710562 750165 779263 725879 630885 631614 665618 706524 665360 696887 675293
6229 675293 634869 533188 553361 476933 442305 366258 284105 303968 195264 182989 166551
6218 166551 109931 101889 137593 241793 250833 146510 127437 211779 128707 120387 146339 141133
6206 141133 198202 185919 105569 89511 144325 192847 172847 177528 188872 203861 178189 240911
6194 240911 254026 256228 261603 226095 267702 284856 198891 154582 156744 174904 213093 155181
6182 155181 181477 256137 243596 221256 227761 266825 280173 192210 70472 67862 90092 90731
6170 90731 114537 195776 282282 350363 393263 498797 459500 394142 517267 594332 626944
6159 626944 481369 412935 412532 437935 364071 361007 409797 327233 309146 278665 228088 252035
6147 252035 245750 183419 161233 76331 -4318 -1587 3494 13154 -17482 -35885 18674 84801
6135 84801 126794 126180 147271 165610 151943 65345 15251 115288 158907 129625 78481 191851
6123 191851 114307 73928 67342 28113 19879 60595 121616 188714 154202 210830 359274 323950
6111 323950 276898 433875 598969 631851 586996 516041 430349 511456 475765 540208 536830
6100 536830 540740 444729 348111 427929 315044 281770 227887 272040 252606 202862 191143 206737
6088 206737 184571 163754 213390 268039 266069 186477 127926 140337 95322 44392 -6062 54744
6076 54744 43779 30777 32147 101934 47073 6148 71161 -19572 -91877 -46466 -20988 -6756
6064 -6756 66385 140482 80413 51468 100414 71359 80353 141180 144276 171198 174786 139951 29397
6051 29397 36650 127137 88292 29557 80320 129587 115674 171406 148706 100727 117537 154054
6039 154054 146100 231798 299853 301505 371091 516848 550957 629205 654827 511601 510340 617132
6027 617132 640385 617106 463314 312385 261884 281832 281223 289892 322338 251531 234216 268431
6015 268431 364668 270296 258220 213792 180988 212842 186311 172988 162196 109659 22841 45664
6003 45664 110813 87035 20416 44843 82144 94061 66053 54105 64398 60705 63489 115297
5991 115297 6691 -15591 36253 60462 74308 80382 61654 20592 35140 129364 101710 90326
5979 90326 144021 211504 280812 176737 107935 60210 151578 155196 129869 145294 172299 197798
5967 197798 205448 273826 188345 117580 202492 151592 238269 309928 401358 503910 518191 535909
5955 535909 566863 482906 448860 439451 405674 389804 414862 378462 222475 213586 228732 175883
5943 175883 71382 98471 79626 92878 60771 58125 39738 33706 19154 14771 87601 73265
5931 73265 140867 116541 48693 41891 67498 -11847 22692 63036 -81843 -120907 -53335 -9264
5919 -9264 -88970 -90212 -78750 -23328 -80996 -58065 -121910 -179415 -147320 -188811 -103875 -72255
5907 -72255 -72992 -95544 -194478 -206743 -166607 -164284 -84163 -41678 -20546 -87470 -91981 -52631 -61048
5894 -61048 -30047 -73151 785 -28111 -17547 62618 36129 38836 92946 52599 111466 84848
5882 84848 -24984 19447 12183 -3858 -17711 20163 5513 -61487 -47515 15814 -17070 -125243
5870 -125243 -123408 -87038 -42843 -31116 17710 56684 66316 48155 44021 80918 133270 132199
5858 132199 93805 123633 130981 152620 184105 126524 35028 108303 152229 115273 77432 -32334
5846 -32334 -99076 -87939 -143080 -159265 -154433 -209337 -218586 -150483 -145290 -180475 -126009 -122660 -172878
5833 -172878 -202605 -212659 -213004 -289808 -313976 -167698 -239319 -291342 -198457 -200214 -101483 -177579
5821 -177579 -219506 -142624 -143574 -234370 -206433 -155276 -130906 -40139 -18318 -86841 -111266 -133921
5809 -133921 -102611 -130454 -91163 -80127 -104295 -56129 -66209 -43775 23227 -126889 -142362
5798 -142362 -93117 -44663 -111464 -109612 -26808 -24088 -42296 -99017 190 10294 11559 45507
5786 45507 29658 -4868 -7638 -54220 7234 -15541 -53377 -56896 -36223 -34594 2173 -5362 -21274
5773 -21274 -27504 -32365 -75204 -63043 -26189 11502 -35689 -13601 -43634 -66395 24605 41599
5761 41599 37839 43260 78999 98979 106610 53001 85556 117143 114386 104173 59541 52287 83353
5748 83353 52209 25990 3887 68230 92371 112610 154284 99531 108134 118531 108844 169886
5736 169886 161446 123777 159659 108284 69716 112686 84703 2805 -88701 -162323 -38238 -1723
5724 -1723 -63090 -73430 53510 -4597 -30524 51268 32089 -6745 35222 103360 154010 173283
5712 173283 152111 136368 145228 203509 224431 262855 300921 298107 268693 373174 367726 427641
5700 427641 513525 542270 688273 757073 738824 640274 548042 514861 460839 382738 329630
5689 329630 361855 317801 224135 240587 229540 246404 259232 166167 187429 193581 222517 225833
5677 225833 280178 233169 265616 263200 220375 221586 207712 174432 292206 367831 328321 210009
5665 210009 158768 233069 258691 263320 238201 209125 236397 273827 314883 427339 504671 549530
5653 549530 587620 604504 591480 606090 611151 564926 556353 494281 407926 370663 341499 307121
5641 307121 256276 198524 202908 204957 143996 193186 133925 154314 202217 142643 74139 61908
5629 61908 12980 82612 41806 121983 174703 189712 169253 157819 77592 39800 77348 167090
5617 167090 118316 98509 232473 175186 76077 -47922 20504 72582 60626 57398 112568
5606 112568 79972 69145 9430 -15404 117768 146842 111320 89497 47338 50198 41255 71315
5594 71315 129869 93512 -11282 -71183 80898 110939 139223 164244 126298 134609 167837 152598
5582 152598 149376 136370 76145 66680 22457 63583 -87308 -58942 -39709 -4504 88035 56361
5570 56361 -19544 -41318 -22783 7727 37675 36619 78467 60878 110448 74500 50185 47256
5558 47256 73095 73128 86702 46688 102710 62981 93556 150394 167591 206547 157773 175513
5546 175513 126542 109806 114765 91246 141276 213055 220620 206106 183516 228316 205796 224360
5534 224360 223783 161900 224855 230482 188605 239554 267255 295450 291613 371107 388601 376827
5522 376827 397215 366893 335016 386354 437020 406253 296832 296417 362709 369776 396890 394557
5510 394557 426537 433538 425876 400553 421009 481154 474948 471376 393833 384190 452252 435457 443938
5497 443938 465025 443736 467822 536874 616137 570882 592543 589519 614529 675461 689437 712457
5485 712457 734904 688979 610881 684438 789007 794324 772877 865307 877249 864179 911541 982228
5473 982228 998030 1013184 1050092 1014218 1103267 1127828 1106471 1199359 1230695 1307568 1460615
5462 1460615 1474708 1500007 1601161 1681409 1804350 1908842 2004388 2108680 2271601 2428436
5452 2428436 2670247 2969805 3273104 3533459 3870283 4168510 4487689 4784544 4886612 4796298
5442 4796298 4617320 4268582 3926283 3583281 3312779 3064427 2903730 2743599 2613625 2567849
5432 2567849 2494341 2406680 2309189 2295456 2285445 2318444 2320953 2381983 2430427 2446027 2546067
5421 2546067 2680171 2674093 2707563 2913264 3158123 3215831 3351025 3468434 3677385 3854793
5411 3854793 4028029 4292520 4628736 4973866 5243289 5605292 6121191 6593216 6875379 6952297
5401 6952297 6791015 6384388 5904943 5470459 5009849 4499366 4114797 3702902 3323503 3151516
5391 3151516 2929473 2659936 2532575 2537802 2529314 2446588 2363962 2238078 2192184 2238135 2263428
5380 2263428 2291934 2353999 2459908 2474276 2524469 2505303 2634904 2767912 2865406 3004698 3186359
5369 3186359 3305432 3335867 3373585 3445997 3422362 3271515 3133676 2857650 2615274 2463187
5359 2463187 2215755 2065132 1965362 1807390 1584301 1584558 1617547 1541646 1476206 1435005 1377052
5348 1377052 1379778 1291438 1211670 1294044 1397011 1374862 1389910 1333058 1307897 1338631 1330377 1238539
5336 1238539 1183588 1166222 1172557 1085911 1013200 1021257 1017229 1054721 922181 931725 884397 744075
5324 744075 757503 795512 769116 791676 854812 866405 774301 758258 780143 724348 759146 716387
5312 716387 701380 668793 612654 701141 681218 683195 638069 656679 651431 699233 672435 727479
5300 727479 757725 795622 718863 697058 717529 678120 539877 620410 577090 604193 637656
5289 637656 584243 571010 546207 606994 594234 601340 543942 582353 571634 604456 578816 584948
5277 584948 673761 669113 654438 615916 533163 670108 643447 602343 621802 664668 653514 534861
5265 534861 570357 606562 610344 517152 540293 648445 540972 439079 495655 506875 521421
5254 521421 615999 611495 619792 607902 613180 684011 683455 678255 674395 625280 696659 642506 614645
5241 614645 631107 584768 669091 724286 679410 609912 584234 550405 546978 650367 697927 699836
5229 699836 701439 737962 639749 596234 634935 680249 732875 732658 700627 704584 750597 855843
5217 855843 841040 886724 909291 829285 767506 787869 854381 874563 843418 830038 844209 846983
5205 846983 896440 882653 849508 878292 987092 948728 912282 924099 919253 866991 858454 744204
5193 744204 818638 853480 852945 810803 857144 909073 900124 876433 882556 936268 1055932 1156355
5181 1156355 1036567 985730 989983 995152 980254 941327 980517 1006233 1057794 1167007 1182500
5170 1182500 1155553 1169718 1201703 1210193 1209119 1155527 1139797 1110259 1188024 1092679 1055655 1187682
5158 1187682 1206708 1169082 1133169 1244682 1331160 1341271 1480060 1495373 1547488 1614288 1727359
5147 1727359 1758748 1792089 2005619 2056475 2058709 2171314 2226484 2307281 2311394 2218770 2159806
5136 2159806 2081355 1971526 1913109 1937161 1900354 1877368 1864585 1998291 2032731 1930188 1969443
5125 1969443 1989920 2025052 2136774 2144345 2185025 2272264 2305817 2398602 2562860 2688813 2744584
5114 2744584 2867699 2948811 3091965 3261560 3483455 3709127 3780728 3795442 3722985 3654641
5104 3654641 3514910 3313908 3214971 3163051 3106730 3035772 2986122 2948066 2930218 2927148 2965020
5093 2965020 3040614 3103882 3084190 3141231 3141482 3164026 3191939 3227872 3349228 3437375 3480548 3589377
5081 3589377 3725889 3778203 3934083 4035374 4218873 4419205 4490101 4569932 4607955 4645784
5071 4645784 4768800 4856769 4999311 5182655 5376146 5609953 5907248 6171663 6370963 6581551
5061 6581551 6799077 7028430 7081100 6984850 6911649 6836842 6761998 6701232 6732139 6721129 6769135
5050 6769135 6738018 6843561 6866055 6839216 6827177 6843271 6926959 6969848 6986302 6960854 7037659
5039 7037659 7063120 7125037 7065330 7163286 7277980 7333351 7340097 7418665 7499018 7477593 7608017
5028 7608017 7610997 7668862 7793070 7831274 7867499 8036480 8108019 8242849 8366872 8574303 8626631
5017 8626631 8718820 8793733 8688471 8499613 8299277 8050415 7847177 7724851 7606793 7510725
5007 7510725 7479496 7506260 7503856 7473788 7515106 7687649 7814652 7954869 7998426 8210312 8465282
4996 8465282 8780885 9086302 9461141 9895489 10347643 10900644 11569278 12227630 12865441 13439708
4986 13439708 14144983 14631539 14751216 14654182 14211057 13575190 13081178 12656055 12330091 12141662
4976 12141662 12056875 11995000 12132201 12208981 12264946 12560763 12924223 13341395 13794276 14337567
4966 14337567 14919457 15642936 16394613 17314910 18435161 19705528 21013896 22428140 23860866
4957 23860866 25237900 26437949 27250187 27304935 26600598 25258931 23662133 22251471 21169526
4948 21169526 20441467 19816349 19465305 19400156 19381216 19425329 19542907 19842386 20378210 20986326
4938 20986326 21617924 22284801 23200362 24218427 25411406 26806615 28452699 30285014 32384695
4929 32384695 34486600 36724424 38885323 40858422 42420112 43281595 43373729 42822210 41642868
4920 41642868 39994380 38071166 36204204 34429382 32808772 31520313 30490439 29730603
4912 29730603 29124926 28721999 28531705 28520060 28687340 29067640 29544233 30181075 30959135 31868868
4902 31868868 32918854 34105603 35574428 37200581 39021518 41262447 43738973 46517158
4894 46517158 49453852 52711226 55780149 58493569 60646764 61614357 61237285 59531541
4886 59531541 56594152 52910579 48826194 44972115 41692486 38800058 36344986 34380311
4878 34380311 32792135 31485218 30467236 29684729 29092650 28682948 28360081 28197638 27902378
4869 27902378 27857783 27956416 28199830 28573685 29108376 29863334 30821642 31946536 33165388
4860 33165388 34542536 35875904 37027126 37929145 38444112 38415688 37661306 36200439 34127990
4851 34127990 31772443 29501361 27306325 25356728 23654797 22184708 20984953 19917027
4843 19917027 19052376 18328323 17706746 17218524 16741875 16479250 16286881 16098079 16020693 15942169
4833 15942169 15793206 15756797 15732183 15641956 15479211 15299382 14984567 14643359 14254633 13787944
4823 13787944 13323746 13000523 12734348 12334115 11932728 11631041 11349350 11077853 10779414
4814 10779414 10576537 10402730 10238099 10213811 10131568 9889344 9835315 9765414 9594949 9546459
4804 9546459 9473786 9327654 9311549 9296961 9317793 9319700 9372039 9335083 9334515 9298499 9228230 9282661
4792 9282661 9281500 9319376 9338193 9285728 9247834 9145276 9055273 9014595 8882665 8820319 8761360
4781 8761360 8661143 8609073 8579226 8538947 8553031 8536454 8426294 8258922 8292095 8195180 8249427
4770 8249427 8219519 8274887 8308849 8321703 8372748 8368934 8417736 8487792 8515462 8407882 8384546
4759 8384546 8343521 8290206 8185977 8066641 7966423 7936973 7779387 7741040 7693684 7701730 7648103
4748 7648103 7590380 7573472 7578214 7555594 7519886 7494383 7384966 7273710 7173867 7123473 7071490
4737 7071490 6966997 6887500 6912764 6882023 6838178 6835567 6925646 7023267 7189255 7265769 7342898
4726 7342898 7429306 7549637 7610973 7573019 7579840 7485962 7421484 7398848 7220781 6969354 6848386
4715 6848386 6650255 6510014 6387931 6217332 6109559 6009615 5895655 5790055 5615153 5475719
4705 5475719 5378287 5198107 5058122 4984259 4822559 4653232 4541942 4476314 4364223 4238438
4695 4238438 4113880 4028812 3976479 3860767 3793461 3629342 3574363 3566865 3497004 3349923 3341267
4684 3341267 3359321 3347970 3313092 3313600 3335414 3342017 3342933 3347691 3339907 3346949 3430560 3451317 3406344
4671 3406344 3422891 3424139 3375233 3280167 3286819 3330058 3296465 3269577 3251200 3234217 3168814 3128983
4659 3128983 3074157 3174395 3159158 3076455 3073928 3094154 3015704 2903988 2926107 2884099 2835347
4648 2835347 2825176 2858589 2829637 2724690 2705433 2696318 2636427 2587424 2579714 2596317 2642557 2717075
4636 2717075 2777907 2848116 2926975 2896388 2987258 2950779 2941780 2907246 2977591 3032498 3068163 3091938
4624 3091938 3096985 3142797 3091124 3036125 2986291 3059752 3085153 3028329 2973842 2964050 2998448 2998657
4612 2998657 2963366 2936950 2913270 2957644 3065438 3104835 3195571 3234578 3237404 3434446 3533202
4601 3533202 3560204 3628221 3665265 3667799 3753578 3824532 3817555 3891252 3953007 3795889 3758848 3772777
4589 3772777 3728614 3756241 3857283 3871694 3891539 4040663 4086924 4018434 4039656 3979741 4054034
4578 4054034 4096461 4142753 4278674 4378552 4503709 4590493 4847772 4993171 5047038 5228526
4568 5228526 5289427 5290640 5370949 5420490 5421196 5369482 5316897 5329674 5381964 5492830 5607076 5730122
4556 5730122 5774334 5885851 6093221 6226446 6370158 6603449 6794005 6864134 6862940 6847409
4546 6847409 6947385 7010791 7095787 7302344 7412456 7540279 7693027 7722371 7869792 8086730
4536 8086730 8140309 8265682 8263522 8276225 8318252 8365135 8489772 8578556 8619466 8788930 9018101
4525 9018101 9161419 9306829 9651189 10072634 10355625 10622929 11006065 11301582 11471607 11581289
4515 11581289 11521346 11423889 11318831 11344832 11309471 11390960 11451609 11627087 11684990 11794309 12018595
4504 12018595 12085369 12134899 12386865 12619723 12819336 13042959 13286644 13559274 13832457 14192908
4494 14192908 14557764 15049749 15557614 16062733 16641251 17301444 18010771 18651886 19392901
4485 19392901 20148089 21008745 21789548 22684579 23674574 24710484 25909803 27223774 28682344
4476 28682344 30290208 32100549 33780452 35486999 36935796 38008410 38858056 39539921
4468 39539921 40330138 41559223 43095653 44970571 47335217 50222924 53459918 57267252
4460 57267252 61493846 66427160 71959154 77897657 84313807 91063589 98179945 105320504
4452 105320504 112267762 118790190 124945997 130565509 135527273 139552981 141969627 142473548
4444 142473548 140757365 136914578 131159229 124061368 116547947 108956196 101767094 94972666
4436 94972666 88315790 82068250 76319847 71156006 66717242 62873697 59617305 56748141
4428 56748141 54288787 52081923 50121567 48319123 46737424 45346834 43977424 42794479
4420 42794479 41643216 40436992 39231047 38018291 36951064 35919351 34857468 33699762
4412 33699762 32302545 30565817 28801302 27029729 25482380 24154213 23017939 22058665
4404 22058665 21225274 20587225 19931537 19333124 18810322 18310311 17926975 17759045 17512447
4395 17512447 17267762 17049546 16791124 16524047 16265534 15938172 15721620 15496429 15245393
4386 15245393 15048831 14865337 14704530 14623479 14592000 14501542 14430842 14446017 14383021 14333429 14191325
4375 14191325 14092344 14028851 13883831 13952709 14081926 14146173 14207808 14157100 13961590 13615423
4365 13615423 13023180 12377663 11930618 11466613 11094977 10776770 10520025 10173642 9819571
4356 9819571 9477003 9065388 8734085 8299720 7973411 7694983 7444505 7198224 7021421 6919371
4346 6919371 6890259 6832613 6835444 6820957 6751655 6808594 6936995 7044201 7031902 6959778 6961269
4335 6961269 6718770 6316907 6091490 5867382 5690631 5544800 5390901 5300084 5254418 5164470
4325 5164470 5171309 5135129 5134095 5126808 5166093 5205316 5328099 5383232 5446001 5614840 5829652
4314 5829652 6135904 6427938 6644939 7033492 7527843 7841439 8030922 8062745 7898335 7391971
4304 7391971 6676358 6199889 5799515 5507750 5267399 5129650 5092851 5049004 4997399 4908812
4294 4908812 4874000 4917955 4932443 5006277 5036782 5107205 5293723 5538675 5825308 6118331 6559194
4283 6559194 6919539 7292363 7807463 8354411 8700646 8950692 8825081 8289400 7476752 6779695
4273 6779695 6067385 5583547 5165993 4867503 4712767 4670793 4620005 4514139 4465386 4383101
4263 4383101 4403279 4388682 4378636 4423359 4487990 4654789 4763841 4886071 5085853 5424368
4253 5424368 5734211 6069860 6426722 6722821 6938373 7010662 6677883 6097815 5468666 4953466
4243 4953466 4522189 4219991 3876224 3613314 3484326 3350075 3245170 3150959 3195155 3092712
4233 3092712 3051795 3017314 3063692 3147455 3208272 3220709 3304908 3356992 3453144 3592933 3676666
4222 3676666 3777585 4008425 4070170 4116472 4078195 3880795 3653633 3421260 3203563 3011943
4212 3011943 2872738 2692417 2631408 2554272 2440422 2470941 2442836 2391207 2347399 2248622 2257031
4201 2257031 2291992 2238087 2198538 2129091 2041365 2089966 2119534 2038738 2053885 2061448 2047980 2052342
4189 2052342 1970529 1948054 1937315 1936977 1856099 1796391 1737730 1754882 1765021 1659267 1533525
4178 1533525 1565587 1607559 1601833 1667567 1586869 1577253 1652684 1651669 1582128 1518010 1495384 1557216
4166 1557216 1526094 1503303 1474000 1522952 1605056 1505895 1464670 1430445 1447695 1396775 1446505
4155 1446505 1477241 1394751 1347648 1384843 1471552 1391981 1471209 1546636 1497367 1523613 1517685 1528664
4143 1528664 1542020 1544384 1544165 1651388 1774722 1786459 1795306 1743464 1772172 1835882 1862344 1884216
4131 1884216 1922433 1942774 2009804 1980536 1978664 1964058 2017341 1945007 1901304 1877196 1908317 1940065
4119 1940065 2043447 2092168 2066263 2145305 2016839 1972522 1950842 1914379 1983728 2061586 2120554
4108 2120554 2076321 2053311 1987646 1973041 2008372 2002903 2018753 2074420 2185687 2156965 2072429
4097 2072429 2091183 2127087 2055452 2075796 2064956 1992885 2011816 2023742 2077248 2136507 2145001 2149134
4085 2149134 2109678 2066997 2015156 2075040 2007141 2034457 2051684 2036520 2066580 2030517 2064489
4074 2064489 2035418 2064661 2093003 2035156 1972270 1974618 1994983 2110227 2211047 2235883 2208006
4063 2208006 2114219 2147643 2229086 2323498 2400667 2343363 2367827 2410359 2414371 2430607 2422064 2459458
4051 2459458 2534495 2492975 2423310 2574766 2530348 2519803 2648328 2685214 2628470 2631433 2725497
4040 2725497 2773651 2708222 2646160 2606667 2596369 2465215 2359802 2430142 2503625 2468453 2362852
4029 2362852 2318994 2364056 2386198 2409661 2469992 2436621 2454372 2521101 2547468 2591754 2606378
4018 2606378 2635577 2594947 2688133 2691705 2736096 2742939 2745326 2743630 2698303 2704401 2708023 2693428 2799251
4005 2799251 2833547 2828670 2886402 2951463 2939082 2932655 3036726 3180347 3318557 3377221 3447949
3994 3447949 3530421 3663907 3535415 3496016 3526391 3589534 3546780 3533866 3673678 3746123 3793598
3983 3793598 3902906 4070934 4169247 4200851 4242064 4217911 4295479 4350589 4465923 4512598 4531347
3972 4531347 4658940 4684892 4744948 4886341 4915895 4907575 4969364 5016020 5086563 5138917 5197954
3961 5197954 5278119 5253743 5327782 5354594 5458466 5601736 5781283 5963673 6098470 6255220
3951 6255220 6549527 6731325 6875808 7021339 7059475 7193744 7342376 7362058 7444611 7654799
3941 7654799 7814962 7909564 7975036 8166023 8244350 8278501 8270820 8302569 8436743 8552981 8619962
3930 8619962 8769791 8920512 8996994 9018320 8998587 8904400 8714221 8606170 8490268 8382848
3920 8382848 8440085 8393421 8367732 8404059 8514293 8699968 8859400 8913471 9077253 9152347 9185371
3909 9185371 9215319 9218465 9189236 9078013 8964001 8833689 8889047 8854228 8827630 8775153 8706527
3898 8706527 8624666 8545951 8471470 8356275 8364840 8358509 8278716 8242180 8164883 8238494 8312451 8326806
3886 8326806 8387726 8506454 8578666 8701635 8804467 8967878 9141668 9272638 9447771 9346306
3876 9346306 9203798 9124854 8977877 8711821 8624852 8546051 8428002 8274902 8121017 8116023
3866 8116023 8043834 8020919 7948813 7949849 7824791 7869796 7899379 7960460 8046449 8116698 8188715
3855 8188715 8340573 8500749 8602250 8715855 8844574 8956953 9048581 9134635 9207424 9360588
3845 9360588 9528640 9701241 9886408 10066611 10169011 10295365 10461101 10703133 10974218 11267489
3835 11267489 11405195 11593104 11776642 12033850 12315709 12695824 12992766 13261462 13555036
3826 13555036 13926640 14237725 14580620 14898975 15209390 15608338 16056219 16433560 16818055
3817 16818055 17316189 17857120 18347709 18881176 19469050 20077463 20779980 21574589 22414629
3808 22414629 23303420 24264682 25344449 26573597 28073853 29688832 31496102 33639479
3800 33639479 35887186 37898157 39725020 41001634 40761247 39117399 37566047 36730964
3792 36730964 36475530 36517877 36800748 37341675 38130765 38956674 39976987 41149818 42361022
3783 42361022 43676977 45108730 46661959 48362526 50342769 52358343 54563674 56953820
3775 56953820 59492328 62026692 64714868 67222745 69345916 71125341 72340400 72812869
3767 72812869 72697003 72137297 71400459 70660210 70177558 70042008 70265276 70774972 71742581
3758 71742581 73025754 74543814 76378619 78543745 81066401 83771406 86662961 89596196
3750 89596196 92611009 95575269 98554188 101714923 104980053 108493667 112278446 116408791
3742 116408791 120661620 124883893 129084429 133141375 136983503 140351932 142934563 144478972
3734 144478972 144749515 143890169 142226217 140432681 138748228 137315177 136216272 135230395
3726 135230395 134378140 133706782 133052484 132388421 131820325 131501737 131326833 131425066 131868582
3717 131868582 132728479 134026532 135539131 137199182 138906481 140293633 141012765 141018680 140088574
3708 140088574 138278334 135614169 132387759 128837544 125231224 121848532 118670782 115789523
3700 115789523 113242308 110996734 109111168 107811745 106891187 106392631 106002695 105405122 104137812
3691 104137812 101717873 98186968 94082899 89627498 85000426 80576292 76357478 72565730
3683 72565730 69295099 66555831 64127555 62095277 60467111 58965935 57614167 56476334
3675 56476334 55496910 54709195 54130443 53622853 53118436 52658368 52110035 51550098 50951453
3666 50951453 50152858 49252478 48241298 47271827 46457625 45545331 44651322 44017943 43561981
3657 43561981 43260205 43152540 43097569 43163230 43024794 42554516 41968504 41143419 40170425 39094063
3647 39094063 38087224 36975689 35882580 34950869 34004272 33168675 32424003 31728388 30957665
3638 30957665 30245344 29581168 29016262 28374335 27785856 27283656 26679754 26162580 25726497
3629 25726497 25225235 24894648 24627092 24332503 23977725 23485175 23040203 22529401 22100346
3620 22100346 21667864 21108445 20713537 20363362 20005905 19658350 19293296 19012511 18688000
3611 18688000 18437017 18231831 18034002 17843736 17746885 17619947 17547517 17473476 17397683 17352759
3601 17352759 17232131 17170378 17217963 17214868 17076165 16979052 16882727 16771462 16788174 16738664 16706249
3590 16706249 16720648 16749366 16838829 16817960 16886217 16972353 17083122 17228767 17423148 17554060
3580 17554060 17728316 17893322 18021031 18177559 18335314 18360099 18472104 18561159 18586700 18602488
3570 18602488 18745781 18797369 18942876 19028984 19120489 19357929 19511390 19654776 19808974 20002765
3560 20002765 20120615 20321864 20583201 20809821 21018340 21068530 21208437 21351265 21523276 21619365
3550 21619365 21549342 21574824 21630556 21658277 21744913 21894694 21915716 21935516 21993152 22059491 22192877
3539 22192877 22358383 22402487 22522968 22672004 22798107 23027249 23237898 23332107 23429554 23630833
3529 23630833 23676149 23631465 23711059 23766430 23836144 23756128 23728920 23685869 23739680 23816188 23869571
3518 23869571 23854297 23861692 23997899 24038421 24087204 24289101 24447906 24531390 24674672 24954432
3508 24954432 25071249 25111182 25298910 25458448 25381026 25426492 25434416 25439276 25391069 25499562 25616448
3497 25616448 25748606 25858722 25853918 25928823 25973660 26048680 26090192 26174184 26290248 26340750 26333741
3486 26333741 26310102 26304036 26384747 26486698 26644312 26813291 27007085 27334430 27707595 28024374
3476 28024374 28368085 28849589 29291214 29704230 30202005 30671930 31220917 31770024 32310301
3467 32310301 32862913 33606069 34347062 35156225 36059556 36951330 37896573 38986657 40027687
3458 40027687 41136780 42286564 43442933 44758159 46128501 47666844 49360485 51160711
3450 51160711 53297154 55605767 58348625 61509590 64983583 68925848 73351411 78243050
3442 78243050 83703481 89866502 96842539 104758930 113867785 124521356 136832110 150882558
3434 150882558 166367629 183029352 200278718 217286394 232251591 242728813 245265545
3427 245265545 238277715 225403784 212008835 200486930 190791499 181719858 171172468
3420 171172468 158759781 145975522 133935618 122978904 113460754 105147395 97589468
3413 97589468 90726484 84405979 78668293 73494883 69091007 65514808 62370720 59621895
3405 59621895 57317877 55376719 53618594 51994847 50505061 48947879 47071425 45062075
3397 45062075 43140548 41269622 39660529 38317664 37030334 35796646 34626789 33379491
3389 33379491 32062148 30869540 29497796 28310110 27357546 26380026 25457161 24651827 23841980
3380 23841980 23139911 22573873 22012357 21524790 21062945 20636102 20114486 19758059 19371034
3371 19371034 18992466 18575236 18252376 17882448 17505348 17186826 16776309 16420423 16143324
3362 16143324 15795581 15385123 15072251 14772940 14554313 14317177 14083640 13826432 13621480
3353 13621480 13430649 13320040 13114010 12929238 12800711 12803148 12736806 12630533 12575356 12630364
3343 12630364 12600827 12517282 12516650 12523210 12512040 12556024 12617135 12659702 12620649 12711870 12981697 13084472
3331 13084472 13174862 13420522 13696808 14008617 14416900 14818078 15173598 15733402 16298983 17012538
3321 17012538 17932087 18956136 20191671 21568436 23014113 24328340 25657588 26591579
3313 26591579 26611411 25419327 23690429 22043943 20755566 19801678 19202530 18711792 18291911
3304 18291911 17857091 17278589 16730959 16192171 15831536 15506962 15240494 15152120 15211475 15348112
3294 15348112 15458824 15653711 15877546 16064778 16215956 16077417 15831686 15272771 14663993
3285 14663993 14178263 13776239 13359157 13104907 12938291 12628631 12552938 12459583 12347419 12379142
3275 12379142 12446005 12487588 12691697 12947025 13196353 13369519 13735851 14102206 14443088 14956006
3265 14956006 15562267 16107881 16756374 17425874 18168233 18727692 19141790 19320389 19247450 19113046
3255 19113046 18790990 18531235 18365487 18171548 17752960 17014096 16097138 14988690 14066629
3246 14066629 13226381 12514152 11788424 11164164 10718641 10236824 9917280 9604059 9326363
3237 9326363 9097022 8911771 8805356 8706870 8616616 8521225 8493449 8496288 8452124 8443244 8424491
3226 8424491 8420063 8442209 8494808 8589114 8665561 8878664 9109997 9241613 9361686 9502662 9646261
3215 9646261 9688608 9663290 9382047 9187515 8832376 8413133 8098928 7706923 7329388 7202948
3205 7202948 7023115 6748509 6535695 6432114 6466130 6351567 6343936 6322263 6265235 6163938
3195 6163938 6053302 6014212 5970614 5903463 5774429 5593660 5526343 5448521 5410339 5332109 5202155
3184 5202155 5174501 5071686 5087452 5007021 4992460 4917049 4792172 4693471 4622035 4590508 4554481
3173 4554481 4430176 4384828 4359247 4345741 4296693 4309094 4307114 4315852 4304553 4308951 4258818 4276238
3161 4276238 4259538 4202495 4170162 4089223 4083266 4069348 4086256 4164260 4168878 4151025 4207906 4234867
3149 4234867 4197768 4190163 4237225 4169606 4226705 4192233 4274484 4330485 4324811 4315125 4301904 4363091
3137 4363091 4385217 4334744 4316000 4278361 4176245 4198268 4238851 4244933 4215854 4236761 4250520
3126 4250520 4287945 4280795 4269393 4336916 4341347 4306616 4359036 4446056 4422748 4441043 4483930 4475086
3114 4475086 4554660 4620563 4638502 4735980 4843649 4847372 4913643 5015294 5074773 4997412 4948841
3103 4948841 5010437 5027582 4934809 4995944 4969198 4804652 4720860 4689564 4746989 4702085 4659786
3092 4659786 4650555 4673233 4643393 4662026 4622347 4561148 4572942 4576864 4572136 4634918 4639264 4691918
3080 4691918 4596322 4551488 4582005 4653616 4688617 4633832 4698720 4776747 4855078 4958291 4979705
3069 4979705 4950228 4869996 4928090 4947946 4913540 4915968 4872098 4933829 4943452 5031461 5089062 5025760
3057 5025760 5083109 5111149 5154157 5140663 5177899 5342084 5393742 5383309 5459464 5461708 5502742
3046 5502742 5544146 5500437 5574518 5671212 5804887 5842597 5865381 5934351 6046765 6130547 6322663
3035 6322663 6458518 6493457 6687414 6877548 7133170 7236678 7444801 7717986 7888635 8140864
3025 8140864 8361839 8553808 8886731 9129736 9348643 9729836 10156712 10600908 10983766 11459199
3015 11459199 11984641 12537283 12984770 13514640 14020035 14376820 14737560 15124973 15484999
3006 15484999 15942358 16362107 16957936 17553594 18240716 19023305 19831377 20756288 21669676
2997 21669676 22489563 23099561 23500004 23768947 23861263 23870759 23891765 23938315 24052568 24418172
2987 24418172 24896332 25496632 26173513 26801627 27499563 27978295 28337263 28332770 28068192 27435346
2977 27435346 26716205 25961911 25242763 24650545 24255281 24041854 23996468 24032304 24053366 24193883
2967 24193883 24234265 24030160 23617294 23018536 22161510 21126396 20119398 19119197 18187978
2958 18187978 17543007 16943693 16367539 15911366 15528493 15214968 14798856 14477923 14079879
2949 14079879 13452047 12898225 12213114 11621793 11002831 10462426 9970585 9511818 9124620
2940 9124620 8743255 8389197 8102132 7868576 7643394 7391608 7195933 6916353 6632658 6362256
2930 6362256 6029269 5831226 5638687 5452104 5236112 5011060 4884078 4818595 4700904 4513162
2920 4513162 4389346 4263298 4077150 3960615 3932433 3909488 3862751 3728917 3714712 3674886
2910 3674886 3562504 3500901 3367428 3253986 3239332 3184996 3106497 3048738 3029855 3066292 2988473
2899 2988473 2965529 2884075 2761564 2737388 2718953 2678738 2620369 2691335 2694723 2582911 2597386
2888 2597386 2498549 2452903 2366071 2388369 2408998 2411893 2400514 2551019 2645954 2549720 2471432
2877 2471432 2533406 2541181 2473799 2425539 2315763 2366152 2254544 2173123 2205124 2161361 2145623
2866 2145623 2075263 2056181 2071371 2019083 1954218 1958532 1970342 1934814 1896563 1876513 1837943 1735594
2854 1735594 1766025 1729381 1725071 1773974 1776155 1725674 1738541 1819995 1828480 1793882 1824457 1791314
2842 1791314 1785470 1722140 1748150 1839479 1787747 1685482 1634316 1639497 1635575 1610587 1652728 1670941
2830 1670941 1677664 1593473 1526722 1522616 1526198 1556895 1602035 1575613 1535716 1561239 1557919 1557304 1624993
2817 1624993 1592288 1606654 1648425 1620285 1750177 1779886 1712684 1725397 1815287 1870238 1844950
2806 1844950 1856731 1816713 1845069 1838762 1830205 1768040 1722331 1777407 1728252 1771561 1770281 1791115
2794 1791115 1733881 1735994 1782948 1704676 1604719 1577757 1650084 1660660 1594458 1580341 1594521 1664439
2782 1664439 1627318 1527243 1436365 1518353 1535429 1542380 1534618 1548112 1585450 1603779 1598699 1662846
2770 1662846 1675273 1634373 1630181 1731500 1736603 1639241 1696379 1752331 1684786 1749421 1735884 1604563
2758 1604563 1509814 1618575 1695467 1750534 1763982 1705752 1659728 1590094 1551429 1538251 1564547
2747 1564547 1545089 1488531 1566618 1514575 1425770 1519067 1497937 1517233 1484484 1460452 1490923
2736 1490923 1478500 1497562 1555004 1595965 1664595 1679978 1596453 1500265 1474948 1509326 1599527
2725 1599527 1600581 1573127 1556974 1635609 1679507 1733584 1706870 1703684 1729491 1760843 1710961 1691451
2713 1691451 1645094 1700282 1713340 1675842 1612864 1614348 1630568 1633374 1571879 1590668 1717999 1790541
2701 1790541 1778688 1765456 1797931 1766909 1695919 1800723 1711152 1776485 1760640 1761816 1875776
2690 1875776 1851126 1862700 1836914 1924110 1951950 1952652 1931286 1961099 1890202 1892595 1890979 1985738
2678 1985738 1947041 1915334 2061353 2063476 2002592 1957336 1958567 2035853 1998694 2000659 2004847 2003771
2666 2003771 2101606 2087278 2011430 1991434 1980119 2104599 2234835 2308927 2300443 2291902 2346143
2655 2346143 2320119 2359571 2349918 2331056 2347079 2333291 2450374 2481157 2458204 2579089 2607586
2644 2607586 2665721 2648573 2597138 2640447 2674806 2676906 2646305 2531717 2582843 2544479 2497979
2633 2497979 2516845 2525627 2510417 2555626 2578458 2525059 2515477 2452398 2608107 2697928 2708395 2700602
2621 2700602 2770584 2813175 2932051 3044615 3052448 3000060 3105140 3187765 3334901 3418932 3460770
2610 3460770 3554848 3735326 3898943 3984732 4043412 4144767 4348896 4348664 4377516 4444588 4514622
2599 4514622 4613672 4650801 4605642 4617449 4709601 4749987 4762810 4745363 4786407 4861500 4805225
2588 4805225 4873554 4798552 4688818 4691534 4698818 4687199 4692897 4665926 4653426 4706790 4618803 4540703
2576 4540703 4410344 4390246 4345503 4290531 4204676 4155425 4045961 4079309 4105415 4124772 4080378
2565 4080378 4038311 4062888 4113072 4097942 4169802 4244232 4279785 4416526 4450527 4518849 4596920
2554 4596920 4690635 4748428 4820699 4799897 4768249 4667146 4600672 4500519 4440506 4392098 4424939
2543 4424939 4466096 4554742 4546070 4502294 4520675 4563680 4666898 4720393 4820932 4837097 4953226
2532 4953226 5062387 5102905 5145468 5194809 5294071 5372036 5468999 5606568 5743804 5752619 5777989
2521 5777989 5718454 5614353 5501089 5413802 5346378 5305934 5160356 5141548 5138500 5133381 5126821
2510 5126821 5031343 5026281 4938129 4870315 4878920 4763622 4646258 4609812 4514689 4516835 4554419 4390603
2498 4390603 4408088 4461153 4399296 4390096 4406449 4396121 4358898 4363461 4389659 4441418 4459976 4450353
2486 4450353 4372160 4352377 4440365 4552091 4593689 4662461 4765471 4824895 4878177 4947844 5005400
2475 5005400 4958402 4966947 5047173 5120398 5116564 5081781 5069240 5078586 5221736 5306968 5304011 5199537
2463 5199537 5258374 5269750 5368766 5443635 5420328 5427602 5427029 5355553 5221592 5210335 5179149 5223470
2451 5223470 5218729 5235163 5187386 5141033 5085441 5096992 5087681 5009674 5036041 5180477 5166840 5232254
2439 5232254 5291521 5271605 5278030 5303295 5269107 5167769 5148716 5225133 5369786 5499997 5495658
2428 5495658 5465476 5529992 5559101 5600214 5614632 5688322 5720495 5810508 5877002 5990932 6100158
2417 6100158 6142771 6098639 6305472 6456847 6588749 6779758 6880875 6963998 7084040 7378384
2407 7378384 7685498 7875239 8043358 8199949 8453154 8710499 8925959 9169210 9352930 9620734
2397 9620734 9812700 10040111 10356413 10528556 10685710 10826110 10871066 11001842 11211508 11347418
2387 11347418 11403082 11475887 11548549 11694543 11737937 11749273 11816423 11826033 11842525 11770062 11702841
2376 11702841 11758090 11754386 11666613 11596564 11576912 11566064 11550811 11486792 11417356 11423509 11400669 11445736
2364 11445736 11594853 11753099 11800009 11849551 12031455 12070143 12237635 12380504 12468720 12590853
2354 12590853 12737853 12894233 13006072 13209887 13516351 13787564 13981967 14214575 14604857
2345 14604857 14918699 15201610 15495449 15809905 16046604 16287424 16706986 17120839 17588355
2336 17588355 18030865 18534314 19005485 19555576 20115554 20718029 21362254 22080963 22696478
2327 22696478 23504228 24447104 25290771 26232599 27364379 28480532 29719835 31181196 32620489
2318 32620489 34163742 35954241 37901680 39981319 42218815 44623795 47405677 50302757
2310 50302757 53384535 56706753 60228575 63709977 67127063 70319395 73044453 75438930
2302 75438930 77179393 78387620 79040266 79168596 79008564 78590379 78089354 77570579 77156208
2293 77156208 76895385 76906586 77029086 77142631 77227990 76974266 76370410 75308188 73774451
2284 73774451 71806483 69404189 66513096 63442890 60226399 56997086 53851976 50960480
2276 50960480 48269369 45943208 43985863 42211514 40697981 39366145 38313327 37433055
2268 37433055 36690657 35955767 35420878 35046927 34488851 33970081 33729002 33309816 32957133
2259 32957133 32673639 32457498 32114814 31884429 31730798 31604060 31577810 31522879 31352328 31241292
2249 31241292 31313136 31398831 31323180 31168143 31073356 31001094 30926641 30788566 30635374 30520221
2239 30520221 30360103 30172339 30105875 29967984 29931107 29959760 29825102 29820512 29865299 29895985 29897458
2228 29897458 29852864 29912387 29967650 30058672 30196035 30215931 30365780 30611679 30867853 31156709
2218 31156709 31474642 31837301 32159333 32570822 32946152 33341685 33881735 34399215 35031980
2209 35031980 35723765 36341663 36973782 37682566 38517594 39373387 40210510 41187761 42337241
2200 42337241 43539027 44822127 46235621 47787500 49493851 51322753 53457120 55691225
2192 55691225 58102479 60887458 63865051 67126507 70633473 74647199 78909916 83563495
2184 83563495 88636670 94122965 100041225 106368027 113049197 120055303 127235729 134568514
2176 134568514 141622625 148115821 153826094 158528241 161949236 164389427 165886752 166588459
2168 166588459 166844515 166807678 167019232 167537287 168453750 169568663 170378042 170604960 170617260
2159 170617260 170362904 169544275 167763659 165015905 161024699 155572424 149095618 141997224
2151 141997224 134617622 127060303 119693253 112928390 106804793 101241558 96235245 91880218
2143 91880218 88078769 84834681 81970465 79662818 77865678 76439953 75299834 74361303
2135 74361303 73634026 72943753 71914494 70380359 68679269 67353671 66525207 66074679 65855239
2126 65855239 65664361 65371533 64992937 64689931 64341432 63871742 63320414 63012723 62985143 63189146
2116 63189146 63632220 64401596 65490773 66990488 68859977 71008111 73541322 76457200
2108 76457200 79820758 83552460 87579063 91930650 96482169 101059361 105703480 110146857
2100 110146857 114052770 117452389 120386069 122944068 124973657 126585478 127451768 127646305
2092 127646305 127313292 126532831 125631624 124503660 123428225 122546963 121716257 121198234 121025867
2083 121025867 121031222 121160656 121345056 121570716 121691913 121506971 120948267 120038862 118611249
2074 118611249 116550565 113976974 110961095 107375227 103449111 99250829 94990613 90684270
2066 90684270 86388866 82133179 78230149 74625866 71192936 68169426 65402557 62868143
2058 62868143 60446136 58191813 56230099 54514399 52779216 51220440 49814052 48611380
2050 48611380 47479539 46422429 45567822 44689298 43979707 43363088 42956860 42604672 42303596
2041 42303596 42107754 41983438 42000405 41991379 42129911 42274113 42389350 42527472 42770276 43168528
2031 43168528 43592684 44310486 44983936 45823147 46762209 47712681 48827228 49892519 50992888
2022 50992888 52053691 53071985 54133617 55142416 56136658 57112264 58176546 59369096
2014 59369096 60746797 62404922 64370042 66540078 68874100 71438874 74142774 77003224
2006 77003224 79981955 83215125 86400874 89902951 93913879 98499756 103448512 108360121
1998 108360121 113458057 118661773 123379693 127161291 128265383 122352785 111341026 101436417
1990 101436417 94217914 89025536 85472559 83210553 81872058 81315005 81210023 81512630
1982 81512630 81904148 82247635 82505766 82628765 82640586 82410906 82073535 81675434 81372866 81375824
1972 81375824 82023765 83366136 85085207 87305593 90149420 93287055 96105811 97548149
1964 97548149 93925923 83627620 72233708 63318129 56693107 51647615 47621367 44446757
1956 44446757 41867490 39749600 37891565 36200315 34637789 33206418 31772105 30555569
1948 30555569 29571036 28657348 27874602 27135094 26511438 25935631 25369233 24898997 24458876
1939 24458876 24104920 23735478 23484924 23282566 23125617 22899880 22728866 22591115 22481169
1930 22481169 22369972 22327635 22298910 22298789 22414683 22573359 22748862 22816810 22871994 23020991 22925053
1919 22925053 22745753 22571123 22339023 22005813 21738443 21358813 20902151 20473296 19967416
1910 19967416 19499146 19007577 18685109 18337073 18004896 17610650 17248641 16961172 16691680
1901 16691680 16405332 16012205 15747378 15612186 15350715 15192157 15162377 15073488 14964550 14876277
1891 14876277 14778251 14677158 14551271 14474805 14392150 14401661 14374677 14418443 14393826 14346763 14325264
1880 14325264 14279301 14259706 14225545 14250493 14255731 14359328 14432574 14472697 14466645 14480894 14446622
1869 14446622 14541692 14620317 14656335 14714598 14927041 15134237 15303313 15520224 15677672 15865944
1859 15865944 16147622 16362879 16596777 16862883 17045674 17327836 17646289 17978788 18300041
1850 18300041 18722888 19175846 19613122 20212467 20807598 21478730 22192733 22861027 23674556
1841 23674556 24296445 24792346 24975590 24859774 24635905 24336609 24182721 24138739 24268254 24574803
1831 24574803 24834034 25244507 25727888 26283403 26908595 27446738 28097401 28754167 29407408
1822 29407408 30197251 31085353 31973346 32826050 33636124 34377986 34904366 35174637 35349737
1813 35349737 35426065 35482485 35458793 35205294 34723777 34055234 33300161 32651070 32203552 31793944
1803 31793944 31555418 31445567 31392930 31421105 31486583 31601594 31783824 32001496 32299601 32633550
1793 32633550 32931853 33282742 33772060 34176149 34739329 35217889 35668195 36160469 36516694
1784 36516694 37008473 37392355 37804250 38403265 39123305 39879632 40804247 41743065 42836045
1775 42836045 43966038 45260615 46706777 48235201 49808873 51546362 53447269 55348400
1767 55348400 57382199 59424242 61608040 63848588 66305582 69135062 72253884 75908766
1759 75908766 80101149 84693193 89998088 96062171 102789404 110368499 118792311 128171122
1751 128171122 138504905 150111019 163349091 178604212 196194199 216794688 240168638
1744 240168638 265740994 292703094 319951204 345400371 365349037 374705452 367863208
1737 367863208 343459966 307892729 270575815 237232982 209596827 187348835 169647479
1730 169647479 155262822 143432268 133212140 123951438 115382010 107429137 99866658 92909572
1722 92909572 86540701 80728343 75589027 71002794 66832266 63180718 59952154 56986713
1714 56986713 54120494 51405657 48890243 46626370 44584598 42737529 41035057 39362098
1706 39362098 37846013 36458256 35139961 33886228 32564905 31384100 30373644 29439368
1698 29439368 28638231 27830005 27150364 26574073 26012686 25507839 25019527 24552123 23989959
1689 23989959 23451992 22981826 22493841 22121692 21597630 21100464 20696041 20224492 19783070
1680 19783070 19377097 18984126 18525215 17947863 17491382 17085511 16789313 16457525 16026275
1671 16026275 15660797 15305981 15040860 14639656 14232706 13892548 13607897 13298153 13012509
1662 13012509 12756282 12543483 12248629 11989693 11747148 11426379 11212706 10999961 10737433
1653 10737433 10556322 10358568 10119842 9880715 9712298 9470428 9214184 9084847 8855418
1644 8855418 8731182 8647296 8552592 8311508 8206940 8177365 8041416 7913052 7839918 7751264
1634 7751264 7572357 7429926 7400935 7312883 7199216 7121050 6927941 6786402 6711693 6585685
1624 6585685 6467475 6429995 6328280 6169868 6162978 6082068 5956303 5912101 5857984 5720672 5607968
1613 5607968 5547103 5412470 5373567 5318966 5231369 5236862 5206621 5055958 4937069 4867175 4801338
1602 4801338 4791255 4798505 4750550 4742257 4622000 4420875 4336072 4283921 4252690 4283324 4241403
1591 4241403 4126995 4159818 4100853 4023886 4048879 4045479 3976655 3959068 3838437 3784918 3765349
1580 3765349 3637415 3599043 3572989 3496936 3532140 3545919 3540655 3561179 3605199 3588106 3516251
1569 3516251 3467118 3442836 3416249 3480513 3449697 3440328 3425775 3423101 3460816 3412972 3389053 3395679
1557 3395679 3428323 3439229 3327474 3286032 3270007 3226550 3202654 3186733 3194349 3111180 3082930
1546 3082930 3002099 2995379 2943183 2922881 2836742 2810475 2807259 2695308 2640939 2711938 2639035 2592342
1534 2592342 2541048 2497462 2368160 2284445 2286173 2229322 2187118 2207190 2203358 2173230 2195791 2150345
1522 2150345 2158591 2116583 2084240 2022602 1964728 2040174 2068989 2121069 2073967 1962800 1898231
1511 1898231 1973222 2039189 2085068 2077517 2076338 2116060 2113931 2099939 2071263 2098185 2060092 2027526
1499 2027526 1964871 1964393 1945287 1952265 1913472 1943036 1919965 1907560 1920901 1896817 1859003 1815221
1487 1815221 1746758 1703202 1709742 1754410 1764456 1699660 1749177 1820549 1864767 1848005 1789633 1756839
1475 1756839 1743582 1827480 1877530 1827908 1765229 1793586 1866149 1837547 1806354 1728738 1838449
1464 1838449 1922455 1885857 1857699 1896498 1905714 1922374 1908930 1890037 1793958 1805435 1880388 1921774
1452 1921774 1892353 1955229 1994830 2008216 2089551 2178477 2281531 2380918 2528977 2600061 2680509
1441 2680509 2804535 2848893 2890450 3048273 2987043 2772846 2697573 2589456 2409456 2281139
1431 2281139 2170079 2213910 2122056 2025517 1956647 1957146 1812589 1748319 1702335 1700286 1638713 1491682
1419 1491682 1441840 1495132 1508029 1397150 1338114 1305518 1364911 1307013 1220616 1243985 1189826
1408 1189826 1228215 1143585 1128238 1162394 1177603 1160862 1237685 1219196 1195590 1186331 1166829 1307608
1396 1307608 1305763 1250139 1211368 1192259 1173979 1126627 1104385 1124694 1060505 1020953 1005149 1012659
1384 1012659 940283 946271 992301 1000703 950956 973484 975346 924437 961446 916774 871077 867829
1372 867829 864193 871993 848803 891676 926037 997630 947133 912547 910254 907038 839054 854095
1360 854095 881094 833555 816497 797240 773595 806405 801993 791672 820380 811777 805213 760621
1348 760621 762265 883537 823397 799021 832214 820661 856068 863403 910488 870172 771880 809797
1336 809797 844969 879052 833254 894535 890981 756234 789418 684540 685104 747054 701514 672508
1324 672508 633803 612559 638623 625564 599777 601981 653588 652734 679485 752830 654897 532286
1312 532286 548891 534044 477327 480307 472563 450529 422303 501079 599698 607791 523933 428638
1300 428638 378933 380044 285211 337501 287582 223370 227455 184828 245240 262688 280781 284175
1288 284175 257871 261457 323543 334025 354728 267564 286466 293385 331145 234143 217619 254713
1276 254713 306260 372134 374556 308801 363267 314232 395224 431687 378558 336172 318015 364738
1264 364738 316196 352139 324610 269475 281472 244333 219353 297370 296965 213087 187694 278965
1252 278965 348744 390684 295618 226646 145023 156320 137428 79702 144549 140933 200979 319592
1240 319592 339053 349112 377797 336819 303615 347159 295908 267384 245174 291568 328130 342097
1228 342097 314903 325751 305180 380656 359669 414104 413607 388381 458785 484192 458185 429404
1216 429404 392909 318874 308615 293478 342513 357945 375664 370074 404367 369103 386996 415777
1204 415777 434089 377881 370171 334897 323779 239413 272292 285357 268545 276895 274170 299866
1192 299866 342500 411538 405506 354296 381404 357034 350302 314476 324018 373004 338899 328358
1180 328358 407688 409270 334894 346450 300544 342342 377842 390318 420815 395835 384444 360274
1168 360274 368040 373501 301176 243584 157884 164574 176019 191250 210286 149158 232848 410063
1156 410063 265736 253295 268999 362902 369795 302476 195923 185403 299216 269706 303989
1145 303989 342455 343396 413934 392470 449887 454143 470506 445337 399892 363341 405488 329188
1133 329188 329829 329556 301081 324799 276927 343675 311214 287142 296321 277951 310313 404903 408967
1120 408967 395856 367825 319649 332398 360981 329556 339235 404089 465966 440341 470751 507172
1108 507172 531993 503945 558542 567876 520722 513443 449302 427070 438665 438630 348994 330038 372674
1095 372674 378589 401005 405956 437152 416991 373371 388616 396065 391711 419014 391374 398263 281542
1082 281542 370891 363138 332587 401360 423298 390355 481051 490869 483298 494638 464945 435033
1070 435033 495697 515175 511064 546838 493699 560432 587713 606710 695005 713104 619354 625669
1058 625669 575604 555226 520459 620788 578156 520043 551415 586098 635290 617021 633650
1047 633650 664346 609280 546423 589988 568163 591629 562211 611728 672286 727611 697461 735081
1035 735081 714154 702666 759623 786744 803335 752191 737602 748237 785116 855746 825480 835606
1023 835606 918162 954767 939006 921957 1085017 1197361 1174891 1272286 1280722 1284029 1306997 1370397
1011 1370397 1506529 1504293 1628840 1758407 1808103 1813291 1796443 1825589 1948226 1938811 1988125
1000 1988125 2154521 2255788 2438754 2469344 2571700 2782510 2863693 2881668 3006676 3267302
990 3267302 3520233 3794058 4006448 4332558 4802242 5115719 5404886 5787411 6199234 6755014
980 6755014 7364063 8089044 9047838 10367611 12043716 13890557 15691343 17943650 20484862
971 20484862 22806001 25065803 25713193 21523801 16222170 12891816 10600739 8969556
963 8969556 7697918 6774793 6051858 5431698 4969202 4665948 4331003 4022047 3740953 3615438
953 3615438 3511876 3242198 2910060 2603225 2513420 2383698 2220663 2130674 2034061 1982277
943 1982277 1809615 1699212 1623757 1659385 1657613 1516008 1496367 1534156 1444896 1404378 1252253
932 1252253 1149193 1165990 1133149 1038647 980419 1005431 934051 886211 924224 831001 741489
921 741489 741210 757005 749413 706303 634108 666571 712033 774980 751716 712475 599837 604136
909 604136 624876 676258 701940 734474 715530 676993 658566 625007 595916 628776 627003 683072
897 683072 592724 584506 579793 596060 584219 505711 469486 481862 573038 484774 507657 490178
885 490178 485123 463083 427679 430627 425347 341158 349935 381997 370191 374328 285658 248952 224037
872 224037 255793 205188 176511 212406 249241 271563 279332 284797 238525 233535 303869 285624
860 285624 254428 266849 239460 211217 184575 164612 189501 181169 197126 80528 16576 85712
848 85712 115679 90400 48352 80633 74322 -26417 -40578 21073 56938 136796 89060 105581
836 105581 149411 26626 78102 124131 118656 56631 -2071 55280 109128 195525 163192 173201
824 173201 152330 158072 84461 92998 129514 167096 153457 195831 90693 103952 129269 186495
812 186495 217493 95269 140808 91954 76525 104043 154569 165167 145841 228675 148213 148047
800 148047 185488 163169 161205 157180 162217 207992 216636 239083 240617 261295 224065 257552 216143
787 216143 127868 143688 151103 46465 58347 75988 56439 106682 103727 -18662 -15831 -23109
775 -23109 -105421 -54610 -98170 -82886 -11997 1130 1527 62890 76135 76033 77508 60715 71238
762 71238 135228 200794 174800 107661 162717 107342 103761 106411 47032 -36377 43445 118810
750 118810 151197 118317 159796 128997 67888 9879 29469 73034 94696 48449 48883 46335
738 46335 20990 114927 40494 94563 166587 209461 158713 140038 241358 264520 283298 326780
726 326780 286152 170472 166366 141322 140515 100361 90761 148261 157259 78365 70971 28467 50841
713 50841 30642 56152 44632 -42192 -9030 13990 22535 -63185 -78597 -98011 -112467 2233
701 2233 46704 -43835 6056 46206 752 43728 85500 49571 492 2483 29141 26692 -24731
688 -24731 -15632 -22166 -30958 51591 66931 63699 103002 140072 79232 43822 -5262 -19273 -24520
675 -24520 -75601 -86507 -54466 -31858 1466 53153 9990 2120 42290 61977 181762 148893
663 148893 44663 74017 140776 205779 103967 -9197 6069 49369 -37840 14807 122029
652 122029 92101 129803 86665 102967 45890 73482 132860 163620 155678 48982 -11181 -44944
640 -44944 -8451 6657 -20987 1778 10055 -24860 57062 40549 2952 -51413 -97903 -12319
628 -12319 -9515 -44553 24834 -1035 -56610 30579 -5697 7892 -18502 -39322 -31230 2999
616 2999 60475 -30343 -32211 -81148 -74790 -53692 -70170 -9206 77912 79567 -35712 -80370 -42266
603 -42266 52548 80139 35526 -40629 -52554 -50938 -10632 5454 -6210 22565 -6257 -72362
591 -72362 -69591 -60213 -14441 -31464 -38113 -75623 -34534 49836 40592 78462 113183 62779 -17826
578 -17826 -13033 -25030 -48246 -56607 15008 -50330 -16013 -2026 -45405 33970 121070 93708
566 93708 262 -50352 -37090 -69146 -95834 11021 -7331 -39170 -999 11308 -19919 -52537
554 -52537 -23683 -104906 -152280 -186668 -95138 -33358 -12883 -48057 -100234 -49330 -93306 -75802
542 -75802 -101214 -105745 -35449 -51750 -99420 -68398 -23202 -29243 -29212 16138 -29725 -66965 -127424
529 -127424 -109774 -98448 -89400 -61072 -57129 -150211 -177653 -222173 -265484 -196731 -203859 -211122 -193897
516 -193897 -142837 -137360 -180419 -192781 -219014 -167160 -124950 -190250 -180709 -197482 -280837 -291411
504 -291411 -226371 -104526 -58050 -127851 -133421 -186654 -147220 -146284 -185226 -213957 -147553 -152244
492 -152244 -134975 -107596 -153573 -99537 -118663 -66758 -44756 -17065 9110 -60335 -33423 -31470
480 -31470 -12228 -51347 24112 -6035 -147083 -111278 -8710 39374 -20406 -79074 -148589 -126234
468 -126234 -6649 23115 88827 129830 83610 49364 57758 36472 -38364 13469 54090 44371
456 44371 95455 103323 175237 113475 121360 189520 99126 24606 -43642 -23134 21729 -22991
444 -22991 -53494 -57060 -27407 -9835 -44964 -61156 -81400 -20048 -88612 -158930 -132832 -53916
432 -53916 -80080 -98233 -142777 -111547 -174486 -166266 -193965 -155035 -98414 -162733 -237175 -100849
420 -100849 -49260 -138433 -155454 -29225 110525 22487 -40684 -54079 -110096 -135196 -137275 -53169
408 -53169 -48295 -13980 -28260 -78912 -97555 -125438 -79502 -160923 -161871 -222982 -193863 -262889 -247088
395 -247088 -242319 -238169 -252830 -218274 -231521 -246395 -227218 -197783 -122523 -166288 -229406 -230405 -173288
382 -173288 -106861 -140730 -118496 -84447 -148819 -206524 -173786 -221734 -253122 -231305 -266493 -236659
370 -236659 -192594 -224048 -227856 -128102 -332424 -389993 -317233 -305193 -287426 -299755 -347009 -376958
358 -376958 -374645 -379966 -338011 -309485 -258191 -182852 -213320 -234601 -215806 -199442 -163070 -178889
346 -178889 -212704 -220696 -184526 -202668 -271812 -203240 -99132 -76441 -94448 -176794 -199974 -182589
334 -182589 -182349 -181642 -154252 -149346 -203917 -274817 -263988 -215661 -195494 -239706 -237929 -167534 -159197
321 -159197 -94330 -108318 -91360 -69584 -80700 -79374 -61296 -138920 -136634 -26255 -38276 -24360
309 -24360 -56547 -82568 -103319 -156178 -166405 -170772 -167258 -162450 -222581 -229788 -254820 -327809 -340692
296 -340692 -330039 -368453 -268504 -266866 -285444 -269264 -260599 -253716 -146960 -149701 -173273 -151912
284 -151912 -138487 -145157 -172243 -160624 -127018 -183951 -287234 -241030 -217996 -231163 -178919 -187917
272 -187917 -215401 -218737 -230935 -201828 -204728 -247099 -285701 -360232 -398034 -269909 -260437 -277292
260 -277292 -212157 -295648 -352066 -208448 -217679 -218419 -208947 -171119 -202313 -167991 -94142 -160223
248 -160223 -150644 -113362 -170986 -115946 -159187 -171194 -146230 -144781 -221172 -252444 -248687 -319347
236 -319347 -328636 -363820 -338637 -330636 -324418 -339467 -232198 -241175 -289263 -319781 -435013 -465104
224 -465104 -399848 -419245 -413687 -375106 -344710 -319669 -358967 -396219 -441961 -421081 -402744 -472784
212 -472784 -408539 -356910 -340814 -324746 -348434 -274071 -238617 -261841 -307828 -345605 -306382 -228603
200 -228603 -272132 -235116 -265232 -228366 -299376 -391637 -390344 -351790 -321880 -304357 -265212 -277121
188 -277121 -269908 -327468 -328976 -283731 -185129 -244758 -312353 -311008 -342538 -314364 -225457 -242801
176 -242801 -278294 -315565 -287732 -225999 -228920 -175997 -171889 -241718 -188205 -97886 -100208 -74923
164 -74923 -145790 -203176 -222357 -207202 -236102 -202820 -231616 -288235 -297071 -300942 -298186 -330984 -301770
151 -301770 -238547 -198026 -136622 -147984 -151719 -185258 -159377 -174930 -228537 -185106 -166205 -141088
139 -141088 -151806 -139721 -194174 -227059 -197787 -200298 -357681 -290842 -268387 -301933 -338211 -325998
127 -325998 -387459 -377395 -302094 -295491 -296155 -313677 -325174 -384881 -398551 -400809 -420750 -420936 -379555
114 -379555 -330009 -328869 -290996 -296921 -297337 -321414 -326948 -300574 -294873 -351471 -337175 -315919 -354113
101 -354113 -394752 -398995 -424231 -439898 -453724 -442726 -394408 -425467 -355430 -288854 -264078 -296334
89 -296334 -349284 -368358 -306876 -349741 -344538 -292659 -299274 -362123 -355955 -277794 -272937 -237819 -265956
76 -265956 -299361 -253043 -236363 -231674 -261564 -285803 -307898 -255850 -287621 -340167 -402739 -372393
64 -372393 -327089 -316169 -330144 -333074 -387132 -393970 -401737 -442893 -379599 -371216 -412077 -480525 -415845
51 -415845 -333525 -289365 -262084 -271487 -313498 -275375 -292046 -299887 -271255 -314186 -360649 -305378
39 -305378 -295928 -254257 -237527 -304616 -346086 -341472 -308371 -306555 -334467 -373985 -310648 -334877 -319700
26 -319700 -315251 -352497 -359191 -318892 -311285 -328202 -385188 -369551 -396742 -421150 -395294 -396352 -396372
13 -396372 -391493 -354805 -384111 -377915 -348310 -341134 -309317 -300679 -373078 -378455 -359701 -342608 -312921
0 -312921
$$ Imaginary data points
##PAGE= N=2
##DATA TABLE= (X++(I..I)), XYDATA
16383 -4305004 -4280426 -4254963 -4247296 -4216245 -4151072 -4072440 -3992377 -3920779 -3867955 -3869137 -3841064 -3773332
16371 -3773332 -3752061 -3675154 -3664424 -3601194 -3513751 -3467087 -3469245 -3435706 -3429332 -3402374 -3306890 -3233744
16359 -3233744 -3154601 -3174571 -3119651 -3053705 -2978059 -2982369 -2896802 -2831375 -2782061 -2776157 -2743017 -2670505
16347 -2670505 -2645732 -2653991 -2547157 -2483085 -2403706 -2370058 -2322746 -2285081 -2240150 -2140121 -2049257
16336 -2049257 -1994139 -1980496 -1994439 -1979518 -1973366 -1905866 -1864991 -1966013 -1866045 -1806305 -1739110
16325 -1739110 -1744720 -1707480 -1670231 -1635933 -1590602 -1540885 -1553132 -1480747 -1382572 -1384242 -1390200 -1350526
16313 -1350526 -1355097 -1275253 -1151162 -1101619 -985935 -933676 -906570 -872849 -821050 -766837 -722577
16302 -722577 -690626 -716732 -714815 -633303 -612994 -560342 -528757 -482458 -485213 -490630 -493720 -473048
16290 -473048 -407734 -340914 -333886 -361500 -334044 -236321 -239795 -260187 -162795 -134603 -46903 -65896
16278 -65896 24767 64452 130194 224900 243579 290620 258670 302732 358211 391911 509867
16267 509867 548488 502675 540193 533743 512008 560187 684365 693381 729688 709389 701867 767276
16255 767276 745153 815273 842000 853003 898851 932721 907837 950583 994346 963691 946604
16244 946604 1018427 1050910 1043146 1045672 1117971 1153886 1194782 1228932 1220824 1195745 1158608 1224149
16232 1224149 1317385 1326689 1302588 1342370 1378104 1430929 1438359 1478875 1518682 1503590 1484881 1503721
16220 1503721 1474349 1550468 1561677 1559042 1580257 1521132 1612322 1685161 1659476 1675044 1667250 1665810
16208 1665810 1717076 1745148 1750225 1697159 1725504 1714035 1706438 1675171 1726313 1787924 1823644 1827008
16196 1827008 1859106 1951567 1979202 1965608 1986103 1981324 1986773 2109378 2143896 2112352 2100992
16185 2100992 2069820 2009283 2120051 2228263 2197960 2119952 2125834 2157479 2209077 2290514 2328761
16174 2328761 2371060 2352767 2307461 2320628 2397535 2367012 2391169 2341105 2323262 2375710 2315636
16163 2315636 2403659 2510291 2543784 2567725 2535579 2494936 2523977 2508840 2508576 2543787 2480448
16152 2480448 2411930 2432665 2457785 2513792 2391386 2386000 2483864 2573300 2630613 2534987 2542559
16141 2542559 2575908 2562517 2542067 2475733 2526390 2594211 2498394 2527275 2470515 2507800 2522939
16130 2522939 2515904 2580847 2539833 2691451 2680822 2692417 2711155 2657113 2633794 2712187 2663950
16119 2663950 2679597 2638861 2628988 2621879 2653713 2697603 2699804 2730124 2797712 2809504 2755488 2757745
16107 2757745 2759690 2828544 2770556 2785103 2830329 2806519 2797784 2711152 2691997 2708936 2725002 2806461
16095 2806461 2775787 2787347 2754668 2697805 2676967 2724865 2729318 2742463 2726820 2735525 2680412 2598848
16083 2598848 2572054 2608582 2634363 2773753 2806650 2774810 2771829 2752213 2883393 2831362 2747588
16072 2747588 2735782 2778957 2768442 2692147 2723606 2791088 2798492 2850520 2915202 2900378 2930823
16061 2930823 2839372 2777404 2774034 2849921 2815249 2821159 2829685 2779009 2779076 2839104 2815802 2819285 2778800
16048 2778800 2771946 2797599 2867714 2867292 2869129 2899492 2839647 2830253 2761691 2698295 2731506 2743819
16036 2743819 2768928 2788141 2788262 2885948 2876457 2819143 2782113 2783032 2834804 2943471 2936694 2945048
16024 2945048 2912817 2764585 2774300 2768116 2747302 2773697 2824746 2864721 2916067 2973782 2956270
16013 2956270 2945137 2881821 2891587 2851801 2873481 2890079 2895862 2938382 2910183 2787946 2839096
16002 2839096 2814373 2882332 2834362 2842968 2855075 2760787 2816115 2820049 2915513 2927885 2907177 2884392
15990 2884392 2820355 2808110 2796412 2794055 2720091 2767063 2887510 2937566 2851837 2910600 2984508
15979 2984508 3022071 3012804 3006925 3017227 3001497 2985238 2920210 2824280 2914570 2994248 2996372 3006141
15967 3006141 3001287 2998975 2932110 2869720 2895325 2869403 2846386 2889774 2914440 2887477 2804423 2774615
15955 2774615 2802844 2837949 2820320 2882950 2884048 2868951 2898331 2957797 2916848 2937045 2858636
15944 2858636 2813385 2856448 2916013 2870482 2936467 2868648 2816599 2797168 2874752 2843118 2863187
15933 2863187 2916990 2868239 2859673 2827543 2850609 2815963 2839610 2777197 2806290 2856856 2863077 2867015
15921 2867015 2776462 2837198 2831355 2827802 2931335 3042202 2977079 2859466 2910234 2907448 2926985
15910 2926985 2929744 2923781 2895711 2872976 2867182 2952486 3031776 2943641 3033860 3011290 3029525 3070857
15898 3070857 3027914 2987613 2951874 2958360 2893632 2898050 2870428 2845936 2858711 2926699 2949540 2934613
15886 2934613 2974262 3012278 3048214 3028994 2954165 2917904 2984815 2989102 2956780 2897512 2888621 2987257
15874 2987257 2924183 2830890 2812722 2862563 2920646 2968304 3013767 3013523 3023052 3046621 2981955 2864021
15862 2864021 2817542 2854005 2855937 2925525 2968961 3003477 2995486 3025218 3038334 3037605 3007971 3048461
15850 3048461 3050534 2989317 3027985 3051797 3041972 2962737 2895395 2939437 2963729 2942145 2955697 2894267
15838 2894267 2876127 2882058 2894298 2918855 2832323 2777046 2770696 2799520 2839428 2847877 2737180 2807916
15826 2807916 2913749 2889948 2873185 2881137 2914925 2906580 2854743 2890011 2906584 2955175 2962293 2985689
15814 2985689 2965566 2856422 2822406 2825372 2869239 2871993 2853463 2840362 2833430 2875703 2899082 2891677
15802 2891677 2851494 2853316 2890102 2913508 2904600 2867052 2830828 2817681 2864418 2906165 2833488 2804524
15790 2804524 2826491 2926657 2977551 2975933 2980072 2963867 3013098 3000171 3029583 3013702 2945226
15779 2945226 2879629 2888994 2894091 2899883 2839068 2788196 2900123 2999284 2972344 2900025 2953053 2907101
15767 2907101 2903458 2910248 2858684 2856398 2842878 2854461 2902078 2935288 2910973 2843341 2857415 2903161
15755 2903161 2917460 3020003 2997227 2924874 2963687 2942917 2873430 2940911 2845557 2797959 2805230
15744 2805230 2791612 2864084 2859509 2823165 2901072 2938686 2961602 2939334 2953209 2904860 2922153
15733 2922153 2904286 2903947 2886911 2958265 2955656 2989507 2976485 2980102 2972693 2953322 2955318 2915384
15721 2915384 2975217 3008071 2988698 2942778 2946839 2978036 2862644 2838682 2858791 2863208 2892887
15710 2892887 2965554 2936729 2989302 3008331 2912410 2895441 2940563 2982653 2986435 2983233 2899733 2806829
15698 2806829 2745597 2841285 2880616 2885467 2896018 2875336 2874203 2934237 2873591 2915364 2975646 2947357
15686 2947357 2893119 2868788 2838602 2811924 2831170 2838497 2855226 2793201 2777477 2840653 2858607
15675 2858607 2916232 2889240 2881821 2927612 2886252 2864047 2953222 2910559 2895602 2844300 2881552
15664 2881552 2874877 2993611 3051973 3048216 3051731 3026917 3069294 3026171 2993648 3031121 3018920 2995294
15652 2995294 2933456 2870669 2887580 2953886 2966866 3043889 3069325 2982635 2948266 2943861 2989846
15641 2989846 3048991 2946380 2982825 2988834 2977883 2996092 3036758 3010820 3054547 3119651 3069294
15630 3069294 3000207 2956594 2956633 2975221 3012164 3093581 3107613 3062599 3057634 2985652 3039610 3046266
15618 3046266 3111924 3095450 3041842 3031218 3146392 3138482 3104423 3156529 3102003 3096756 3076438
15607 3076438 3058736 2998630 3029261 3006773 2957698 2925725 2977975 2995152 2947130 3034725 3058730
15596 3058730 3039536 3020970 3046959 3065041 3066068 3119415 3073277 2998951 3008059 2921511 2931299 2906603
15584 2906603 2907686 2980317 3048442 3131057 3095520 2991171 2984652 2991392 3015435 2966623 2863587
15573 2863587 2812592 2850622 2781171 2773538 2814496 2815766 2822728 2900184 2914583 2894463 2955155 2929112
15561 2929112 2861903 2874187 2836574 2845787 2924377 2982855 2889217 2888954 2916585 2907117 2933453 2874584
15549 2874584 2883468 2976268 2991894 2993319 2949085 2940868 3010353 2941514 3008327 3018495 2950409 2953084
15537 2953084 2844688 2879057 2963465 2963328 2987526 3053646 3122727 3114016 3115587 3277459 3214018 3168264
15525 3168264 3225901 3213213 3182373 3186889 3134040 3089110 3098717 3112635 3184329 3132138 3162723 3269925
15513 3269925 3241341 3235441 3215192 3143248 3142743 3111464 3102847 3055663 3064183 3042801 3060491 3051165
15501 3051165 3083628 3101344 3124422 3090630 3028861 3046976 3063487 3074941 3082948 3092302 3097444 3009607
15489 3009607 2909541 2993476 3038890 3024855 3049161 3010102 2962347 2981672 3071469 3113773 3061166
15478 3061166 2980415 2931862 2916129 2914377 2969189 2979383 2888016 2898167 3016429 3083877 3108619
15467 3108619 3074668 3032554 3089199 3123449 3020058 3031472 3110802 3079003 3091527 3062801 3104065
15456 3104065 3045163 3024614 3054275 3074507 3052884 2954631 2947235 2867752 2824593 2816167 2876562 2918995
15444 2918995 2828732 2905555 2929225 2884893 2941287 2944548 3018330 3133817 3084316 3059496 3039660
15433 3039660 2961230 2973318 2978958 2951896 3021990 3097682 3050104 3050750 3051282 3013649 3006965 3039245
15421 3039245 2985324 2958847 2933766 2908203 2930337 2959182 2953782 2860806 2908088 2857873 2807363
15410 2807363 2809028 2856356 2811156 2833780 2811370 2812113 2910893 2971101 2987683 2956932 2990031 3030272
15398 3030272 3066727 3084512 3132659 3109624 3110426 3128353 3171433 3178777 3127867 3117869 3069877 3111437
15386 3111437 3118101 3095966 3075888 3015264 3116300 3014571 2943323 3012808 3018062 3004906 2962425
15375 2962425 2976933 2985491 2997325 3037714 3044785 3046212 3078818 3061754 3022247 2983831 2993075 3020224
15363 3020224 3000766 2999825 3020312 3018466 3012545 3076094 3031813 3039529 3058856 3000070 2953510 2926717
15351 2926717 2927515 2888983 2930903 2937085 2973769 2914151 2882998 2908416 2938017 2890273 2899931 2938732
15339 2938732 2944843 2903099 2925488 2997922 2969952 3020791 3021602 3085669 3034910 3041590 3099612 3128333
15327 3128333 3074041 3049973 3002283 3034423 2957516 2951669 2956643 2941587 2977350 2983638 2940432 2932455
15315 2932455 2956432 3052963 3050645 3087008 3038488 3012620 3000695 2993904 3040869 3042344 3128259 3176460
15303 3176460 3131874 3080796 3014030 2945601 2954271 3043954 3058328 3015556 3038784 3134404 3232951
15292 3232951 3132443 3073914 3095059 3090752 3024836 3018042 3122536 3119622 3106217 3143967 3208252
15281 3208252 3218022 3190123 3113047 3063238 3172883 3220038 3263946 3277895 3268440 3270143 3278832 3295246
15269 3295246 3270624 3188473 3164585 3155043 3202210 3231971 3214319 3186787 3181428 3128161 3148313 3073721
15257 3073721 3191535 3183982 3138669 3151652 3178436 3162475 3147278 3185122 3110453 3101525 3193729
15246 3193729 3205336 3157339 3187018 3225512 3131202 3127602 3148046 3122295 3123824 3144536 3234240 3213290
15234 3213290 3239950 3248221 3238127 3240234 3132174 3157328 3201314 3174675 3096732 3078594 3086943 3056242
15222 3056242 3077971 3090312 3136576 3149869 3113523 3094689 3167172 3125554 3118715 3058549 3040567
15211 3040567 3038482 3044511 3069304 3008357 3150118 3140699 3091730 3095466 3044133 3036971 3037858 3066707
15199 3066707 3168104 3066308 3046632 3108418 3180417 3193400 3090986 3085108 3123959 3172941 3177248
15188 3177248 3138579 3111855 3139313 3083017 3075411 3059026 3012016 3016423 3084028 3101468 3016486 3046230
15176 3046230 3086400 3116960 2994969 3111424 3170801 3117579 3098176 3087681 3220266 3174302 3123168
15165 3123168 3121260 3139603 3144414 3272374 3186359 3203832 3254303 3170532 3199272 3126483 3110198
15154 3110198 3116322 3103676 3073971 3053300 3116597 3098253 3076748 3135545 3125317 3051234 3035838
15143 3035838 3042774 3113095 3075379 3154126 3189737 3196866 3175462 3172501 3215050 3196426 3161843 3156156
15131 3156156 3162756 3125939 3152210 3171634 3191984 3140981 3091283 3182674 3200088 3138077 3110604
15120 3110604 3115127 3079393 3147311 3199308 3257254 3205335 3172596 3207450 3261175 3228600 3205753
15109 3205753 3222567 3146071 3222502 3256818 3194851 3290029 3270630 3232457 3312703 3285905 3200982
15098 3200982 3205708 3187312 3130181 3147497 3149169 3227171 3186603 3199428 3101043 2976318 3096259
15087 3096259 3041469 2964666 2936945 3050148 3113343 3138475 3144325 3121228 3157178 3196752 3132411
15076 3132411 3221989 3248690 3231548 3277234 3319559 3292299 3275756 3246432 3306763 3305643 3312230 3279725
15064 3279725 3255215 3285443 3240116 3274373 3158393 3170476 3145781 3153180 3105079 3025653 3037671
15053 3037671 3135735 3136590 3128035 3121190 3116365 3126012 3114198 3012610 2987881 2994903 3075645 3070984 3074641
15040 3074641 3085053 3152579 3202295 3248328 3107294 3173988 3131816 3191890 3250233 3270152 3220753
15029 3220753 3150431 3138288 3156450 3126216 3160709 3162945 3265902 3258911 3198054 3154219 3068063
15018 3068063 3082830 3035808 3034529 3076999 3050250 3032767 2969243 2924378 2994492 2982344 3053972
15007 3053972 3115914 3052942 2958112 3081297 3072983 3088951 3060344 3106981 3089713 3167121 3206009
14996 3206009 3154965 3148522 3131420 3099652 3129490 3188465 3198971 3173523 3186440 3160046 3147669
14985 3147669 3136152 3131186 3112813 3061697 3089897 3179690 3113836 3105914 3157426 3185637 3107328 3035122
14973 3035122 3149536 3160145 3062981 3046253 3082747 3139461 3121803 3122070 3124287 3107702 3125191 3156572
14961 3156572 3117985 3118949 3188086 3138269 3105673 3134021 3127562 3093620 3053722 3109318 3103018 3162962
14949 3162962 3116532 3181026 3283507 3210282 3125369 3058421 3169610 3152902 3079680 3148442 3168477
14938 3168477 3142172 3144299 3070181 3076436 3077666 3036726 3096898 3125618 3134174 3077821 3060849 3075360
14926 3075360 3204152 3206514 3188671 3204984 3187054 3204928 3238529 3255896 3224285 3213974 3198943
14915 3198943 3218828 3211426 3267194 3233971 3203809 3266886 3184955 3185257 3143600 3181207 3202368 3205303
14903 3205303 3261281 3218115 3238933 3304798 3294855 3229212 3180023 3176585 3203421 3124571 3196037 3175190
14891 3175190 3222721 3200846 3108444 3124291 3180710 3211536 3206029 3154929 3253970 3315346 3269437
14880 3269437 3292849 3319214 3376480 3374080 3311613 3299398 3229279 3155711 3220473 3232106 3260439
14869 3260439 3245554 3261598 3311468 3243271 3203780 3142693 3130057 3150889 3181022 3261629 3288183
14858 3288183 3236694 3134380 3061948 3090805 3139904 3163347 3209064 3243217 3193410 3226554 3192911
14847 3192911 3213741 3227560 3268765 3284510 3273894 3192888 3091565 3167171 3309724 3234631 3198852
14836 3198852 3211646 3235161 3299637 3314764 3284839 3323383 3265206 3160297 3211907 3256194 3245489
14825 3245489 3195166 3160993 3206128 3285168 3226014 3146129 3246312 3269046 3295319 3202137 3260381
14814 3260381 3340187 3325271 3300615 3252712 3202899 3222249 3280875 3233722 3275334 3190398 3246410
14803 3246410 3194365 3227627 3331341 3346098 3266316 3282812 3285342 3178709 3214299 3204982 3093211
14792 3093211 3180582 3187699 3157303 3197156 3249709 3184321 3252545 3273825 3333153 3255471 3262223 3252444
14780 3252444 3223667 3217425 3211309 3220472 3216330 3182046 3174513 3176383 3289464 3235987 3268173 3335852
14768 3335852 3260366 3276388 3301353 3204054 3195709 3265029 3292509 3267114 3229158 3279564 3242912
14757 3242912 3311307 3279516 3327074 3318781 3294924 3222880 3250501 3262451 3247925 3182231 3205213
14746 3205213 3192645 3274387 3336126 3269872 3294004 3345139 3282913 3324831 3314921 3274991 3298550
14735 3298550 3366394 3354199 3328581 3299656 3288371 3278680 3241562 3366113 3404544 3325679 3311801
14724 3311801 3315972 3281637 3298454 3303691 3362897 3369872 3288501 3308412 3405515 3294223 3253304 3159782
14712 3159782 3121170 3128642 3099644 3168293 3155008 3239391 3220595 3293933 3307287 3249257 3299502
14701 3299502 3346059 3360464 3324934 3293494 3346317 3358285 3357404 3293554 3264769 3265588 3226291 3203698
14689 3203698 3273628 3287329 3304899 3398565 3393063 3419953 3325191 3312587 3281932 3232783 3237166 3321838
14677 3321838 3321969 3309596 3346076 3373910 3389841 3302771 3382967 3317988 3314898 3416996 3380821 3357450
14665 3357450 3373371 3308395 3360523 3306167 3352683 3396979 3344278 3330468 3349799 3341749 3279200
14654 3279200 3349174 3432657 3498938 3475440 3401332 3332469 3374830 3328098 3342167 3333798 3348097
14643 3348097 3329475 3318528 3359912 3393284 3421467 3417032 3333147 3382290 3388972 3320953 3253278 3285395
14631 3285395 3273080 3272206 3242051 3291693 3285547 3336660 3422546 3356219 3350723 3379871 3352110 3313905
14619 3313905 3265525 3244881 3283341 3211010 3145217 3138038 3211606 3309717 3279615 3206642 3221267
14608 3221267 3243559 3334450 3248889 3307913 3350662 3320637 3279013 3265162 3247683 3257725 3292774
14597 3292774 3294817 3340078 3309527 3250632 3117487 3085435 3122182 3205089 3198223 3216526 3181737
14586 3181737 3113555 3214586 3266519 3285970 3272859 3304124 3296633 3152472 3105052 3219224 3235845
14575 3235845 3298780 3318778 3303007 3259359 3278355 3302256 3267822 3285997 3280801 3225970 3201256
14564 3201256 3176293 3164096 3180408 3243541 3220260 3163109 3150632 3111363 3178527 3138542 3145266
14553 3145266 3093309 3088466 3171335 3128050 3078429 3124040 3203022 3212332 3263953 3199014 3209690 3277238
14541 3277238 3259069 3251247 3179461 3226687 3240358 3190157 3129878 3138714 3178625 3221082 3131719 3202604
14529 3202604 3177118 3160290 3167777 3149638 3167166 3137304 3167483 3141208 3147377 3059739 3073900 3172332
14517 3172332 3236667 3192440 3248194 3216930 3123648 3222076 3327070 3343613 3310212 3314041 3289539
14506 3289539 3315725 3334285 3264534 3246811 3297865 3253541 3173739 3200675 3283289 3239509 3248470
14495 3248470 3285475 3334885 3350823 3427408 3483514 3305818 3298463 3306051 3354441 3322184 3267976
14484 3267976 3290085 3402398 3365744 3309835 3343171 3464157 3468968 3387816 3367839 3330385 3335169
14473 3335169 3328673 3310718 3352655 3379163 3366113 3359300 3336668 3292768 3394125 3415531 3469126
14462 3469126 3496977 3474023 3408747 3396425 3441356 3374883 3409176 3388990 3341708 3394373 3397383
14451 3397383 3427149 3477659 3495801 3461851 3502183 3423865 3375945 3389135 3427001 3474378 3448155
14440 3448155 3414623 3297466 3319500 3298554 3283498 3244737 3281835 3264161 3302604 3313077 3338085
14429 3338085 3279476 3271773 3265380 3259320 3233209 3257108 3268022 3246405 3281729 3277689 3287574 3289411
14417 3289411 3371248 3378400 3344148 3374329 3329901 3339941 3362475 3391472 3311075 3261652 3295012
14406 3295012 3353433 3331018 3339165 3400280 3386943 3423463 3488647 3511372 3462842 3437109 3477974
14395 3477974 3463860 3378462 3387324 3367818 3364211 3328522 3293510 3342807 3418930 3459837 3415288 3454425
14383 3454425 3456998 3397875 3363693 3370568 3352083 3345746 3331969 3303192 3350902 3340971 3282594 3251771
14371 3251771 3226044 3276740 3362154 3379574 3408204 3409386 3420228 3418806 3395778 3408496 3403406 3368646
14359 3368646 3375514 3380650 3366097 3347965 3344703 3376387 3376600 3392197 3302216 3341600 3416797 3372412
14347 3372412 3305804 3233020 3171862 3073586 3043925 3065425 3150074 3093609 3122373 3217684 3305165
14336 3305165 3330353 3330342 3364770 3426697 3444050 3411285 3393658 3371787 3402247 3361323 3388333 3389167
14324 3389167 3441019 3401455 3435214 3507995 3515686 3550393 3510237 3522147 3459991 3473104 3430051
14313 3430051 3450017 3430415 3361071 3354829 3417656 3413647 3339632 3334210 3355953 3364783 3386284 3442866
14301 3442866 3315012 3355979 3462672 3465327 3430644 3406622 3488569 3367575 3446241 3517343 3608536
14290 3608536 3536703 3563396 3628922 3614385 3558600 3549859 3592016 3614264 3516429 3487997 3442725
14279 3442725 3357746 3343966 3373982 3311878 3359173 3407655 3348019 3459437 3436852 3398592 3433295
14268 3433295 3427654 3393531 3401350 3347740 3353834 3360441 3281802 3287340 3350558 3313316 3432206 3357464
14256 3357464 3285029 3399093 3499197 3463509 3467091 3453353 3511913 3496800 3424757 3360307 3404258
14245 3404258 3396806 3282406 3261131 3205251 3242557 3246818 3265743 3323224 3359138 3388964 3367312
14234 3367312 3448414 3358207 3316743 3318780 3333912 3363594 3391452 3355007 3382589 3378557 3409504 3429195
14222 3429195 3474937 3517243 3485240 3455024 3460143 3511345 3525152 3413959 3411258 3462963 3313900
14211 3313900 3273054 3280125 3324286 3376527 3425658 3413864 3300226 3263312 3351969 3405061 3364872
14200 3364872 3307958 3279990 3270141 3300285 3322829 3330407 3376989 3420398 3427459 3412785 3436611 3454895
14188 3454895 3516771 3435999 3377367 3403229 3367180 3368890 3443869 3479546 3472498 3407323 3317613 3356029
14176 3356029 3390587 3412335 3399670 3464241 3449634 3457417 3532513 3644346 3630135 3541965 3516931
14165 3516931 3515378 3450469 3372390 3462313 3528780 3424630 3470217 3459884 3511430 3506999 3486186
14154 3486186 3427265 3446871 3464021 3398715 3385923 3366605 3340959 3366994 3371793 3422785 3476258
14143 3476258 3444857 3429174 3456579 3474827 3545277 3569619 3486748 3573721 3537887 3522315 3560679
14132 3560679 3513157 3532247 3511041 3532082 3581493 3551162 3521061 3560635 3543449 3412748 3421941
14121 3421941 3457389 3464248 3433198 3465599 3502433 3443645 3454840 3517015 3559769 3581638 3612267
14110 3612267 3587451 3518958 3509793 3508481 3547064 3558290 3557702 3558217 3673887 3630593 3580093 3664520
14098 3664520 3654173 3632140 3572533 3515985 3567765 3607925 3630805 3613749 3629392 3613416 3590989
14087 3590989 3592350 3533533 3567763 3609248 3608033 3637683 3670092 3596498 3662278 3670641 3554700 3524876
14075 3524876 3524002 3513007 3474289 3566168 3519094 3549115 3566210 3522999 3498798 3438037 3447604 3423631
14063 3423631 3481748 3395577 3427237 3484402 3434297 3357987 3353651 3414555 3380923 3397354 3417180
14052 3417180 3412637 3513411 3392704 3374430 3483029 3496954 3523079 3473011 3469747 3514493 3499262
14041 3499262 3462038 3424072 3441525 3503158 3491026 3498806 3521765 3475658 3481769 3526400 3492967 3466288
14029 3466288 3427666 3460985 3463865 3467473 3449781 3439573 3463939 3437529 3401956 3428265 3507000 3511539
14017 3511539 3473927 3488357 3516231 3530596 3488250 3485427 3524011 3524720 3502257 3513803 3536454 3461754
14005 3461754 3527865 3527435 3552678 3573232 3550828 3459676 3450316 3521839 3564567 3516717 3462475 3441619
13993 3441619 3394378 3539368 3456190 3506981 3515041 3602030 3644459 3616507 3583631 3596045 3594487
13982 3594487 3568732 3595475 3583384 3589657 3631118 3695226 3674657 3787152 3772713 3677013 3689818
13971 3689818 3666735 3684924 3546314 3527466 3656116 3718694 3724676 3673575 3585384 3531502 3582433
13960 3582433 3580355 3532128 3583291 3605472 3627654 3610906 3648797 3671735 3644455 3672171 3623307
13949 3623307 3633017 3630765 3720623 3717259 3662877 3695157 3728613 3675100 3700665 3758474 3737190 3661840
13937 3661840 3680625 3667362 3651184 3643314 3652327 3677930 3631403 3640030 3640981 3544035 3561412 3537401
13925 3537401 3492473 3532215 3600224 3561519 3535075 3588929 3557973 3548585 3535218 3545404 3570758
13914 3570758 3635413 3677555 3637760 3635263 3611155 3621769 3657948 3611112 3595211 3673315 3589647
13903 3589647 3535857 3585921 3635220 3558876 3521403 3538867 3584974 3597282 3581962 3629167 3526996
13892 3526996 3512690 3554571 3604713 3624179 3589001 3586845 3497946 3515727 3535979 3524462 3579758
13881 3579758 3539303 3556605 3527667 3561878 3554699 3547958 3516659 3573635 3656876 3550946 3485044
13870 3485044 3585640 3535907 3482086 3552618 3444189 3450052 3464379 3498078 3462681 3434097 3506035
13859 3506035 3587024 3569398 3600235 3587440 3478019 3500845 3538430 3540789 3509499 3560730 3595323
13848 3595323 3659413 3584010 3566989 3619707 3678686 3689314 3572320 3531516 3532671 3532571 3524774 3590468
13836 3590468 3680035 3702504 3652000 3634572 3621799 3593397 3621572 3619757 3668098 3603831 3580185
13825 3580185 3637632 3596433 3577033 3668207 3650469 3687674 3739152 3704260 3733508 3727846 3730745 3769938
13813 3769938 3786044 3780787 3777033 3755870 3714983 3671462 3676257 3673757 3661282 3693418 3713137 3719330
13801 3719330 3697765 3725420 3737836 3674761 3710260 3702734 3631133 3662207 3577523 3472086 3437658
13790 3437658 3433300 3468234 3487252 3560032 3556528 3571007 3573743 3625620 3621782 3607549 3639512 3657987
13778 3657987 3603952 3580434 3599601 3602128 3642030 3684502 3709473 3664719 3577274 3525060 3604996
13767 3604996 3596855 3637108 3702266 3715722 3705317 3655573 3636405 3614966 3643168 3540105 3546046
13756 3546046 3496514 3532004 3523731 3590992 3636295 3636420 3602286 3627928 3644654 3615473 3665696 3647316
13744 3647316 3661238 3666018 3698357 3671630 3672804 3666838 3671552 3627984 3701922 3670754 3648060 3594403
13732 3594403 3624367 3641343 3643352 3564648 3454435 3452056 3528450 3444331 3508692 3579965 3595494
13721 3595494 3621728 3631133 3613848 3590793 3600198 3594634 3600875 3578682 3646731 3603195 3605758 3628520
13709 3628520 3622370 3600477 3581969 3585502 3578706 3554447 3634630 3678085 3659426 3644271 3558027 3562702
13697 3562702 3594912 3620017 3608778 3583728 3705780 3739315 3701470 3636344 3702060 3770889 3711311
13686 3711311 3708656 3762499 3682407 3675019 3667785 3693953 3742785 3743835 3728976 3719326 3753525 3764107
13674 3764107 3711100 3784737 3735719 3805389 3805067 3759556 3740315 3781275 3749835 3668820 3625939 3667561
13662 3667561 3670048 3649499 3766194 3745227 3739465 3699789 3707774 3711370 3760246 3742969 3774141 3701043
13650 3701043 3696222 3782988 3769338 3732024 3759480 3732984 3692408 3644104 3653955 3657040 3605580 3606863
13638 3606863 3676734 3659473 3637428 3619094 3555044 3567443 3616279 3620084 3524385 3569821 3561395 3571273
13626 3571273 3632300 3586841 3659528 3724998 3678449 3607631 3610419 3635732 3720797 3707708 3695631
13615 3695631 3594966 3521020 3559022 3571036 3518511 3533043 3492328 3549664 3588449 3590854 3600380
13604 3600380 3648793 3629088 3555510 3590125 3618287 3590323 3519719 3536327 3565870 3697220 3693472
13593 3693472 3660021 3619463 3617257 3677454 3723610 3724328 3772859 3784178 3732894 3779165 3689137 3654631
13581 3654631 3643553 3599723 3606792 3615467 3688843 3699520 3657635 3657827 3655615 3660702 3661609 3690412 3711319
13568 3711319 3684403 3775099 3821603 3773807 3789968 3866397 3861350 3886939 3909895 3879710 3787135
13557 3787135 3794248 3873127 3939807 3958811 4014590 3930076 3935413 3872705 3796213 3765095 3802673 3730429
13545 3730429 3751076 3752511 3755021 3768719 3713861 3630704 3575971 3607686 3566917 3642515 3639582 3642644
13533 3642644 3584994 3509843 3533216 3601988 3608543 3634427 3709558 3701839 3665729 3739168 3703989 3667435
13521 3667435 3752241 3755607 3699789 3659247 3598061 3630889 3672181 3645171 3674305 3747533 3723816
13510 3723816 3826705 3768703 3646337 3641324 3665330 3676033 3583888 3581831 3657244 3627749 3629828
13499 3629828 3668920 3579403 3615272 3633799 3537341 3549918 3568329 3597404 3647145 3781078 3711913
13488 3711913 3666667 3661135 3653286 3654708 3767005 3707658 3653813 3664497 3709338 3660228 3638722 3705939
13476 3705939 3693496 3727904 3572988 3576999 3565708 3559716 3465809 3574414 3621747 3582800 3632856
13465 3632856 3551458 3529374 3570763 3617234 3605432 3609047 3630749 3711550 3691380 3648950 3666166
13454 3666166 3649216 3624167 3636113 3747560 3758143 3732310 3707190 3654622 3731408 3744857 3712147
13443 3712147 3746647 3779030 3794836 3819225 3796080 3763138 3691001 3757569 3780967 3745585 3756309
13432 3756309 3747882 3819938 3765649 3804267 3811566 3809650 3816623 3812629 3834126 3846470 3841361 3829578
13420 3829578 3840593 3884830 3884520 3924484 3878385 3815909 3802600 3830240 3867368 3881230 3912018 3910510
13408 3910510 3878469 3836921 3861514 3855042 3802704 3836717 3764503 3685812 3620650 3687411 3786977
13397 3786977 3848814 3808458 3736949 3749309 3768703 3751987 3760739 3720393 3721760 3716206 3729422 3840005
13385 3840005 3803272 3711295 3677031 3673927 3703811 3699295 3649830 3712154 3732249 3788094 3695444 3680812
13373 3680812 3729915 3797766 3783466 3740238 3760015 3841491 3739820 3674313 3757495 3793222 3803364
13362 3803364 3801358 3764675 3764988 3819639 3889347 3850493 3760441 3820239 3786378 3760484 3805919 3794411
13350 3794411 3781230 3677876 3677323 3654568 3642547 3690887 3725323 3735641 3656413 3668505 3686410
13339 3686410 3594100 3558633 3649663 3653322 3681838 3718285 3743428 3796626 3852769 3827360 3829326 3831638
13327 3831638 3809989 3832317 3922892 3940052 3935001 3878521 3848331 3885104 3855341 3877849 3808299
13316 3808299 3779791 3823071 3806389 3770430 3718200 3660791 3596656 3620255 3682177 3728694 3708252
13305 3708252 3725050 3749759 3729836 3694355 3724949 3708075 3751445 3794997 3825283 3839069 3783433
13294 3783433 3819439 3910984 3947700 3852028 3888560 3853910 3900901 3903398 3921919 3920121 3978043 4031687
13282 4031687 4043338 4100714 3980348 3929446 3930064 3868102 3793820 3713636 3727702 3811547 3831445
13271 3831445 3778775 3777995 3792709 3852265 3816175 3743509 3765214 3816669 3809712 3810914 3815956 3765993
13259 3765993 3788010 3659482 3642272 3681775 3728880 3691453 3776686 3833383 3858927 3838968 3827585
13248 3827585 3797103 3811527 3842052 3853244 3831573 3823845 3762679 3734366 3682966 3645875 3729531
13237 3729531 3730214 3785355 3785892 3815235 3834074 3827112 3836075 3792157 3759177 3833540 3843210 3828335 3859049
13224 3859049 3876868 3804715 3787674 3892954 3892928 3838518 3869922 3859563 3913080 3958379 3937154 3815983
13212 3815983 3814945 3823836 3753087 3841730 3800686 3728442 3766306 3759211 3790287 3817173 3795021 3706826
13200 3706826 3805952 3831663 3812108 3843655 3778058 3761839 3766488 3799419 3828773 3765605 3875598
13189 3875598 3907893 3944517 3897738 3794694 3857084 3929921 3837099 3780342 3805975 3766126 3796993
13178 3796993 3769764 3776414 3736976 3777044 3772158 3669577 3610323 3624095 3689062 3701421 3809302
13167 3809302 3796758 3735412 3748376 3801310 3800578 3741091 3760234 3755162 3861399 3886762 3885141 4024854
13155 4024854 4030122 3869555 3928155 3989669 3981807 4012028 4061795 4046375 3992065 4036956 4001958
13144 4001958 3948994 3878681 3931744 3969072 3939203 3922290 3923871 4062166 3961753 3927535 3929706
13133 3929706 3967981 4018433 4008873 3927184 3905658 3875342 3942557 3918369 3898160 3951226 3936486
13122 3936486 3946132 3957599 4026869 3993356 3904699 3869627 3834265 3785261 3766824 3811186 3873546
13111 3873546 3964300 3924975 3887615 3887145 3894166 3906601 3912387 3891808 3886040 3949945 3968563 4036360
13099 4036360 3919826 3815238 3835995 3894828 3940034 3972389 3940183 3928142 3988236 4019402 3961832
13088 3961832 3915479 3952670 4013474 3901799 3894381 3902770 3868302 3844772 3765636 3660519 3753211
13077 3753211 3766320 3776867 3857686 3840862 3828787 3881559 3858359 3849818 3875616 3933281 3880738
13066 3880738 3775785 3739561 3695902 3701617 3778137 3835332 3887157 3949453 3874488 3890881 3919621
13055 3919621 3868192 3802554 3836968 3903775 3946434 3921122 3892212 3862304 3826256 3839333 3857849
13044 3857849 3863340 3844831 3836818 3870300 3874096 3981011 3957988 3909006 3882056 3900068 3815067 3802221
13032 3802221 3940711 3931252 3940115 3932693 3972185 3929814 3902243 3966881 3985741 4059081 4015372 3990791
13020 3990791 3955830 3930871 3944321 3940023 3890341 3940151 3910037 3884497 3966946 3895427 3915264
13009 3915264 3882517 3928920 3944184 3919026 3913227 3910310 3853516 3948421 3965899 3961948 3923500 3961491
12997 3961491 3970438 3985924 4035322 3958597 3901074 3903757 3905437 3936126 3969137 3940625 4018015 3991944
12985 3991944 3908454 3872993 3931725 3823243 3818016 3857464 3854716 3877141 3920854 3964085 3988287
12974 3988287 3939943 3902746 3911809 3812319 3779962 3801980 3776013 3846822 3956507 3963670 3954797 3986417
12962 3986417 3987209 3966469 3980476 3987794 3978663 4001239 4028429 4032313 4047223 4078658 4020868 3983194
12950 3983194 3942696 3943623 4024473 3980774 4015375 4050960 3994250 3971665 4032219 4034472 3998767 3966361
12938 3966361 3917092 3999792 4032337 4017010 4008084 3962397 3976402 4022446 4031082 4063059 4027596 3971328
12926 3971328 3946355 3978019 4039658 4063808 3997662 3950573 3964665 3993984 4002177 4009800 3965130 3996760
12914 3996760 4046798 4063576 4052793 4032683 4075714 3926212 3819396 3938118 3912476 3894282 3835057
12903 3835057 3872396 4005902 3942255 3922575 3947599 3934638 3961151 3978866 4029147 4090554 4066704
12892 4066704 4040530 4055626 4093997 4098855 4051287 4012323 4028802 4046414 4035959 3969344 4003469
12881 4003469 4012275 3946278 3962101 3899644 3739135 3804517 3802333 3746164 3796209 3891762 3969133
12870 3969133 3964381 3807133 3817516 3775567 3849554 3914893 3922321 3952285 3947101 3969695 3948050 3965343
12858 3965343 3947485 3966267 3973481 3923841 3969227 4038616 4071891 4056717 4073972 4057424 4006386
12847 4006386 3960423 3898880 3901244 3865962 3868684 3846522 3896331 3996169 4027660 3939601 3950493 3952608
12835 3952608 4014303 4070963 4007798 4057387 4094434 4028139 4004530 3972161 3936729 3998090 4066448
12824 4066448 4102594 4085621 4057603 4082435 4120923 4130329 4150547 4085140 4024123 4045913 3982961
12813 3982961 3902161 3877624 3903769 3906343 3947178 3910206 3969246 4052091 4062628 4123281 4176421
12802 4176421 4109577 4128566 4145597 4096202 4140204 4159347 4142442 4140110 4165695 4172095 4146436 4061583
12790 4061583 4123039 4105189 4118071 4106711 4070685 4045630 4034804 4008835 3894484 3815154 3853673
12779 3853673 3895554 4003070 4082815 4043808 4044839 4111754 4066518 4110967 4186410 4165163 4095704
12768 4095704 4055567 4190610 4153521 4203539 4238753 4232048 4111700 4095775 4117408 4128894 4116300
$$ [...]
##END NTUPLES=NMR SPECTRUM
##END=
