##TITLE=1H_EC-3032(II-2)
 CDCl3, 8 sc, 
 11.05.2021
##JCAMPDX= 6.0         $$ Bruker NMR JCAMP-DX V2.0
##DATA TYPE= NMR SPECTRUM
##DATA CLASS= NTUPLES
##ORIGIN= UXNMR, Bruker Analytische Messtechnik GmbH
##OWNER= root
$$ XWIN-NMR		Version 3.5
$$ Tue May 11 10:07:53 2021 Russian Standard Time (UT+4h)  she@DPX200
##.OBSERVE FREQUENCY= 200.131506
##.OBSERVE NUCLEUS= ^1H
##.ACQUISITION MODE= SIMULTANEOUS
##.ACQUISITION SCHEME= undefined
##.AVERAGES= 8
##.DIGITISER RES= 18
##SPECTROMETER/DATA SYSTEM= spect
##.PULSE SEQUENCE= zg30
##.SOLVENT NAME= CDCl3
##.SHIFT REFERENCE= (INTERNAL, CDCl3, 0, 15.9813)
##AUDIT TRAIL= $$ (NUMBER, WHEN, WHO, WHERE, WHAT)
$$ ##TITLE= Audit trail, XWIN-NMR		Version 3.5
$$ ##JCAMPDX= 5.01
$$ ##ORIGIN= Bruker BioSpin GmbH
$$ ##OWNER= she
$$ F:/spectra/data/she/nmr/H-F/1/pdata/1/auditp.txt
$$ ##AUDIT TRAIL=  $$ (NUMBER, WHEN, WHO, WHERE, WHAT)
(   1,<2021-05-11 10:06:44.82 +0400>,<she>,<DPX200>,
      <created by zg, POWCHK disabled, PULCHK disabled
       configuration hash MD5:
       00 E9 B6 7A A2 85 ED C7 34 08 36 98 17 FE 4E 26
       data hash MD5: 16K
       07 CF 8F DE 26 4D 65 05 27 62 83 42 5E 8B 64 A0>)
(   2,<2021-05-11 10:06:47.31 +0400>,<she>,<DPX200>,
      <Start of raw data processing
       efp BC_mod = 2 LB = 0.24 FT_mod = 6 PKNL = 1 PHC0 = -11122.47 PHC1 = 15.801 SI = 16K 
       data hash MD5: 16K
       C2 AD 81 2C 5C 34 09 2F 04 3D D3 65 3E 8A 80 0E>)
(   3,<2021-05-11 10:07:02.23 +0400>,<she>,<DPX200>,
      <pk PHC0 = 1.899262 PHC1 = -3.2 
       data hash MD5: 16K
       DF 27 ED 41 C1 DE 3A 90 1E 9C 41 94 44 35 EC 58>)
(   4,<2021-05-11 10:07:05.18 +0400>,<she>,<DPX200>,
      <abs ABSG = 5 
       data hash MD5: 16K
       05 6A EC 55 45 0E 49 CA C6 72 60 95 EF EF A5 10>)
$$ ##END=
$$ 
$$ hash MD5
$$ AA EE B9 EB 28 2C 81 10 BB 21 8C 57 6F 9B 9B B1
##$RELAX= 
##$RELAX= 
##$RELAX= 
##$RELAX= 
##$RELAX= 
##$RELAX= 
$$ Bruker specific parameters
$$ --------------------------
##$DU= <F:/spectra>
##$EXPNO= 1
##$NAME= <H-F>
##$PROCNO= 1
##$TYPE= <nmr>
##$USER= <she>
##$AMP= (0..31)
100 100 100 100 100 100 100 100 100 100 100 100 100 100 100 100 100 100 
100 100 100 100 100 100 100 100 100 100 100 100 100 100 
##$AQSEQ= 0
##$AQ_mod= 1
##$AUNM= <au_zg>
##$AUTOPOS= <>
##$BF1= 200.13
##$BF2= 200.13
##$BF3= 200.13
##$BF4= 200.13
##$BF5= 200.13
##$BF6= 200.13
##$BF7= 200.13
##$BF8= 200.13
##$BYTORDA= 1
##$CFDGTYP= 0
##$CFRGTYP= 5
##$CHEMSTR= <none>
##$CNST= (0..31)
1 1 145 1 1 1 1 1 1 1 1 1 1 1 1 1 1 1 1 1 1 1 1 1 1 1 1 1 1 1 1 1 
##$CPDPRG= <>
##$CPDPRG1= <>
##$CPDPRG2= <>
##$CPDPRG3= <>
##$CPDPRG4= <mlev>
##$CPDPRG5= <mlev>
##$CPDPRG6= <mlev>
##$CPDPRG7= <mlev>
##$CPDPRG8= <mlev>
##$CPDPRGB= <>
##$CPDPRGT= <>
##$D= (0..31)
0 1.2 0 0 0 0 0 0 0 0.06 0 0.03 0 0 0 0 0.0002 0 0 0 0 0 0 0 0 0 0 0 0 
0 0 0 
##$DATE= 1620713204
##$DBL= (0..7)
120 120 120 120 120 120 120 120 
##$DBP= (0..7)
150 150 150 150 150 150 150 150 
##$DBP07= 0
##$DBPNAM0= <>
##$DBPNAM1= <>
##$DBPNAM2= <>
##$DBPNAM3= <>
##$DBPNAM4= <>
$$ [...]
##$SUBNAM3= <"">
##$SUBNAM4= <"">
##$SUBNAM5= <"">
##$SUBNAM6= <"">
##$SUBNAM7= <"">
##$SUBNAM8= <"">
##$SUBNAM9= <"">
##$SW= 16.9725357007746
##$SWIBOX= (0..15)
0 0 2 0 0 0 0 0 0 0 0 0 0 0 0 0 
##$SW_h= 3396.73913043478
##$TD= 16384
##$TD0= 1
##$TE= 0
##$TE2= 300
##$TE3= 300
##$TEG= 300
##$TL= (0..7)
0 120 120 120 120 120 120 120 
##$TP= (0..7)
150 150 150 150 150 150 150 150 
##$TP07= 0
##$TPNAME0= <>
##$TPNAME1= <>
##$TPNAME2= <>
##$TPNAME3= <>
##$TPNAME4= <>
##$TPNAME5= <>
##$TPNAME6= <>
##$TPNAME7= <>
##$TPOAL= (0..7)
0.5 0.5 0.5 0.5 0.5 0.5 0.5 0.5 
##$TPOFFS= (0..7)
0 0 0 0 0 0 0 0 
##$TUNHIN= 0
##$TUNHOUT= 0
##$TUNXOUT= 0
##$USERA1= <user>
##$USERA2= <user>
##$USERA3= <user>
##$USERA4= <user>
##$USERA5= <user>
##$V9= 5
##$VALIST= <valist>
##$VCLIST= <CCCCCCCCCCCCCCC>
##$VD= 0
##$VDLIST= <DDDDDDDDDDDDDDD>
##$VPLIST= <PPPPPPPPPPPPPPP>
##$VTLIST= <TTTTTTTTTTTTTTT>
##$WBST= 1024
##$WBSW= 4
##$XGAIN= (0..3)
0 0 0 0 
##$XL= 0
##$YL= 0
##$YMAX_a= 396821
##$YMIN_a= -528979
##$ZGOPTNS= <>
##$ZL1= 120
##$ZL2= 120
##$ZL3= 120
##$ZL4= 120
##$ABSF1= 15.9864
##$ABSF2= -0.9862642
##$ABSG= 5
##$ABSL= 3
##$ALPHA= 0
##$AQORDER= 0
##$ASSFAC= 0
##$ASSFACI= 0
##$ASSFACX= 0
##$ASSWID= 0
##$AUNMP= <proc_1d>
##$AZFE= 0.1
##$AZFW= 0.1
##$BCFW= 0
##$BC_mod= 2
##$BYTORDP= 0
##$COROFFS= 0
##$CY= -3
##$DATMOD= 1
##$DC= 0
##$DFILT= <>
##$DTYPP= 0
##$F1P= 0
##$F2P= 0
##$FCOR= 1
##$FTSIZE= 16384
##$FT_mod= 6
##$GAMMA= 0
##$GB= 0
##$INTBC= 1
##$INTSCL= 1.334414e-10
##$ISEN= 128
##$LB= 0.24
##$LEV0= 0
##$LPBIN= 0
##$MAXI= 10000
##$MC2= 0
##$MEAN= 0
##$ME_mod= 0
##$MI= 1.114404
##$NCOEF= 0
##$NC_proc= -6
##$NLEV= 6
##$NOISF1= 3.799351
##$NOISF2= 2.8
##$NSP= 0
##$NTH_PI= 0
##$NZP= 0
##$OFFSET= 15.98128
##$PC= 1
##$PHC0= -11120.57
##$PHC1= 12.601
##$PH_mod= 1
##$PKNL= yes
##$PPARMOD= 0
##$PSCAL= 0
##$PSIGN= 0
##$REVERSE= no
##$SF= 200.130006035454
##$SI= 16384
##$SIGF1= 3
##$SIGF2= 2
##$SINO= 5.538805
##$SIOLD= 16384
##$SREGLST= <1H.CDCl3>
##$SSB= 0
##$STSI= 16384
##$STSR= 0
##$SW_p= 3396.73913043479
##$SYMM= 0
##$S_DEV= 0
##$TDeff= 16384
##$TDoff= 0
##$TI= <>
##$TILT= no
##$TM1= 0
##$TM2= 0
##$TOPLEV= 0
##$USERP1= <user>
##$USERP2= <user>
##$USERP3= <user>
##$USERP4= <user>
##$USERP5= <user>
##$WDW= 1
##$XDIM= 16384
##$YMAX_p= 378980446
##$YMIN_p= -1272000
$$ End of Bruker specific parameters
$$ ---------------------------------
##NTUPLES= NMR SPECTRUM
##VAR_NAME=  FREQUENCY,     SPECTRUM/REAL,   SPECTRUM/IMAG
##SYMBOL=    X,             R,               I
##VAR_TYPE=  INDEPENDENT,   DEPENDENT,       DEPENDENT
##VAR_FORM=  AFFN,          ASDF,            ASDF
##VAR_DIM=   16384,         16384,           16384
##UNITS=     HZ,            ARBITRARY UNITS, ARBITRARY UNITS
##FACTOR=    0.207333158178282, 1,           1
##FIRST=     3198.33372826542, 0,            0
##LAST=      -198.405402169366, 0,           0
##MIN=       -198.405402169366, -1272000,    0
##MAX=       3198.33372826542, 378980446,    0
$$ Real data points
##PAGE= N=1
##DATA TABLE= (X++(R..R)), XYDATA
$$ [...]
4510A5809988K22033m7517M1718J41665J18625l1475K2436K55851J50024P3067
$$ 15809988 16032021 15984504 16026222 16167887 16286512 16255037 16277473 16533324 16683348 16756415
4500A6756415J06209K16937K10779J09450o0506P4833L00523L46715L64804K06521
$$ 16756415 16862624 17079561 17290340 17399790 17339284 17414117 17714640 18061355 18426159 18632680
4490A8632680k8607P3368k9419j0791K48205J62994K45849K01640L37304M67462
$$ 18632680 18604073 18677441 18648022 18637231 18885436 19048430 19294279 19495919 19833223 20300685
4480B0300685M56811N32077N12821M68109O22964M90577O31121O27555O47930
$$ 20300685 20757496 21289573 21802394 22270503 22893467 23384044 24015165 24642720 25290650
4471B5290650O86388O58251N44943N45747N46520N67556O88129R03818J160988
$$ 25290650 25977038 26635289 27180232 27725979 28272499 28840055 29528184 30432002 31592990
4462C1592990J429240J499028J895619J942608K071452K607137K840634L079995
$$ 31592990 33022230 34521258 36416877 38359485 40430937 43038074 45878708 48958703
4454D8958703L242004L546731L708724M021311L880603M048098L838293L562590
$$ 48958703 52200707 55747438 59456162 63477473 67358076 71406174 75244467 78807057
4446G8807057L054831K774526K152784J139465m8986j460374k834293l871955
$$ 78807057 81861888 84636414 86789198 87928663 87879677 86419303 83585010 79713055
4438G9713055m328504m023438l923855m071931l809838l741085l596940l516306
$$ 79713055 75384551 71361113 67437258 63365327 59555489 55814404 52217464 48701158
4430D8701158k994956k651477k214317k061555j860435j475936j341624j131158
$$ 48701158 45706202 43054725 40840408 38778853 36918418 35442482 34100858 32969700
4422C2969700j237900j247552j040134r46696r30105o87280p66728n97170p42309
$$ 32969700 31731800 30484248 29444114 28497418 27567313 26880033 26113305 25516135 24773826
4413B4773826q98732o41648n90053p49760q82940p88921p00076p38693o52344
$$ 24773826 23875094 23233446 22643393 21893633 21010693 20221772 19521696 18783003 18130659
4404A8130659n98175m78655l27712l74502l61229l70026k99122k90575p4469k70117
$$ 18130659 17532484 17053829 16726117 16351615 15990386 15620360 15321238 15030663 14956194 14686077
4394A4686077j30137j83777j51317p7106j03801k17797j37063j53063l4963j70002
$$ 14686077 14555940 14372163 14220846 14143740 14039939 13822142 13685079 13532016 13497053 13327051
4384A3327051j50962q8469j71914j31865j29953j21171j16457q7766k01133j39018
$$ 13327051 13176089 13087620 12915706 12783841 12653888 12532717 12416260 12328494 12127361 11988343
4374A1988343j62424k76918k63898k07444k33215l05539j47244O9485p8729k59472
$$ 11988343 11825919 11549001 11285103 11077659 10844444 10538905 10391661 10461146 10382417 10122945
4364A0122945k42185k20583k93742j83309k16964m9716j11955k06478j43919r1904
$$ 10122945 9880760 9660177 9366435 9183126 8966162 8916446 8804491 8598013 8454094 8362190
4354H362190j11169j22621o7174K747J6739k41010j30690l1312r1065j6990M2051
$$ 8362190 8251021 8128400 8061226 8063973 8080712 7839702 7709012 7677700 7586635 7569645 7611696
4343G611696J04214k03994K038j1329j18334M9516k6350l3722L9362l6129q6771
$$ 7611696 7715910 7511916 7513954 7502625 7384291 7433807 7407457 7373735 7413097 7376968 7290197
4332G290197n2271j29431j10119k808j01302j05946j4854k3920j49630p2269q131
$$ 7290197 7237926 7108495 6998376 6995568 6894266 6788320 6773466 6749546 6599916 6527647 6519516
4321F519516j9811l0578M8755J19119k2963J5741j1573M4224O9735j05329j9497
$$ 6519516 6499705 6469127 6517882 6637001 6614038 6629779 6618206 6662430 6732165 6626836 6607339
4310F607339J34493M3194L0914J73881J89632O1818M7201p7518l14336j15771
$$ 6607339 6741832 6785026 6815940 6989821 7179453 7241271 7288472 7210954 6896618 6780847
4300F780847j62203N3228N1716J4840l393j01262J53490n9027n3115L9915J42063
$$ 6780847 6618644 6671872 6723588 6738428 6735035 6633773 6787263 6728236 6675121 6715036 6857099
4289F857099M6749L9629r838J39979K14366J13703J47888n9180K30344L68309
$$ 6857099 6903848 6943477 6933639 7073618 7287984 7401687 7549575 7490395 7720739 8089048
4279H089048L69283L25835K98233K39588L28960M21436J24621R7760K83514M68103
$$ 8089048 8458331 8784166 9082399 9321987 9650947 10072383 10197004 10294764 10578278 11046381
4269A1046381N19183Q47331R38292J377834J839653J487910J741591J660412J622002
$$ 11046381 11565564 12412895 13351187 14729021 16568674 18056584 19798175 21458587 23080589
4260B3080589p06610m344357l445647k180337j460884j012825p78228m13622l87612
$$ 23080589 22373979 18029622 14583975 12403638 10942754 9929929 9151701 8738079 8350467
4251H350467k24739k28789k14242r9106j23979j95233j77128l57823k48888k24085
$$ 8350467 8125728 7896939 7682697 7583591 7459612 7264379 7087251 6729428 6480540 6256455
4241F256455r6333j54662j31820k12035r7979p4041l40826n7387J8864n9948j12336
$$ 6256455 6160122 6005460 5873640 5661605 5563626 5489585 5148759 5091372 5110236 5050288 4937952
4230D937952J08410n1823j70621M061j57170k7826P7558j93176o6188J02778L2108
$$ 4937952 5046362 4994539 4823918 4827979 4670809 4642983 4720541 4527365 4461177 4563955 4596063
4219D596063q4619M7323p0215p7404O7532k08360j98367j65339j4940n3633j03251
$$ 4596063 4511444 4558767 4488552 4411148 4478680 4270320 4071953 3906614 3891674 3838041 3734790
4208C734790L3190N0982O0624M303j75570j5797N2171o0184j30962N770K0298
$$ 3734790 3767980 3818962 3879586 3883889 3708319 3692522 3744693 3684509 3553547 3559317 3579615
4197C579615J07427o6343p9004r1195L849n5R5122N1324r2013Q2012j78365n4687
$$ 3579615 3687042 3620699 3541695 3450500 3454349 3454294 3549416 3600740 3508727 3590739 3412374 3357687
4185C357687N3278r5886o5951j7331r4753o2802K13744o4360j36559l5494L3161
$$ 3357687 3410965 3315079 3249128 3231797 3137044 3074242 3287986 3223626 3087067 3051573 3084734
4174C084734o3839k1044o3421q9387O5920Q5722m1973k0682l0043O6146O1296
$$ 3084734 3020895 2999851 2936430 2847043 2912963 2998685 2956712 2936030 2905987 2972133 3033429
4163C033429K5745l0145j49726l4448J0852j961m7720J01261L5600M8495k02830
$$ 3033429 3059174 3029029 2879303 2844855 2855707 2853746 2806026 2907287 2942887 2991382 2788552
4152B788552q5732j0836l2309P8028N6942j16684L2551l8686J4491L9614P7276
$$ 2788552 2702820 2691984 2659675 2737703 2794645 2677961 2710512 2671826 2686317 2725931 2803207
4141B803207l2166j10466K33498O1612j81492N7678j536k6766L2234J9519j73261
$$ 2803207 2771041 2660575 2894073 2955685 2774193 2831871 2830335 2803569 2835803 2855322 2682061
4130B682061r4318P3015J43377P9642o5269K1974Q5741j01158l7944J46813n2199
$$ 2682061 2587743 2660758 2804135 2883777 2818508 2840482 2926223 2825065 2787121 2933934 2881735
4119B881735o3176l7920j44452P1822P7182J02798k8803p5651k6589Q8326R0901
$$ 2881735 2818559 2780639 2636187 2708009 2785191 2887989 2859186 2783535 2756946 2845272 2936173
4108B936173q4768k1858l2139K3176n5214j5235q0744O8263n9018L9953O9052
$$ 2936173 2851405 2829547 2797408 2820584 2765370 2750135 2669391 2737654 2678636 2718589 2787641
4097B787641p9680j1086O9451Q5727M7401j73447o7051l478O0429P4576k45815
$$ 2787641 2707961 2696875 2766326 2852053 2899454 2726007 2658956 2655478 2715907 2790483 2544668
4086B544668j04791J02742m1564J29221J660J6974m1540j27567k9499O9454l3288
$$ 2544668 2439877 2542619 2501055 2630276 2631936 2648910 2607370 2479803 2450304 2519758 2486470
4075B486470O9060M6468M5677j5963j10145O4682l0426j5847r5426L9859J40223
$$ 2486470 2555530 2601998 2647675 2631712 2521567 2586249 2555823 2539976 2444550 2484409 2624632
4064B624632N4892n2835j2378K3708N1495P5357K4539p7155J45006j06176n0583
$$ 2624632 2679524 2626689 2614311 2638019 2689514 2764871 2789410 2712255 2857261 2751085 2700502
4053B700502Q3027L4337r8393m3422k2603K3523J09079L5158j52061j30530J97560
$$ 2700502 2783529 2817866 2719473 2676051 2653448 2676971 2786050 2821208 2669147 2538617 2736177
4042B736177M2945r5278N7207o127J852Q3419O153M3345j06977Q682p960k0409
$$ 2736177 2779122 2683844 2741051 2734924 2736776 2820195 2826348 2869693 2762716 2771398 2763438 2743029
4030B743029M7591j00671K1258J37998m4862J5885P7745j362J63483n0705p0658
$$ 2743029 2790620 2689949 2711207 2849205 2804343 2820228 2897973 2896611 3060094 3009389 2938731
4019B938731L0060J0477l0415K9907L0019j67289J34784L604R8070O7155L9071
$$ 2938731 2968791 2979268 2948853 2978760 3008779 2841490 2976274 2979878 3077948 3145103 3184174
4008C184174R210P8317K48026j60196L446M487L6401Q2808R5468L7165J00572
$$ 3184174 3193384 3271701 3519727 3359531 3362977 3367464 3403865 3486673 3582141 3619306 3719878
3997C719878J77637M3084o8262j54706o7908j09074j7776n7288p8091M1223L4451
$$ 3719878 3897515 3940599 3872337 3717631 3649723 3540649 3522873 3465585 3387494 3428717 3463168
3986C463168m0000l0638j68624Q8459N8991k7249m8578N0307p838j1490j9863
$$ 3463168 3423168 3392530 3223906 3312365 3371356 3344107 3295529 3345836 3337998 3326508 3306645
3975C306645K30538N1219l8632n1764p4203R3599N8648o2972l9533J09963l8200
$$ 3306645 3537183 3588402 3549770 3498006 3423803 3517402 3576050 3513078 3473545 3583508 3545308
3964C545308J20462L5221N7433M8046n5805j0097K33804m0527J25326J5700L8799
$$ 3545308 3665770 3700991 3758424 3806470 3750665 3740568 3974372 3933845 4059171 4074871 4113670
3953D113670K11369Q1533r9846O7944J08744l734Q6391N5751M9193q0597k0665
$$ 4113670 4325039 4406572 4306726 4374670 4483414 4479680 4566071 4621822 4671015 4590418 4569753
3942D569753J05299R1543p1216R1299L7350n4433o050k7692J25822O6455K7410
$$ 4569753 4675052 4766595 4695379 4786678 4824028 4769595 4763545 4735853 4861675 4928130 4955540
3931D955540p7875L2163K4929P5209M0891O0380j0348K0498J09961k3400R1907
$$ 4955540 4877665 4909828 4934757 5009966 5050857 5111237 5100889 5121387 5231348 5207948 5299855
3920E299855Q1805r9348p6454J15687j8873m3244J45358P8343j20125L2816M7637
$$ 5299855 5381660 5282312 5205858 5321545 5302672 5259428 5404786 5483129 5363004 5395820 5443457
3909E443457q7727N9771Q5909j61181n4111J21999R3972n9333R0209j7429j1462
$$ 5443457 5355730 5415501 5501410 5340229 5286118 5408117 5502089 5442756 5532965 5515536 5504074
3898E504074q2068m6036J2351q2334J03267M1305n454Q4800J30062O038k3578
$$ 5504074 5422006 5375970 5388321 5305987 5409254 5450559 5445105 5529905 5659967 5666005 5642427
3887E642427K20832J69985j01829j494l9435o7748J54751N3716j04757m2941P7162
$$ 5642427 5863259 6033244 5931415 5929921 5890486 5822738 5977489 6031205 5926448 5883507 5960669
3876E960669J14928j18228K606J41289J59479l8657m0785p566j2523P5633q6636
$$ 5960669 6075597 5957369 5959975 6101264 6260743 6222086 6181301 6173735 6161212 6236845 6150209
3865F150209Q3872J00935q2458m1753L1221P2553N5460J61448J08249K0674O0559
$$ 6150209 6234081 6335016 6252558 6210805 6242026 6314579 6370039 6531487 6639736 6660410 6720969
3854F720969j757J4549L7191J98202K3415J41822R9426j4281m0751J89204K36186
$$ 6720969 6719212 6733761 6770952 6969154 6992569 7134391 7233817 7219536 7178785 7367989 7604175
3843G604175J83694J45444J84926J54058O094P7289K16040J29847O0256J79608
$$ 7604175 7787869 7933313 8118239 8272297 8278391 8355680 8571720 8701567 8761823 8941431
3833H941431J30513K53851K47337K21538J15033J97978N5261K79946J68570K02146
$$ 8941431 9071944 9325795 9573132 9794670 9909703 10107681 10162942 10442888 10611458 10813604
3823A0813604K95778L54647L49226K18288K51259M32617M94529M90496M91236
$$ 10813604 11109382 11464029 11813255 12031543 12282802 12715419 13209948 13700444 14191680
3814A4191680L82419N81157O61870P73672O42016P77943O75914O13803M45259
$$ 14191680 14574099 15155256 15817126 16590798 17232814 18010757 18686671 19300474 19745733
3805A9745733k34313o48846l87998Q9326K09655j8189K38115K48405J23227M40749
$$ 19745733 19511420 18862574 18474576 18563902 18773557 18755368 18993483 19241888 19365115 19805864
3795A9805864O50599N51880O14802P86135P34665O39773Q15550P78700P43615
$$ 19805864 20456463 21008343 21623145 22409280 23143945 23783718 24599268 25377968 26121583
3786B6121583J173303J169272R83955J225007J297965J183801J506723J513657
$$ 26121583 27294886 28464158 29448113 30673120 31971085 33154886 34661609 36175266
3778C6175266J721965J930964K124979J980512J911892J817965J507378Q96530
$$ 36175266 37897231 39828195 41953174 43933686 45845578 47663543 49170921 50067451
3770E0067451L49858k19933p11895j002762q82353n84438l13634j5767K13137
$$ 50067451 50417309 50197376 49485481 48482719 47600366 47015928 46702294 46686527 46899664
3761D6899664L78750P42926R99491R54815J261332J390403J425385J859410K118022
$$ 46899664 47278414 48021340 49020831 49975646 51236978 52627381 54052766 55912176 58030198
3752E8030198J997836K180758K121214K252021K562814K580526K692081K913775
$$ 58030198 60028034 62208792 64330006 66582027 69144841 71725367 74417448 77331223
3744G7331223L215076L225531L157142L252824L290157K963616K013637J431212
$$ 77331223 80546299 83771830 86928972 90181796 93471953 96435569 98449206 99880418
3736I9880418M95717p27556j370120j900705k009654j602698q88016n42325l78008
$$ 99880418 100376135 99648579 98278459 96377754 94368100 92765402 91877386 91335061 90957053
3727I0957053o3493j89442j1983K4708l9029K247P3490J74032L22518N50477Q06199
$$ 90957053 90893560 90704118 90692135 90716843 90677814 90680061 90753551 90927583 91250101 91800578 92606777
3716I2606777R91819J094496J022456P17264J11817k89921p53640j170401j510988
$$ 92606777 93598596 94693092 95715548 96432812 96544629 96254708 95501068 94330667 92819679
3707I2819679j859291j919597j554237j361524j337863j205216j331867j086920
$$ 92819679 90960388 89040791 87486554 86125030 84787167 83581951 82250084 81163164
3699H1163164q86929m59229o1654K90707J17717r0638n32833j454969j779880
$$ 81163164 80276235 79817006 79755352 80046059 80163776 80073138 79540305 78085336 76305456
3690G6305456j937633j764189j108644n73302j21538P15323J361721K015630K917756
$$ 76305456 74367823 72603634 71494990 70921688 70800150 71515473 72877194 74892824 77810580
3681G7810580L878319M991245O307145P450645Q444920Q664263Q293748O662328
$$ 77810580 81688899 86680144 92987289 100437934 108882854 117547117 125840865 132503193
3673A32503193L132991n272239j4249390j5688731j2785954r870427p508611o101922
$$ 132503193 135636184 130363945 116114555 100425824 87639870 77769443 70260832 64158910
3665F4158910n079217m050150l234875k608977k267538j971293j992573j580849
$$ 64158910 59079693 55029543 51794668 49185691 46918153 44946860 42954287 41373438
3657D1373438j436159j458678j142929j194413r98151r37542r74406r34695r77751
$$ 41373438 39937279 38478601 37335672 36141259 35143108 34205566 33231160 32296465 31318714
3648C1318714p94795r85666j021654q33548p06071p40633o20060o09517p30415
$$ 31318714 30523919 29538253 28516599 27683051 26976980 26236347 25616287 25006770 24276355
3639B4276355p69614m01200n39943o59608o80445m55566m70777o11224m57388
$$ 24276355 23506741 23105541 22565598 21905990 21225545 20769979 20299202 19687978 19230590
3630A9230590m58798m87645n68748m59266m05455m20172l79255k74698k13643
$$ 19230590 18771792 18284147 17715399 17256133 16850678 16430506 16051251 15776553 15562910
3621A5562910k91131l55688j24003j92940k89648l55580l02797j95927l37389
$$ 15562910 15271779 14916091 14792088 14599148 14309500 13953920 13651123 13455196 13117807
3612A3117807k73479j87199q4861r9464k49169j33419j28314k0125l5509j64815
$$ 13117807 12844328 12657129 12572268 12472804 12223635 12090216 11961902 11941777 11906268 11741453
3602A1741453j78361q226l5619j87119j10357K9212p4043j56688p473j20188n3190
$$ 11741453 11563092 11554866 11519247 11332128 11221771 11250983 11176940 11020252 11012779 10892591 10839401
3591A0839401j64746m2775J9291J22715J34449k9001j9071m5194P150N0596j0456
$$ 10839401 10674655 10631880 10651171 10773886 10908335 10879334 10860263 10815069 10822219 10872815 10862359
3580A0862359k835K50602m7753o1451j9040O1072J59726J27927K238n1719L5914
$$ 10862359 10859524 11110126 11062373 11000922 10981882 11042954 11202680 11330607 11332845 11281126 11317040
3569A1317040J3828m5298R6584n0254M0686J4249o0768O5671M2222J67487o1942
$$ 11317040 11330868 11285570 11382154 11331900 11372586 11386835 11326067 11391738 11433960 11601447 11539505
3558A1539505J12056k5190M4151J14294q0255O3047J93552J25601l6075J7097
$$ 11539505 11651561 11626371 11670522 11784816 11704561 11767608 11961160 12086761 12050686 12067783
3548A2067783o1478J21801Q8581q7975K9933Q8576N1656o6023O3831N9125N8895
$$ 12067783 12006305 12128106 12216687 12128712 12158645 12247221 12298877 12232854 12296685 12355810 12414705
3537A2414705J20308J35017J36267p455j4677J38689R8350J9768j04168j70449
$$ 12414705 12535013 12670030 12806297 12798842 12784165 12922854 13021204 13040972 12936804 12766355
3527A2766355j4415L9706m0149j44065J4843J30563m4385L5804J47182L6976J09874
$$ 12766355 12751940 12791646 12751497 12607432 12622275 12752838 12708453 12744257 12891439 12928415 13038289
3516A3038289J57165K66436j7347j0603J71869N7667J82217K07184R8434J64361
$$ 13038289 13195454 13461890 13444543 13433940 13605809 13663476 13845693 14052877 14151311 14315672
3506A4315672K9050J58783K60704K6237L4818k5268j82755j1347l7593k6722P511
$$ 14315672 14344722 14503505 14764209 14790446 14825264 14799996 14617241 14605894 14568301 14541579 14549090
3495A4549090P1301M1360j9063L3741J11168P3148L2193k5873j8967K45273R015
$$ 14549090 14620391 14661751 14642688 14676429 14787597 14860745 14892938 14867065 14848098 15093371 15102386
3484A5102386K06500K36581N0148J74487O555J72855K52927J11197R5482K22974
$$ 15102386 15308886 15545467 15595615 15770102 15776657 15949512 16202439 16313636 16409118 16632092
3474A6632092L87178J59181K00260K65141K12570K99780L10391L45090L71229
$$ 16632092 17019270 17178451 17378711 17643852 17856422 18156202 18466593 18811683 19182912
3465A9182912M68045N08235N31607N24463N44124O19493M61656P00658N36058
$$ 19182912 19650957 20159192 20690799 21215262 21759386 22378879 22840535 23541193 24077251
3456B4077251N23401N10433N12324Q26801O95470Q02815Q77341J047469J159608
$$ 24077251 24600652 25111085 25623409 26450210 27145680 27948495 28825836 29873305 31032913
3447C1032913J286912J550623J542729J653581K098011K332714K705725K855430
$$ 31032913 32319825 33870448 35413177 37066758 39164769 41497483 44203208 47058638
3439D7058638L123934L404542L601158M188311M814894N515261O253980P542779
$$ 47058638 50182572 53587114 57188272 61376583 66191477 71706738 77960718 85503497
3431H5503497Q769143R949970J1026382J1574638J1518383J0294257P303874J880873
$$ 85503497 94272640 104222610 115248992 126823630 138342013 148636270 155940144 157821017
3423A57821017o390014j2929717j4503518j2884812j0699012r058681q181677
$$ 157821017 151431003 138501286 123997768 111112956 100413944 91355263 83173586
3416H3173586p314794n972920m675778l500556k876562k906285k821027k585301
$$ 83173586 75858792 69885872 65210094 61709538 58832976 55926691 53105664 50520363
3408E0520363k367476k240479k041112j753720j808189j959645k179499k090647
$$ 50520363 48152887 45912408 43871296 42117576 40309387 38349742 36170243 34079596
3400C4079596j889250j733529j450589j219054j118282j081046j116151q48286
$$ 34079596 32190346 30456817 29006228 27787174 26668892 25587846 24471695 23623409
3392B3623409p59092q64684p16528p30441n98199o25703n48387n88452q09415
$$ 23623409 22864317 21999633 21283105 20552664 19954465 19328762 18780375 18191923 17382508
3383A7382508o21944n83835m56065o34965m31240m38025l76662j68684l56445
$$ 17382508 16760564 16176729 15720664 15085699 14654459 14216434 13839772 13671088 13314643
3374A3314643j97891j85264l38178k10158j84934l33469l04500k09478k43263
$$ 13314643 13116752 12931488 12593310 12383152 12198218 11864749 11560249 11350771 11107508
3365A1107508l14305j07891j40661o7857k37141k51232n8887j14009j66235j05321
$$ 11107508 10793203 10685312 10544651 10476794 10239653 9988421 9929534 9815525 9649290 9543969
3355I543969j97968j09420j19831j82598r3564o3311M0705J9553j41494o1516
$$ 9543969 9346001 9236581 9116750 8934152 8840588 8777277 8817982 8837535 8696041 8634525
3345H634525o0520j32299q9793r6527j4264q2412j61924q1407k0004k4751M735
$$ 8634525 8574005 8441706 8351913 8255386 8241122 8158710 7996786 7915379 7895375 7870624 7875359
3334G875359m7913K5635J16575J26779k8629J34769P7390J9290J14742K20762
$$ 7875359 7827446 7853081 7969656 8096435 8067806 8202575 8279965 8299255 8413997 8634759
3324H634759J07500L48385L86178J77831M31760K03785K49548K43767R9167j6974
$$ 8634759 8742259 9090644 9476822 9654653 10086413 10290198 10539746 10783513 10882680 10865706
3314A0865706k82616m23346l16893j43747j34894J7499O9869J31285K09381J53465
$$ 10865706 10583090 10159744 9842851 9699104 9564210 9581709 9651578 9782863 9992244 10145709
3304A0145709K21204L97669L52865L23579L01555L68459K04381K57389l6882K1504
$$ 10145709 10366913 10764582 11117447 11441026 11742581 12111040 12315421 12572810 12535928 12557432
3294A2557432J13645J84099k4121r522N5822j89126m61541m87443l99332m14760
$$ 12557432 12671077 12855176 12831055 12821533 12877355 12688229 12226688 11739245 11339913 10925153
3284A0925153j05895k53062j32282l2453J4198Q5335L5705j27868o0649j26984
$$ 10925153 10819258 10566196 10433914 10401461 10415659 10500994 10536699 10408831 10348182 10221198
3274A0221198j51437r6115j66351j80640j52158q4483J4978R4255K06092J47386
$$ 10221198 10069761 9973646 9807295 9626655 9474497 9390014 9404992 9499247 9705339 9852725
3264I852725J97876J14716K27809J74381J3660j54055j93049j03940k49549k77943
$$ 9852725 10050601 10165317 10393126 10567507 10581167 10427112 10234063 10130123 9880574 9602631
3254I602631l08294k76507m96521m43459k66630j44894k37537l64859j26114q0061
$$ 9602631 9294337 9017830 8521309 8077850 7811220 7666326 7428789 7063930 6937816 6857755
3244F857755l03313l43961p6399K6869p4219k28607j66062o1414q3483j23803
$$ 6857755 6554442 6210481 6134082 6160951 6086732 5858125 5692063 5630649 5547166 5423363
3234E423363l9040J18746j35615k3278l1727m7613k1094m3680L7392k2944J00949
$$ 5423363 5384323 5503069 5367454 5344176 5312449 5264836 5243742 5200062 5237454 5214510 5315459
3223E315459k0624O3738j22809k7286K65155n4628j18630L5093L8560P1358M0298
$$ 5315459 5294835 5358573 5235764 5208478 5473633 5419005 5300375 5335468 5374028 5445386 5485684
3212E485684l7271j55114J09423R7983L4008j76979j54795r9300P778q0720j86745
$$ 5485684 5448413 5293299 5402722 5500705 5534713 5357734 5202939 5103639 5111417 5030697 4843952
3201D843952k24659j65586P4341o1449j60879m9011K0437l2855r1890R2215M0533
$$ 4843952 4619293 4453707 4528048 4466599 4305720 4256709 4277146 4244291 4152401 4244616 4285149
3190D285149o6324p3881J9497M740n211J0120j0864m1260J67031j2790j70028
$$ 4285149 4218825 4144944 4164441 4169181 4163970 4174090 4163226 4121966 4288997 4276207 4106179
3179D106179L3733j07566k5174q2945n8266M303o3413j03932P6679K0970j9117
$$ 4106179 4139912 4032346 4007172 3924227 3865961 3870264 3806851 3702919 3779598 3800568 3781451
3168C781451j32702M3446j33029l3867k5976J61123l3579k58591m6703J92698
$$ 3781451 3648749 3692195 3559166 3525299 3499323 3660446 3626867 3368276 3321573 3514271
3158C514271J47304j00401n3181m5217l8432J6234P5474L0628M8489M5737P4480
$$ 3514271 3661575 3561174 3507993 3462776 3424344 3440578 3516052 3546680 3595169 3640906 3715386
3147C715386Q3391p5822p3237J03875k9313L1956N3245L8122j19028N6739J39058
$$ 3715386 3798777 3722955 3649718 3753593 3724280 3756236 3809481 3847603 3728575 3785314 3924372
3136C924372J7140Q4860k0943m4756J2729M696J20500P1194Q5706o5294o4985
$$ 3924372 3941512 4026372 4005429 3960673 3973402 3978098 4098598 4169792 4255498 4190204 4125219
3125D125219L8066J18858J63380o9030j27971l5956J62986K09053R1841N1002
$$ 4125219 4163285 4282143 4445523 4376493 4248522 4212566 4375552 4584605 4676446 4727448
3115D727448j00689j41332J08312m8393K12960R4520M7654L6486J19970p905J13169
$$ 4727448 4626759 4485427 4593739 4545346 4758306 4852826 4900480 4936966 5056936 5049031 5162200
3104E162200K1487J68788J68480J22774J43907j42816J07698l7334J1884P5972
$$ 5162200 5183687 5352475 5520955 5643729 5787636 5644820 5752518 5715184 5727068 5803040
3094E803040Q0639J18678K0639j39934N868N9474K81391k838l3221K7211L17025
$$ 5803040 5883679 6002357 6022996 5883062 5888930 5948404 6229795 6226957 6193736 6220947 6537972
3083F537972K78188R3486J27708K32223J63497K06708J36047R5263K38330K79605
$$ 6537972 6816160 6909646 7037354 7269577 7433074 7639782 7775829 7871092 8109422 8389027
3073H389027K81201K84635K41529K04013K90670L35967M22369K94142M00364M71267
$$ 8389027 8670228 8954863 9196392 9400405 9691075 10027042 10449411 10743553 11143917 11615184
3063A1615184N68585M78364N78786N49180N49335N75167N88134N13841L89858
$$ 11615184 12183769 12662133 13240919 13790099 14339434 14914601 15502735 16016576 16406434
3054A6406434M70904N82767N67816N07384M79286N26667N04796O80664P48285
$$ 16406434 16877338 17460105 18027921 18535305 19014591 19541258 20046054 20726718 21475003
3045B1475003P98897P17804O75058N10790L98754K74516P7867j35977P4378J84117
$$ 21475003 22273900 22991704 23666762 24177552 24576306 24850822 24928689 24792712 24867090 25051207
3035B5051207L93809N75367M60939N95177O64900Q03340Q54398M25838K58340
$$ 25051207 25445016 26020383 26481322 27076499 27741399 28544739 29399137 29824975 30083315
3026C0083315K02545l01273l74424m92827k45385k26229k09374q4330J40128K19885
$$ 30083315 30285860 29984587 29610163 29117336 28871951 28645722 28436348 28352018 28492146 28712031
3016B8712031K57681M30739K49330L00660m5619k48214k80734l81535n60433m99178
$$ 28712031 28969712 29400451 29649781 29950441 29904822 29656608 29375874 28994339 28433906 27934728
3006B7934728k72388k15273j9005J50697K37333J37251N6038O4365m9337k72201
$$ 27934728 27662340 27447067 27428062 27578759 27816092 27953343 28009381 28073746 28024409 27752208
2996B7752208j71473m80837n51692n70017l00385k88447o2333N5865j26192R7379
$$ 27752208 27580735 27099898 26548206 25978189 25677804 25389357 25327024 25382889 25256697 25354076
2986B5354076J11572K03953J141j47606l28353r02749o55611n63551p44024o39150
$$ 25354076 25465648 25669601 25670742 25523136 25194783 24292034 23636423 23072872 22328848 21689698
2976B1689698n59518m54148k26212j51585j06863j34928n1746l63064k97511m02045
$$ 21689698 21130180 20676032 20449820 20298235 20191372 20056444 20004698 19641634 19344123 18942078
2966A8942078o78871q06835q61899o77105q48217p89167m03411n14364k11950
$$ 18942078 18263207 17456372 16594473 15917368 15069151 14279984 13876573 13362209 13150259
2957A3150259k91719m11755k99224l48653j98904m44407m92958l34985l63943
$$ 13150259 12858540 12446785 12147561 11798908 11600004 11155597 10662639 10327654 9963711
2948I963711n48670m82954m82142l99882l23484l13437k93164k75129j40126n4827
$$ 9963711 9415041 8932087 8449945 8050063 7726579 7413142 7119978 6844849 6704723 6649896
2938F649896k22914j36159k81771k95681l13099j37120l08460o6546j62076r7667
$$ 6649896 6426982 6290823 6009052 5713371 5400272 5263152 4954692 4888146 4726070 4628403
2928D628403r0066j48802j19612k16373o2468J4135j32561r0974j44287j64227
$$ 4628403 4538337 4389535 4269923 4053550 3991082 4005217 3872656 3781682 3637395 3473168
2918C473168k9676l8883r3705m743n303n8400j52657j47867O901l4584l9154J21
$$ 3473168 3443492 3404609 3310904 3306161 3300858 3242458 3089801 2941934 2948835 2914251 2875097 2875218
2906B875218J884j26863j4797j51228J1955J85761j78802l2330l3618n1310k811
$$ 2875218 2877102 2750239 2735442 2584214 2596169 2781930 2603128 2570798 2537180 2485870 2483059
2895B483059J68223k05154j16039j5634p8527Q2832p2391j01196R7021R3149j21688
$$ 2483059 2651282 2446128 2330089 2314455 2235928 2318760 2246369 2145173 2242194 2335343 2213655
2884B213655P5106j14356R5094p2496p084k5330p6437K10425j15853j61654L3616
$$ 2213655 2288761 2174405 2269499 2197003 2189919 2164589 2088152 2298577 2182724 2021070 2054686
2873B054686n988l0772J35547l6211j52445J8983O6785q0321m3971q3327j62652
$$ 2054686 2048698 2017926 2153473 2117262 1964817 1983800 2050585 1970264 1926293 1842966 1680314
2862A680314M2723J12329j2523j3462K8245P6615J47610m7418n1543k1540k7072
$$ 1680314 1723037 1835366 1822843 1809381 1837626 1914241 2061851 2014433 1962890 1941350 1914278
2851A914278O2016O3067m7741j68721j16355M1957J10682P2330k3463j9234j6401
$$ 1914278 1976294 2039361 1991620 1822899 1706544 1748501 1859183 1931513 1908050 1888816 1872415
2840A872415j25605j49297J74780J12499M5652q2224o9326j5904r3943n3235M4723
$$ 1872415 1746810 1597513 1772293 1884792 1930444 1848220 1778894 1762990 1669047 1615812 1660535
2829A660535M9960R8083J3277N503r644Q8419o7649r1612j84325J855J38027J25047
$$ 1660535 1710495 1808578 1821855 1827358 1817714 1906133 1838484 1746872 1562547 1564402 1702429 1827476
2817A827476k3943j11123J28911R8034k5035J62522r6523l5359J62642M6207l7341
$$ 1827476 1803533 1692410 1821321 1919355 1894320 2056842 1960319 1924960 2087602 2133809 2096468
2806B096468J0323N6182k6649n5786j9605J21692J2916L4798K7290J61236P9417
$$ 2096468 2106791 2162973 2136324 2080538 2060933 2182625 2195541 2230339 2257629 2418865 2498282
2795B498282j18380P8443N5119o6901J15462r7523O0160k6180o5933p6049j64287
$$ 2498282 2379902 2458345 2513464 2446563 2562025 2464502 2524662 2498482 2432549 2356500 2192213
2784B192213j4105J5566j18699j01478m685N2648r0607o1279l6840n9057N3760
$$ 2192213 2178108 2193674 2074975 1973497 1968812 2021460 1930853 1869574 1832734 1773677 1827437
2773A827437J56242q1798r2072L7181R4829J33777j33318j73679J54110J60194
$$ 1827437 1983679 1901881 1809809 1846990 1941819 2075596 1942278 1768599 1922709 2082903
2763B082903p1822L4641J46563K84q381k7314k4703l7553M0751K4722J00763J04113
$$ 2082903 2011081 2045722 2192285 2192569 2184188 2156874 2132171 2094618 2135369 2160091 2260854 2364967
2751B364967K3379j25047L2272N8621j44111J23018p3094j05928p6063J3751J11931
$$ 2364967 2388346 2263299 2295571 2354192 2210081 2333099 2260005 2154077 2078014 2091765 2203696
2740B203696m8596j71660Q5381J53748j14950o515j80538P6423k3217j73752K0739
$$ 2203696 2155100 1983440 2068821 2222569 2107619 2101104 1920566 1996989 1973772 1800020 1820759
2729A820759O8890n0083Q2185p9918o0621j8307k5259j26409M2368J25962j43926
$$ 1820759 1889649 1839566 1921751 1841833 1781212 1762905 1737646 1611237 1653605 1779567 1635641
2718A635641J8484M0390J19582j01748L1570K4832O9149L2550p2994r0084J31323
$$ 1635641 1654125 1694515 1814097 1712349 1743919 1768751 1837900 1870450 1797456 1707372 1838695
2707A838695M6653r907O1345l9143k1971K9873q6488K8331k9930L0302J47605
$$ 1838695 1885348 1875441 1936786 1897643 1875672 1905545 1819057 1847388 1817458 1847760 1995365
2696A995365J29538k4475j05205p452Q5689J524j05153j15343m9550O1930L3527
$$ 1995365 2124903 2100428 1995223 1987771 2073460 2074984 1969831 1854488 1804938 1866868 1900395
2685A900395k4668k0852r9813p1017J73685J33722j03685Q5528J303J10385K112
$$ 1900395 1875727 1854875 1755062 1684045 1857730 1991452 1887767 1973295 1974598 2084983 2087095
2674B087095j39594q7494J90255J14511q9500K7469O02L1005q9479Q3689J2677
$$ 2087095 1947501 1860007 2050262 2164773 2075273 2102742 2103344 2134349 2044870 2128559 2141236
2663B141236j71690R795M0289M3580K04275P0935j19499j8636L6770l4381J48352
$$ 2141236 1969546 1979341 2019630 2063210 2267485 2338420 2218921 2200285 2237055 2202674 2351026
2652B351026M0823O584o6553j03895N6702K9569K1864R8317L5599k608j9316N1018
$$ 2351026 2391849 2398433 2331880 2227985 2284687 2314256 2336120 2434437 2470036 2467428 2448112 2499130
2640B499130P6252R5364j5539L71J7023J40723P6631J46014J2320m9363J9477
$$ 2499130 2575382 2670746 2655207 2655578 2672601 2813324 2889955 3035969 3048289 2998926 3018403
2629C018403M0614L6067P9133J52950O3610p4743P4031l3599k1439J64942M0270
$$ 3018403 3059017 3095084 3174217 3327167 3390777 3316034 3390065 3356466 3335027 3499969 3540239
2618C540239P0230j4851j6714J23323J65012n9971P0685J93116M6706L6667M8740
$$ 3540239 3610469 3595618 3578904 3702227 3867239 3807268 3877953 4071069 4117775 4154442 4203182
2607D203182M6096o9155Q2714J60131P7760l1495m8772J71140K06511J48857M4955
$$ 4203182 4249278 4180123 4262837 4422968 4500728 4469233 4420461 4591601 4798112 4946969 4991924
2596D991924o7586K10101J47976M5516L3156q849J65431J1847N7550K39115M3651
$$ 4991924 4924338 5134439 5282415 5327931 5361087 5352238 5517669 5529516 5587066 5826181 5869832
2585E869832P3656K24084R4355K8078L4236J45233J32557P5845K8078J07775P6893
$$ 5869832 5943488 6167572 6261927 6290005 6324241 6469474 6602031 6677876 6705954 6813729 6890622
2574F890622R6559J7646R5011P2715K6709q3975j2144K19408J95750Q40P7457
$$ 6890622 6987181 7004827 7099838 7172553 7199262 7115287 7103143 7322551 7518301 7519141 7596598
2563G596598J29863J13704J46876j55381J44076J25282J39508J86949J82107J61267
$$ 7596598 7726461 7840165 7987041 7831660 7975736 8101018 8240526 8427475 8609582 8770849
2553H770849N7811J57550J23928J00985K45900K89015K01383J92052K17578K02684
$$ 8770849 8828660 8986210 9110138 9211123 9457023 9746038 9947421 10139473 10357051 10559735
2543A0559735R8472K09279J74092K48268K47821L77023L85602L33221M87624M50824
$$ 10559735 10658207 10867486 11041578 11289846 11537667 11914690 12300292 12633513 13121137 13571961
2533A3571961L67067L71968N20519N86287M31459P24106P77375P67485P27501
$$ 13571961 13939028 14310996 14831515 15417802 15849261 16573367 17350742 18118227 18845728
2524A8845728R61625J063299J170335J280009J313339J432854J629390J854818
$$ 18845728 19807353 20870652 22040987 23320996 24634335 26067189 27696579 29551397
2516B9551397J943018K192968K295026K365823K818346L001600L086261L069042
$$ 29551397 31494415 33687383 35982409 38348232 41166578 44168178 47254439 50323481
2508E0323481K900505K967826K648176K176734J742251J170270P11256K72269
$$ 50323481 53223986 56191812 58839988 61016722 62758973 63929243 64640499 64912768
2500F4912768j80490n20053o73736m43145m46825l95959k71986j48275P3038l6000
$$ 64912768 64732278 64212225 63538489 63095344 62648519 62252560 61980574 61832299 61905337 61869337
2490F1869337m08061p99324r77300j494081k024435k252927k641445l096643l166338
$$ 61869337 61461276 60661952 59684652 58190571 56166136 53913209 51271764 48175121 45008783
2481D5008783l063201l061712k894039k625667k341656k008768j710012j740619
$$ 45008783 41945582 38883870 35989831 33364164 31022508 29013740 27303728 25563109
2473B5563109j440404j396454j140178j040326q81045p42292p89164o40368n71118
$$ 25563109 24122705 22726251 21586073 20545747 19664702 18922410 18133246 17492878 16921760
2464A6921760p74135n33688l77657l97881l52226l43584m33670j73194m50137
$$ 16921760 16147625 15613937 15236280 14838399 14486173 14142589 13708919 13535725 13085588
2455A3085588k98944j39621k70086j76607k70418k05646k50881k36844Q371J7078
$$ 13085588 12786644 12647023 12376937 12200330 11929912 11724266 11473385 11236541 11244912 11261990
2445A1261990j08938k35022j89284k0506n6225p5862q6713o279r4942j8229q0225
$$ 11261990 11153052 10918030 10728746 10708240 10652015 10576153 10489440 10483161 10388219 10369990 10289765
2434A0289765M7762Q266N1639n7232n3543R1749J34632k3441M2130P9185J45678
$$ 10289765 10337527 10345793 10397432 10340200 10286657 10378406 10513038 10489597 10531727 10610912 10756590
2423A0756590R2890o8929m3240n257R0725J12603p7681r4554M9359J58621J37714
$$ 10756590 10849480 10780551 10737311 10732054 10822779 10935382 10857701 10763147 10812506 10971127 11108841
2412A1108841j9006J20818J72841J84539J36069J68980j5431J53019J60986J11197
$$ 11108841 11089835 11210653 11383494 11568033 11704102 11873082 11857651 12010670 12171656 12282853
2402A2282853J00480J73185J11879K61017M52956J99260J71450K41568L38461
$$ 12282853 12383333 12556518 12668397 12929414 13382370 13581630 13753080 13994648 14333109
2393A4333109L38463Q9367J61152J51993J65666L05213J42234K92293K75004L88890
$$ 14333109 14671572 14760939 14922091 15074084 15239750 15544963 15687197 15979490 16254494 16643384
2383A6643384J51105L14589K19138M60889N08246L33334M94536L96980M64076
$$ 16643384 16794489 17109078 17328216 17789105 18297351 18630685 19125221 19522201 19986277
2374A9986277N73376N72173N82124N17296Q49323P73843O52833R34147R08681
$$ 19986277 20559653 21131826 21713950 22231246 23080569 23854412 24507245 25441392 26350073
2365B6350073Q58982Q91918R99480Q72527Q49729P45515N43184M23633L42237
$$ 26350073 27209055 28100973 29100453 29972980 30822709 31568224 32111408 32535041 32877278
2356C2877278P3837j90339k49376j73138j27819m40672k55185m6196M5352Q6684
$$ 32877278 32951115 32760776 32511400 32338262 32210443 31769771 31514586 31468390 31513742 31600426
2346C1600426J80159L48459M64995N21297P37291Q20062Q91728P86259Q12723
$$ 31600426 31780585 32129044 32594039 33115336 33852627 34672689 35564417 36350676 37163399
2337C7163399J157724J262412J307748J474033J652567J795970J928488K058984
$$ 37163399 38321123 39583535 40891283 42365316 44017883 45813853 47742341 49801325
2329D9801325K259507K484354K934312L094289L336282L548093L778350L808667
$$ 49801325 52060832 54545186 57479498 60573787 63910069 67458162 71236512 75045179
2321G5045179L939667L824293L851380L630139L404384L333466L301257L307999
$$ 75045179 78984846 82809139 86660519 90290658 93695042 97028508 100329765 103637764
2313A03637764L201088L525303L759668M209719M479172M670439M794940M572827
$$ 103637764 106838852 110364155 114123823 118333542 122812714 127483153 132278093 136850920
2305A36850920M007445L043788K318532J375184R4108j031377j921377k833506
$$ 136850920 140858365 143902153 146220685 147595869 147689977 146658600 144737223 141903717
2297A41903717l111988l559738l599393l332196k949631k617792j995927j465132
$$ 141903717 138791729 135231991 131632598 128300402 125350771 122732979 120737052 119271920
2289A19271920j006057o20736l19614j40437j27184l0427l63644o69737r98002
$$ 119271920 118265863 117645127 117325513 117185076 117057892 117027465 116663821 115994084 114996082
2280A14996082j499988j944469k400744k624679l013391l349867l579235l568961
$$ 114996082 113496094 111551625 109150881 106526202 103512811 100162944 96583709 93014748
2272I3014748l570930l612521l524993l284761l035008k657170k542887k329633
$$ 93014748 89443818 85831297 82306304 79021543 75986535 73329365 70786478 68456845
2264F8456845k063013j995941j658401j654064j412943j327805j228057j092475
$$ 68456845 66393832 64397891 62739490 61085426 59672483 58344678 57116621 56024146
2256E6024146r78403p78109o63283m29226l06467k91855o9884m8692O486K87990
$$ 56024146 55045743 54267634 53604351 53175125 52868658 52576803 52506919 52458227 52464713 52752703
2246E2752703M49312L65542N14952N11764O89597R70705Q41617J151507J347798
$$ 52752703 53202015 53567557 54082509 54594273 55283870 56254575 57096192 58247699 59595497
2237E9595497J440833J771897J568191J975927K273867K556279K868031L343313
$$ 59595497 61036330 62808227 64376418 66352345 68626212 71182491 74050522 77393835
2229G7393835L375402L741909L966411M260705M434468M539816M638746M721412
$$ 77393835 80769237 84511146 88477557 92738262 97172730 101712546 106351292 111072704
2221A11072704M552074M429239M094659L537552L043352K601205K134486J899990
$$ 111072704 115624778 120054017 124148676 127686228 130729580 133330785 135465271 137365261
2213A37365261J547785J304236J301771J100471J173664R74663P56221L59410
$$ 137365261 138913046 140217282 141519053 142619524 143793188 144767851 145524072 145883482
2205A45883482J64220k84244o53000j271163j481011j714101k123537k138361
$$ 145883482 146047702 145763458 145110458 143839295 142358284 140644183 138520646 136382285
2197A36382285k253469k204910k296920k262122k025460k027317j833733j829620
$$ 136382285 134128816 131923906 129626986 127364864 125339404 123312087 121478354 119648734
2189A19648734j670052j269168r28191q43455l06150K51363R22971J477571J884168
$$ 119648734 117978682 116709514 115781323 114937868 114631718 114883081 115806052 117283623 119167791
2180A19167791K754363L278224L597399L828519L739325L372404K806647J946726
$$ 119167791 121922154 125200378 128797777 132626296 136365621 139738025 142544672 144491398
2172A44491398J327321N85887j68944n36269r88721j008306j143628r10057n15173
$$ 144491398 145818719 146404606 146235662 145699393 144710672 143702366 142558738 141648681 141133508
2163A41133508j91572P2665j82150m81041p88903j258553k197650k847609l591284
$$ 141133508 140941936 141014601 140832451 140351410 139562507 138303954 136106304 133258695 129667411
2154A29667411m460318m953489n402738m916876m543882m032747l596429l143921
$$ 129667411 125207093 120253604 114850866 109933990 105390108 101357361 97760932 94617011
2146I4617011k634611k446228k079785j734203j197501j308454j156159j060342
$$ 94617011 91982400 89536172 87456387 85722184 84524683 83216229 82060070 80999728
2138H0999728p09865k38637J67035N61017Q57262J245238J744412K350222K499991
$$ 80999728 80289863 80051226 80218261 80779278 81636540 82881778 84626190 86976412 89476403
2129H9476403K622275L475046M965049O051815O776842O914421P020236O848291
$$ 89476403 92098678 95573724 100538773 106590588 113367430 120281851 127302087 134150378
2121A34150378N729818m847012j1185038o522484l360591r64534P0414Q52288
$$ 134150378 139880196 135033184 123848146 117325662 113965071 113000537 113070951 113923239
2113A13923239J018961J437077J253310J086647O79480O16906L31185K40937J5452
$$ 113923239 114942200 116379277 117632587 118719234 119398714 120015620 120346805 120587742 120603194
2104A20603194N1466P0682L44747O38064J080055J599276K656603L981236M763289
$$ 120603194 120654660 120725342 121070089 121708153 122788208 124387484 127044087 131025323 135788612
2095A35788612M704676N036437M878450M552494r48741j3135551j3507713r222985
$$ 135788612 140493288 145529725 150408175 154960669 154011928 140876377 127368664 118145679
2087A18145679p091814n483680n044851m652847m290638l994588l817517l613529
$$ 118145679 111053865 105570185 100525334 95872487 91581849 87587261 83769744 80156215
2079H0156215l382751l290082k869502k439016k218812j883177j563258j213866
$$ 80156215 76773464 73483382 70613880 68174864 65956052 64072875 62509617 61295751
2071F1295751j146277r03079o66103n36196o01163n67857p75929o04789o79437
$$ 61295751 60149474 59246395 58580292 58044096 57442933 56875076 56099147 55494358 54814921
2062E4814921n60678l50633k90144j15899j20843j31713k8504L32039N41748Q10103
$$ 54814921 54254243 53903610 53613466 53497567 53376724 53245011 53216507 53548546 54090294 54900397
2052E4900397R36443J066402J348515J631360K065730K408477K731361L045847
$$ 54900397 55836840 56903242 58251757 59883117 61948847 64357324 67088685 70134532
2044G0134532L296167L813637M280765M406458M890488M588520M632184M367279
$$ 70134532 73430699 77244336 81525101 85931559 90822047 95410567 100042751 104410030
2036A04410030L824486L206438K128449J246145K1204j137327k264592l441059
$$ 104410030 108234516 111440954 113569403 114815548 114836752 113699425 111434833 107993774
2028A07993774m222069m983652n294515n254446n185174m943847m418536m083037
$$ 107993774 103771705 98788053 93493538 88239092 83053918 78110071 73691535 69608498
2020F9608498l480014k956969k612354j890149j373533r83421o27466m27323K7178
$$ 69608498 66128484 63171515 60559161 58669012 57295479 56312058 55684592 55257269 55284447
2011E5284447J35486L62014N82184N60236M92713N93392N62391O31828M89155
$$ 55284447 55419933 55781947 56364131 56924367 57417080 58010472 58572863 59204691 59693846
2002E9693846N29892M54983M55535O4058j68961k67879l01954k59057L3450O31227
$$ 59693846 60223738 60678721 61134256 61198314 61029353 60761474 60459520 60200463 60233913 60865140
1992F0865140O54928P72780R11585Q77321P9651k062804k946980k019037j312941
$$ 60865140 61520068 62292848 63204433 64081754 64161405 62098601 59151621 57132584 55819643
1983E5819643q08340k99824k79189l70892l96614n44456r34950j215778j271286
$$ 55819643 55011303 54711479 54432290 54061398 53664784 53120328 52185378 50969600 49698314
1974D9698314j632973j667461j646426j576032j629294j371815j065655r54406
$$ 49698314 48065341 46397880 44751454 43175422 41546128 40174313 39108658 38154252
1966C8154252o41027k15947l6463K78114N00209O15698M22735O9679k066436l750651
$$ 38154252 37513225 37297278 37260815 37538929 38039138 38654836 39077571 39147250 37080814 33330163
1956C3330163l227450k287059j905378j474696j126915q50427o83246n77983n32699
$$ 33330163 30102713 27815654 25910276 24435580 23308665 22458238 21774992 21197009 20664310
1947B0664310o62353n74134m43205m62717k79384k63677l94865m74866j29224
$$ 20664310 20001957 19427823 18984618 18521901 18242517 17978840 17583975 17109109 16979885
1938A6979885l12211j69931j15828o1677r8727N4285N5309Q7809J10312Q6747
$$ 16979885 16667674 16497743 16381915 16320238 16221511 16275796 16331105 16418914 16529226 16615973
1928A6615973M9859J08566J93739Q7199R6156K43828K12536O1215K05703M606
$$ 16615973 16665832 16774398 16968137 17055336 17151492 17395320 17607856 17669071 17874774 17879380
1918A7879380j37543j60215q7606j41089j24728k12043j44001j26893k24867m6690
$$ 17879380 17741837 17581622 17494016 17352927 17228199 17016156 16872155 16745262 16520395 16473705
1908A6473705L5459n6379K3872j2915J00722K39688L26326K97291K70902J87271
$$ 16473705 16509164 16452785 16476657 16463742 16564464 16804152 17130478 17427769 17698671 17885942
1898A7885942J77106P0188j99041m29844o13585o36603m80708m84431l30702k37270
$$ 17885942 18063048 18133236 17934195 17504351 16890766 16254163 15773455 15289024 14958322 14721052
1888A4721052j83412N244J27881J3204j27633N5408n9948N6864K39230n0838K4437
$$ 14721052 14537640 14542884 14670765 14683969 14556336 14611744 14551796 14608660 14847890 14797052 14821489
1877A4821489P6813K59703J67382J98668J22027R8823L17870J10495K12860L44403
$$ 14821489 14898302 15158005 15325387 15524055 15646082 15744905 16062775 16173270 16386130 16730533
1867A6730533J57004J68732R1638K32311L9358J87089K70621K12039R4225K27843
$$ 16730533 16887537 17056269 17147907 17380218 17419576 17606665 17877286 18089325 18183550 18411393
1857A8411393L02377J86078K87827K00253L52366L67300M68991L68618K53085
$$ 18411393 18713770 18899848 19187675 19387928 19740294 20107594 20576585 20945203 21198288
1848B1198288M62738K41876L19285L07588M54199M78930N03196O10875M66124
$$ 21198288 21661026 21902902 22222187 22529775 22983974 23462904 23966100 24576975 25043099
1839B5043099M68061N44751N23319O04344O76425P23951O54898M54711N28938
$$ 25043099 25511160 26055911 26579230 27183574 27859999 28583950 29238848 29693559 30222497
1830C0222497L99161K40350M15265O10251N03652M08809O25508Q09159O62177
$$ 30222497 30621658 30862008 31277273 31887524 32391176 32799985 33425493 34234652 34896829
1821C4896829R01365Q40138Q45588Q78821P02326P17361O65925O88865Q15395
$$ 34896829 35798194 36638332 37483920 38362741 39065067 39782428 40448353 41137218 41952613
1812D1952613R64771J099748J280811J270703J461200J393302J441593J722575
$$ 41952613 42917384 44017132 45297943 46568646 48029846 49423148 50864741 52587316
1804E2587316J613781J811096J652772J732290J583264J497288J641640J667565
$$ 52587316 54201097 56012193 57664965 59397255 60980519 62477807 64119447 65787012
1796F5787012J764418J858033K292364K516551K679791L104759L915979M297295
$$ 65787012 67551430 69409463 71701827 74218378 76898169 80002928 83918907 88216202
1788H8216202M998254N653652O420487P135184P956935Q763916R596642J0543034
$$ 88216202 93214456 98868108 105288595 112423779 120380714 129144630 138741272 149284306
1780A49284306J1590834J3059809J4559100J6720414J9503511K2746532K5346371
$$ 149284306 160875140 173934949 188494049 205214463 224717974 247464506 272810877
1773B72810877K7255795K7444682K5127682J8863515P477895r847604k7712728
$$ 272810877 300066672 327511354 352639036 371502551 378980446 369132842 341420114
1766C41420114l7354248l7030589l1718752k5304502j9783139j5145969j1731358
$$ 341420114 304065866 267035277 235316525 210012023 190228884 175082915 163351557
1759A63351557q790887o798305n588037m469944l397908k092489r78592P2546
$$ 163351557 154560670 147762365 142174328 137704384 134306476 132213987 131235395 131307941
1751A31307941J298064K347551L019503M174590N013296O014261P277446Q642765
$$ 131307941 132606005 134953556 137973059 142147649 147160945 153175206 160452652 169095417
1743A69095417J0480920J2505489J4964992J7210185J8434921J8452920J6511050
$$ 169095417 179576337 192081826 207046818 224257003 242691924 261144844 277655894
1736B77655894J1238886K023009j0981596k3455355k9200344k7920037k3719093
$$ 277655894 288894780 290917789 279936193 256480838 227280494 199360457 175641364
1729A75641364j8947558j4992192j1862276r125025p727163o578377n967668n592328
$$ 175641364 156693806 141701614 129839338 120714313 112987150 106408773 100441105 94848777
1721I4848777n595408n442814n273676m972763m333675l882401l422960l157737
$$ 94848777 89253369 83810555 78536879 73564116 69230441 65348040 61925080 58767343
1713E8767343k863436k742216k534011k219716k032796j985664j832903j421772
$$ 58767343 55903907 53161691 50627680 48407964 46375168 44389504 42556601 41134829
1705D1134829j612948j485272j354766j573905j308094j156774j250169j077640
$$ 41134829 39521881 38036609 36681843 35107938 33799844 32643070 31392901 30315261
1697C0315261r67548j088252r22047r27976p54854o80938q35315o59631o71420
$$ 30315261 29347713 28259461 27337414 26409438 25654584 24973646 24138331 23478700 22807280
1688B2807280n88312o67835n62964l77488o60077n93375l87941m68092l91505
$$ 22807280 22218968 21551133 20988169 20610681 19950604 19357229 18969288 18501196 18109691
1679A8109691l89690m71206l74191l50298l24008k22912l59452k45060l53751
$$ 18109691 17720001 17248795 16874604 16524306 16200298 15977386 15617934 15372874 15019123
1670A5019123j54431l40766k51732J0080k93234k77011k66514m11216l42193l27359
$$ 15019123 14864692 14523926 14272194 14282274 13989040 13712029 13445515 13034299 12692106 12364747
1660A2364747l25479k75611l07780j75011j63393k92335l05291q3392k30928k85794
$$ 12364747 12039268 11763657 11455877 11280866 11117473 10825138 10519847 10436455 10205527 9919733
1650I919733o6209k70950j99005j63648j55485k29882k83142l9570k03890j50260
$$ 9919733 9853524 9582574 9383569 9219921 9064436 8834554 8551412 8511842 8307952 8157692
1640H157692p6676j53242j90971J220j28443k00276k54023K970j46967j53984
$$ 8157692 8081016 7927774 7736803 7738023 7609580 7409304 7155281 7158251 7011284 6857300
1630F857300K235j04478j32303K974n5056n2827m7050j34390n4176j07424o2671
$$ 6857300 6859535 6755057 6622754 6625728 6570672 6517845 6470795 6336405 6282229 6174805 6112134
1619F112134o226q2299j13840j69838l6711j25735r1856q9667j33351n4557j9059
$$ 6112134 6105908 6023609 5909769 5739931 5703220 5577485 5485629 5395962 5262611 5208054 5188995
1608E188995l6845j27828r2511M7808k01546k00464j3529l2832j84990j48203
$$ 5188995 5152150 5024322 4931811 4979619 4778073 4577609 4564080 4531248 4346258 4198055
1598D198055J2861L3980N7332P8809j41211M810M1343j17156N6801p4406L021
$$ 4198055 4210916 4244896 4302228 4381037 4239826 4244636 4285979 4168823 4225624 4151218 4154239
1587D154239j74686o2405N2821j02376r1979n8752O5101J90301j11523j85994
$$ 4154239 3979553 3917148 3969969 3867593 3775614 3716862 3781963 3972264 3860741 3674747
1577C674747q7710l023K4526m9293l198Q1019j07549l4148q6418M2782K1254q6674
$$ 3674747 3587037 3584014 3608540 3559247 3556049 3637068 3529519 3495371 3408953 3451735 3472989 3386315
1565C386315r1335J10235r548o4033m1995N7862L8309j19796j52862j30171q1312
$$ 3386315 3294980 3405215 3395667 3331634 3289639 3347501 3385810 3266014 3113152 2982981 2901669
1554B901669J8934N2033n3011q9749J13655Q3898k593l7216l9082o924j17753
$$ 2901669 2920603 2972636 2919625 2829876 2943531 3027429 3024836 2987620 2948538 2941614 2823861
1543B823861n6625N6735K12675j8039k34648k6207m5028J340J131O3921o1686
$$ 2823861 2767236 2823971 3036646 3018607 2783959 2757752 2712724 2714064 2715195 2779116 2717430
1532B717430m0243L7645n4381k9464m091j426o0868o8696L4469r313p5318j2762
$$ 2717430 2677187 2714832 2660451 2630987 2626896 2625470 2564602 2495906 2530375 2521062 2445744 2432982
1520B432982l9548M1112j09287o4941J41903K16510p7739q6406k3436j63555Q360
$$ 2432982 2393434 2434546 2325259 2260318 2402221 2618731 2540992 2454586 2431150 2267595 2275955
1509B275955J42967K6544r5736m9862k3578j41994N3728O0721J2476q4759q6418
$$ 2275955 2418922 2445466 2349730 2299868 2276290 2134296 2188024 2248745 2261221 2176462 2090044
1498B090044J36297l1301M962O8699r7757j9806J06795m7488l7042N3540j81719
$$ 2090044 2226341 2195040 2200002 2268701 2170944 2151138 2257933 2210445 2173403 2226943 2045224
1487B045224N2094J11052Q7949J87505J60166j44040M324P2188J13708l6316O3708
$$ 2045224 2097318 2208370 2296319 2483824 2643990 2499950 2504274 2576462 2690170 2653854 2717562
1476B717562J84019p0678j30238J41382P5810Q9797J49751Q4378p3667N7924o4361
$$ 2717562 2901581 2830903 2700665 2842047 2917857 3007654 3157405 3241783 3168116 3226040 3161679
1465C161679o5759j06320j93864j70548j45673M7692j22493p3538j14533k2651
$$ 3161679 3095920 2989600 2795736 2625188 2479515 2527207 2404714 2331176 2216643 2193992
1455B193992N2810j18462O9090M4490r7279k5962j1741l4380m388k2838K14040
$$ 2193992 2246802 2128340 2197430 2241920 2144641 2118679 2106938 2072558 2068170 2045332 2259372
1444B259372J4924o5361J35491K8718j6450k2591J88738O169J03694J6171q6627
$$ 2259372 2274296 2208935 2344426 2373144 2356694 2334103 2522841 2529010 2632704 2648875 2562248
1433B562248O889j13484j98850p3844j0136j85580j11830r2252k9657Q86M0794
$$ 2562248 2569137 2455653 2256803 2182959 2172823 1987243 1875413 1783161 1753504 1754390 1795184
1422A795184l2385j69561j76433l6944J70274p1425j56462J01490J29561L603
$$ 1795184 1762799 1593238 1416805 1379861 1550135 1478710 1322248 1423738 1553299 1556902
1412A556902j42916m3309j38610r1251k9225K120J9747l8055N7603O2164J59509
$$ 1556902 1413986 1370677 1232067 1140816 1111591 1113711 1133458 1095403 1153006 1215170 1374679
1401A374679o1792o5246j89305N1504M7713j67561K6045J11166K452J20710p9592
$$ 1374679 1312887 1247641 1058336 1109840 1157553 989992 1016037 1127203 1129655 1250365 1170773
1390A170773l2994j82723J48817j9060K3601k9860p5233l299J18356j5987r490
$$ 1170773 1137779 955056 1103873 1084813 1108414 1078554 1003321 1000022 1118378 1102391 1092901
1379A092901P3451m0695k42388J46066P3606j97982l5174o6036O9606o827K6646
$$ 1092901 1166352 1125657 883269 1029335 1102941 904959 869785 803749 873355 866528 893174
1368H93174R8332j3345j56702o65r5942J17896o6011j4857O3496J10449P0501
$$ 893174 991506 978161 821459 820794 724852 842748 776737 761880 825376 935825 1006326
1357A006326k0642q8019j07755O6753m9135j44141q280n5100m3599J38272J04065
$$ 1006326 985684 897665 789910 856663 807528 663387 655107 600007 556408 694680 798745
1346G98745q7451J8083J86449N867q1646j44201L0050j64779N410Q2099O8328
$$ 798745 711294 729377 915826 921693 840047 695846 725896 561117 566527 648626 716954
1335G16954j9100j28736j1462R5813j0599r4165K51695J2044o4692n7949M0953
$$ 716954 697854 569118 557656 653469 642870 548705 800400 812444 747752 689803 730756
1324G30756m5793j46497j2774J09418j891n1982J9237N0271q0166j0204r6434
$$ 730756 684963 538466 525692 635110 633219 581237 600474 650745 570579 560375 463941
1313D63941J06978N9256J8522j01251k0210Q0060J86038J7091r8559L8238p6696
$$ 463941 570919 630175 648697 547446 527236 607296 793334 810425 711866 750104 673408
1302F73408j10608j3920J54979P0475j72715r6091J4632K1855q0899J90789n285
$$ 673408 562800 548880 703859 774334 601619 505528 520160 542015 461116 651905 646620
1291F46620j24905O4151J3632P9544r3800j00673m3152J4543r3025J08093R3745
$$ 646620 521715 585866 599498 679042 585242 484569 441417 455960 362935 471028 564773
1280E64773k3527O0373K8142j06922j23699R7251k0864M2334J35920N1944k12765
$$ 564773 541246 601619 629761 522839 399140 496391 475527 517861 653781 705725 492960
1269D92960k34339N9828J06667J3056r8108Q875J25426M7284k9180L1217p244
$$ 492960 258621 318449 425116 438172 340064 348939 474365 521649 492469 523686 516442
1258E16442k20148J0349P5589J84210p0850j56108J43416J58546j12400P243n7679
$$ 516442 296294 306643 382232 566442 495592 339484 482900 641446 529046 536289 478610
1247D78610k9686K20044j03234P6964l0083K5363J48055j34408j26790p8932R8142
$$ 478610 448924 668968 565734 642698 612615 637978 786033 651625 524835 445903 544045
1236E44045J27724m924n1796n0322j73011l538N2691L9799N6237p2229j00646
$$ 544045 671769 666845 615049 564727 391716 388178 440869 480668 536905 464676 364030
1225C64030m9183N9692q1600q160J5097l6586J00598L0401j02989N1307K7284
$$ 364030 314847 374539 292939 284779 299876 263290 363888 394289 291300 342607 369891
1214C69891J497l2969K1851j7943J10397M3396M3492q070l1130n8343Q9566r6690
$$ 369891 371388 338419 360270 342327 452724 496120 539612 531542 500412 442069 531635 434945
1202D34945q9335m9314q5870J3833J08383J14887j3858j51499Q3411K0399j2238
$$ 434945 345610 296296 210426 224259 332642 447529 433671 282172 365583 385982 373744
1191C73744Q5m8305O6467J53251k44617l9620l4584J11288K26911j09607k0942
$$ 373744 373829 325524 391991 545242 300625 261005 226421 337709 564620 455013 434071
1180D34071J22886l1355q4459n1317n3455O8300k5556N8203L2820l0468p6478
$$ 434071 556957 525602 441143 389826 336371 404671 379115 437318 470138 439670 363192
1169C63192j03999m8609J6584q4258N4574J65695P3089q9318R8618j42404o3505
$$ 363192 259193 210584 227168 142910 197484 363179 436268 346950 445568 303164 239659
1158B39659p4520J00943J1486p1181P8045J5991J07243l9493j17477P7019j7043
$$ 239659 165139 266082 277568 206387 284432 300423 407666 368173 250696 327715 310672
1147C10672j14490N678J144J11201J32985n6404M694N5167P8438m435r9085N5016
$$ 310672 196182 201860 203004 314205 447190 390786 395480 450647 529085 524650 425565 480581
1135D80581j00728R4938R3939j4959j32882m0341Q1664j7819k759N5964J225n7784
$$ 480581 379853 474791 568730 553771 420889 380548 462212 444393 441634 497598 498823 441039
1123D41039r6148J49502K3786r7560J02301j50269K9308L8620R387J0693n0858
$$ 441039 344891 494393 518179 420619 522920 372651 401959 440579 449966 460659 409801
1112D09801j28158M5371J53724j02243N101J68517O1456o8197m8799L1282N6765
$$ 409801 281643 327014 480738 378495 383596 552113 613569 545372 496573 527855 584620
1101E84620o2317j44721P0219R1512J12089L5404j79272m0076J09715L4082Q7187
$$ 584620 522303 377582 447801 539313 651402 686806 507534 467458 577173 611255 698442
1090F98442N4597j60339l7300M2354o0911J03057K9320O9119K2389l7473k0721
$$ 698442 753039 592700 555400 597754 536843 639900 669220 738339 760728 723255 702534
1079G02534J23825R0866n6615R1412j7598j71736j05401P8236L056M4557J8129
$$ 702534 826359 917225 860610 952022 934424 762688 657287 735523 738579 783136 801265
1068H01265O1648J026j63759q0319O7142k842J04301j1315J9969J99677J13966
$$ 801265 862913 863939 700180 619861 687003 684161 788462 777147 797116 996793 1110759
1057A110759J70323J48048N059K8120J09000j41508q9826l9623n5305J6971M9610
$$ 1110759 1281082 1429130 1434189 1462309 1571309 1429801 1339975 1300352 1245047 1262018 1311628
1046A311628M717q8015L2366K8152O4513J29578q2297n0361l2964l15o487J722
$$ 1311628 1316345 1228330 1260696 1288848 1353361 1482939 1400642 1350281 1317317 1317002 1310515 1312237
1034A312237M5446k4495L9251K76802N9224r4773j17025j75672K9403N9321J23196
$$ 1312237 1357683 1333188 1372439 1649241 1708465 1613692 1496667 1320995 1350398 1409719 1532915
1023A532915l7087P2447J90982O5542K1786n0144k7787k6040m9736K3440L00402
$$ 1532915 1495828 1568275 1759257 1824799 1846585 1796441 1768654 1742614 1692878 1716318 2016720
1012B016720l7170N8578m8343L4979J03014q5j29717R2137M5951J95970J58623
$$ 2016720 1979550 2038128 1989785 2024764 2127778 2127693 1997976 2090113 2136064 2332034 2490657
1001B490657L1725k3052Q4677R3175R2441Q5951J57255L08926K30866J59499K28729
$$ 2490657 2522382 2499330 2584007 2677182 2769623 2855574 3012829 3321755 3552621 3712120 3940849
990C940849N8721J90051O3652N8731J84425J89222L06098K01310L02367K91682
$$ 3940849 3999570 4189621 4253273 4312004 4496429 4685651 4991749 5193059 5495426 5787108
980E787108K50633K31465L94217M99337N59745M56509O82487J073807R03532P72407
$$ 5787108 6037741 6269206 6663423 7162760 7722505 8179014 8861501 9935308 10838840 11611247
970A1611247O59755P42125J162840J421342J593112J992173K307331K873483M008019
$$ 11611247 12271002 13013127 14175967 15597309 17190421 19182594 21489925 24363408 28371427
961B8371427M664985N083176M877573N012239M990843L305929r623383j2740119
$$ 28371427 33036412 38119588 42997161 48009400 53000243 56306172 46682789 33942670
953C3942670p324846n204148l231974k596854k021480j548433r85593q84274n26961
$$ 33942670 26617824 21413676 18181702 15584848 13563368 12014935 11029342 10145068 9618107
944I618107m57630l58299o34413k39010j88974o76894o74556n10308m98938k23566
$$ 9618107 9160477 8802178 8167765 7928755 7739781 7062887 6388331 5878023 5379085 5155519
934E155519k72883l03346k30885p0396l21772k24646j79346j41160r2649j25511
$$ 5155519 4882636 4579290 4348405 4278009 3956237 3731591 3552245 3411085 3318436 3192925
924C192925k42558j81000j69588k25921j21832M3535M5363o4704j33816l6281
$$ 3192925 2950367 2769367 2599779 2373858 2252026 2295561 2340924 2276220 2142404 2106123
914B106123j19454J070n7966o5461J4557J8025j21570j6275j18723j75614j14087
$$ 2106123 1986669 1987739 1929773 1864312 1878869 1896894 1775324 1759049 1640326 1464712 1350625
903A350625J46019l1372n6660q7293K9093Q0597j06194k31933J7477J41776J09772
$$ 1350625 1496644 1465272 1408612 1321319 1350412 1431009 1324815 1092882 1110359 1252135 1361907
892A361907j49699q0874j57470J01065M9588r452p5476p707r7348o2902j12292
$$ 1361907 1212208 1131334 973864 1074929 1124517 1115065 1039589 1031882 934534 871632 759340
881G59340Q908L3216M7718Q3328k94984p1459R627o4052J83885J0150l7581R6099
$$ 759340 768248 801464 849182 932510 637526 566067 575694 511642 695527 705677 668096 764195
869G64195r0134j8677O3440k9637L7523q7574L4051L1335J5568n6241r4751l1960
$$ 764195 674061 655384 718824 689187 726710 639136 673187 704522 720090 663849 569098 537138
857E37138j13329m80P4898J44825k3888m5952L0504l5309k5422N5960m139p4227
$$ 537138 423809 423329 498227 643052 619164 573212 603716 568407 542985 598945 594806 520579
845E20579j11598m6599L9697P8673m7540j44113m407J37924j1768L5677L2047
$$ 520579 408981 362382 402079 480752 433212 289099 284692 422616 410848 446525 478572
834D78572j35310l0088k4326j05219P9320O0980L7365j85195P037L1504n1924
$$ 478572 343262 313174 288848 183629 262949 323929 361294 176099 183136 214640 162716
823A62716O8172j95294q0359J78178L9779P16m8408J73100J32096J0990j34554
$$ 162716 230888 35594 -44765 133413 173192 173908 125500 298600 430696 441686 307132
812C07132M6526j27687O9496N0357J38141l8200j68696j21150L0796J35037N083
$$ 307132 353658 225971 295467 345824 483965 445765 277069 155919 186715 321752 326835
801C26835r4520q6333J02385j45188l4563J28311K121j40140p8794J72940R3042
$$ 326835 232315 145982 248367 103179 68616 196927 199048 58908 -19886 153054 246096
790B46096m6478J54565m9062j17617J2813j5627j2866K281N7995j7469o8008Q6798
$$ 246096 199618 354183 305121 187504 200317 184690 171824 174105 232100 214631 146623 233421
778B33421L0860P512j09447q5506l5881q2996j5943R2171J67047M1002j35154
$$ 233421 264281 271793 162346 76840 40959 -42037 -57980 34191 201238 242240 107086
767A07086Q7506J37173l27K3420n4111J0978j25762k8207P8719m5538P91R47L0432
$$ 107086 194592 331765 331438 354858 300747 311725 185963 157756 236475 190937 191728 192675 223107
754B23107J03372R115n4801q5393l5317J9103L1445q0463o8527P7273K8455Q3167
$$ 223107 326479 335594 280793 195400 160083 179186 210631 130168 61641 138914 167369 250536
742B50536n0049l0425J8018n747O9672j09725o4122M6318j0235l9869k4191L5917
$$ 250536 200487 170062 188080 182333 252005 142280 78158 124476 114241 74372 50181 86098
730H6098M7388m477j32201k082M3602M7745J37538m25n1701j2903k939m3594k6348
$$ 86098 133486 129009 -3192 -5274 38328 86073 223611 223186 171485 158582 155643 112049 85701
717H5701p451l000J5984l5645J3184p2933l879n1824L6971R0021j55149J11437
$$ 85701 78250 75250 91234 55589 68773 -4160 -8039 -59863 -22892 67129 -88020 23417
705B3417j1328Q681L3720K9311l71J356m2590m9189R1011l4741q0305J05141m4289
$$ 23417 12089 20770 54490 83801 83430 84786 42196 -6993 84018 49277 -31028 74113 29824
692B9824q1639P9018k7264M3362K9107N9318l9378j2525M1101l7417J02414n5305
$$ 29824 -51815 27203 -61 43301 72408 131726 92348 79823 120924 83507 185921 130616
680A30616j50784K15486R8723q2973K718K9450k13325L0573J30008L0908o6110
$$ 130616 -20168 195318 294041 211068 213786 243236 29911 60484 190492 221400 155290
669A55290J19792O7953l7838q9625p5578j6924L9295Q9168r1988j14077K0085
$$ 155290 275082 343035 305197 215572 139994 123070 162365 251533 159545 45468 65553
658F5553N8976J20151L2042q2580p2616k9409o8353j1762M522J7290J15729n9394
$$ 65553 124529 244680 276722 194142 121526 92117 23764 12002 16524 33814 149543 90149
646I0149m4968m8719M3069J43069p1915j64076P2044L0598j04947R246j2533j3934
$$ 90149 45181 -3538 39531 182600 110685 -53391 18653 49251 -55696 -46450 -58983 -72917
634g2917L6298o186j56418J69167J89635P037r2315j35707r284m603j4039J46817
$$ -72917 -36619 -42805 -199223 -30056 159579 166616 74301 -61406 -70690 -75293 -89332 57485
622E7485P5849j01706n7480q1979Q9638R0085j02399O2340L6871j07002L5530
$$ 57485 133334 31628 -25852 -107831 -18193 71892 -30507 31833 68704 -38298 -2768
611b768J7761l2068k7556k8507R5691N0741q5468k557Q9842l9094K2130J26391
$$ -2768 14993 -17075 -44631 -73138 22553 73294 -12174 -14731 75111 36017 58147 184538
599A84538J7032J50853q0381q6808p8329J5202J28302o1555m2633j7741j50605
$$ 184538 201570 352423 272042 185234 106905 122107 250409 188854 146221 128480 -22125
588b2125M2523P0016O0785k6998k50784j32359Q832J0042Q4585L2878J8381J58174
$$ -22125 20398 90414 151199 124201 -126583 -258942 -250110 -240068 -155483 -122605 -104224 53950
576E3950o6041o6101J00625o845p9456l4260P3618M9054n2110j30446J68347J07766
$$ 53950 -12091 -78192 22433 15588 -63868 -98128 -24510 24544 -27566 -158012 10335 118101
564A18101p6472l7682j50290j8284N7252r9733J39540O1539J01815K4516l2213
$$ 118101 41629 3947 -146343 -164627 -107375 -207108 -67568 -6029 95786 120302 88089
553H8089r0890K257o4869J6752Q1261j4043K6908o2274r4703Q6638K0182j33798
$$ 88089 -2801 -544 -65413 -48661 32600 18557 45465 -16809 -111512 -24874 -4692 -138490
541a38490j00182R1825J08207N4963K8734L7481q0969L4909N9540j57173o5644
$$ -138490 -238672 -146847 -38640 16323 45057 82538 1569 36478 96018 -61155 -126799
530a26799K1425N5776j58635P0479M8364o2124r8517K5410M726J56348k8104L5525
$$ -126799 -105374 -49598 -208233 -137754 -89390 -151514 -250031 -224621 -219895 -63547 -91651 -56126
518e6126m245P7842O7290j05167J47154j03824j42453R4885k170M4982j67843
$$ -56126 -60371 17471 84761 -20406 126748 22924 -119529 -24644 -26814 18168 -149675
507a49675j3849J36049j1204n0058Q2573K9688l3155l0462J29431L6692L29M7517
$$ -149675 -163524 -27475 -38679 -88737 -6164 23524 -9631 -40093 89338 126030 126359 173876
495A73876m3230o648j44791M391p7053j05516N6184j2372J03167j6997j04967
$$ 173876 130646 123998 -20793 -16402 -93455 -198971 -142787 -155159 -51992 -68989 -173956
484a73956J44189N3252q4656J9304p1888l0466M2178m0285J27033m8089N9973
$$ -173956 -29767 23485 -61171 -41867 -113755 -144221 -102043 -142328 -15295 -63384 -3411
473c411j1243L0683L6465k3424K7306o6380R371n8529k4644J04300m0254p2013
$$ -3411 -14654 16029 52494 29070 56376 -10004 -633 -59162 -83806 20494 -19760 -91773
461i1773m6784Q2657J12948k9764k03873r1329J03830Q5351K674r7872j4431R4475
$$ -91773 -138557 -55900 57048 27284 -176589 -267918 -164088 -78737 -76063 -173935 -188366 -93891
449i3891J01345n7213m8591q6736K06615O8622j60482P5720J24683j2052j16408
$$ -93891 7454 -49759 -98350 -185086 21529 90151 -70331 5389 130072 118020 1612
438A612m2294J9397n8027q6396M4028m78l73j6772j98094M3956K6479l8100J25522
$$ 1612 -40682 -21285 -79312 -165708 -121680 -122158 -122531 -139303 -337397 -293441 -266962 -305062 -179540
425a79540J3667Q6990j9538j40257J74705J40406j6715j36557j15697Q7051l9054
$$ -179540 -165873 -78883 -98421 -238678 -63973 76433 59718 -76839 -192536 -105485 -144539
414a44539Q4620j18160l0752J55031J31288q3409m5277n6492m6047M4777K8505
$$ -144539 -59919 -178079 -208831 -53800 77488 -5921 -51198 -107690 -153737 -108960 -80455
403h0455l8614M4626p28J127J59559j78016m9609N3966J1483p6492J5583N9982
$$ -80455 -119069 -74443 -75171 -74044 85515 -92501 -142110 -88144 -76661 -153153 -137570 -77588
391g7588j28607K0847N7017N4694P7209r3348j37346j6893P9869K1979j47642
$$ -77588 -206195 -185348 -128331 -73637 3572 -89776 -227122 -244015 -164146 -142167 -289809
380b89809j0030J80690L6840j6618o6155N7001m1621K6953l6765m606O5988R2350
$$ -289809 -299839 -119149 -82309 -98927 -165082 -108081 -149702 -122749 -159514 -164120 -98132 -5782
368e782N4299q001m2623M6267q7614K7704m1113l4485L2757n3461L5461n3701
$$ -5782 48517 40516 -2107 44160 -43454 -15750 -56863 -91348 -58591 -112052 -76591 -130292
356a30292r293J8052j4104J14267k3180j50026R8789P9139J3546L2450j0115n2835
$$ -130292 -139585 -121533 -135637 -21370 -44550 -194576 -95787 -16648 -3102 29348 19233 -33602
344c3602j7672p2373p3227R423P2877k9963L3245L669n1096j16525O3706J09936
$$ -33602 -51274 -123647 -196874 -187451 -114574 -144537 -111292 -107623 -158719 -275244 -211538 -101602
332a01602j0565j23716M6429J06944J56033m5350j44549r2749J25089M6352j07320
$$ -101602 -112167 -235883 -189454 -82510 73523 28173 -116376 -209125 -84036 -37684 -145004
321a45004j05975J5626J36877n7716j5250m9324K465J47401j21249R805P4205
$$ -145004 -250979 -235353 -98476 -156192 -171442 -220766 -218301 -70900 -192149 -182344 -108139
310a08139j5369j8555k6932K3979N575j1454P2683o9894j50441M7525J24782p3492
$$ -108139 -123508 -142063 -168995 -145016 -139441 -150895 -78212 -148106 -298547 -251022 -126240 -199732
298a99732j2025O0734n6378M4978O4079O7356j21169l2537Q154m6532M0865o0575
$$ -199732 -211757 -151023 -207401 -162423 -98344 -30988 -152157 -184694 -176540 -223072 -182207 -242782
286b42782r5117K33169Q7251L3716j47162j36595O6096J39597j13890n7078P773
$$ -242782 -337899 -104730 -17479 16237 -130925 -267520 -201424 -61827 -175717 -232795 -225022
275b25022N7458J9690k9660k2855J9938Q7533n0566m3245P5874j05492N6265K45148
$$ -225022 -167564 -147874 -177534 -200389 -180451 -92918 -143484 -186729 -110855 -216347 -160082 85066
263H5066j03505m0560l1188j04109q3719k4054J09454J75756j35394K0668R6271
$$ 85066 -18439 -58999 -90187 -194296 -278015 -302069 -192615 -16859 -152253 -131585 -35314
252c5314m1874j09476j6616O8605M0966l0767P9042L0806j10186M2841j27755
$$ -35314 -77188 -186664 -203280 -134675 -93709 -124476 -45434 -14628 -124814 -81973 -209728
241b09728j41607M3842k0689N1627Q4077R0647J1275q4116O744L8187j30280N9863
$$ -209728 -351335 -307493 -328182 -276555 -192478 -101831 -90556 -174672 -167928 -129741 -260021 -200158
229b00158J38510l1755n1893j58696L6396K26634J74608j24885j85514K9095M4995
$$ -200158 -61648 -93403 -145296 -303992 -267596 -40962 133646 8761 -176753 -147658 -102663
218a02663j35646k3668k4123l1528J30402l1215Q2538L1850j37913R0899M5622
$$ -102663 -238309 -261977 -286100 -317628 -187226 -218441 -135903 -104053 -241966 -151067 -105445
207a05445m3186o1135Q9245j2937j47938N9144N3244Q2690N050j03611K4853m7829
$$ -105445 -148631 -209766 -120521 -133458 -281396 -222252 -169008 -86318 -81268 -184879 -160026 -207855
195b07855p5675j70j354K3930l0887J26790J12607q1047m2666j13590m6606N3899
$$ -207855 -283530 -283700 -285054 -261124 -292011 -165221 -52614 -133661 -176327 -289917 -336523 -282624
183b82624J44796N9824m7391j2218J08725j07702k5361j1713n1050O2261J5632
$$ -282624 -137828 -78004 -125395 -137613 -28888 -136590 -161951 -173664 -224714 -162453 -146821
172a46821m6075m0973J5240j5175J2330m1757J1276r739n8159J36701R5478q1879
$$ -146821 -192896 -233869 -218629 -233804 -221474 -263231 -251955 -261694 -319853 -183152 -87674 -169553
160a69553k4397L1071j02211n1900J5252J43192L4591l9689P0700J7364N0844
$$ -169553 -193950 -162879 -265090 -316990 -301738 -158546 -123955 -163644 -92944 -75580 -24736
149b4736j09129j15773Q0965n3668j0072J00990N7410l8040p1580r644j12438
$$ -24736 -133865 -249638 -168673 -222341 -232413 -131423 -74013 -112053 -183633 -193277 -305715
138c05715O6273M5788m3525L3674K0554p209J25904p4139L3102k28723L1947J25231
$$ -305715 -239442 -193654 -237179 -203505 -182951 -190160 -64256 -138395 -105293 -334016 -302069 -176838
126a76838j16013J0770m3397J03250Q6475r7979R0811j6886r5474k6847p7548
$$ -176838 -292851 -282081 -325478 -222228 -135753 -233732 -142921 -159807 -255281 -282128 -359676
115c59676q6315J56707Q5613l7862m0569k5550J13062J4280n9550l0161K6089
$$ -359676 -445991 -289284 -203671 -241533 -282102 -307652 -194590 -180310 -239860 -270021 -243932
104b43932n2491l5756M4727J04815k4129j10852m419J4675M1802K9474l6792n2050
$$ -243932 -296423 -332179 -287452 -182637 -206766 -317618 -322037 -307362 -265560 -236086 -272878 -324928
92c24928J4156K5937N5116M9862k2901K6271j51033k6219L7174L0360K6129L9163
$$ -324928 -310772 -284835 -229719 -179857 -202758 -176487 -327520 -353739 -316565 -286205 -260076 -220913
80b20913q1129L6885J28866k3142l3841J24532n5224p7296M0892r6397l9759R3492
$$ -220913 -302042 -265157 -136291 -159433 -193274 -68742 -123966 -201262 -160370 -256767 -296526 -203034
68b03034J27576l2355o5617m5047l9796j631o6859K3242Q5466p469P914J2297
$$ -203034 -75458 -107813 -173430 -218477 -258273 -259904 -326763 -303521 -218055 -225524 -217610 -205313
56b05313m8112L5576N8655m5969n4804j18061O2837P6751p3197J00003k8286m241
$$ -205313 -253425 -217849 -159194 -205163 -259967 -378028 -315191 -238440 -311637 -211634 -239920 -244161
44b44161o8500O4860j434j01049K4502m3563N4230L5432L4562O0847J9163ll4286
$$ -244161 -312661 -247801 -249235 -350284 -325782 -369345 -315115 -279683 -245121 -184274 -165111 -165114 -199400
31a99400n5044j10691M5479J17220k3370J20876J5715r9303o7184k7828J4789
$$ -199400 -254444 -365135 -319656 -202436 -225806 -104930 -89215 -188518 -255702 -283530 -268741
20b68741J0281l9912K3450J19499q8499O0192N8614j63427j37756M9708J33991
$$ -268741 -258460 -298372 -274922 -155423 -243922 -183730 -125116 -288543 -426299 -376591 -242600
9b42600m7771p2953J15790J9938j14167l4426l8773J12537J53463
$$ -242600 -290371 -363324 -247534 -227596 -341763 -376189 -414962 -302425 -148962
0a48962
$$ -148962
$$ Imaginary data points
##PAGE= N=2
##DATA TABLE= (X++(I..I)), XYDATA
16383e138119L7291J2453J03914k0673n450R1017J69007J51633k2569l5288R7529
$$ -5138119 -5100828 -5088375 -4984461 -5005134 -5010584 -4919567 -4750560 -4598927 -4621496 -4656784 -4559255
16372d559255j7709N9673J75265M3424m0920j2086J08182J30073Q3855L9390M3447
$$ -4559255 -4576964 -4517291 -4342026 -4298602 -4339522 -4351608 -4243426 -4113353 -4029498 -3990108 -3946661
16361c946661K3813P550J60073O1135l2802Q9178L856L6898M2164J42057K2477
$$ -3946661 -3922848 -3915298 -3755225 -3694090 -3726892 -3637714 -3633858 -3596960 -3554796 -3412739 -3390262
16350c390262m482P8219J7617J01962m9337R625J12427Q0416K8648J5730J19264
$$ -3390262 -3394744 -3316525 -3298908 -3196946 -3246283 -3236658 -3124231 -3043815 -3015167 -2999437 -2880173
16339b880173q368l3580L7308N6432J29052Q1599n432J13582Q4672j2002J497
$$ -2880173 -2888541 -2922121 -2884813 -2828381 -2699329 -2617730 -2623162 -2509580 -2424908 -2436910 -2435413
16328b435413N681k3365N7947R3132J32714Q2545o057l9138N0366N4532J10541
$$ -2435413 -2429732 -2453097 -2395150 -2302018 -2169304 -2086759 -2092816 -2131954 -2081588 -2027056 -1916515
16317a916515M3051P4638O5826k9435R851J3423P0826J46025L9373K3024O8647
$$ -1916515 -1873464 -1798826 -1733000 -1762435 -1752584 -1739161 -1668335 -1522310 -1482937 -1459913 -1391266
16306a391266O823P1722P6827J3719K9493o53k0079n7770k4809J59077J81896
$$ -1391266 -1384443 -1312721 -1235894 -1222175 -1192682 -1193335 -1213414 -1271184 -1295993 -1136916 -955020
16295i55020R3789L6025Q3944o1249k3860Q1969J06469M5462l1765Q9278R9548
$$ -955020 -861231 -825206 -741262 -802511 -826371 -744402 -637933 -592471 -624236 -534958 -435410
16284d35410M943J02394L3454M231O488p1662R3891O9153L4241Q951k9607O9518
$$ -435410 -430467 -328073 -294619 -290388 -283900 -355562 -261671 -192518 -158277 -149326 -178933 -109415
16272a09415Q3682m0667k1978J43413J40663l176K0501J21514O369n8439k6839
$$ -109415 -25733 -66400 -88378 55035 195698 192522 213023 334537 340906 282467 255628
16261B55628M8571j02252J92002J23042o1991j8421K4314J16428q7448J761K00206
$$ 255628 304199 201947 393949 516991 455000 436579 460893 577321 489873 491634 691840
16250F91840O2759r1014J10068J1806K1829Q8987M1289l420N2146q7712L9125
$$ 691840 754599 663585 773653 785459 807288 896275 937564 934144 986290 898578 937703
16239I37703k8675p2407J56639K0036k4139K18406m3431P8976p3981j00765J86828
$$ 937703 909028 836621 993260 1013296 989157 1207563 1164132 1243108 1169127 1068362 1255190
16228A255190O7697J51283p6413k9209l7684N1392p8245O3381O4037J15876q2957
$$ 1255190 1322887 1474170 1397757 1368548 1330864 1382256 1304011 1367392 1431429 1547305 1464348
16217A464348o1976K04579l9213N8934L0456r0259R2052m8230L2375K0901L8178
$$ 1464348 1402372 1606951 1567738 1626672 1657128 1566869 1658921 1610691 1643066 1663967 1702145
16206A702145Q4832p2198K6728r6782N8881O937M9649K33748J18016r5292o8888
$$ 1702145 1786977 1714779 1741507 1644725 1703606 1710543 1760192 1993940 2111956 2016664 1947776
16195A947776K1161k9352O2678K4085J747n772k3305P0055N729L9636K6684r7137
$$ 1947776 1968937 1939585 2002263 2026348 2028095 2022323 1999018 2069073 2074802 2114438 2141122 2043985
16183B043985J8738O5800L2572J6441L0113p8531j4201k3351j70741K75384j5623
$$ 2043985 2062723 2128523 2161095 2177536 2207649 2129118 2114917 2091566 1920825 2196209 2180586
16172B180586m5410O1605Q7279J59943j36477q7252p661L0996K7509J5479J92187
$$ 2180586 2135176 2196781 2284060 2444003 2307526 2220274 2212613 2243609 2271118 2286597 2478784
16161B478784j55307J3064N8928k1148J46042k5334K4474K178k1856m8822M4226
$$ 2478784 2323477 2336541 2395469 2374321 2520363 2495029 2519503 2521681 2499825 2451003 2495229
16150B495229J03026M7247K2644l8853j75264J17086J138o5665n2564O4558L7899
$$ 2495229 2598255 2645502 2668146 2629293 2454029 2571115 2572253 2506588 2454024 2518582 2556481
16139B556481K7411m5138j24388R797J74836J26888p6712R4209j60869M183Q5660
$$ 2556481 2583892 2538754 2414366 2424163 2598999 2725887 2649175 2743384 2582515 2586698 2672358
16128B672358J01J44287r2500J4231r2010L9951n1928J3841J79547r0404r9884
$$ 2672358 2672459 2816746 2724246 2738477 2646467 2686418 2634490 2648331 2827878 2737474 2637590
16117B637590L7574k00447Q6969L6636L8586k6737j46O8980O1895P6624p4364
$$ 2637590 2675164 2474717 2561686 2598322 2636908 2610171 2610025 2679005 2740900 2817524 2743160
16106B743160K6718K0972O1107j25287o7160R5166P7018m2588N1360o5534l2281
$$ 2743160 2769878 2790850 2851957 2726670 2659510 2754676 2831694 2789106 2840466 2774932 2742651
16095B742651K216r154J04336j12594K0524J91026p6805O9987k0651o9552m0208
$$ 2742651 2744867 2735713 2840049 2727455 2747979 2939005 2862200 2932187 2911536 2841984 2801776
16084B801776j1775o2439O7958J14976j45418r9568J40246n9815j4974P9725N7908
$$ 2801776 2790001 2727562 2795520 2910496 2765078 2665510 2805756 2745941 2730967 2810692 2868600
16073B868600p3492n2434J40692j18629P8070J55761k7926o1455j23J01260o2144
$$ 2868600 2795108 2742674 2883366 2764737 2842807 2998568 2970642 2909187 2909064 3010324 2948180
16062B948180k8473j510o7668r7941J53029J7206L2278k6661r1944J30213M9367
$$ 2948180 2919707 2918197 2850529 2752588 2905617 2922823 2955101 2928440 2836496 2966709 3016076
16051C016076j47315r2434M720Q3108p9672j8300n7951J25310o335P4606J03618
$$ 3016076 2868761 2776327 2781047 2864155 2784483 2766183 2708232 2833542 2827207 2901813 3005431
16040C005431n4041k4357l2116P3766Q988J4232k09824l6180J2892R170P9718
$$ 3005431 2951390 2927033 2894917 2968683 2977671 2991903 2782079 2745899 2758791 2767961 2847679
16029B847679J04268J3764K6324l5460j44193K5354J90403M8549q3310J943k3265
$$ 2847679 2951947 2965711 2992035 2956575 2812382 2837736 3028139 3076688 2993378 2995321 2972056
16018B972056j23341j8005M42R4852k9527R0400j21682L4678K2768j37668p2428
$$ 2972056 2848715 2830710 2831152 2926004 2896477 2986877 2865195 2899873 2922641 2784973 2712545
16007B712545M2898J64353l4511j05777K24742Q4120j71841m4589n9251J17612
$$ 2712545 2755443 2919796 2885285 2779508 3004250 3088370 2916529 2871940 2812689 2930301
15997B930301J8009R0377O8863p5966j713n2809l3097o7537M548L0521o7793N8139
$$ 2930301 2948310 3038687 3107550 3031584 3029871 2977062 2943965 2876428 2880976 2911497 2843704 2901843
15985B901843o1971q9543P2427Q8477j69175O2286J32154r548L6232L6327m6940
$$ 2901843 2839872 2750329 2822756 2911233 2742058 2804344 2936498 2926950 2963182 2999509 2952569
15974B952569k1232J6524j73306m8382Q762J75645M6817l7655P8300J06044o6657
$$ 2952569 2931337 2947861 2774555 2726173 2734935 2910580 2957397 2919742 2998042 3104086 3037429
15963C037429n7427P8443l5126O5872o3367j32511k9336Q8883m6080j67449j1605
$$ 3037429 2980002 3058445 3023319 3089191 3025824 2893313 2863977 2952860 2906780 2739331 2727726
15952B727726J12549O4772J3924r8167P2999J7581j12095p2596J4618J64150J4246
$$ 2727726 2840275 2905047 2918971 2820804 2893803 2911384 2799289 2726693 2741311 2905461 2919707
15941B919707k4328j0786K7308k8777K0465j394O0076J76116M3355m24J062k09686
$$ 2919707 2895379 2884593 2911901 2883124 2903589 2902195 2962271 3138387 3181742 3181318 3182380 2972694
15929B972694P5177p7132k25003n215J03880R960k0609K4904K15334N3293r8160
$$ 2972694 3047871 2970739 2745736 2740521 2844401 2854361 2833752 2858656 3073990 3127283 3029123
15918C029123j40165k4936P3720L1264n3865q866J9672J27366p9342j26659n3879
$$ 3029123 2888958 2864022 2937742 2969006 2915141 2906275 2925947 3053313 2973971 2847312 2793433
15907B793433K59244n861k7987J5882o9575R2891L8043j9138j50903M8817M3430
$$ 2793433 3052677 3046816 3018829 3034711 2965136 3058027 3096070 3076932 2926029 2974846 3018276
15896C018276K20732r7531j7473o7840k33787R3240J20053o9522j15901K1081
$$ 3018276 3239008 3141477 3124004 3056164 2822377 2915617 3035670 2966148 2850247 2871328
15886B871328J04227j347n4673J51359o6520j02695K1107n8426J09797M7298N9161
$$ 2871328 2975555 2974208 2919535 3070894 3004374 2901679 2922786 2864360 2974157 3021455 3080616
15875C080616j30382J03654j21111J6985J19576P6850j38603R4871j40367j15353
$$ 3080616 2950234 3053888 2932777 2949762 3069338 3146188 3007585 3102456 2962089 2846736
15865B846736K529O6995r1633K4138k033O4703Q2771p6121j38559J73940P5648
$$ 2846736 2849265 2916260 2824627 2848765 2846732 2911435 2994206 2918085 2779526 2953466 3029114
15854C029114l21045J03266J22842n2172N1174J69197P9881p1130k48812j6241
$$ 3029114 2708069 2811335 2934177 2882005 2933179 3102376 3182257 3111127 2862315 2846074
15844B846074J62531o6129j17633k8555j08184J67909J35521k7711j1884J05661
$$ 2846074 3008605 2942476 2824843 2796288 2688104 2856013 2991534 2963823 2951939 3057600
15834C057600n3252m3961O0559o7144j6729r7719r4053M0920O9171P561J75924
$$ 3057600 3004348 2960387 3020946 2953802 2937073 2839354 2745301 2786221 2855392 2862953 3038877
15823C038877K9609l8561n4942j21344P8117l1946K9408K2077R1907j08021j7739
$$ 3038877 3068486 3029925 2974983 2853639 2931756 2899810 2929218 2951295 3043202 2935181 2917442
15812B917442N9831O3291p7807L415K2646O9711j82956L5771j00214J28437m2989
$$ 2917442 2977273 3040564 2962757 2966172 2988818 3058529 2875573 2911344 2811130 2939567 2896578
15801B896578l4425K14201m6081k081K9796j4214L497O2558j37620K4726L5622
$$ 2896578 2862153 3076354 3030273 3028192 3057988 3043774 3047271 3109829 2972209 2996935 3032557
15790C032557o998l7410Q1716P4929m3216j31971r2620J39490j2505K2074q3015
$$ 3032557 3025559 2988149 3069865 3144794 3101578 2969607 2876987 3016477 3003972 3026046 2943031
15779B943031O560L7599l1060j14144j3710N4975m4835J75902k9887N0448Q798
$$ 2943031 2949591 2987190 2956130 2841986 2828276 2883251 2838416 3014318 2984431 3034879 3043677
15768C043677P1851K8547j18159q6031M6654k5637j2915k7095O3426m7528o1298
$$ 3043677 3115528 3144075 3025916 2939885 2986539 2960902 2947987 2920892 2984318 2936790 2875492
15757B875492N4045l497n7905K9598J27280j45575m2483l2466P7163k0269M8285
$$ 2875492 2929537 2926040 2868135 2897733 3025013 2879438 2836955 2804489 2881652 2861383 2909668
15746B909668P6207q4538O4478l44K4537R0238J02905j48268n1621k7074j1394
$$ 2909668 2985875 2901337 2965815 2965471 2990008 3080246 3183151 3034883 2983262 2956188 2944794
15735B944794K9501j7200R968o0705o1570P6300j1021l0342J72297O9203p28j5734
$$ 2944794 2974295 2957095 2967063 2906358 2844788 2921088 2910067 2879725 3052022 3121225 3120497 3104763
15723C104763l5982m4458j57665N356n5336P2335n8614j12163K22817n3321P7556
$$ 3104763 3068781 3024323 2866658 2872014 2816678 2889013 2830399 2718236 2941053 2887732 2965288
15712B965288r8177L7626N1089P7410K8408m6687J14784p2275m4332l3084j65484
$$ 2965288 2867111 2904737 2955826 3033236 3061644 3014957 3129741 3057466 3013134 2980050 2814566
15701B814566p265L6898J7961k1717P9827l8073j39532P3198J23552J10326j32188
$$ 2814566 2807301 2844199 2862160 2840443 2920270 2882197 2742665 2815863 2939415 3049741 2917553
15690B917553j45906Q5641j9984J87868P9885k8930l8239Q811n0708m9556l5932
$$ 2917553 2771647 2857288 2837304 3025172 3105057 3076127 3037888 3046699 2995991 2946435 2910503
15679B910503l9274J00629p4759m7019K462r9641J90526J21900m5303R1089j14253
$$ 2910503 2871229 2971858 2897099 2850080 2852542 2752901 2943427 3065327 3020024 3111113 2996860
15668B996860L5295m8683o9806r4761R6815O9427O5985M3176r2456K7609P2836
$$ 2996860 3032155 2983472 2913666 2818905 2915720 2985147 3051132 3094308 3001852 3029461 3102297
15657C102297O5239O103j06270m796n3551P4306j5830N1476j7261m619J4801k644
$$ 3102297 3167536 3173639 3067369 3062573 3009022 3083328 3067498 3118974 3101713 3097094 3111895 3109251
15645C109251o194j08196n1549l9090J16403o5843n6667M9604l8678m065J2647
$$ 3109251 3103057 2994861 2943312 2904222 3020625 2954782 2898115 2947719 2909041 2904976 2917623
15634B917623Q2748L8525p1829m5359M4597L7085K9519l5960K2590l3120j9287
$$ 2917623 3000371 3038896 2967067 2921708 2966305 3003390 3032909 2996949 3019539 2986419 2967132
15623B967132P5522K0736q0415l5447j29461K13837l0996J21295k2092r2799P243
$$ 2967132 3042654 3063390 2982975 2947528 2818067 3031904 3000908 3122203 3100111 3007312 3014555
15612C014555M5987k619n5652q9222L9886J5078l5388O9777L6877J99643J993
$$ 3014555 3060542 3057923 3002271 2913049 2952935 2968013 2932625 3002402 3039279 3238922 3240915
15601C240915j47723l160l890j00181j17450k721P1170J4529R6916O7501q5773
$$ 3240915 3093192 3090032 3086142 2985961 2868511 2865790 2936960 2951489 3048405 3115906 3030133
15590C030133j48413J02607o4006L9541o0354M0094r2065K35096K6522j63349
$$ 3030133 2881720 2984327 2920321 2959862 2899508 2939602 2847537 3082633 3109155 2945806
15580B945806O4399p0949N4096o8712p0835J36831p6588m7230O7847J06301o5170
$$ 2945806 3010205 2939256 2993352 2924640 2853805 2990636 2914048 2866818 2934665 3040966 2975796
15569B975796N2197r0639j25268J54918K1360o9047J37637j436O0659k3899j34794
$$ 2975796 3027993 2937354 2812086 2967004 2988364 2919317 3056954 3055518 3116177 3092278 2957484
15558B957484m7428R7691L6951m3983q7613M2260j1947R3516o9588r3104J34978
$$ 2957484 2910056 3007747 3044698 3000715 2913102 2955362 2943415 3036931 2967343 2874239 3009217
15547C009217N0249J12143o7952n1233J3739Q0633j71078M5501O7358m9151J22709
$$ 3009217 3059466 3171609 3103657 3052424 3066163 3146796 2975718 3021219 3088577 3039426 3162135
15536C162135r1508j18092J13789M183j24877R7734j8655R193K4019J31492J1905
$$ 3162135 3070627 2952535 3066324 3070507 2945630 3043364 3024709 3033902 3057921 3189413 3201318
15525C201318K3009m2658k5859j24374o0582J3022R5776J11014j32066j2625P2912
$$ 3201318 3224327 3181669 3155810 3031436 2970854 2983876 3079652 3190666 3058600 3045975 3118887
15514C118887p5222J20439o7947j23205K1928O361Q4045N5497K1978L1010l0148
$$ 3118887 3043665 3164104 3096157 2972952 2994880 3001241 3085286 3140783 3162761 3193771 3163623
15503C163623j44451L2700m6351J90551k19551j93429K47639J30360o1600K899
$$ 3163623 3019172 3051872 3005521 3196072 2976521 2783092 3030731 3161091 3099491 3102390
15493C102390P4622q3230l6894N4621j07R5348j6380m1497J926J7316q4963l0074
$$ 3102390 3177012 3093782 3056888 3111509 3111402 3206750 3190370 3148873 3150799 3168115 3083152 3053078
15481C053078Q1358k9200p716N2470l1861n611P2787L5943m3946n1096n3032q8386
$$ 3053078 3134436 3105236 3097520 3149990 3118129 3112518 3185305 3221248 3177302 3126206 3073174 2984788
15469B984788l6391K3006m7105L9643K7443l0844N6457o9828j76035J62906R1974
$$ 2984788 2948397 2971403 2924298 2963941 2991384 2960540 3016997 2947169 2771134 2934040 3026014
15458C026014J71827j38633j1579r9650j08214J45175J42084L9968n4492n2211
$$ 3026014 3197841 3059208 3047629 2947979 2839765 2984940 3127024 3166992 3112500 3060289
15448C060289J34289J59316o4480j86795J1772L2712l0620j09465M3392M2518
$$ 3060289 3194578 3353894 3289414 3102619 3114391 3147103 3116483 3007018 3050410 3092928
15438C092928j04744J74104J03489J6054j7636j09025m1524j9712j6898O1306
$$ 3092928 2988184 3162288 3265777 3281831 3264195 3155170 3113646 3093934 3077036 3138342
15428C138342m2694k2596L2581O6537j19824r418J19431p9047Q8027o8965J21267
$$ 3138342 3095648 3073052 3105633 3172170 3052346 3042928 3162359 3083312 3171339 3102374 3223641
15417C223641J71708j94004j13441j51513P4658k8588P489J17806k9800K214j66144
$$ 3223641 3395349 3201345 3087904 2936391 3011049 2982461 2989950 3107756 3077956 3080170 2914026
15406B914026R2208j8148j0639m488n3308N8625K8119M1599j2369K7372J16502
$$ 2914026 3006234 2988086 2977447 2972959 2919651 2978276 3006395 3047994 3035625 3062997 3179499
15395C179499P7806m6529m7197j15474j45765m7781J8539J4962N7915Q6377N2790
$$ 3179499 3257305 3210776 3163579 3048105 2902340 2854559 2873098 2888060 2945975 3032352 3085142
15384C085142L2822m5845j70982J20814J02423q5111N1334L1015p3097Q8469j3265
$$ 3085142 3117964 3072119 2901137 3021951 3124374 3039263 3090597 3121612 3048515 3136984 3123719
15373C123719o9768k8768M391k5963J12575R2069J4853n7964L5569p5006k7423
$$ 3123719 3053951 3025183 3029574 3003611 3116186 3208255 3223108 3165144 3200713 3125707 3098284
15362C098284p8797j6083Q2361N9154j21589l1064O0467q9048n9224L21057l1707
$$ 3098284 3019487 3003404 3085765 3144919 3023330 2992266 3052733 2963685 2904461 3225518 3193811
15351C193811j57660o042K6533l9744Q8412l8833l5584K8910N1965M5065m4818
$$ 3193811 3036151 3030109 3056642 3016898 3105310 3066477 3030893 3059803 3111768 3156833 3112015
15340C112015O0052n5279j33833J41667l028l3645N5902J57250L5004k42121L1443
$$ 3112015 3172067 3116788 2982955 3124622 3121594 3087949 3143851 3301101 3336105 3093984 3125427
15329C125427o8164P749k7144m2406Q0398J7452j68582M2378P5022K6849K5559
$$ 3125427 3057263 3065012 3037868 2995462 3075860 3093312 2924730 2967108 3042130 3068979 3094538
15318C094538m6870K8669Q7948n9886M3282J07957m4878j00972o4432J9139o2968
$$ 3094538 3047668 3076337 3164285 3104399 3147681 3255638 3210760 3109788 3045356 3064495 3001527
15307C001527J06172N7648k9282o0635P4608O2697j17274J30056j0463j17661
$$ 3001527 3107699 3165347 3136065 3075430 3150038 3212735 3095461 3225517 3215054 3097393
15297C097393J5668M4842L4815O5527j33288J2602r4915j54149k0892R1022O1429
$$ 3097393 3113061 3157903 3192718 3258245 3124957 3137559 3042644 2888495 2867603 2958625 3020054
15286C020054M2000J8823m268l4766O9827l2181n874Q3130J02801q8267j27811
$$ 3020054 3062054 3080877 3076609 3041843 3111670 3079489 3073615 3156745 3259546 3171279 3043468
15275C043468J00988k5401P7647q9316l5038p5806R6798J10765n3477j90083J5413
$$ 3043468 3144456 3119055 3196702 3107386 3072348 2996542 3093340 3204105 3150628 2960545 2975958
15264B975958J00855J56571k8272k0713l074j46703M9703Q709n7054p519K66735
$$ 2975958 3076813 3233384 3205112 3184399 3181325 3034622 3084325 3093034 3035980 3028461 3295196
15253C295196J0985M9555j17703L2392k0673n5278J3996j21285K1774M8747M571
$$ 3295196 3306181 3355736 3238033 3270425 3249752 3194474 3208470 3087185 3108959 3157706 3162277
15242C162277r3882j9985Q0667n7319N0494j11911N8172R7507k5315r4372J11901
$$ 3162277 3068395 3048410 3129077 3071758 3122252 3010341 3068513 3166020 3140705 3046333 3158234
15231C158234J36787k15126n2069O8405Q070J12604q1640L4141J01J17838r962
$$ 3158234 3295021 3079895 3027826 3096231 3104301 3216905 3135265 3169406 3169507 3287345 3277383
15220C277383p2273J4693n0883K3687q978j1718J4200q648m0071l7123M6818l8533
$$ 3277383 3205110 3219803 3168920 3192607 3183629 3171911 3186111 3177463 3137392 3100269 3147087 3108554
15208C108554k1945j9542o3322J17394J17601o2889n2085j86303l3263M2107j4846
$$ 3108554 3086609 3067067 3003745 3121139 3238740 3175851 3123766 2937463 2904200 2946307 2931461
15197B931461J09256O1346j02969L0754O1917J69616m9386j41774M7976o4503
$$ 2931461 3040717 3102063 2999094 3029848 3091765 3261381 3211995 3070221 3118197 3053694
15187C053694J41138j04983K8027J11501N4040j003q5974q9478J5715q8210J28001
$$ 3053694 3194832 3089849 3117876 3229377 3283417 3282414 3196440 3106962 3122677 3034467 3162468
15176C162468M5159m8296K2972Q7715j11464J36650l5849r6508n9319J01373N4817
$$ 3162468 3207627 3159331 3182303 3270018 3158554 3295204 3259355 3162847 3103528 3204901 3259718
15165C259718o4659R207M3441J3419k7257k40141m0461J95593R5351k6288k02675
$$ 3259718 3195059 3204266 3247707 3261126 3233869 2993728 2953267 3148860 3244211 3217923 3015248
15154C015248O6911J06507n8354J25230j18904L9841O1108P3812k9999n0403j8532
$$ 3015248 3082159 3188666 3130312 3255542 3136638 3176479 3237587 3311399 3281400 3230997 3212465
15143C212465k3025o3733l9527J9476l8260J62889R96m4518J2782n2752P2678
$$ 3212465 3189440 3125707 3086180 3105656 3067396 3230285 3231281 3186763 3199545 3146793 3219471
15132C219471o9986j82627N1972K4464Q8444j6602J5954J5979j6811m107l2351
$$ 3219471 3149485 2966858 3018830 3043294 3131738 3115136 3131090 3147069 3130258 3126151 3093800
15121C093800N2894P0114j38469l1009j10879K7937N6433P6866k446K9334K0627
$$ 3093800 3146694 3216808 3078339 3047330 2936451 2964388 3020821 3097687 3095241 3124575 3145202
15110C145202m1242L21p6779L5377J23972p186M5590m0621j38001J05884K7344
$$ 3145202 3103960 3104281 3027502 3062879 3186851 3179665 3225255 3184634 3046633 3152517 3179861
15099C179861j21617M7765L1499j15037N963O1562R774J3971P2222r2862R6259
$$ 3179861 3058244 3106009 3137508 3022471 3028434 3089996 3099770 3113741 3185963 3093101 3189360
15088C189360J2346K547Q932j24123n9020J04996J2161M5407R1867r0562j4534
$$ 3189360 3201706 3204253 3213185 3089062 3030042 3135038 3147199 3192606 3284473 3193911 3179377
$$ [...]
##END NTUPLES=NMR SPECTRUM
##END=
