##TITLE=1H_EC-3029(VII-22-2)
 CDCl3
 8 sc, 
 25.07.2022
##JCAMPDX= 6.0         $$ Bruker NMR JCAMP-DX V2.0
##DATA TYPE= NMR SPECTRUM
##DATA CLASS= NTUPLES
##ORIGIN= UXNMR, Bruker Analytische Messtechnik GmbH
##OWNER= root
$$ XWIN-NMR		Version 3.5
$$ Mon Jul 25 14:05:46 2022 Russian Standard Time (UT+4h)  she@DPX200
##.OBSERVE FREQUENCY= 200.1313499994
##.OBSERVE NUCLEUS= ^1H
##.ACQUISITION MODE= SIMULTANEOUS
##.ACQUISITION SCHEME= undefined
##.AVERAGES= 8
##.DIGITISER RES= 18
##SPECTROMETER/DATA SYSTEM= spect
##.PULSE SEQUENCE= zg30
##.SOLVENT NAME= CDCl3
##.SHIFT REFERENCE= (INTERNAL, CDCl3, 0, 15.7447)
##AUDIT TRAIL= $$ (NUMBER, WHEN, WHO, WHERE, WHAT)
$$ ##TITLE= Audit trail, XWIN-NMR		Version 3.5
$$ ##JCAMPDX= 5.01
$$ ##ORIGIN= Bruker BioSpin GmbH
$$ ##OWNER= she
$$ F:/spectra/data/she/nmr/H-F/1/pdata/1/auditp.txt
$$ ##AUDIT TRAIL=  $$ (NUMBER, WHEN, WHO, WHERE, WHAT)
(   1,<2022-07-25 14:04:22.82 +0400>,<she>,<DPX200>,
      <created by zg, POWCHK disabled, PULCHK disabled
       configuration hash MD5:
       00 E9 B6 7A A2 85 ED C7 34 08 36 98 17 FE 4E 26
       data hash MD5: 16K
       E8 30 BF 21 32 D5 89 0F FA 2D 86 94 90 6F 89 FD>)
(   2,<2022-07-25 14:04:27.71 +0400>,<she>,<DPX200>,
      <Start of raw data processing
       efp BC_mod = 2 LB = 0.24 FT_mod = 6 PKNL = 1 PHC0 = -18037.32 PHC1 = 11.60068 SI = 16K 
       data hash MD5: 16K
       F7 B8 3C C4 AE 8C 85 95 2C 85 D6 53 3A 22 E6 21>)
(   3,<2022-07-25 14:04:42.48 +0400>,<she>,<DPX200>,
      <pk PHC0 = 1.489555 PHC1 = -2.6 
       data hash MD5: 16K
       23 AC 0F E7 0D 56 B5 A7 18 02 70 A3 72 23 AD 37>)
(   4,<2022-07-25 14:04:47.01 +0400>,<she>,<DPX200>,
      <abs ABSG = 5 
       data hash MD5: 16K
       8F E6 61 EA 5E 2D E4 3E E9 44 96 C8 2C 44 28 58>)
$$ ##END=
$$ 
$$ hash MD5
$$ ED 51 F4 E3 C5 42 17 30 0E F5 2D 48 BC 56 F0 41
##$RELAX= 
##$RELAX= 
##$RELAX= 
##$RELAX= 
##$RELAX= 
##$RELAX= 
$$ Bruker specific parameters
$$ --------------------------
##$DU= <F:/spectra>
##$EXPNO= 1
##$NAME= <H-F>
##$PROCNO= 1
##$TYPE= <nmr>
##$USER= <she>
##$AMP= (0..31)
100 100 100 100 100 100 100 100 100 100 100 100 100 100 100 100 100 100 
100 100 100 100 100 100 100 100 100 100 100 100 100 100 
##$AQSEQ= 0
##$AQ_mod= 1
##$AUNM= <au_zg>
##$AUTOPOS= <>
##$BF1= 200.13
##$BF2= 200.13
##$BF3= 200.13
##$BF4= 200.13
##$BF5= 200.13
##$BF6= 200.13
##$BF7= 200.13
##$BF8= 200.13
##$BYTORDA= 1
##$CFDGTYP= 0
##$CFRGTYP= 5
##$CHEMSTR= <none>
##$CNST= (0..31)
1 1 145 1 1 1 1 1 1 1 1 1 1 1 1 1 1 1 1 1 1 1 1 1 1 1 1 1 1 1 1 1 
##$CPDPRG= <>
##$CPDPRG1= <>
##$CPDPRG2= <>
##$CPDPRG3= <>
##$CPDPRG4= <mlev>
##$CPDPRG5= <mlev>
##$CPDPRG6= <mlev>
##$CPDPRG7= <mlev>
##$CPDPRG8= <mlev>
##$CPDPRGB= <>
##$CPDPRGT= <>
##$D= (0..31)
0 1.2 0 0 0 0 0 0 0 0.06 0 0.03 0 0 0 0 0.0002 0 0 0 0 0 0 0 0 0 0 0 0 
0 0 0 
##$DATE= 1658743462
##$DBL= (0..7)
120 120 120 120 120 120 120 120 
##$DBP= (0..7)
150 150 150 150 150 150 150 150 
##$DBP07= 0
##$DBPNAM0= <>
##$DBPNAM1= <>
##$DBPNAM2= <>
##$DBPNAM3= <>
$$ [...]
##$SUBNAM2= <"">
##$SUBNAM3= <"">
##$SUBNAM4= <"">
##$SUBNAM5= <"">
##$SUBNAM6= <"">
##$SUBNAM7= <"">
##$SUBNAM8= <"">
##$SUBNAM9= <"">
##$SW= 18.0517283424941
##$SWIBOX= (0..15)
0 0 2 0 0 0 0 0 0 0 0 0 0 0 0 0 
##$SW_h= 3612.71676300578
##$TD= 16384
##$TD0= 1
##$TE= 0
##$TE2= 300
##$TE3= 300
##$TEG= 300
##$TL= (0..7)
0 120 120 120 120 120 120 120 
##$TP= (0..7)
150 150 150 150 150 150 150 150 
##$TP07= 0
##$TPNAME0= <>
##$TPNAME1= <>
##$TPNAME2= <>
##$TPNAME3= <>
##$TPNAME4= <>
##$TPNAME5= <>
##$TPNAME6= <>
##$TPNAME7= <>
##$TPOAL= (0..7)
0.5 0.5 0.5 0.5 0.5 0.5 0.5 0.5 
##$TPOFFS= (0..7)
0 0 0 0 0 0 0 0 
##$TUNHIN= 0
##$TUNHOUT= 0
##$TUNXOUT= 0
##$USERA1= <user>
##$USERA2= <user>
##$USERA3= <user>
##$USERA4= <user>
##$USERA5= <user>
##$V9= 5
##$VALIST= <valist>
##$VCLIST= <CCCCCCCCCCCCCCC>
##$VD= 0
##$VDLIST= <DDDDDDDDDDDDDDD>
##$VPLIST= <PPPPPPPPPPPPPPP>
##$VTLIST= <TTTTTTTTTTTTTTT>
##$WBST= 1024
##$WBSW= 4
##$XGAIN= (0..3)
0 0 0 0 
##$XL= 0
##$YL= 0
##$YMAX_a= 233017
##$YMIN_a= -355387
##$ZGOPTNS= <>
##$ZL1= 120
##$ZL2= 120
##$ZL3= 120
##$ZL4= 120
##$ABSF1= 15.73477
##$ABSF2= -2.31708
##$ABSG= 5
##$ABSL= 3
##$ALPHA= 0
##$AQORDER= 0
##$ASSFAC= 0
##$ASSFACI= 0
##$ASSFACX= 0
##$ASSWID= 0
##$AUNMP= <proc_1d>
##$AZFE= 0.1
##$AZFW= 0.1
##$BCFW= 0
##$BC_mod= 2
##$BYTORDP= 0
##$COROFFS= 0
##$CY= -3
##$DATMOD= 1
##$DC= 0
##$DFILT= <>
##$DTYPP= 0
##$F1P= 0
##$F2P= 0
##$FCOR= 1
##$FTSIZE= 16384
##$FT_mod= 6
##$GAMMA= 0
##$GB= 0
##$INTBC= 1
##$INTSCL= 0
##$ISEN= 128
##$LB= 0.24
##$LEV0= 0
##$LPBIN= 0
##$MAXI= 10000
##$MC2= 0
##$MEAN= 0
##$ME_mod= 0
##$MI= 1.114404
##$NCOEF= 0
##$NC_proc= -7
##$NLEV= 6
##$NOISF1= 3.799351
##$NOISF2= 2.8
##$NSP= 0
##$NTH_PI= 0
##$NZP= 0
##$OFFSET= 15.74469
##$PC= 1
##$PHC0= -18035.83
##$PHC1= 9.000681
##$PH_mod= 1
##$PKNL= yes
##$PPARMOD= 0
##$PSCAL= 0
##$PSIGN= 0
##$REVERSE= no
##$SF= 200.130005373905
##$SI= 16384
##$SIGF1= 3
##$SIGF2= 2
##$SINO= 5.538805
##$SIOLD= 16384
##$SREGLST= <1H.CDCl3>
##$SSB= 0
##$STSI= 16384
##$STSR= 0
##$SW_p= 3612.71676300578
##$SYMM= 0
##$S_DEV= 0
##$TDeff= 16384
##$TDoff= 0
##$TI= <>
##$TILT= no
##$TM1= 0
##$TM2= 0
##$TOPLEV= 0
##$USERP1= <user>
##$USERP2= <user>
##$USERP3= <user>
##$USERP4= <user>
##$USERP5= <user>
##$WDW= 1
##$XDIM= 16384
##$YMAX_p= 431234377
##$YMIN_p= -620224
$$ End of Bruker specific parameters
$$ ---------------------------------
##NTUPLES= NMR SPECTRUM
##VAR_NAME=  FREQUENCY,     SPECTRUM/REAL,   SPECTRUM/IMAG
##SYMBOL=    X,             R,               I
##VAR_TYPE=  INDEPENDENT,   DEPENDENT,       DEPENDENT
##VAR_FORM=  AFFN,          ASDF,            ASDF
##VAR_DIM=   16384,         16384,           16384
##UNITS=     HZ,            ARBITRARY UNITS, ARBITRARY UNITS
##FACTOR=    0.220516191357247, 1,           1
##FIRST=     3150.9848825841, 0,             0
##LAST=      -461.731880421679, 0,           0
##MIN=       -461.731880421679, -620224,     0
##MAX=       3150.9848825841, 431234377,     0
$$ Real data points
##PAGE= N=1
##DATA TABLE= (X++(R..R)), XYDATA
$$ [...]
7379a7067P4250l5534j01649N3470q6465J04412q2714K2726K44024M2426Q0076
$$ -17067 57183 21649 -80000 -26530 -112995 -8583 -91297 -68571 175453 217879 297955
7368B97955j04641J6495j6914J9704j34733M147J04600K34542j35614j63616j7599
$$ 297955 193314 209809 192895 212599 77866 82013 186613 421155 285541 121925 104326
7357A04326j61500L30466J13988j6343j28143r2820n7338n5770J78686J10206
$$ 104326 -57174 273292 387280 370937 242794 149974 92636 36866 215552 325758
7347C25758k499k3838K10959j32729j20953O5006j35858J43448j79410k97752
$$ 325758 323259 299421 510380 377651 256698 321704 185846 329294 149884 -147868
7337a47868J4874J51923R6994n7561J24388J31763j02040R1634L8286q6325k5185
$$ -147868 -132994 18929 115923 58362 182750 314513 212473 304107 342393 256068 230883
7326B30883o2640r071K16195M120j09726j0241j02668j19569L1026R9033J24311
$$ 230883 168243 159172 375367 379487 269761 259520 156852 37283 68309 167342 291653
7315B91653J6290j70543m4980N1492n025P5928r3889o0644K70961k72725j70914
$$ 291653 307943 137400 92420 143912 138887 214815 120926 60282 331243 58518 -112396
7304a12396J53854P3923P336j40990L15617j5109j77963o6273k9863M8819R6894
$$ -112396 41458 115381 122717 -18273 297344 282235 104272 37999 8136 56955 153849
7293A53849K107m1379L8092j29472j20000r2611K13255M9377L5442K0986Q2937
$$ 153849 155956 114577 152669 23197 -96803 -189414 23841 73218 108660 129646 212583
7282B12583N5657M4201j81628O6256j29240m5944m7987Q7305K3523l1959R4873
$$ 212583 268240 312441 130813 197069 67829 21885 -26102 61203 84726 52767 147640
7271A47640P3156j14586k4657J12200j06641J4799P4828J25304M3757j18615k02404
$$ 147640 220796 106210 81553 193753 87112 101911 176739 302043 345800 227185 24781
7260B4781M1824M603J89646j19156J81952k0169l6521J13864p1186j30529P7377
$$ 24781 66605 71208 260854 141698 323650 303481 266960 380824 309638 179109 256486
7249B56486Q3360K287L1059q0357q1242n0735k7145J48760j26633Q7227Q5209
$$ 256486 339846 342133 373192 292835 211593 160858 133713 282473 155840 243067 328276
7238C28276j29961j03141L4768N085j00692J25287k3958J60393K9819j58103L8363
$$ 328276 198315 95174 129942 135027 34335 159622 135664 296057 325876 167773 206136
7227B06136r2394l6426J72952o688M8423R7593R7643j66137M2083j89703N1339
$$ 206136 113742 77316 250268 243580 292003 389596 487239 321102 363185 173482 224821
7216B24821J98693q4057M5204P1912Q2109k52265o4856J76916m9638R4909l6454
$$ 224821 423514 339457 384661 456573 538682 286417 221561 398477 348839 443748 407294
7205D07294j20184J27540j10683Q4199l0152J15456j975j4745J8191P9944J821
$$ 407294 287110 414650 303967 388166 358014 473470 471495 456750 474941 554885 556706
7194E56706j02114k0335j58007J29624K0768q5456P8220o3991j0254K3434O6061
$$ 556706 454592 434257 276250 405874 426642 341186 419406 355415 345161 368595 434656
7183D34656O304J62537R8923j95371k55346J79431J01022n894m4139j08530Q8747
$$ 434656 440960 603497 702420 507049 251703 431134 532156 526262 482123 373593 462340
7172D62340n7522N3061j7104O6398J90218R7682j07480N5132J18895j04438k90979
$$ 462340 404818 457879 440775 507173 697391 795073 687593 742725 861620 757182 466203
7161D66203J73464K7364j07941J8612j2260k4032R1403J48130m3675j09970l9023
$$ 466203 639667 667031 559090 577702 565442 541410 632813 780943 737268 627298 588275
7150E88275O397J08231k1863R1959Q2548O0293K5690K0979q0401r0673K17620
$$ 588275 594672 702903 681040 772999 855547 915840 941530 962509 882108 791435 1009055
7139A009055j1800k46054K01113j80342q5689K00419L8681j36474J5792J01324
$$ 1009055 997255 751201 952314 771972 686283 886702 925383 788909 804701 906025
7129I06025P8959J30495Q4186N119j16552J11007R2199K5484k53779K25144p0019
$$ 906025 984984 1115479 1199665 1204784 1088232 1199239 1291438 1316922 1063143 1288287 1218268
7118A218268m2945j60278j77174J62637J77090j35936J10895J66174k31396J39052
$$ 1218268 1175323 1015045 837871 1000508 1177598 1041662 1152557 1318731 1087335 1226387
7108A226387L5537P3392k30955J07442L6592l0056J81406J9951o4141R0390J33424
$$ 1226387 1261924 1335316 1104361 1211803 1248395 1218339 1399745 1419696 1355555 1445945 1579369
7097A579369R4427j6941k97762O7086L48906M7533p6762P0169n8621R6916M4265
$$ 1579369 1673796 1656855 1359093 1426179 1775085 1822618 1745856 1816025 1757404 1854320 1898585
7086A898585J53930J7819k1535K2327J32422o571J86796L1202l7293J23115m980
$$ 1898585 2052515 2070334 2048799 2071126 2203548 2196977 2383773 2414975 2377682 2500797 2495817
7075B495817k0941k3387J60789J62825K1496P2046k3795M1578J21682k6328O4016
$$ 2495817 2474876 2451489 2612278 2775103 2796599 2868645 2844850 2886428 3008110 2981782 3045798
7064C045798K55277P1766K30030J75983J32157l8647m0239K68993O6658J30014
$$ 3045798 3301075 3372841 3602871 3778854 3911011 3872364 3832125 4101118 4167776 4297790
7054D297790J1598J85174O9848K70465m9450K19080K80888j6925M8226J27526
$$ 4297790 4309388 4494562 4564410 4834875 4785425 5004505 5285393 5268468 5316694 5444220
7044E444220L57644K26937Q6340J97818J82259J35753K74621J76809K82500M31010
$$ 5444220 5801864 6028801 6115141 6312959 6495218 6630971 6905592 7082401 7364901 7795911
7034G795911J24794J09547M10827K35177L98082L59881L07223O06703M38599M82726
$$ 7795911 7920705 8030252 8441079 8676256 9074338 9434219 9741442 10348145 10786744 11269470
7024A1269470N19472M41129M10127M72469Q79935P51760O65052N80624O72816
$$ 11269470 11788942 12230071 12640198 13112667 13992602 14744362 15409414 15990038 16662854
7015A6662854R93942R07366J048155J032020J035280Q89111J269220J382321J140513
$$ 16662854 17656796 18564162 19612317 20644337 21679617 22568728 23837948 25220269 26360782
7006B6360782J415895J406672J405870J401463J316656J659968J199477J116375
$$ 26360782 27776677 29183349 30589219 31990682 33307338 34967306 36166783 37283158
6998C7283158J139693P91830P03005O13265M95129l49356l68628j49784o84451
$$ 37283158 38422851 39214681 39917686 40530951 41026080 40676724 40308096 40158312 39473861
6989C9473861j093591j305791j454911j369013j387350j402666j424889j350962
$$ 39473861 38380270 37074479 35619568 34250555 32863205 31460539 30035650 28684688
6981B8684688j201085j331724j360041j318502j166635j088182j148967r61397
$$ 28684688 27483603 26151879 24791838 23473336 22306701 21218519 20069552 19108155
6973A9108155r99478j039154o58023p33675p76665o36508n70880n31250n36068
$$ 19108155 18108677 17069523 16411500 15677825 14901160 14264652 13693772 13162522 12626454
6964A2626454m83405n12164m35112l77930l63302m11431l90543m14846m00774
$$ 12626454 12143049 11630885 11195773 10817843 10454541 10043110 9652567 9237721 8836947
6955H836947j10313k86565l83743l2371l69122m19496k53718j68010l29666j56662
$$ 8836947 8726634 8440069 8056326 8023955 7654833 7235337 6981619 6813609 6483943 6327281
6945F327281q2344j66763l13803O6514p2934k66082j34184j44767j07728m6367
$$ 6327281 6244937 6078174 5764371 5830885 5757951 5491869 5357685 5212918 5105190 5058823
6935E058823k4473k36577k39041l06962k8773J27730k84072l2147o1510j40897
$$ 5058823 5034350 4797773 4558732 4251770 4222997 4350727 4066655 4034508 3972998 3832101
6925C832101l3775j55994j71595j88395j01796j1244m0322r984P493M6068L2471
$$ 3832101 3798326 3642332 3470737 3282342 3180546 3169302 3128980 3118996 3126489 3172557 3205028
6914C205028m30098r8440J80440k5333o7962j23221q6714n3991j43084l2660n7028
$$ 3205028 2774930 2676490 2856930 2831597 2763635 2640414 2553700 2499709 2356625 2323965 2266937
6903B266937o6640P3834j09123j85234J81502j20762k47427Q9407o9691m4793
$$ 2266937 2200297 2274131 2165008 1979774 2161276 2040514 1793087 1882494 1812803 1768010
6893A768010n0252Q1342O9465j55502j67676L07282J57224j89390j40190K3783
$$ 1768010 1717758 1799100 1868565 1713063 1545387 1852669 2009893 1820503 1680313 1704096
6883A704096K48534k36352j28370R3662n1516p166p2720K4759j19897M221Q340
$$ 1704096 1952630 1716278 1587908 1681570 1630054 1622888 1550168 1574927 1455030 1459251 1467591
6872A467591j04379O9448k16218J7165N0854Q5896j01129P84k82242o1184l8896
$$ 1467591 1363212 1432660 1216442 1233607 1284461 1370357 1269228 1270012 987770 926586 887690
6861H87690L2063j040r5207J38071j63119M8257J6993J6730P1358o7391n3255
$$ 887690 919753 918713 823506 961577 798458 846715 863708 880438 951796 884405 831150
6850H31150j63020j92599J40450M9099J35987R8600o5916Q4856q4592K0001N4286
$$ 831150 668130 475531 615981 665080 801067 899667 833751 918607 834015 854016 908302
6839I08302o471k66818J41640J52738L7393k2473Q98p9512j50201P933J27871
$$ 908302 901831 635013 776653 929391 966784 944311 945209 865697 715496 723429 851300
6828H51300K0829n1238o2409j62884K23201l1523k17882J61234N4978j83139P1272
$$ 851300 872129 820891 758482 595598 818799 787276 569394 730628 785606 602467 673739
6817F73739j0152M5029J66162j48098n3633P0078j962J69137j21246n0647K0676
$$ 673739 663587 708616 874778 726680 673047 743125 741163 910300 789054 738407 759083
6806G59083N6134j04508R0479j51715J4197P1888n0380K2454M2136k7207j11224
$$ 759083 815217 710709 801188 649473 663670 735558 685178 707632 749768 722561 611337
6795F11337k11222P9598J46527n7144N0905M9835p9449j65695M2733j24233l0587
$$ 611337 400115 479713 626240 569096 620001 669836 590387 424692 467425 343192 312605
6784C12605l4600R4348M182K2717k889K15123M6600j34205l6121m7718k09886
$$ 312605 278005 372353 376535 399252 396363 611486 658086 523881 487760 440042 230156
6773B30156J05841R3224J250q3325q2951R7396N3994P2782J16629k51217k46410
$$ 230156 335997 429221 430471 347146 264195 361591 415585 488367 604996 353779 107369
6762A07369K07330j78204J04783J55051M7987n6057j60960R9809K46743k25255
$$ 107369 314699 136495 241278 396329 444316 388259 227299 327108 573851 348596
6752C48596M1904N3087r2530r4666J07031K9522J08065j3501j86728L4936q5944
$$ 348596 390500 443587 351057 256391 363422 392944 501009 487508 300780 335716 249772
6741B49772P8125J68658k59085o5514Q1522m9528J14430j23752n6577L50436J9808
$$ 249772 327897 496555 237470 171956 253478 203950 318380 194628 138051 488487 508295
6730E08295j77370J64166O489k37249Q5823K45064j27317j60121J40238K84025
$$ 508295 330925 495091 501580 264331 350154 595218 467901 307780 448018 732043
6720G32043k43334j72192n1510O5668J92665j83384k5942J05375m7720j27609
$$ 732043 488709 316517 265007 330675 523340 339956 314014 419389 371669 244060
6710B44060q7346L789K27193j06073R2494r81l6220j09550O9947P2264J41619
$$ 244060 156714 160503 387696 281623 374117 373136 336916 227366 297313 369577 511196
6699E11196P8580k44662O7087p4475j72365r2679Q8825Q5591J29587j01530j04632
$$ 511196 589776 345114 412201 337726 165361 72682 161507 247098 376685 275155 170523
6688A70523J75541J0650k6364J42955k6956K3883k5821j34582j25708k3744Q977
$$ 170523 346064 356714 330350 473305 446349 470232 444411 309829 184121 160377 169354
6677A69354K3648M9899J43559R6880L4976j92984J4422l966K9400K12020M6411
$$ 169354 193002 242901 386460 483340 518316 325332 339754 335788 365188 577208 623619
6666F23619k53317J85321o429L9759j17111J60611J33738j098R4522j11732k59669
$$ 623619 370302 555623 549194 588953 471842 632453 766191 765093 859615 747883 488214
6655D88214k4093M3171j45801j19742J81080j29626k0512N3992m9988J12786n6644
$$ 488214 464121 507292 361491 241749 422829 293203 272691 326683 276695 389481 332837
6644C32837R9017J66090k4076j61282j01258j23383p275O1703Q0335j44068K2008
$$ 332837 431854 597944 573868 412586 311328 187945 180670 242373 322708 178640 200648
6633B00648k1373j79698J29707K28048m073n6179q9658m6008K14817O3081r1667
$$ 200648 179275 -423 129284 357332 353259 297080 207422 161414 376231 439312 347645
6622C47645K22351J28419j59903P0090l5403K3224J11139k94045K11354N3114
$$ 347645 569996 698415 538512 608602 573199 596423 707562 413517 624871 677985
6612F77985J03361L8378J0671Q3290k10375k25100J8704j24335J3745p9656j0968
$$ 677985 781346 819724 830395 913685 703310 478210 496914 372579 386324 306668 295700
6601B95700n5463o5012j6060K47332j4856m9690o0251l8867L5816k74389J25775
$$ 295700 240237 175225 159165 406497 391641 341951 281700 242833 278649 4260 130035
6590A30035J8506R0988n97r5430J42144r2395j01850k3261j14943J46292J0819
$$ 130035 148541 239529 238932 143502 285646 193251 91401 68140 -46803 99489 110308
6579A10308Q231L7589P6665J50617n8362N3646j06988N6473j19845r9771J65156
$$ 110308 118539 156128 232793 383410 325048 378694 271706 328179 208334 108563 273719
6568B73719L0078j48096n623K25074m2214M3566R9207L8882n7047K5140J0741
$$ 273719 303797 155701 150078 375152 332938 376504 475711 514593 457546 482686 493427
6557D93427k22186K42662p4486q4407J6454j10266m4516k6795J16283o8777J47738
$$ 493427 271241 513903 439417 355010 371464 261198 216682 189887 306170 237393 385131
6546C85131j1723k52376k1080k1340o3458K106J30563Q6976p3414j06118J01067
$$ 385131 373408 121032 99952 78612 15154 17260 147823 234799 161385 55267 156334
6535A56334R1136J33375j62163j5328J03734j59665J61544l7154r5810R6599P783
$$ 156334 247470 380845 218682 203354 307088 147423 308967 271813 176003 272602 280385
6524B80385j61614L8372r8048j08433J1347K88892J53251k8502L1489J80825l40419
$$ 280385 118771 157143 59095 -49338 -37991 250901 404152 375650 407139 587964 247545
6513B47545P0197J68869j18089N4843j70895q5722p4656M1582N7126K9883J67568
$$ 247545 317742 486611 368522 423365 252470 166748 92092 133674 190800 220683 388251
6502C88251N0393K19107j05227N3525J17406m383k22356j28420O8424j37562P1686
$$ 388251 438644 657751 552524 606049 723455 719072 496716 368296 436720 299158 370844
6491C70844J65298O2692j5409J50111m5128M4794k93064j26777q453L1121J88999
$$ 370844 536142 598834 583425 733536 688408 733202 440138 313361 304908 336029 525028
6480E25028k29041J91628L7060j59979j5886K09731N4185k46825J86922l759j3479
$$ 525028 295987 487615 524675 364696 348810 558541 612726 365901 552823 549064 535585
6469E35585N6133J20028j51135K37611M6111l36124P300j03531n6992L2832R3239
$$ 535585 591718 711746 560611 798222 844333 508209 515509 411978 354986 387818 481057
6458D81057J12313J43615j59249K6051M5515N8415J25706q6900j9889M5175n2461
$$ 481057 593370 736985 577736 603787 649302 707717 833423 746523 726634 771809 719348
6447G19348m4196J53829R7903j27495P250N495J81086J4339J46035m7810k27011
$$ 719348 675152 828981 926884 799389 806639 812134 993220 1007559 1153594 1105784 878773
6436H78773M5238k03841J53601M6817J06393p9829q320M993r9727j44049K6031
$$ 878773 924011 720170 873771 920588 1026981 947152 938832 943825 844098 700049 726080
6425G26080q159N1180M9940J31391l2506j04812r9952J57020J01591N3757P7027
$$ 726080 717921 769101 819041 950432 917926 813114 713162 870182 971773 1025530 1102557
6414A102557j04485J1319j09747J16873K22760k55691k24649Q1823R4308j45963
$$ 1102557 998072 1009391 899644 1016517 1239277 983586 758937 840760 935068 789105
6404G89105k6172k3495k76955J14719N42J07829j63835O5101K3078j26187J66165
$$ 789105 762933 739438 462483 577202 577744 685573 521738 586839 609917 483730 649895
6393F49895J72054p9917R6486N5362J13786r8855R6883N8627j18007P4256j44344
$$ 649895 821949 742032 838518 893880 1007666 908811 1005694 1064321 946314 1020570 876226
6382H76226j7624J88306j18663k6855M0128l5498J38816J22316J49400j29270
$$ 876226 858602 1046908 928245 901390 941518 906020 1044836 1167152 1316552 1187282
6372A187282k24072P5399K01098j07436k2469R6041j3361m6896q0294R6152j26094
$$ 1187282 963210 1038609 1239707 1132271 1109802 1205843 1192482 1145586 1065292 1161444 1035350
6361A035350R0361L295j45455Q6389N0083J79646j18132J02023J66889J28924
$$ 1035350 1125711 1129006 983551 1069940 1120023 1299669 1181537 1283560 1450449 1579373
6351A579373j66896Q2779j34726K8190P7057o308j6603l310k3939r0911n4382
$$ 1579373 1412477 1495256 1360530 1388720 1465777 1459469 1442866 1439556 1415617 1324706 1270324
6340A270324j27095O3835M8607j7471J50856J90746m7992J22173J18095k24185
$$ 1270324 1143229 1207064 1255671 1238200 1389056 1579802 1531810 1653983 1772078 1547893
6330A547893k99160K22612J31169J88643R1530j58253k1681n0585j23042J2348
$$ 1547893 1248733 1471345 1602514 1791157 1882687 1724434 1702753 1652168 1529126 1541474
6320A541474R3980J07225P9593k31996j58795K26001j30744j55755Q6106R160
$$ 1541474 1635454 1742679 1822272 1590276 1431481 1657482 1526738 1370983 1457089 1466249
6310A466249l1829k68749l1098J76098L6031j1391l9145K1297q8672l9310O8318
$$ 1466249 1434420 1165671 1134573 1310671 1346702 1335311 1296166 1317463 1228791 1189481 1257799
6299A257799m7365J36360j15240N7927L33086k98687k30381J38037K1416M7864
$$ 1257799 1210434 1346794 1231554 1289481 1622567 1323880 1093499 1231536 1252952 1300816
6289A300816J07593J60810j97659n6633L17967j1358k01887N0794J23364P806
$$ 1300816 1408409 1569219 1371560 1314927 1632894 1621536 1419649 1470443 1593807 1601613
6279A601613m6794Q263P0396Q6657j50122j97299K5767L14J96494k8831j49966
$$ 1601613 1554819 1563082 1633478 1720135 1570013 1372714 1398481 1398795 1595289 1566458 1416492
6268A416492j26429K12528O7019M9229J3619o5825J48917j23290K37647N8601
$$ 1416492 1290063 1502591 1569610 1618839 1632458 1566633 1715550 1592260 1829907 1888508
6258A888508J7094J57252j58614K7787j54010j33384Q2675L6618P3561R5101J25119
$$ 1888508 1905602 2062854 1904240 1932027 1778017 1644633 1727308 1763926 1837487 1932588 2057707
6247B057707p3843n1163Q8759J31422N4468j6650Q2184m6087R2877k2482n4179
$$ 2057707 1983864 1932701 2021460 2152882 2207350 2190700 2272884 2226797 2319674 2297192 2243013
6236B243013J91567J09796r9431P7492j13340P3025K17083j56277m4717L50187
$$ 2243013 2434580 2544376 2444945 2522437 2409097 2482122 2699205 2542928 2498211 2848398
6226B848398Q9795q4710J96528L6600o3865k4633r2598J15464J34251j47978K23220
$$ 2848398 2938193 2853483 3050011 3086611 3022746 2998113 2905515 3020979 3155230 3007252 3230472
6215C230472Q0244j7636M4746O7511P4199K89176M9949j15096P4164L021J56638
$$ 3230472 3310716 3293080 3337826 3405337 3479536 3768712 3818661 3703565 3777729 3780750 3937388
6204C937388l25664J15800K78977j14487J50539J92278J03247M3316m3923R6187
$$ 3937388 3611724 3727524 4006501 3892014 4042553 4234831 4338078 4381394 4337471 4433658
6194D433658n6014R0625K50675Q4044L7414q0160J18265L81345K23635j25879
$$ 4433658 4377644 4468269 4718944 4802988 4840402 4760242 4878507 5259852 5483487 5357608
6184E357608J81609J3567L8552K33219K55136J48012j85826K16429J46180P6105
$$ 5357608 5539217 5552784 5591336 5824555 6079691 6227703 6041877 6258306 6404486 6480591
6174F480591L37226L64917J94582J62337J21645L31099K05675M3621K35570J50373
$$ 6480591 6817817 7182734 7377316 7539653 7661298 7992397 8198072 8241693 8477263 8627636
6164H627636M19919J77462L51418J83484j4935K10367L39526N22492N36396K60396
$$ 8627636 9047555 9225017 9576435 9759919 9744984 9955351 10294877 10817369 11353765 11614161
6154A1614161M59061L50895J75483J56777N11859O53766M66156O69512P04863
$$ 11614161 12073222 12424117 12599600 12756377 13268236 13922002 14388158 15057670 15762533
6145A5762533O82519P88350J049712R59561J198873J442390J595427J853388J997402
$$ 15762533 16445052 17233402 18283114 19242675 20441548 21883938 23479365 25332753 27330155
6136B7330155J912995J703153J172414O69733L53396J79649N20406Q06681J404366
$$ 27330155 29243150 30946303 32118717 32788450 33141846 33321495 33841901 34648582 36052948
6127C6052948J772740K092559K008226J207566O29745K73425k446O21174J249289
$$ 36052948 37825688 39918247 41926473 43134039 43763784 44037209 44034763 44655937 45905226
6118D5905226J470138J709003J924040J324631Q47902O37472J182341K065299
$$ 45905226 47375364 49084367 51008407 52333038 53180940 53818412 55000753 57066052
6110E7066052K485174L201710M100878M986329N975691O950487P639309P210437
$$ 57066052 59551226 62752936 66853814 71840143 77815834 84766321 92405630 99616067
6102I9616067N127075J348356l327129o814167q250052p223739n167211l275546
$$ 99616067 104743142 106091498 102764369 95950202 87700150 80476411 75309200 72033654
6094G2033654j602838Q4452J000135K112456L148520M113046N096058O528776
$$ 72033654 70430816 70515268 71515403 73627859 76776379 80889425 85985483 92514259
6086I2514259P240266P160358N672162L115210J413743o55934l073285n671964
$$ 92514259 99754525 106914883 112587045 115702255 117115998 116460064 113386779 107714815
6078A07714815p833396r006983q520810o920329n256203m106325k761995j808985
$$ 107714815 99881419 90874436 82353626 75433297 70177094 66070769 63308774 61499789
6070F1499789q15444l67013M07344J338697J749074K655718L159879L860673M629562
$$ 61499789 60684345 60317332 60724676 62063373 63812447 66468165 69628044 73488717 78118279
6061G8118279N213457O131466P035510P096692O535805M090169J345862q41079
$$ 78118279 83331736 89463202 96498712 103595404 110131209 114221378 115567240 114726161
6053A14726161k862819m996045o242270p303180p018487o083993m447748l112754
$$ 114726161 111863342 106867297 100625027 93321847 86303360 80219367 75771619 72658865
6045G2658865j548780n47741N76572J327386K007576L164920M363421N200099
$$ 72658865 71110085 70562344 71138916 72466302 74473878 77638798 82002219 87202318
6037H7202318N705956N029888K235821j557222n013037p351590q266726p391550
$$ 87202318 92908274 97938162 100173983 98616761 93603724 86252134 77985408 70593858
6029G0593858o406472m938875l800913k410257j945909j095652m51984k51384
$$ 70593858 64187386 59248511 55447598 53037341 51091432 49995780 49543796 49292412
6021D9292412m8475m51012j206813j270032j096393q60801m73837j54663m76249
$$ 49292412 49243937 48792925 47586112 46316080 45219687 44358886 43885049 43730386 43254137
6012D3254137r94190j521855j715719k092025k162634j504829j391110q26105
$$ 43254137 42259947 40738092 39022373 36930348 34767714 33262885 31871775 31045670
6004C1045670m61961m31380l32514q15634j515595k088844k069442j874330j368521
$$ 31045670 30583709 30152329 29819815 29004181 27488586 25399742 23330300 21455970 20087449
5995B0087449j085410j338340r59918l64276m91298o91091l02576n71616l67218
$$ 20087449 19002039 17663699 16703781 16339505 15848207 15157116 14854540 14282924 13915706
5986A3915706q4859k00943j53701j74394k56837l94490m44646m92453k41035k60459
$$ 13915706 13830847 13629904 13476203 13301809 13044972 12650482 12205836 11713383 11472348 11211889
5976A1211889l35962l60743l26664k84525l01335l95233l57314k81181k35611
$$ 11211889 10875927 10515184 10188520 9903995 9602660 9207427 8850113 8568932 8333321
5967H333321k45063p2080l13520k43325l27942q7619K7427k99593k60592R060
$$ 8333321 8088258 8016178 7702658 7459333 7131391 7043772 7071199 6771606 6511014 6520074
5957F520074k75349j05267j09180k37343K3935q4012l29130j09501r4828p0115
$$ 6520074 6244725 6139458 6030278 5792935 5816870 5732858 5403728 5294227 5199399 5129284
5947E129284J5751p0548k37746k68339j09843l3081k8088j2619M8521j09928j17259
$$ 5129284 5145035 5074487 4836741 4568402 4458559 4425478 4397390 4384771 4433292 4323364 4206105
5936D206105M1370j25034j30939M35J39327M9667k18576j24429p9094M9178j98418
$$ 4206105 4247475 4122441 3991502 3991937 4131264 4180931 3962355 3837926 3758832 3808010 3609592
5925C609592M1595J35630J29091p4728j02871O1476N3448L2189k0210k5275O2540
$$ 3609592 3651187 3786817 3915908 3841180 3738309 3799785 3853233 3885422 3865212 3839937 3902477
5914C902477q4410l27949n1480q2936j78691L3815j17741k430M9245J12709l21830
$$ 3902477 3818067 3490118 3438638 3355702 3177011 3210826 3093085 3090655 3139900 3252609 2930779
5903B930779k29966J01351r2063j81903J08005n7122k48880L5066P0490l2204
$$ 2930779 2700813 2802164 2710101 2528198 2636203 2579081 2330201 2365267 2435757 2403553
5893B403553J75426j52999k30558L5422l2031K15089J28206k49777j1848p9596
$$ 2403553 2578979 2425980 2195422 2230844 2198813 2413902 2542108 2292331 2280483 2200887
5883B200887k08909K29615O016N6294m5860m0985k17538J86485R1828j38109o0111
$$ 2200887 1991978 2221593 2227609 2283903 2238043 2197058 1979520 2166005 2257833 2119724 2059613
5872B059613J37275q1670J8513J17229j42336R6700p1800J5399j73843p0676Q1606
$$ 2059613 2196888 2115218 2133731 2250960 2108624 2205324 2133524 2148923 1975080 1904404 1986010
5861A986010P10j15136J22412n6391j3820J00742P9268k11328K85680l37395l5760
$$ 1986010 1986720 1871584 1993996 1937605 1923785 2024527 2103795 1892467 2178147 1840752 1804992
5850A804992j5711n6605K6656m0338R1084k12515K14936J36467k17219p4231N4827
$$ 1804992 1789281 1732676 1759332 1718994 1810078 1597563 1812499 1948966 1731747 1657516 1712343
5839A712343Q4293J7254L998K58166J64739j11149j41728N2710j32116M105n0937
$$ 1712343 1796636 1813890 1817888 2076054 2240793 2129644 1987916 2040626 1908510 1912615 1861678
5828A861678K6919j55546J37747r351j35980Q2521j8531j88043o459L8872J18581
$$ 1861678 1888597 1733051 1870798 1861447 1725467 1807988 1789457 1601414 1594955 1633827 1752408
5817A752408p962j30736J64418Q6435O9192R6989j12814m4548J54006j18893j69142
$$ 1752408 1744446 1613710 1778128 1864563 1933755 2030744 1917930 1873382 2027388 1908495 1739353
5806A739353Q3229O9342j07129J16223J13475N485o9378m3706j35375L6619J90342
$$ 1739353 1822582 1891924 1784795 1901018 2014493 2019978 1950600 1906894 1771519 1808138 1998480
5795A998480L35157M3773n1684L6614j65091k3090k0491J87337J02855l02731
$$ 1998480 2333637 2377410 2325726 2362340 2197249 2174159 2153668 2341005 2443860 2141129
5785B141129j24237P8214P2041R4884J3465p1647j17742k10734q9219J29962j15204
$$ 2141129 2016892 2095106 2167147 2262031 2275496 2203849 2086107 1875373 1786154 1916116 1800912
5774A800912n9744K4646r1146L8025J50653j40317J22649j54939J75803m0719
$$ 1800912 1741168 1765814 1674668 1712693 1863346 1723029 1845678 1690739 1866542 1825823
5764A825823K255O4585K878J4356J55359M3561n5330P5050n5106J60262o3948
$$ 1825823 1828078 1892663 1895541 1909897 2065256 2108817 2053487 2128537 2073431 2233693 2169745
5753B169745J87338O0230J15838J33621j09424q856l9469J76071l31915o374k4450
$$ 2169745 2357083 2417313 2533151 2666772 2557348 2548492 2509023 2685094 2353179 2346805 2322355
5742B322355k10330J68223k0014j35645o9048k53286J91365J74764J26318k4033
$$ 2322355 2112025 2280248 2260234 2124589 2055541 1802255 1993620 2168384 2294702 2270669
5732B270669k25618J90972j50396k0662J6354M3634K49296o086n0753J76900r8548
$$ 2270669 2045051 2236023 2085627 2064965 2081319 2124953 2374249 2368163 2317410 2494310 2395762
5721B395762m8193J59758N1251J55418J17187j44053l31091r2315J53762M0263
$$ 2395762 2347569 2507327 2558578 2713996 2831183 2687130 2356039 2263724 2417486 2457749
5711B457749L1507k30697J6194o9390o8844j45430J65017P3533l37258L5860K95581
$$ 2457749 2489256 2258559 2274753 2205363 2136519 1991089 2156106 2229639 1892381 1928241 2223822
5700B223822k02310j22215J79477J08641L6903k04655J34688N7960M2601j18720
$$ 2223822 2021512 1899297 2078774 2187415 2224318 2019663 2154351 2212311 2254912 2136192
5690B136192n3176k2469R1334J22892j35411n0452J3020N5523p2230k4987J51005
$$ 2136192 2083016 2060547 2151881 2274773 2139362 2088910 2101930 2157453 2085223 2060236 2211241
5679B211241J44420p124r7719p7517K4321n0732K36680J35802R8117k18250J3956
$$ 2211241 2355661 2348537 2250818 2173301 2197622 2146890 2383570 2519372 2617489 2399239 2413195
5668B413195j5277j725n6651J38184P8775r2483j474N8309Q5009j43905J33571
$$ 2413195 2397918 2396193 2339542 2477726 2556501 2464018 2462544 2520853 2605862 2461957 2595528
5657B595528r2983M9593j01805j37070J4963j22624P7516l2782N0281R8782k6701
$$ 2595528 2502545 2552138 2450333 2313263 2328226 2205602 2283118 2250336 2300617 2399399 2372698
5646B372698m1250l6341j10020L2758J91973J5086k32513p6399K51438M8990n6872
$$ 2372698 2331448 2295107 2185087 2217845 2409818 2424904 2192391 2115992 2367430 2416420 2359548
5635B359548k44766j599J3173j48652K5787M6542J09695O4626O1054O0968J60187
$$ 2359548 2114782 2113183 2126356 1977704 2003491 2050033 2159728 2224354 2285408 2346376 2506563
5624B506563j86645j36868J48654j09096q1633J53912j06941j21059m2018J15996
$$ 2506563 2319918 2183050 2331704 2222608 2140975 2294887 2187946 2066887 2024869 2140865
5614B140865Q1940j25938J38383k06892k11295J98244m3382p439J50826l5713
$$ 2140865 2222805 2096867 2235250 2028358 1817063 2015307 1971925 1964486 2115312 2079599
5604B079599n786J25395k34265p3844K26326J40599J07888J01790K08360q5013
$$ 2079599 2073813 2199208 1964943 1891099 2117425 2258024 2365912 2467702 2676062 2591049
5594B591049q3277o9144j4928J21195n395J53720L329m88893J07377L18948j95078
$$ 2591049 2507772 2438628 2423700 2544895 2539500 2693220 2696549 2207656 2315033 2633981 2438903
5583B438903p4390L579j39091N5571K93674p4514j04713r3758J66959N5566j20739
$$ 2438903 2364513 2368092 2229001 2284572 2578246 2503732 2399019 2305261 2472220 2527786 2407047
5572B407047L062p768L244J795Q6856k92855j10264J79965O1882J82877J1309
$$ 2407047 2410109 2402341 2405585 2407380 2494236 2201381 2091117 2271082 2332964 2515841 2527150
5561B527150j16244J7171J90968J11501l9070K20373j64710m8317K58978p5359
$$ 2527150 2410906 2428077 2619045 2730546 2691476 2911849 2747139 2698822 2957800 2882441
5551B882441j55123L6021k28287O8391K00868J15435k5069K08746M5063J97940
$$ 2882441 2727318 2763339 2535052 2603443 2804311 2919746 2894677 3103423 3148486 3346426
5541C346426m3605l1622j35191k92901j87485O5367k34676p6906J6858l4036K56618
$$ 3346426 3302821 3271199 3136008 2843107 2655622 2720989 2486313 2409407 2426265 2392229 2648847
5530B648847J6959k87287n175K58037M4300O3166l0621o4391j6717j1216q195
$$ 2648847 2665806 2378519 2373344 2631381 2675681 2738847 2708226 2643835 2627118 2615902 2607707
5519B607707O225j42755Q8754N0985m3434m0356q4470p521K27535K22502L8708
$$ 2607707 2613932 2471177 2559931 2610916 2567482 2527126 2442656 2435135 2662670 2885172 2923880
5508B923880O2811o2478N2853K42721O119L265q0166P9986J26580J19807J84294
$$ 2923880 2986691 2924213 2977066 3219787 3225906 3229171 3149005 3228991 3355571 3475378 3659672
5497C659672K0830J20021M3186P2254N5935O4612K79280J82735J45096J65552
$$ 3659672 3680502 3800523 3843709 3915963 3971898 4036510 4315790 4498525 4643621 4809173
5487D809173M16279J34319l173n4455P2431j65049k62249l39131j4585L19298
$$ 4809173 5225452 5359771 5356598 5302143 5374574 5209525 4947276 4608145 4593560 4912858
5477D912858k07594J56363j60658j56461R1201K0573K54969j53901n7148L399
$$ 4912858 4705264 4861627 4700969 4544508 4635709 4656282 4911251 4757350 4700202 4703601
5467D703601K76400K42886J57017K78269K00233O5756M43193L36632J18230J42791
$$ 4703601 4980001 5222887 5379904 5658173 5858406 5924162 6367355 6703987 6822217 6965008
5457F965008M12367L85418K27948K65271j38132n47622j50185m18394j53429j9601
$$ 6965008 7377375 7762793 7990741 8256012 8117880 7570258 7420073 7001679 6848250 6828649
5447F828649j56450j73547m0913O1284J78006K00089J17452j09321J06524J25059
$$ 6828649 6672199 6498652 6457739 6519023 6697029 6897118 7014570 6905249 7011773 7136832
5437G136832R115J20795L01879P6125L22929K92456K56908J46153K17605N24836
$$ 7136832 7145947 7266742 7568621 7644746 7967675 8260131 8517039 8663192 8880797 9405633
5427I405633K24087M07214L60900L55889K69798K08051m1256n6197J07841J75497
$$ 9405633 9629720 10036934 10397834 10753723 11023521 11231572 11190316 11134119 11241960 11417457
5417A1417457n9040J63969j1294K18089J10234J35242K95742N14382J29487K78951
$$ 11417457 11358417 11522386 11511092 11729181 11839415 11974657 12270399 12784781 12914268 13193219
5407A3193219K69976L27042J57451J26624N09464N36504J15618J18549N14104
$$ 13193219 13463195 13790237 13947688 14074312 14583776 15120280 15235898 15354447 15868551
5398A5868551L49267M74918N16877M93222N76283M01713O43173M68099Q72106
$$ 15868551 16217818 16692736 17209613 17702835 18279118 18680831 19324004 19792103 20664209
5389B0664209O90070N57163R71043J018337J057321J044997J197470J257688J678274
$$ 20664209 21354279 21911442 22882485 23900822 24958143 26003140 27200610 28458298 30136572
5380C0136572J525692K062424K022272K192842K698958K861408L395972L733795
$$ 30136572 31662264 33724688 35746960 37939802 40638760 43500168 46896140 50629935
5372E0629935M334582M822035N081368N900531O488174P429641Q007049Q573368
$$ 50629935 54964517 59786552 64867920 70768451 77256625 84686266 92693315 101266683
5364A01266683R319924R353324R667993R539697R051085P709407O148657M437970
$$ 101266683 110586607 119939931 129607924 139147621 148198706 155908113 162056770 166494740
5356A66494740K019142j290208m658353p505560r250985r742212r362358r283837
$$ 166494740 168513882 167223674 162565321 155059761 145808776 136066564 126704206 117420369
5348A17420369r291792r246981r266814r007166q099017p391494o557761n405659
$$ 117420369 108128577 98881596 89614782 80607616 72508599 65117105 58559344 53153685
5340E3153685m372903l841551l317347k953445k766226k032196j838580j553072
$$ 53153685 48780782 44939231 41621884 38668439 35902213 33870017 32031437 30478365
5332C0478365j642002j575696j313429j033631j016885j063539p94472j010549
$$ 30478365 28836363 27260667 25947238 24913607 23896722 22833183 22038711 21028162
5324B1028162q36841o99087o23391p47470p79903m82088o65519m56678n72836
$$ 21028162 20191321 19492234 18868843 18121373 17341470 16859382 16193863 15737185 15164349
5315A5164349l89511n04632m86141k28003l86612n00482k73795m15629l17203
$$ 15164349 14774838 14270206 13784065 13556062 13169450 12668968 12395173 11979544 11662341
5306A1662341l60738k58151l87966k32569j07613k57521j32697m52138j3861j53445
$$ 11662341 11301603 11043452 10655486 10422917 10315304 10057783 9925086 9472948 9459087 9305642
5296I305642k03808j79444m16330k18393p9906j62486j79119n1363k10269j22383
$$ 9305642 9101834 8922390 8506060 8287667 8207761 8045275 7866156 7814793 7604524 7482141
5286G482141j70959p5474m34667j44177K3939q3651n5490k27950j33118r622m7293
$$ 7482141 7311182 7235708 6801041 6656864 6680803 6597152 6541662 6313712 6180594 6170972 6123679
5275F123679j87795k732q1096j65543j13248Q5513j18801j33924J26562M4771
$$ 6123679 5935884 5933152 5852056 5686513 5573265 5658778 5539977 5406053 5532615 5577386
5265E577386j75970j81387O2834j99962o352P3933j58182J8019L3992j33344k61032
$$ 5577386 5401416 5220029 5282863 5082901 5076549 5150482 4992300 5010319 5044311 4910967 4649935
5254D649935k04449r0308k0597R0887l6124n8510j04036m2198j90279j68152k3932
$$ 4649935 4445486 4355178 4334581 4425468 4389344 4330834 4226798 4184600 3994321 3826169 3802237
5243C802237P9313J31988j0668k34213j53105K68114p5795j1484p4454P5107j09540
$$ 3802237 3881550 4013538 4002870 3768657 3615552 3883666 3807871 3796387 3721933 3797040 3687500
5232C687500M5279j31933m23654n7554J47686j59849J24133j64302R3131j560
$$ 3687500 3732779 3600846 3177192 3119638 3267324 3107475 3231608 3067306 3160437 3158877
5222C158877k4640k0083M2219R9284r2606m281Q2658K7713j51760q3755J80185
$$ 3158877 3134237 3114154 3156373 3255657 3163051 3158770 3241428 3269141 3117381 3033626 3213811
5211C213811J40407o5238q1078L8593p6409Q673p8866q2964l334L4205K22587
$$ 3213811 3354218 3288980 3207902 3246495 3170086 3178759 3099893 3016929 3013595 3047800 3270387
5200C270387o0652J18520R1940k96058n8146J09505j01163J32962q3616K12164
$$ 3270387 3209735 3328255 3420195 3124137 3065991 3175496 3074333 3207295 3123679 3335843
5190C335843j07870J05908q9571P3284J87548K3343q6213j13821k0260m639O5756
$$ 3335843 3227973 3333881 3244310 3317594 3505142 3528485 3442272 3328451 3308191 3303552 3369308
5179C369308m5981l9285K49798m0215j03639k63413l05970j72097k6058O9012
$$ 3369308 3323327 3284042 3533840 3493625 3389986 3126573 2820603 2648506 2622448 2691460
5169B691460J480n8745n8514O0060J09595j90458n680R3356Q0870j16584m9604
$$ 2691460 2692940 2634195 2575681 2635741 2745336 2554878 2549198 2642554 2723424 2606840 2557236
5158B557236n8858j6246J78470K2834j76649j08994r1481l579J11285M8439J63262
$$ 2557236 2498378 2482132 2660602 2683436 2506787 2397793 2306312 2302733 2414018 2462457 2625719
5147B625719j24081j57802N1435j33962J24389K33784k8203o1555l3276q2581
$$ 2625719 2501638 2343836 2395271 2261309 2385698 2619482 2591279 2529724 2496448 2413867
5137B413867k9673l6446j81322P1277Q6935n1297m2613J63095l2285J19102R4205
$$ 2413867 2384194 2347748 2166426 2237703 2324638 2273341 2230728 2393823 2361538 2480640 2574845
5126B574845j55750o8502j442J43031J45374r3860j6811k49636J14391l2746L5142
$$ 2574845 2419095 2350593 2349151 2492182 2637556 2543696 2526885 2277249 2391640 2358894 2394036
5115B394036k24791r4846L3293j0509K32440P023o0188j12955J0236L73363j13774
$$ 2394036 2169245 2074399 2107692 2097183 2329623 2336646 2276458 2163503 2173739 2547102 2433328
5104B433328n7781J63373M8143j73270m0492j28684j59090J22395j579N973J03002
$$ 2433328 2375547 2538920 2587063 2413793 2373301 2244617 2085527 2207922 2206343 2212316 2315318
5093B315318R8887j80623k20399N6524o0017N4033M8235J86913P2007j27894J15270
$$ 2315318 2414205 2233582 2013183 2069707 2009690 2063723 2111958 2298871 2370878 2242984 2358254
5082B358254J34159m0569n5538j747q941n96J1401J04949q7390P7538R8370r2398
$$ 2358254 2492413 2451844 2396306 2394559 2385618 2385022 2396423 2501372 2413982 2491520 2589890 2497492
5070B497492l6476M5859O1022O3464K7249J81253j2440J78644j66818K56568O2194
$$ 2497492 2461016 2506875 2567897 2631361 2658610 2839863 2827423 3006067 2839249 3095817 3158011
5059C158011j06720m4890j6039M24099J46950N2264P5323M4749j78422J42695
$$ 3158011 3051291 3006401 2990362 3414461 3561411 3613675 3688998 3733747 3555325 3698020
5049C698020K32798r8243J36272J40701o8282l8706r0821j29221j8797K4487k6630
$$ 3698020 3930818 3832575 3968847 4109548 4041266 4002560 3911739 3782518 3763721 3788208 3761578
5038C761578J03418J29865K16168L1642K81981N8836l13939J80100Q9755j35027
$$ 3761578 3864996 3994861 4211029 4242671 4524652 4583488 4269549 4449649 4539404 4404377
5028D404377O2072n1246q4768j32834j09001p817P9955K75562n8072j73837K00531
$$ 4404377 4466449 4415203 4330435 4197601 4088600 4080783 4160738 4436300 4378228 4204391 4404922
5017D404922R9580l2794M7571O7438L3940K08357L7526j27537L290O0308L6852
$$ 4404922 4504502 4471708 4519279 4586717 4620657 4829014 4866540 4739003 4742293 4802601 4839453
5006D839453M8260L06025J96761K8825K19608J94559K11676J81936O8910J44026
$$ 4839453 4887713 5193738 5390499 5419324 5638932 5833491 6045167 6227103 6296013 6440039
4996F440039J84145L23773K38378L45859J94266L31289K28418L08490K62481L50292
$$ 6440039 6624184 6947957 7186335 7532194 7726460 8057749 8286167 8594657 8857138 9207430
4986I207430N79175M09093N52379P34311M06656O56489Q70075J049031J107023
$$ 9207430 9786605 10195698 10748077 11482388 11889044 12545533 13415608 14464639 15571662
4977A5571662J292813J008531O93632N00971M57953K51077k1897k05308l00830
$$ 15571662 16864475 17873006 18566638 19067609 19525562 19776639 19754742 19549434 19248604
4968A9248604l52672j52893K11984L67481Q25808R06989Q14816O81271M06607
$$ 19248604 18895932 18743039 18955023 19322504 20148312 21055301 21870117 22551388 22957995
4959B2957995R3858k90842o22525o64854r80809j061723r19267q74060p82907
$$ 22957995 23051853 22761011 22138486 21473632 20492823 19431100 18511833 17637773 16854866
4950A6854866n56855k40789K8245N2303L13991K80090M58664P09144N50566R88643
$$ 16854866 16298011 16057222 16085467 16137770 16451761 16731851 17190515 17899659 18450225 19438868
4940A9438868J425293R68894J281799J344417J609064J353006J218439J231962
$$ 19438868 20864161 21833055 23114854 24459271 26068335 27421341 28639780 29871742
4932B9871742P66594P31928J009103O66733J027302R91798J309107J667080J128528
$$ 29871742 30638336 31370264 32379367 33046100 34073402 35065200 36374307 38041387 39169915
4923C9169915J077287R02411J89779r36346j525083j902271k363758k492886k239793
$$ 39169915 40247202 41149613 41339392 40403046 38877963 36975692 34611934 32119048 29879255
4914B9879255k531093j946674j386442j267506q24683m95399j49321K4323K41274
$$ 29879255 27348162 25401488 24015046 22747540 21922857 21427458 21278137 21302460 21543734
4905B1543734P27135Q05473R80729J181437J611740J329788J114697J140357O08566
$$ 21543734 22270869 23076342 24057071 25238508 26850248 28180036 29294733 30435090 31043656
4896C1043656L98877l31049j006148j126386j749465k233340j932428j934748
$$ 31043656 31442533 31111484 30105336 28978950 27229485 24996145 23063717 21128969
4888B1128969j810432j567141j306256r58848r37144r35893r18814l36759m61274
$$ 21128969 19318537 17751396 16445140 15486292 14549148 13613255 12694441 12357682 11896408
4879A1896408l66930k62945m31935j98657o3262j76593k09486m3897k50944l01484
$$ 11896408 11529478 11266533 10834598 10635941 10572679 10396086 10186600 10142703 9891759 9590275
4869I590275L2268K00343M1719O3953L13528l9309k4509J21141M2808K35959L02707
$$ 9590275 9622543 9822886 9864605 9928558 10242086 10202777 10178268 10299409 10342217 10578176 10880883
4858A0880883J79514k3517k21549j26007o4343k83327m30547j61038k27342l80387
$$ 10880883 11060397 11036880 10815331 10689324 10624981 10341654 9911107 9750069 9522727 9142340
4848I142340k35328k55118p5429l14346k06957j3007J30477p4601j34716r1097
$$ 9142340 8907012 8651894 8576465 8262119 8055162 8042155 8172632 8098031 7963315 7872218
4838G872218K6536J25257j25293j60878l7819N9697p420R2401L4519R2822K96901
$$ 7872218 7898754 8024011 7898718 7737840 7700021 7759718 7752298 7844699 7879218 7972040 8268941
4827H268941J34021J28629P9874M0941J841K44116m3981J14630L32464j22379
$$ 8268941 8402962 8531591 8611465 8652406 8654247 8898363 8854382 8969012 9301476 9179097
4817I179097J3195l9475Q1976j7275P4505K45493J340J82784J64916L8523O8983
$$ 9179097 9192292 9152817 9234793 9217518 9292023 9537516 9538856 9721640 9886556 9925079 9994062
4806I994062K31004J17318j35738K79132M12265M59253N89260N25960O5261j47366
$$ 9994062 10225066 10342384 10206646 10485778 10898043 11357296 11946556 12472516 12537777 12390411
4796A2390411j45356k06706J1893n7485r307Q8970p7957o1137Q1783j30204K64273
$$ 12390411 12245055 12038349 12050242 11992757 11983450 12072420 11994463 11933326 12015109 11884905 12149178
4785A2149178K49368L73447J89809Q4316L6698j31404J39466J60389L36176K82791
$$ 12149178 12398546 12771993 12961802 13046118 13082816 12951412 13090878 13251267 13587443 13870234
4775A3870234L00426K34776O1274M37724L17026J67876L37942L71672L74862J84946
$$ 13870234 14170660 14405436 14466710 14904434 15221460 15389336 15727278 16098950 16473812 16658758
4765A6658758M54643N60915N15348L91098L99022L01307P693J98645L07160M41501
$$ 16658758 17113401 17674316 18189664 18580762 18979784 19281091 19288784 19487429 19794589 20236090
4755B0236090M50514N25412M95366L97979L59015N08009O09895M25499L98305
$$ 20236090 20686604 21212016 21707382 22105361 22464376 22972385 23582280 24007779 24406084
4746B4406084O45776N32233O23463N74913N77458N22041O15147Q06726Q84943
$$ 24406084 25051860 25584093 26207556 26782469 27359927 27881968 28497115 29303841 30188784
4737C0188784P69113P61944N79890P43696Q40980O33825J084180J099287R63763
$$ 30188784 30957897 31719841 32299731 33043427 33884407 34518232 35602412 36701699 37665462
4728C7665462J016226J377789J005098J203203J241527J063456J074140J388038
$$ 37665462 38681688 40059477 41064575 42267778 43509305 44572761 45646901 47034939
4720D7034939J321864J540161J471693J591873J590698K201832K440152K363089
$$ 47034939 48356803 49896964 51368657 52960530 54551228 56753060 59193212 61556301
4712F1556301K807062L371361L647456L923812M376362M635512N206040N391881
$$ 61556301 64363363 67734724 71382180 75305992 79682354 84317866 89523906 94915787
4704I4915787N600008N808404O096167O657446P215603P730080Q480335R110497
$$ 94915787 100515795 106324199 112420366 119077812 126293415 134023495 142503830 151614327
4696A51614327R876672J0770779J0971877J1526706J1801071J1938963J2001079
$$ 151614327 161490999 172261778 183233655 194760361 206561432 218500395 230501474
4689B30501474J2206379J2182975J1281728R568520O187390J939141k465393o688041
$$ 230501474 242707853 254890828 266172556 275741076 281928466 283867607 281402214 274714173
4681B74714173j0202018j2513313j3556771j3441628j1796070r879012q344984
$$ 274714173 264512155 251998842 238442071 225000443 213204373 203325361 194980377
4674A94980377q156576q905064j0190397j1239669j0710135r396424p740702o119745
$$ 194980377 186823801 177918737 167728340 156488671 145778536 136382112 128641410 122521665
4666A22521665m674794l411030k862990k376763k465928k489396k863126l669829
$$ 122521665 117846871 114435841 111572851 109196088 106730160 104240764 101377638 97707809
4658I7707809l715869m124783m055397m300655m276655l840031l617639l540111
$$ 97707809 93991940 89867157 85811760 81511105 77234450 73394419 69776780 66236669
4650F6236669l096877k714462k582824k483742k095865j881078j700258j418991
$$ 66236669 63139792 60425330 57842506 55358764 53262899 51381821 49681563 48262572
4642D8262572j228369q35418p05518p13188n19840k3706K8982J93452N85261L88419
$$ 48262572 47034203 46198785 45493267 44780079 44260239 44236533 44265515 44458967 45044228 45432647
4632D5432647O69456J248807J455260J286038J672769K204205K669447L024793
$$ 45432647 46102103 47350910 48806170 50092208 51764977 53969182 56638629 59663422
4624E9663422L306310L154877K886857K542464J933972R74256j02485r04503k107275
$$ 59663422 62969732 66124609 69011466 71553930 73487902 74462158 74359673 73455170 71347895
4615G1347895l526734l836380m323668m576748m295027m159016l654381l327963
$$ 71347895 67821161 63984781 59661113 55084365 50789338 46630322 42975941 39647978
4607C9647978k716951j944506j970351j654826j054719r86974p20912q07688o57356
$$ 39647978 36931027 34986521 33016170 31361344 30306625 29319651 28598739 27791051 27133695
4598B7133695o15204n93836m36640m31671o84192m90946l53163o60432l12465
$$ 27133695 26518491 25924655 25488015 25056344 24372152 23881206 23528043 22867611 22555146
4589B2555146q1715j2934l13874k08922j54892o6876r5903k3888k38990L9662
$$ 22555146 22473431 22460497 22146623 21937701 21782809 21715933 21620030 21596142 21357152 21396814
4579B1396814k29943j25648J00000J89668J40319L7359N6592K44333J13559O8821
$$ 21396814 21166871 21041223 21141223 21330891 21471210 21508569 21565161 21809494 21923053 21991874
4569B1991874K92794P2360K91130K61665M7722p9479p2531j7719J42689K13307
$$ 21991874 22284668 22357028 22648158 22909823 22957545 22878066 22805535 22787816 22930505 23143812
4559B3143812N2190L05115J92291J69766K68943O6366O3595Q8359K1082K44819
$$ 23143812 23196002 23501117 23693408 23863174 24132117 24198483 24262078 24350437 24371519 24616338
4549B4616338Q0792J29786J04624N79191K22909J81675K91723M77644O47370K99403
$$ 24616338 24697130 24826916 24931540 25510731 25733640 25915315 26207038 26684682 27332052 27631455
4539B7631455M39656L91384M24015Q05726N57192L41521M39973N37455O77799
$$ 27631455 28071111 28462495 28886510 29692236 30249428 30590949 31030922 31568377 32246176
4530C2246176M83756P48177L82712M86115N92843P94160P78151R42086P93747
$$ 32246176 32729932 33478109 33860821 34346936 34939779 35733939 36512090 37454176 38247923
4521C8247923N45614P26985O50627P48089Q76644Q48808R42944J365515J441261
$$ 38247923 38793537 39520522 40171149 40919238 41795882 42644690 43587634 44953149 46394410
4512D6394410J244947J249701J922368J856923J827843K246698K388372K460778
$$ 46394410 47639357 48889058 50811426 52668349 54496192 56742890 59131262 61592040
4504F1592040K726817L452918L822149M562288N216342O300848P117886Q507950
$$ 61592040 64318857 67771775 71593924 76156212 81372554 87673402 94791288 103299238
4496A03299238R465993J1217374J3106007J5617187J7539100J9814350K2151699
$$ 103299238 112765231 123982605 137088612 152705799 170244899 190059249 212210948
4489B12210948K6594577L2775694M3048676N3143655N3619024R841803l5708056
$$ 212210948 238805525 271581219 314629895 367773550 421392574 431234377 395526321
4482C95526321o0238656o7122746n1258978l6517995k5120287j8870712j3618918
$$ 395526321 335287665 268164919 216905941 180387946 155267659 136396947 122778029
4475A22778029j0863324q650210p275783n498423m827445l870600l364989k462635
$$ 122778029 111914705 103264495 95988712 90490289 85662844 81792244 78427255 75964620
4467G5964620k350700j888906j656148j216149j371718j182059j308015q54038
$$ 75964620 73613920 71725014 70068866 68852717 67480999 66298940 64990925 64136887
4459F4136887r53312n17742n82330m54299j00858J52454J19674K91612M93939
$$ 64136887 63183575 62665833 62083503 61629204 61528346 61680800 61800474 62092086 62586025
4450F2586025L10658M32290O72978Q82058J225492J431867J935318J870003K088376
$$ 62586025 62896683 63328973 64001951 64884009 66109501 67541368 69476686 71346689 73435065
4441G3435065K317715K623617L116344L567798L984080M861529N661368O332849
$$ 73435065 75752780 78376397 81492741 85060539 89044619 93906148 99567516 105900365
4433A05900365P380155P481347O234225M078216O52871k009463l307313l743089
$$ 105900365 113280520 120761867 126996092 131074308 131727179 129717716 126410403 122667314
4425A22667314k427921j78303J753814L643875N268237O878369Q234750J0133625
$$ 122667314 120239393 120061090 121814904 125458779 130727016 137605385 145840135 155973760
4417A55973760J2127237J4668985J6822182J9104843K1896935K4808658K8195963
$$ 155973760 168100997 182769982 199592164 218697007 240593942 265402600 293598563
4410B93598563L1768492L1787231K1092254j895754k5543463m0193642m3641612
$$ 293598563 325367055 357154286 378246540 376350786 350807323 310613681 266972069
4403B66972069l8470520l0298616k2917058j7256883j3259495j0195508q010521
$$ 266972069 228501549 198202933 175285875 158028992 144769497 134573989 126563468
4396A26563468o162790m735924l448431k432030j459411l92237O40086P32230
$$ 126563468 120400678 115664754 112216323 109784293 108324882 107932645 108572731 109304961
4388A09304961j62956j540135l811245n770107o488261o644709n802304m680600
$$ 109304961 109142005 107601870 103790625 98020518 91532257 84887548 79085244 74404644
4380G4404644l833068k840192k266092j981566j506202j441078j439633j663382
$$ 74404644 70571576 67731384 65465292 63483726 61977524 60536446 59096813 57433431
4372E7433431j617438j700778j863326j804750j926787j765269j585000j333169
$$ 57433431 55815993 54115215 52251889 50447139 48520352 46755083 45170083 43836914
4364D3836914j272646p71700q89226p67047p23172o10340m30500l11818n5982
$$ 43836914 42564268 41792568 40903342 40136295 39413123 38802783 38372283 38060465 38004483
4355C8004483l4756o7593J89245K96321P33529N87102P01337M25484M11762P56859
$$ 38004483 37969727 37902134 38091379 38387700 39121229 39708331 40409668 40835152 41246914 42003773
4345D2003773Q81724Q63592J028536J332209J809776J693037J910878J469220
$$ 42003773 42885497 43749089 44777625 46109834 47919610 49612647 51523525 52992745
4337E2992745J338079J649519J592398J084254O51831j82142j095893j885401
$$ 52992745 54330824 55980343 57572741 58656995 59308826 59126684 58030791 56145390
4329E6145390k480444k936165l008985k099227j355506r88782o88670n03936k28027
$$ 56145390 53664946 50728781 47719796 45620569 44265063 43276281 42587611 42083675 41855648
4320D1855648o9253K35512L64433N11852O14803P20467J046218P84235N03265
$$ 41855648 41786395 42021907 42386340 42898192 43512995 44233462 45279680 46063915 46567180
4311D6567180L74004N41054Q74797J153094J855686K073602K390758K397568L147171
$$ 46567180 46941184 47482238 48357035 49510129 51365815 53439417 55830175 58227743 61374914
4302F1374914L102186L196236L224691K973333K154568J337414J117209M69221
$$ 61374914 64477100 67673336 70898027 73871360 76025928 77363342 78480551 78949772
4294G8949772M57417M71641N39404N35396N0092K03183N71234J456777K102933
$$ 78949772 79407189 79878830 80418234 80953630 81003722 81206905 81778139 83234916 85337849
4285H5337849K754053L805025M683373N882179P278543Q544140J0567606J1885383
$$ 85337849 88091902 91896927 96580300 102462479 109741022 118285162 128852768 140738151
4277A40738151J3616747J5675975J7689621J9393406K0375857K0894124K1181959
$$ 140738151 154354898 170030873 187720494 207113900 227489757 248383881 269565840
4270B69565840K2203117K4886093K8634705K9520242J7669757r547417l4827326
$$ 269565840 291768957 316655050 345289755 374809997 392479754 382932337 348105011
4263C48105011m9099272n0307684m1767436l1700436k3294108j7818045j3845975
$$ 348105011 299005739 248698055 206930619 175230183 151936075 134118030 120272055
4256A20272055j1007511r087349p232657o544910n873193n192685m165171l681833
$$ 120272055 109264544 100177195 92944538 86399628 80526435 75333750 71168579 67486746
4248F7486746l121162k665793k528945k120125j921773j550476j451629j027805
$$ 67486746 64365584 61699791 59170846 57050721 55128948 53578472 52126843 51099038
4240E1099038q64987q57132n28347k30430o8064O13077O52724Q41794J570222
$$ 51099038 50234051 49376919 48848572 48618142 48550078 49163155 49815879 50657673 52227895
4231E2227895J826511J884617J445722N42155j206070k275001l084275l209438
$$ 52227895 54054406 55939023 57384745 57926900 56720830 54445829 51361554 48152116
4223D8152116k959292k082317j374083o91720m74667L4788L81434J037948J061466
$$ 48152116 45192824 43110507 41736424 41044704 40570037 40604825 40986259 42024207 43085673
4214D3085673J149451K78344j058961k371282l291209l074446k476449j890854
$$ 43085673 44235124 44513468 43454507 41083225 37792016 34717570 32241121 30350267
4206C0350267j771394j123183q21016q59360p60642n60482l99553l45133l11691
$$ 30350267 28578873 27455690 26634674 25775314 25014672 24454190 24054637 23709504 23397813
4197B3397813R3893Q8403R2278K53496O01113N42793N76054J086855Q75996Q15075
$$ 23397813 23491706 23580109 23672387 23925883 24526996 25069789 25645843 26732698 27608694 28423769
4187B8423769K54742k73166j273030j153439j317371q63509m01156m33062k36365
$$ 28423769 28678511 28405345 27132315 25978876 24661505 23797996 23396840 22963778 22727413
4178B2727413K10111K94048M73438Q64149R54138M28073n2699o89110r47224j189981
$$ 22727413 22937524 23231572 23705010 24569159 25523297 25951370 25898671 25209561 24262337 23072356
4168B3072356j344467j168965j216383j145919q34062q86763n81070n12597l19202
$$ 23072356 21727889 20558924 19342541 18196622 17362560 16475797 15894727 15382130 15062928
4159A5062928n8630m55493k19436r191p4848K31669j50765K19675J84621Q2414
$$ 15062928 15004298 14548805 14329369 14320178 14245330 14476999 14326234 14545909 14730530 14812944
4149A4812944L74682M68079K49129N70579P85983M53179J89054R0818j70169m71224
$$ 14812944 15187626 15655705 15904834 16475413 17261396 17714575 17903629 17994447 17824278 17353054
4139A7353054o19503o93335o54599p79613m08086k11626m32018j56953L5005k11058
$$ 17353054 16733551 16040216 15385617 14606004 14197918 13986292 13554274 13397321 13432326 13221268
4129A3221268q8827K5775J80390k1509k76287k41186K62395R5733L10744l3650
$$ 13221268 13132441 13158216 13338606 13317097 13040810 12799624 13062019 13157752 13468496 13434846
4119A3434846R7376L57744K61234J41917K30987j38732J71854K45024L74247J42968
$$ 13434846 13532222 13889966 14151200 14293117 14524104 14385372 14557226 14802250 15176497 15319465
4109A5319465N29383L28136L47098J27777L04905M61919M83134N9695J91486K83591
$$ 15319465 15848848 16176984 16524082 16651859 16956764 17418683 17901817 17961512 18152998 18436589
4099A8436589M98864K58523L51749K42338N35173L53966N39764N37120Q88447
$$ 18436589 18935453 19193976 19545725 19788063 20323236 20677202 21216966 21754086 22642533
4090B2642533O96360R80205Q50843J094309R45165J466959J306761J778007J579863
$$ 22642533 23338893 24319098 25169941 26264250 27209415 28676374 29983135 31761142 33341005
4081C3341005K181386K713530L049330L012532M469594M711002N754918N468653
$$ 33341005 35522391 38235921 41285251 44297783 48767377 53478379 59233297 64701950
4073F4701950P088174P882350J0166662J1529485J3177833J3931999J7346967
$$ 64701950 71790124 79672474 89839136 101368621 114546454 128478453 145825420
4066A45825420J9952862K8553998L6353146M8937658K6640568k1901599m2075512
$$ 145825420 165778282 194332280 230685426 279623084 306263652 284362053 242286541
4059B42286541n5682667m3286481k9483188j9375572j4063535r775507q021337
$$ 242286541 186603874 143317393 113834205 94458633 80395098 70619591 62598254
4052F2598254o070500n336077m008168l731519k919234k676940k312185k353183
$$ 62598254 56527754 51191677 47183509 43451990 40532756 37855816 35543631 33190448
4044C3190448j661781j417128j510706j419434j171923j330079j010933r71196
$$ 33190448 31528667 30111539 28600833 27181399 26009476 24679397 23668464 22697268
4036B2697268j016618q88043r27296p80868o99474m63050o81040n07871n96670
$$ 22697268 21680650 20792607 19865311 19084443 18384969 17921919 17240879 16733008 16136338
4027A6136338o49151l56349j74274m29064l90685k97523l24823k54494j55315
$$ 16136338 15487187 15130838 14956564 14527500 14136815 13839292 13514469 13259975 13104660
4018A3104660l50289k95943k14768k39285m18012p2100k05379M5602J6808l5304
$$ 13104660 12754371 12458428 12243660 12004375 11586363 11514263 11308884 11354486 11371294 11335990
4008A1335990k43414j76662l3306K34375J40096K51735j49964J58871J15184K90583
$$ 11335990 11092576 10915914 10882608 11116983 11257079 11508814 11358850 11517721 11632905 11923488
3998A1923488J32501L89720M76542K63526L41535M21144L16119O14228J88651
$$ 11923488 12055989 12445709 12922251 13185777 13527312 13948456 14264575 14878803 15067454
3989A5067454Q7562n6007K5648m33788p50010p13842k86297n44225m26458k90057
$$ 15067454 15155016 15099009 15124657 14690869 13940859 13227017 12940720 12396495 11970037 11679980
3979A1679980l72066k04252J2249q8939P3712P9460J39990Q4610J3737K79085
$$ 11679980 11307914 11103662 11115911 11026972 11100684 11180144 11320134 11404744 11418481 11697566
3969A1697566M8808K92670Q2636L13062M41429M41807O84851O66185L56798M23145
$$ 11697566 11746374 12039044 12121680 12434742 12876171 13317978 14002829 14669014 15025812 15448957
3959A5448957O65273M30256N77734R06912Q60573R40338M60802K79238M79775
$$ 15448957 16114230 16544486 17122220 18029132 18889705 19830043 20290845 20570083 21049858
3950B1049858J0739n26921n16074m67644o90824n09088k64320j89080K7554K28795
$$ 21049858 21060597 20533676 20017602 19549958 18859134 18350046 18085726 17896646 17924200 18152995
3940A8152995N10244Q03275O09961R06432J294064J770143J816508J810217J695942
$$ 18152995 18663239 19466514 20076475 20982907 22276971 24047114 25863622 27673839 29369781
3931B9369781J873209J566103J041250L69450l67619r46951j335131j570680j962197
$$ 29369781 31242990 32809093 33850343 34219793 33852174 32905223 31570092 29999412 28037215
3922B8037215k247534k027229j772549j609029j345389n84517l31433k32323n1275
$$ 28037215 25789681 23762452 21989903 20380874 19035485 18450968 18119535 17887212 17835937
3913A7835937L51921K86594P27741P11833O32197Q84184N09648J83671J1135O8107
$$ 17835937 18187858 18474452 19202193 19914026 20546223 21430407 21940055 22123726 22134861 22202968
3903B2202968J53903k60827o14041l17835k54298L0948P36792R60022M00542N16577
$$ 22202968 22356871 22096044 21482003 21164168 20909870 20940818 21677610 22637632 23038174 23554751
3893B3554751Q2784l68540k45663N3823m13290q21402q94437q94147q27518l76957
$$ 23554751 23637535 23268995 23023332 23077155 22663865 21842463 20948026 20053879 19226361 18849404
3883A8849404o62493o64390m91162n17109o46847m22547k31804k16411k8198J87185
$$ 18849404 18186911 17522521 17031359 16514250 15867403 15444856 15213052 14996641 14968443 15155628
3873A5155628N86326N33395N90388P0769J4934l07186n44343l17798m88708r60037
$$ 15155628 15741954 16275349 16865737 16936506 16951440 16644254 16099911 15782113 15293405 14333368
3863A4333368r72064j186888j066226r87841n26337k46922j80947l10645j78498
$$ 14333368 13361304 12174416 11108190 10120349 9594012 9347090 9166143 8855498 8677000
3854H677000l7267N7683O601J85037J59109R9901L75702N8883l5509J39564L00808
$$ 8677000 8639733 8697416 8704017 8889054 9048163 9148064 9523766 9582649 9547140 9686704 9987512
3843I987512K46953N9053P1166M03896N32526N01962K28484j1342k40056k06279
$$ 9987512 10234465 10293518 10364684 10768580 11301106 11803068 12031552 12020210 11780154 11573875
3833A1573875m29196l09545o86353r47886r90437q44079q71213m23667l47322
$$ 11573875 11144679 10835134 10148781 9200895 8210458 7366379 6495166 6071499 5724177
3824E724177j82258k60745n53627m31816j78528k2062j33965j71670n2722j71166
$$ 5724177 5541919 5281174 4727547 4295731 4117203 4095141 3961176 3789506 3736784 3565618
3814C565618l3364l99368j02906q7446j51705p17k6131m2310K1884k04094o2513
$$ 3565618 3532254 3132886 3029980 2942534 2790829 2790112 2763981 2721671 2743555 2539461 2476948
3803B476948N7766j5554j59117j27844R4641k9773Q1932k815j4921j23567j64272
$$ 2476948 2534714 2519160 2360043 2232199 2326840 2297067 2378999 2376184 2361263 2237696 2073424
3792B073424J40988q0572j46606J12894N0459j36869j45297J17736P7973L894
$$ 2073424 2214412 2133840 1987234 2100128 2150587 2013718 1868421 1986157 2064130 2068024
3782B068024M2262q0799J52698J39104j1362K54053J29614N2246K43380j8081
$$ 2068024 2110286 2029487 2182185 2321289 2309927 2563980 2693594 2745840 2989220 2971139
3772B971139p5126j29106j15151k29186k11522l8866J31551k35789l94233l7944
$$ 2971139 2896013 2766907 2651756 2422570 2211048 2172182 2303733 2067944 1673711 1635767
3762A635767O1042M0899J15121j44598j26540J46664k63468r2031r1492r427p7753
$$ 1635767 1696809 1737708 1852829 1708231 1581691 1728355 1464887 1372856 1281364 1271937 1194184
3751A194184P7115J3802K05356l14k7474j78558k53265J55368K03888J40587m7452
$$ 1194184 1271299 1285101 1490457 1490143 1462669 1284111 1030846 1186214 1390102 1530689 1483237
3740A483237l71244k10495q79J72854m4034k6954N8791k9250l0994K47764P4459
$$ 1483237 1111993 901498 900619 1073473 1029439 1002485 1061276 1032026 1001032 1248796 1323255
3729A323255J0028j234k16130k06152j1942q5231k9439n0786N7637J81906J22013
$$ 1323255 1333283 1332049 1115919 909767 897825 812594 783155 732369 790006 971912 1093925
3718A093925R7978N2902J3322l26355J29233K56094o3324l6773k15897J71082
$$ 1093925 1191903 1244805 1258127 931772 1061005 1317099 1253775 1217002 1001105 1172187
3708A172187N9423m392J50394j4987J26308P9719J68671N6517K6606J9676Q0719
$$ 1172187 1231610 1227218 1377612 1362625 1488933 1568652 1737323 1793840 1820446 1840122 1920841
3697A920841q7782L1320k3711O9102K54224r9332l1024L26816K06025j7442j9502
$$ 1920841 1833059 1864379 1840668 1909770 2163994 2064662 2033638 2360454 2566479 2549037 2529535
3686B529535j30945Q9133o6126l2176k12444n4898p8348J051p9427j81020J61334
$$ 2529535 2398590 2487723 2421597 2389421 2176977 2122079 2043731 2044782 1965355 1784335 1945669
3675A945669Q2755K700P2452J0554j03177k22440J18593r3967p3431J64288j29741
$$ 1945669 2028424 2031124 2103576 2114130 2010953 1788513 1907106 1813139 1739708 1903996 1774255
3664A774255p0217L3750o6214J22716J62106k8754j07173J94417R179J00222J16419
$$ 1774255 1704038 1737788 1671574 1794290 1956396 1927642 1820469 2014886 2024065 2124287 2240706
3653B240706o8101K4679j72883r1976r1607J77693j22849q5323R8716J8183r378
$$ 2240706 2172605 2197284 2024401 1932425 1840818 2018511 1895662 1810339 1909055 1927238 1917860
3642A917860m882n0216O6016j34831J02315l6175j7510m3646o4329n3988J76582
$$ 1917860 1912978 1862762 1928778 1793947 1896262 1860087 1842577 1798931 1734602 1680614 1857196
3631A857196O6196r2365O3190j4988J0349K6678N0680m2790q1145L3560L1217
$$ 1857196 1923392 1831027 1894217 1879229 1889578 1916256 1966936 1924146 1843001 1876561 1907778
3620A907778n2970N9314M5704j28194j46673m4108l7680n0228J82983k58587j7524
$$ 1907778 1854808 1914122 1959826 1831632 1684959 1640851 1603171 1552943 1735926 1477339 1459815
3609A459815K41340J7647M4842n8791m0684K40865j82090N8183Q5295k8838r160
$$ 1459815 1701155 1718802 1763644 1704853 1664169 1905034 1722944 1781127 1866422 1837584 1828424
3598A828424j17946P896R9774O7387j98065L6295N384J92449J14505Q781J88252
$$ 1828424 1710478 1718374 1818148 1885535 1687470 1723765 1729149 1921598 2036103 2044884 2233136
3587B233136P4479J61391K27971k10329j1604P8504J19624j06293K30850Q5873
$$ 2233136 2307615 2469006 2696977 2486648 2475044 2553548 2673172 2566879 2797729 2883602
3577B883602l6174R2356J47938J77763J18169J67706R6542K55056p3056J12698
$$ 2883602 2847428 2939784 3087722 3265485 3383654 3551360 3647902 3902958 3829902 3942600
3567C942600J06543K5306l1723J3158R2160J31759k5549J10798M953j45094j66853
$$ 3942600 4049143 4074449 4042726 4055884 4148044 4279803 4254254 4365052 4370005 4224911 4058058
3556D058058J13207N250l440R7836M7533k2667m1772O5227R1937r2546J19175
$$ 4058058 4171265 4176515 4173075 4270911 4318444 4295777 4254005 4319232 4411169 4318623 4437798
3545D437798Q2821M5402L8328J02305r4839m1237K15789k2677Q5346J89381J55866
$$ 4437798 4520619 4566021 4604349 4706654 4611815 4570578 4786367 4763690 4849036 5038417 5194283
3534E194283J81348M31103O7176J62218K04242L50824J48088k79541j76412K8309
$$ 5194283 5375631 5806734 5873910 6036128 6240370 6591194 6739282 6459741 6283329 6311638
3524F311638R3309J0037l68595j69044p0724O0842j67595R9064M2290j09244k53899
$$ 6311638 6404947 6414984 6046389 5877345 5806621 5867463 5699868 5798932 5841222 5731978 5478079
3513E478079k50568m7139p3096k96618m60011m68977l37085j77127k3836j62857
$$ 5478079 5227511 5180372 5107276 4810658 4350647 3881670 3544585 3367458 3343622 3180765
3503C180765k31305j85411m16226j07469J8816q1821L0081J8439J5422j60684
$$ 3180765 2949460 2764049 2347823 2240354 2259170 2177349 2207430 2225869 2241291 2080607
3493B080607l65412j25483J47021k7973k5662k59288J42174j28562k73511J322
$$ 2080607 1715195 1589712 1736733 1708760 1683098 1423810 1565984 1437422 1163911 1165233
3483A165233o0141N4564j0649j69833o2505M4338P617J289J00314j87162j9084
$$ 1165233 1105092 1159656 1149007 979174 916669 961007 968624 969913 1070227 883065 863981
3472H63981P2738J19044l416l16158J03232M9129L5939m6478k5722j76689k49145
$$ 863981 936719 1055763 1052347 736189 839421 888550 924489 878011 852289 675600 426455
3461D26455N3671Q0602M8381r4267j51754J62445j81455l7189J63051J1846o0586
$$ 426455 480126 560728 609109 514842 363088 525533 344078 306889 469940 481786 421200
3450D21200J73300j40523M9726R3250p3413K2195J46737q5537j339M8171j12196
$$ 421200 594500 453977 503703 596953 523540 545735 692472 606935 605596 653767 541571
3439E41571j62034L6810K25947r6403q1993J8710k05449j0082J93903Q3057m5428
$$ 541571 379537 416347 642294 545891 463898 482608 277159 267077 460980 544037 498609
3428D98609k22969Q221k7465r1300K35487J01642k12693j39637J25144K08448
$$ 498609 275640 283861 256396 165096 400583 502225 289532 149895 275039 483487
3418D83487m4188N712P0017j40375j25393P0729J84774q0311k6384l317j41982
$$ 483487 439299 445011 515028 374653 249260 319989 504763 424452 398068 394751 252769
3407B52769j13335J77438j30306j0356J32363J721N5447k222l6077J16451P2781
$$ 252769 139434 316872 186566 176210 308573 310294 365741 363519 327442 443893 516674
3396E16674N4720R2435J47674m8501j32640J47799j67113k05562r6349j43028
$$ 516674 571394 663829 811503 763002 630362 778161 611048 405486 309137 166109
3386A66109J64971L6831n5441J03226j65289k7229k9225o8533J70241R4506J75680
$$ 166109 331080 367911 312470 415696 250407 223178 193953 125420 295661 390167 565847
3375E65847k17264k98299J02551K0027k05853M1787J90129J433p0782j13362P354
$$ 565847 348583 50284 152835 172862 -32991 8796 198925 200358 129576 16214 23568
3364B3568K29987K85002l86111m7600J19559k19018J96007J21974q77M0751j30863
$$ 23568 253555 538557 152446 104846 224405 5387 201394 323368 322491 363242 232379
3353B32379J41151o3772J02932K05491k85237k40406J58434N8986J01574m3539
$$ 232379 373530 309758 412690 618181 332944 92538 250972 309958 411532 367993
3343C67993L6943m6146R436j31997j19163k2294J64320J25150K2556j72938O8461
$$ 367993 404936 358790 368226 236229 117066 94772 259092 384242 406798 233860 302321
3332C02321O4611j37811J38018J221N0749N2062N5003j44479K44099j76983j27677
$$ 302321 366932 229121 367139 368360 419109 471171 526174 381695 625794 448811 321134
3321C21134O9836r6701R6250m9201K10371j766j67175J34386q0410J92919P7321
$$ 321134 390970 294269 390519 341318 551689 549923 382748 517134 436724 629643 706964
3310G06964l1357P0602J32830k03484j89636J48334j40289J0943J19492L0331
$$ 706964 675607 746209 879039 675555 485919 634253 493964 504907 624399 654730
3300F54730J66633j01110J04145J3343j58459L2721j02915R6631p7608K2537J77071
$$ 654730 821363 720253 824398 837741 679282 712003 609088 705719 628111 650648 827719
3289H27719j14951R1073J89458k55496n0562n7298P4271J48639J2111p530Q9023
$$ 827719 712768 803841 993299 737803 687241 629943 704214 852853 864964 857434 946457
3278I46457k8615J34921J03936K14005J0192J17778J6404J42749K03043j10992
$$ 946457 917842 1052763 1156699 1370704 1380896 1498674 1515078 1657827 1860870 1749878
3268A749878j31969j54002l8009Q0724K6301n1951K85498J42833N8837l2310m06473
$$ 1749878 1617909 1463907 1425898 1506622 1532923 1480972 1766470 1909303 1968140 1935830 1529357
3257A529357k6321J20978J93662Q0760K7541K77733J8275J04502K4498J40581
$$ 1529357 1503036 1624014 1817676 1898436 1925977 2203710 2221985 2326487 2350985 2491566
3247B491566Q7420L99144L23868K48718K08435J97315M19280K68929M19990N53569
$$ 2491566 2578986 2978130 3301998 3550716 3759151 3956466 4375746 4644675 5064665 5618234
3237E618234N68659P13583N73559J47805j48696m65556p82789n38023o92113o12493
$$ 5618234 6186893 6900476 7474035 7621840 7473144 7007588 6224799 5686776 4994663 4382170
3227D382170m46822l50705j07334j17281l57274J2114J46103q2106k67688j43869
$$ 4382170 3935348 3584643 3477309 3360028 3002754 3014868 3160971 3078865 2811177 2667308
3217B667308j00844k53803j22201r3258l2079k62244k50659J2612p2356Q1304
$$ 2667308 2566464 2312661 2190460 2097202 2065123 1802879 1552220 1564832 1492476 1573780
3207A573780p5199j02153o3897L17741j41070k07133n6314L4315k46662n3523
$$ 1573780 1498581 1396428 1332531 1650272 1509202 1302069 1245755 1280070 1033408 979885
3197I79885R5112j47334O9780N355J02652j13086q3170j16282L7707M2211j1956
$$ 979885 1074997 927663 997443 1002798 1105450 992364 909194 792912 830619 872830 860874
3186H60874j56961k4764o214K7512J7246n1491Q4640m0988m1926J33478J3063
$$ 860874 703913 679149 672935 700447 717693 666202 750842 709854 667928 801406 814469
3175H14469j47002k41162Q7029J15186M6730Q8258N1314j72535o425P5552j10647
$$ 814469 667467 426305 513334 628520 675250 763508 814822 642287 635862 711414 600767
3164F00767j4137M5833q8523M4085O431o5720n3878j96321r6263K50046Q2465
$$ 600767 586630 632463 543940 588025 594456 528736 474858 278537 182274 432320 514785
3153E14785j98994p5291P7124j59883j01370K64423q7496M5515m6026j37862L3710
$$ 514785 315791 240500 317624 157741 56371 320794 233298 278813 232787 94925 128635
3142A28635Q8873P6097M6638R2805m2034j21909J36133j28108M8642j1469q9091
$$ 128635 217508 293605 340243 433048 391014 269105 405238 277130 325772 314303 225212
3131B25212j45621j12650K35243Q7566k1278j04465J46105M3626j19461j69065
$$ 225212 79591 -33059 202184 289750 268472 164007 310112 353738 234277 65212
3121F5212L5521p8490O8542R6876o6903j47240J56576L1448q0894M1325K93282
$$ 65212 100733 22243 90785 187661 120758 -26482 130094 161542 80648 121973 415255
3110D15255q71q5028r8050o9909J85895J5067j32446r6727P1989m7663K21736
$$ 415255 414384 329356 231306 161397 347292 362359 229913 133186 205175 157512 379248
3099C79248n6227O8088J01816k65806N650k1580l9143n9334J34051Q7075r2868
$$ 379248 323021 391109 492925 227119 232769 211189 172046 112712 246763 333838 240970
3088B40970m0616N4896J121N5360J54216m3021r7573j52702j92783L04946O2417
$$ 240970 200354 255250 256371 311731 465947 422926 325353 172651 -20132 284814 347231
3077C47231O0111p2184k9023J05872j59506j44639m8875o8945N6113N2165j23072
$$ 347231 407342 335158 306135 412007 252501 107862 58987 -9958 46155 98320 -24752
3066b4752l7544j89750K44163O557K490J36885n3805P9319n0832j75932K81588
$$ -24752 -62296 -252046 -7883 -1326 1164 138049 84244 163563 112731 -63201 218387
3055B18387P2624k60103k6154O2967O3709J50521J20183q3283M0191r6547J38727
$$ 218387 291011 30908 4754 67721 131430 281951 402134 318851 359042 262495 401222
3044D01222j38554j64514N9253j08016M2913O917q3507q4200N6897K81138j30732
$$ 401222 262668 98154 157407 49391 92304 99221 15714 -68486 -11589 269549 138817
3033A38817j03024J62467k5697P3369r5L1525k2305J7970j11022J75657j81871
$$ 138817 35793 198260 172563 245932 245837 277362 255057 273027 162005 337662 155791
3022A55791r6952j88092K3826Q9875J02716j30451J9057j4189p7749l2735Q03
$$ 155791 58839 -129253 -105427 -15552 87164 -43287 -24230 -38419 -116168 -148903 -148100
3011a48100p3400J00466L01357J00402l667j36123n8049p8532J20040j05577P4691
$$ -148100 -221500 -121034 180323 280725 277058 140935 82886 4354 124394 18817 93508
3000I3508o6572m1477j58221J669K56863r6578j94086K58695J14516j89876q0886
$$ 93508 26936 -14541 -172762 -171093 85770 -10808 -204894 53801 168317 -21559 -102445
2989a02445K2107K64658j01192k5711o7614j00541O7402n5592j11923L3042O1405
$$ -102445 -80338 184320 83128 57417 -10197 -110738 -43336 -98928 -210851 -177809 -116404
2978a16404J7301O1553o8485p1419j2704K28199j02641m2794O7727Q4883j65791
$$ -116404 -99103 -37550 -106035 -177454 -190158 38041 -64600 -107394 -39667 45216 -120575
2967a20575r0143K22442j0539m1658o3398J21338J88403R0649j60646J3010P9673
$$ -120575 -210718 11724 1185 -40473 -103871 17467 205870 296519 135873 148883 228556
2956B28556J71331K7856j06480J7505j14908j869m1261J35680K5728k70229K0506
$$ 228556 399887 427743 321263 338768 223860 221991 180730 316410 342138 71909 92415
2945I2415l1074P8106M487j00161q0460l7710J40553M7736J97947l7297M147j18557
$$ 92415 61341 139447 143934 43773 -36687 -74397 66156 113892 311839 274542 278689 160132
2933A60132j83164P3387J87245J18545j32677j53633n1446J46506p0736j8182
$$ 160132 -23032 50355 237600 356145 223468 69835 18389 164895 94159 75977
2923G5977Q6303o0477l8788m6647Q4746J84070K42673k06920l16538P0307J30584
$$ 75977 162280 101803 63015 16368 101114 285184 527857 320937 4399 74706 205290
2912B05290l7907j4850N6852j16909J1787K34629Q7809j40361J64049j77169j65654
$$ 205290 167383 152533 209385 92476 104263 338892 426701 286340 450389 273220 107566
2901A07566M4781p6303J60626M5434o3082K0738J50732o2141L8436K02422M6144
$$ 107566 152347 76044 236670 282104 219022 239760 390492 328351 366787 569209 615353
2890F15353r1655K4376m6548J0010k40291J29892o3715j3644k2562K6105J8336
$$ 615353 523698 548074 501526 511536 271245 401137 337422 323778 301216 327321 345657
2879C45657J31386K6204q5088j82081j8929J85740J14535k19655j68253N7997
$$ 345657 477043 503247 418159 236078 217149 402889 517424 297769 129516 187513
2869A87513P0761O1290K16620N4967m10709Q7525J64420j48765o7170q0030J48463
$$ 187513 258274 319564 536184 591151 180442 267967 432387 283622 216452 136422 284885
2858B84885K00578k05385k80465J15772N3031j65449R0147Q7707K11159Q3984
$$ 284885 485463 280078 -387 115385 168416 2967 93114 180821 391980 475964
2848D75964l0095r1517p1932j93386l6124n2204J62738k5095o4560q617J51516
$$ 475964 445869 354352 282420 89034 52910 706 163444 138349 73789 65172 216688
2837B16688K1972r8127l4650N5753J473K2601j10170P7290N9536j52902j42832
$$ 216688 238660 140533 105883 161636 163109 185710 75540 152830 212366 59464 -83368
2826h3368K62998k8488k05774O0324J14737j15951q9425J9851J80950p0401k2054
$$ -83368 179630 151142 -54632 5692 120429 4478 -84947 -65096 115854 45453 23399
2815B3399R9837O763j63045j37192l120O8715Q5069K28482j88907k0723K81430
$$ 23399 123236 129999 -33046 -170238 -173358 -104643 -19574 208908 20001 -722 280708
2804B80708j88402k0682p0154O2338j16566M4846q5911J09673Q6476j7680j68182
$$ 280708 92306 71624 1470 63808 -52758 -7912 -93823 15850 102326 84646 -83536
2793h3536O5805J95K014Q2396j49385m5595Q1583J0199K18040k35217L9510Q0014
$$ -83536 -17731 -17536 -15522 66874 -82511 -128106 -46523 -36324 181716 -53501 -13991 66023
2781F6023k86822J89522j4810j19056M6236K16710m9109r8107j39160K12507M7952
$$ 66023 -220799 -31277 -46087 -165143 -118907 97803 48694 -49413 -188573 23934 71886
2770G1886k19160J15397Q1619K522j04708k5641N2046j50342o9122P036J41507
$$ 71886 -147274 -31877 49742 52264 -52444 -78085 -26039 -176381 -245503 -238467 -96960
2759i6960p9918J4374K4393k0728p9995m9588J43782m6039J06191Q6178j50881
$$ -96960 -176878 -162504 -138111 -158839 -238834 -288422 -144640 -190679 -84488 1690 -149191
2748a49191Q416O5268j19147M322M3586j77140N8657J46385j80914O4033J52850
$$ -149191 -140775 -75507 -194654 -190332 -146746 -323886 -265229 -118844 -299758 -235725 -82875
2737h2875J67515q4016k39291P8603K1915o8612Q7819k85764l3522j19521k4592
$$ -82875 84640 624 -238667 -160064 -138149 -206761 -118942 -404706 -438228 -557749 -582341
2726e82341J90490N0396J84754p2735J36413n1057P490j9215K09506k57800j95523
$$ -582341 -391851 -341455 -156701 -229436 -93023 -144080 -136590 -155805 53701 -204099 -399622
2715c99622J83960N034K054j20283O9439J04366Q6520K807P0785j09769L657J1477
$$ -399622 -215662 -210628 -208574 -328857 -259418 -155052 -68532 -65725 5060 -104709 -101052 -89575
2703h9575n0455Q4697j42712l1489o550J10285M9950J6389K55389N9101k90992
$$ -89575 -140030 -55333 -198045 -229534 -236084 -125799 -75849 -59460 195929 255030 -35962
2692c5962j19785J21260J4145k1710p6086j14135J48958R4657j46317O5843p2716
$$ -35962 -155747 -34487 -20342 -42052 -118138 -232273 -83315 11342 -134975 -69132 -141848
2681a41848J24822n6155J773J0962l019j13548L8152r9055K5279M6613k0255O1238
$$ -141848 -17026 -73181 -71408 -60446 -63465 -177013 -138861 -237916 -212637 -166024 -186279 -125041
2669a25041j05015j23808K32049j5402q4591N5252q7514l0195r5743M0145K39873
$$ -125041 -230056 -353864 -121815 -137217 -221808 -166556 -254070 -284265 -380008 -339863 -99990
2658i9990j63736l5173J14047J88993J306k35202J41571M1030o3276O9912Q5203
$$ -99990 -263726 -298899 -184852 4141 5447 -229755 -88184 -47154 -110430 -40518 44685
2647D4685K474M9936q5920j13260j82494r3629K8144J38680P5534J0747j09164
$$ 44685 47159 97095 11175 -102085 -284579 -378208 -350064 -211384 -135850 -125103 -234267
2636b34267K39284l5703j58287K014k2509k663K24970J44553k04653q9292K0194
$$ -234267 5017 -30686 -188973 -186959 -209468 -212131 12839 157392 -47261 -136553 -116359
2625a16359K22090o1463Q9539k39685l6631J54929j1245m5932j45276J60720r4657
$$ -116359 105731 44268 133807 -105878 -142509 12420 1175 -44757 -190033 -29313 -123970
2614a23970j06098j2473P4135k65061l0284J27763J84860J41294q1511j51617
$$ -123970 -230068 -242541 -168406 -433467 -463751 -335988 -151128 -9834 -91345 -242962
2604b42962j65950J15307J59337J40396Q2889p664J5503j97818K1467K52487k3184
$$ -242962 -408912 -293605 -134268 6128 89017 81353 96856 -100962 -79495 172992 149808
2593A49808L4760k84918j01470P0408L4841O9318j39571J14749M7773p7422j62953
$$ 149808 184568 -100350 -201820 -131412 -96571 -27253 -166824 -52075 -4302 -81724 -244677
2582b44677j91769N1733Q3251n5955O4611M3171M950J97067L2946j21543K50028
$$ -244677 -436446 -384713 -301462 -357417 -292806 -249635 -244685 -47618 -14672 -136215 113813
2571A13813j8914j70176k14140R0348O5337J31477P8091j18701P3099L8941j13001
$$ 113813 94899 -75277 -289417 -199069 -133732 -2255 75836 -42865 30234 69175 -43826
2560d3826l3757j36646j73416J77806K4699r563m6381j8550J51070O5516r6048
$$ -43826 -77583 -214229 -387645 -209839 -185140 -194703 -241084 -259634 -108564 -43048 -139096
2549a39096o0089q8666j17261L7672J07684K6154m3729J79802o4640J68521j26671
$$ -139096 -199185 -287851 -405112 -367440 -259756 -233602 -277331 -97529 -162169 6352 -120319
2538a20319l23033J72744J75490J17380j30330o4346p5824Q0553K10154o8037
$$ -120319 -443352 -270608 -95118 22262 -108068 -172414 -248238 -167685 42469 -25568
2528b5568j1130J9556R0717j5526j91646r8661Q4706p1326o5423K4070K17405
$$ -25568 -36698 -17142 73575 58049 -133597 -232258 -147552 -218878 -284301 -260231 -42826
2517d2826l733n0566j51601J5268Q5496k87772J50691j6152K85105o8173J14046
$$ -42826 -46559 -97125 -248726 -233458 -147962 -435734 -285043 -301195 -16090 -84263 29783
2506B9783j75845j27911J73604j03043r5374N68O2677k5224L3295O0556n1836
$$ 29783 -146062 -273973 -100369 -203412 -298786 -298218 -235541 -260765 -227470 -166914 -218750
2495b18750m0688K27634j63912k4446J30218J422J33130o6862l0176L7629J79530
$$ -218750 -259438 -31804 -195716 -220162 -89944 -88522 44608 -22254 -52430 -14801 164729
2484A64729l9239k4692q944j68773J10547r062k1999m7343R1986j53013L1072
$$ 164729 125490 100798 91854 -76919 33628 24566 2567 -44776 47210 -105803 -74731
2473g4731J87518j16857Q5744r9995k2763N0754r9644j22980j09292J03389J03840
$$ -74731 112787 -4070 81674 -18321 -41084 9670 -89974 -212954 -322246 -218857 -115017
2462a15017j10793l361J10840j09705m045Q4961J25133j42262k2991L8418j64835
$$ -115017 -225810 -229171 -118331 -228036 -232081 -147120 -21987 -164249 -187240 -148822 -313657
2451c13657J63991n7262J95401l8223j38445L8345n469O947n5935j49397R9278
$$ -313657 -149666 -206928 -11527 -49750 -188195 -149850 -155319 -148372 -204307 -353704 -254426
2440b54426O056L758M1289K38090R1826j67748M7861N3594k21294q0148K11462
$$ -254426 -248370 -244612 -203323 34767 126593 -41155 6706 60300 -160994 -241142 -29680
2429b9680m0780j06846n7978J47150J93390n1597l5802J15645R148j32549R7302
$$ -29680 -70460 -177306 -235284 -88134 105256 53659 17857 133502 142650 10101 107403
2418A07403O158k59850m2674l1379j8581P5623j6444l5098K1653L5213R0985J15313
$$ 107403 113561 -146289 -188963 -220342 -238923 -163300 -179744 -214842 -193189 -157976 -66991 48322
2406D8322J75275k59157j60704O337O1263Q9958j7565j81474J38602K84907k07218
$$ 48322 223597 -35560 -196264 -189927 -128664 -38706 -56271 -237745 -99143 185764 -21454
2395b1454k9762R2952k44624j34440J10196M7091O4610j29666l449O3583j16812
$$ -21454 -51216 41736 -202888 -337328 -227132 -180041 -115431 -245097 -248546 -184963 -301775
2384c01775o4014J67645K63601k4409L0244L9740m7391o448q7933L4294Q6678
$$ -301775 -365789 -198144 65457 41048 71292 111032 63641 57193 -30740 3554 90232
2373I0232l187l6555j92526R4973J59665j20452R2088P4918J79258j65333r6502
$$ 90232 87045 50490 -142036 -47063 112602 -7850 84238 159156 338414 173081 76579
2362G6579J04996J11650NJ02975l8141k74287N1721j39341k3180n8892N832j46379
$$ 76579 181575 293225 293230 396205 358064 83777 135498 -3843 -27023 -85915 -80083 -226462
2350b26462j4053K09177j03830J49942J61559j25658q6000L9506Q2822l5292k599
$$ -226462 -240515 -31338 -135168 14774 176333 50675 -35325 4181 87003 51711 49112
2339D9112j24905J57883j68809j54895J14189J30807l0550j09513q0475L09109
$$ 49112 -75793 82090 -86719 -241614 -127425 3382 -27168 -136681 -217156 91953
2329I1953M9299j17923k20061N5068K00686J8763M6319k26882O33Q1090R6412
$$ 91953 141252 23329 -196732 -141664 59022 77785 124104 -102778 -102145 -21055 75357
2318G5357r9984j02130m9513K6711R7813N1169J37286j19894k2650p9152l5635
$$ 75357 -24627 -126757 -176270 -149559 -51746 -577 136709 16815 -5835 -84987 -120622
2307a20622P9855J3917J18206n5084j92076J48185J47382r7222j53403J0006J70148
$$ -120622 -40767 -26850 91356 36272 -155804 -7619 139763 42541 -110862 -100856 69292
2296F9292m9873p883o2297K7223j4312p9385J5099r3208N0251J84015j2204L6095
$$ 69292 19419 11536 -50761 -23538 -37850 -117235 -102136 -195344 -145093 38922 26718 62813
2284F2813r2906K1544O2966K7217m0296l5175k1405q978J68199L9725l2413O2814
$$ 62813 -30093 -8549 54417 81634 41338 6163 -15242 -24220 143979 183704 151291 214105
2272B14105J28368j98593j48050j66923P7569j1992j05966R4763K79720O1897
$$ 214105 342473 143880 -4170 -171093 -93524 -105516 -211482 -116719 163001 224898
2262B24898k78104r6251J13297K06673n3683j8702q4076J19353J23424r9855j04113
$$ 224898 -53206 -149457 -36160 170513 116830 98128 14052 133405 256829 156974 52861
2251E2861R2480r2944K32826K1976j95096r0334J14738O7077l2369j5257p1392
$$ 52861 145341 52397 285223 307199 112103 21769 136507 203584 171215 155958 84566
2240H4566K04573o5936o8219n1190O7376J41769j15704r3495j68820J74649J92412
$$ 84566 289139 223203 154984 103794 171170 312939 197235 103740 -65080 109569 301981
2229C01981L6188L101O7263r1606j36684j9983Q473J40819j2691N9370l0555o0277
$$ 301981 338169 341270 408533 316927 180243 160260 168733 309552 296861 356231 325676 265399
2217B65399j1066J19105k14410K5007K40076j37885J19496o7617L5968p4066N3118
$$ 265399 254333 373438 159028 184035 424111 286226 405722 338105 374073 300007 353125
2206C53125O9039m3079j36326l6268J28155P125M283Q5791N0826k01821J49831
$$ 353125 422164 379085 242759 206491 334646 341771 346054 431845 482671 280850 430681
2195D30681N7792j21814J33383K1250q9899p411J23643Q0411J23547j52029K1836
$$ 430681 488473 366659 500042 521292 431393 423982 547625 628036 751583 599554 621390
2184F21390J1355K9254L2688L473R1800Q7890q8857N9315P8656J36923J5242L5749
$$ 621390 632745 661999 694687 698160 789960 877850 788993 848308 926964 1063887 1079129 1114878
2172A114878R356n7003J59732J72211K03176j10557M471M13R6529J06099K4729
$$ 1114878 1124234 1067231 1226963 1399174 1602350 1491793 1496264 1496677 1593206 1699305 1724034
2161A724034l1312j3376P2243J68218J28677L2363m595j564L4334L4891k0049
$$ 1724034 1692722 1679346 1751589 1919807 2048484 2080847 2076252 2074688 2109022 2143913 2123864
2150B123864J4038L33543P9084j6935J84362o5297N7566K28050K6205R0754M8641
$$ 2123864 2137902 2471445 2550529 2533594 2717956 2652659 2710225 2938275 2964480 3055234 3103875
2139C103875J06183J8788J87885R52M3984K99766K15446Q0282q704L85651L75947
$$ 3103875 3210058 3228846 3416731 3417683 3461667 3761433 3976879 4057161 4048457 4434108 4810055
2128D810055J41789J36628J66502J14277K95649J70467M02985M40299R2287K58037
$$ 4810055 4951844 5088472 5254974 5369251 5664900 5835367 6238352 6678651 6770938 7028975
2118G028975M41636M16596P79010N32976Q17581O47064Q42255J015577J324551
$$ 7028975 7470611 7887207 8666217 9199193 10016774 10663838 11506093 12521670 13846221
2109A3846221J736354J266298J422980J212124J588878K171080K679627L364412
$$ 13846221 15582575 16848873 18271853 19483977 21072855 23243935 25923562 29287974
2101B9287974L654308M272560M774947O090551P145811J0061834J2812163J5174848
$$ 29287974 32942282 37214842 41989789 48080340 55226151 65287985 78100148 93274996
2093I3274996J820568j0009057j5223916j6776772j1345939p909004n266760m157174
$$ 93274996 95095564 85086507 69862591 53085819 41739880 33830876 28564116 24406942
2085B4406942l045134k341083j582824j578629j025447q00079n63686q26505p88283
$$ 24406942 21361808 19020725 17437901 15859272 14833825 14033746 13470060 12643555 11855272
2076A1855272q21511p76085p52699n65642p79871l74316n44138n38322m20425
$$ 11855272 11033761 10257676 9504977 8939335 8159464 7785148 7241010 6702688 6282263
2067F282263j65669l76957m89198k54253j40598l02493j13753l34467J10881j27864
$$ 6282263 6116594 5739637 5250439 4996186 4855588 4553095 4439342 4104875 4215756 4087892
2057D087892l05734j19737j17152k16017j23370j98206m2006q498j16913j68226
$$ 4087892 3782158 3662421 3545269 3329252 3205882 3007676 2965670 2957172 2840259 2672033
2047B672033j12694m9527N6004k03653j05271j81731j93314R0680K45169k6248
$$ 2672033 2559339 2509812 2565816 2362163 2256892 2075161 1881847 1972527 2217696 2191448
2037B191448n1795n9158N4036j185j78409k49360J11210j22131o4403J088j9832
$$ 2191448 2139653 2080495 2134531 2133346 1954937 1705577 1816787 1694656 1630253 1631341 1611509
2026A611509N3481m7166k05172k38103L7998J45119L9682o577j95409O1290P8465
$$ 1611509 1664990 1617824 1412652 1174549 1212547 1357666 1397348 1390771 1195362 1256652 1335117
2015A335117j67470r6696J1293k6069J4704N945k09236J71286j12898l7462k17489
$$ 1335117 1167647 1070951 1082244 1056175 1070879 1076824 867588 1038874 925976 888514 671025
2004F71025K10676L353K3476Q4788j60681M222m7549l5382o6695o0092j49818
$$ 671025 881701 885054 908530 993318 832637 836859 789310 753928 687233 627141 477323
1993D77323N4955L2561J63920k2415j58087J27689j26928K8063P4605J26884m6523
$$ 477323 532278 564839 728759 706344 548257 675946 549018 577081 651686 778570 732047
1982G32047k04899k4899j83136J06557Q5361j40339n2618j4094O0405P5819P015
$$ 732047 527148 502249 319113 425670 511031 370692 318074 303980 364385 440204 447219
1971D47219j19507K3033m7880j62663j88983M10207J25001j9232j3034j01667
$$ 447219 327712 350745 302865 140202 -48781 361426 486427 467195 454161 352494
1961C52494N6228j49132j16840M0289Q7065p7209n8083J29458J74674J63518j13861
$$ 352494 408722 259590 142750 183039 270104 192895 134812 264270 438944 602462 488601
1950D88601j39699k07325J00909O2727j82481M335J36958J12336M2563q4127L2255
$$ 488601 348902 141577 242486 305213 122732 127067 264025 376361 418924 334797 367052
1939C67052N8408j70293k3668j66637j10121j14257K3184R9593J82593l5341o9533
$$ 367052 425460 255167 231499 64862 -45259 -159516 -136332 -36739 145854 110513 40980
1928D0980J68680j56164M6567J13035l89064j8456K48931l3252r983R7636j08756
$$ 40980 209660 53496 100063 213098 -175966 -194422 54509 21257 11274 108910 154
1917A54N1341M6646j21797q6733R7966K32532O5635k50626k66703P292J04592
$$ 154 51495 98141 -23656 -110389 -12423 220109 285744 35118 -231585 -224293 -119701
1906a19701J87456R1298j59299j48192K97091k6726j76723J13491M7019j03425
$$ -119701 67755 159053 -246 -148438 148653 121927 -54796 58695 105714 2289
1896B289Q5169l9043N5859M0683O9654k91054J24316O7808k12885q954J26305
$$ 2289 87458 48415 104274 144957 214611 -76443 47873 115681 -97204 -106158 20147
1885B0147O984R8357m696k59402K48499j12783O7152J78985k5580j58950l7677
$$ 20147 27131 125488 120792 -138610 109889 -2894 64258 243243 217663 58713 21036
1874B1036J5508l2410K4700O7616r1939N688N2064j61085J22472r3431M3786j11335
$$ 21036 36544 4134 28834 96450 4511 10199 62263 -98822 23650 -69781 -25995 -137330
1862a37330M0861P2475k1489j06913Q1234R7397p6312P1905j63247O0390J64681
$$ -137330 -96469 -23994 -45483 -152396 -71162 26235 -50077 21828 -141419 -81029 83652
1851H3652k2250J47650M5642k35753o386o6059M9203J20516R7618j93536j88949
$$ 83652 61402 209052 254694 18941 12555 -53504 -4301 116215 213833 20297 -168652
1840a68652J81825R4278R2460k98013J37616J10977K3484M5229q4579j24260O6610
$$ -168652 13173 107451 199911 -98102 39514 150491 173975 219204 134625 10365 76975
1829G6975P4255J044O2536J89961J26805k17851K4973m7878j19417j56955J65480
$$ 76975 151230 152274 214810 404771 531576 313725 338698 290820 171403 14448 179928
1818A79928o3475q2467o3898k4380K20562k2961m6986j46465j46339J08220J42514
$$ 179928 116453 33986 -29912 -54292 166270 143309 96323 -50142 -196481 -88261 54253
1807E4253J07451o0143k8548K2019J83428j66744M4607k61531J13597K80215L7865
$$ 54253 161704 101561 73013 95032 278460 111716 156323 -105208 8389 288604 326469
1796C26469l06458k47479J36210J72399q3917m3891P8954l9432j05653Q5570j42069
$$ 326469 20011 -227468 -91258 81141 -2776 -46667 32287 -7145 -112798 -27228 -169297
1785a69297K7498N0416n2082L6566O3611n0534J0513o2245J40831O5701L6290
$$ -169297 -141799 -91383 -143465 -106899 -43288 -93822 -83309 -145554 -4723 60978 97268
1774I7268l0223j09575j32817k55091K00546Q2422O4008j61534J70057J62671
$$ 97268 67045 -42530 -175347 -430438 -229892 -147470 -83462 -244996 -74939 87732
1764H7732k05443O52o2276L8992j27954J58553j06131j53292K41496O2610K44264
$$ 87732 -117711 -117059 -179335 -140343 -268297 -109744 -215875 -369167 -127671 -65061 179203
1753A79203M9463k09585k6883N4167k7496m0120N6984n8816m6619L13985n7716
$$ 179203 228666 19081 -7802 46365 18869 -21251 35733 -23083 -69702 244283 186567
1742A86567j96977j37243O2881j94133K40246L1616k60906J33840P6237l2277
$$ 186567 -10410 -147653 -84772 -278905 -38659 -7043 -267949 -134109 -57872 -90149
1732i0149k5441j0959m7427J18428J35227P4309o2965j73437K7670K5665J3398
$$ -90149 -115590 -126549 -173976 -55548 79679 153988 91023 -82414 -54744 -29079 -15681
1721a5681K2281j10223N8062j7289K5127J49050Q8193k34632j75502O3537J27392
$$ -15681 6600 -103623 -45561 -62850 -37723 111327 199520 -35112 -210614 -147077 -19685
1710a9685j16599j58685K51866m5716O6730j28483K2870J14701J67292k53303
$$ -19685 -136284 -294969 -43103 -88819 -22089 -150572 -127702 -13001 154291 -99012
1700i9012k4794L5162O0323N0969j61005n2887O2508m5529m1982j1757M0049J52697
$$ -99012 -123806 -88644 -28321 22648 -138357 -191244 -128736 -174265 -216247 -228004 -187955 -35258
1688c5258M6670k3293j42270J8063j8196J17610k9707p9134J92527j46895M7302
$$ -35258 11412 -11881 -154151 -136088 -154284 -36674 -66381 -145515 47012 -99883 -52581
1677e2581m6455P1351m8403N3103K3575o3176j3666m4030J230J59688k16584q8524
$$ -52581 -99036 -27685 -76088 -22985 590 -62586 -76252 -120282 -119052 40636 -175948 -264472
1665b64472K31285l1482r5038N7639K49783q1406J00278q9538j71542R0311j75603
$$ -264472 -33187 -64669 -159707 -102068 147715 66309 166587 77049 -94493 -4182 -179785
1654a79785p9087J03481J70748L5883O2742n0345p097q7813k00451J47419n8037
$$ -179785 -258872 -155391 15357 51240 113982 63637 56540 -31273 -231724 -84305 -142342
1643a42342l8280K7356J18629Q4500q1740P230J81052j87465J69963p5546k36914
$$ -142342 -180622 -153266 -34637 49863 -31877 -24647 156405 -31060 138903 63357 -173557
1632a73557K36442q968j491j70605j77766R4103Q8933J69295m9796j90600J78368
$$ -173557 62885 53917 52426 -118179 -295945 -201842 -112909 56386 6590 -184010 -5642
1621e642p5998k65186J22668j9916J45686N3419J04592J5164j84312l3378K36802
$$ -5642 -81640 -346826 -224158 -244074 -98388 -44969 59623 74787 -109525 -142903 93899
1610I3899k4047j2272k43700n3560J73660p3749J92550j8046j06733j8542j01042
$$ 93899 69852 57580 -186120 -239680 -66020 -139769 52781 34735 -71998 -90540 -191582
1599a91582j8143q0580J46584L0465N5656J51705j16043k20831J71611Q0284q4775
$$ -191582 -209725 -290305 -143721 -113256 -57600 94105 -21938 -242769 -71158 9126 -75649
1588g5649J25824k1881Q089J30223k17055J52331j3902L6755p8064j95623L4310
$$ -75649 50175 28294 36383 166606 -50449 101882 87980 124735 46671 -148952 -114642
1577a14642J30390L9564k04619J00868j2663o7660K325j7009J43895N9270j63080
$$ -114642 15748 55312 -149307 -48439 -61102 -128762 -126437 -143446 449 59719 -103361
1566a03361K7030L7580Q022N3763k1985J31516j36947J3230K0147k38817K02327
$$ -103361 -76331 -38751 -30729 23034 1049 132565 -4382 8848 28995 -209822 -7495
1555g495j61317J6608M845l4730L5346M7277J51053q7327J28420n7435k695r5601
$$ -7495 -168812 -152204 -147359 -182089 -146743 -99466 51587 -35740 92680 35245 32550 -63051
1543f3051O313L7761M0154j127j30018j11052j07328K9767J74737L2199m4323
$$ -63051 -56738 -18977 21177 20050 -109968 -221020 -328348 -298581 -123844 -91645 -135968
1532a35968o0533N928O5976J10378Q5634j83597O2183l7689J63890p5516R8934
$$ -135968 -196501 -190573 -124597 -14219 71415 -112182 -49999 -87688 76202 686 99620
1521I9620R2885l07837J35299Q9415m0522j34533R6741P2066j86498R3065k62064
$$ 99620 192505 -115332 19967 109382 68860 -65673 31068 103134 -83364 9701 -252363
1510b52363K87543J03660k60019M1394J70230R0648j04899j35594j02073K1801
$$ -252363 35180 138840 -121179 -79785 90445 181093 76194 -59400 -161473 -139672
1500a39672q445j2782O3589J44682j5146o4328J89372p5195J8125O1132k1654
$$ -139672 -148117 -160899 -97310 47372 32226 -32102 157270 82075 100200 161332 139678
$$ [...]
##END NTUPLES=NMR SPECTRUM
##END=
