##TITLE=1H_EC-3029(VII-22-1)
 CDCl3
 108 sc, 
 25.07.2022
##JCAMPDX= 6.0         $$ Bruker NMR JCAMP-DX V2.0
##DATA TYPE= NMR SPECTRUM
##DATA CLASS= NTUPLES
##ORIGIN= UXNMR, Bruker Analytische Messtechnik GmbH
##OWNER= root
$$ XWIN-NMR		Version 3.5
$$ Mon Jul 25 14:18:48 2022 Russian Standard Time (UT+4h)  she@DPX200
##.OBSERVE FREQUENCY= 200.1313499994
##.OBSERVE NUCLEUS= ^1H
##.ACQUISITION MODE= SIMULTANEOUS
##.ACQUISITION SCHEME= undefined
##.AVERAGES= 108
##.DIGITISER RES= 18
##SPECTROMETER/DATA SYSTEM= spect
##.PULSE SEQUENCE= zg30
##.SOLVENT NAME= CDCl3
##.SHIFT REFERENCE= (INTERNAL, CDCl3, 0, 15.7337)
##AUDIT TRAIL= $$ (NUMBER, WHEN, WHO, WHERE, WHAT)
$$ ##TITLE= Audit trail, XWIN-NMR		Version 3.5
$$ ##JCAMPDX= 5.01
$$ ##ORIGIN= Bruker BioSpin GmbH
$$ ##OWNER= she
$$ F:/spectra/data/she/nmr/H-F/1/pdata/1/auditp.txt
$$ ##AUDIT TRAIL=  $$ (NUMBER, WHEN, WHO, WHERE, WHAT)
(   1,<2022-07-25 14:17:15.89 +0400>,<she>,<DPX200>,
      <continue with go, POWCHK disabled, PULCHK disabled
       configuration hash MD5:
       00 E9 B6 7A A2 85 ED C7 34 08 36 98 17 FE 4E 26
       data hash MD5: 16K
       D5 07 09 AD 98 FE 25 E2 2C 34 21 6E 88 7B 51 0B>)
(   2,<2022-07-25 14:17:18.35 +0400>,<she>,<DPX200>,
      <Start of raw data processing
       efp BC_mod = 2 LB = 0.24 FT_mod = 6 PKNL = 1 PHC0 = -18035.83 PHC1 = 9.00068 SI = 16K 
       data hash MD5: 16K
       8A 83 ED 28 FC D7 51 73 6B 30 AE 34 09 27 37 1F>)
(   3,<2022-07-25 14:17:23.37 +0400>,<she>,<DPX200>,
      <abs ABSG = 5 
       data hash MD5: 16K
       10 4A 2B A2 E6 A8 7D 2C 49 0A 41 99 C3 C5 9D F0>)
(   4,<2022-07-25 14:17:44.45 +0400>,<she>,<DPX200>,
      <pk PHC0 = -1.052917 PHC1 = -1.399999 
       data hash MD5: 16K
       9D 97 21 34 D7 8E D2 C1 6A 8B 2A A4 6E 74 C3 38>)
(   5,<2022-07-25 14:17:47.82 +0400>,<she>,<DPX200>,
      <abs ABSG = 5 
       data hash MD5: 16K
       3A 94 BB D3 E3 08 76 D5 55 FC DC 9D 14 B7 FF 30>)
$$ ##END=
$$ 
$$ hash MD5
$$ 80 21 EF E6 70 75 E5 D0 2E 97 DB FA 35 73 46 B5
##$RELAX= 
##$RELAX= 
##$RELAX= 
##$RELAX= 
##$RELAX= 
##$RELAX= 
$$ Bruker specific parameters
$$ --------------------------
##$DU= <F:/spectra>
##$EXPNO= 1
##$NAME= <H-F>
##$PROCNO= 1
##$TYPE= <nmr>
##$USER= <she>
##$AMP= (0..31)
100 100 100 100 100 100 100 100 100 100 100 100 100 100 100 100 100 100 
100 100 100 100 100 100 100 100 100 100 100 100 100 100 
##$AQSEQ= 0
##$AQ_mod= 1
##$AUNM= <au_zg>
##$AUTOPOS= <>
##$BF1= 200.13
##$BF2= 200.13
##$BF3= 200.13
##$BF4= 200.13
##$BF5= 200.13
##$BF6= 200.13
##$BF7= 200.13
##$BF8= 200.13
##$BYTORDA= 1
##$CFDGTYP= 0
##$CFRGTYP= 5
##$CHEMSTR= <none>
##$CNST= (0..31)
1 1 145 1 1 1 1 1 1 1 1 1 1 1 1 1 1 1 1 1 1 1 1 1 1 1 1 1 1 1 1 1 
##$CPDPRG= <>
##$CPDPRG1= <>
##$CPDPRG2= <>
##$CPDPRG3= <>
##$CPDPRG4= <mlev>
##$CPDPRG5= <mlev>
##$CPDPRG6= <mlev>
##$CPDPRG7= <mlev>
##$CPDPRG8= <mlev>
##$CPDPRGB= <>
##$CPDPRGT= <>
##$D= (0..31)
0 1.2 0 0 0 0 0 0 0 0.06 0 0.03 0 0 0 0 0.0002 0 0 0 0 0 0 0 0 0 0 0 0 
0 0 0 
##$DATE= 1658743857
$$ [...]
##$SUBNAM2= <"">
##$SUBNAM3= <"">
##$SUBNAM4= <"">
##$SUBNAM5= <"">
##$SUBNAM6= <"">
##$SUBNAM7= <"">
##$SUBNAM8= <"">
##$SUBNAM9= <"">
##$SW= 18.0517283424941
##$SWIBOX= (0..15)
0 0 2 0 0 0 0 0 0 0 0 0 0 0 0 0 
##$SW_h= 3612.71676300578
##$TD= 16384
##$TD0= 1
##$TE= 0
##$TE2= 300
##$TE3= 300
##$TEG= 300
##$TL= (0..7)
0 120 120 120 120 120 120 120 
##$TP= (0..7)
150 150 150 150 150 150 150 150 
##$TP07= 0
##$TPNAME0= <>
##$TPNAME1= <>
##$TPNAME2= <>
##$TPNAME3= <>
##$TPNAME4= <>
##$TPNAME5= <>
##$TPNAME6= <>
##$TPNAME7= <>
##$TPOAL= (0..7)
0.5 0.5 0.5 0.5 0.5 0.5 0.5 0.5 
##$TPOFFS= (0..7)
0 0 0 0 0 0 0 0 
##$TUNHIN= 0
##$TUNHOUT= 0
##$TUNXOUT= 0
##$USERA1= <user>
##$USERA2= <user>
##$USERA3= <user>
##$USERA4= <user>
##$USERA5= <user>
##$V9= 5
##$VALIST= <valist>
##$VCLIST= <CCCCCCCCCCCCCCC>
##$VD= 0
##$VDLIST= <DDDDDDDDDDDDDDD>
##$VPLIST= <PPPPPPPPPPPPPPP>
##$VTLIST= <TTTTTTTTTTTTTTT>
##$WBST= 1024
##$WBSW= 4
##$XGAIN= (0..3)
0 0 0 0 
##$XL= 0
##$YL= 0
##$YMAX_a= 445702
##$YMIN_a= -784606
##$ZGOPTNS= <>
##$ZL1= 120
##$ZL2= 120
##$ZL3= 120
##$ZL4= 120
##$ABSF1= 15.74469
##$ABSF2= -2.307159
##$ABSG= 5
##$ABSL= 3
##$ALPHA= 0
##$AQORDER= 0
##$ASSFAC= 0
##$ASSFACI= 0
##$ASSFACX= 0
##$ASSWID= 0
##$AUNMP= <proc_1d>
##$AZFE= 0.1
##$AZFW= 0.1
##$BCFW= 0
##$BC_mod= 2
##$BYTORDP= 0
##$COROFFS= 0
##$CY= -3
##$DATMOD= 1
##$DC= 0
##$DFILT= <>
##$DTYPP= 0
##$F1P= 0
##$F2P= 0
##$FCOR= 1
##$FTSIZE= 16384
##$FT_mod= 6
##$GAMMA= 0
##$GB= 0
##$INTBC= 1
##$INTSCL= 0
##$ISEN= 128
##$LB= 0.24
##$LEV0= 0
##$LPBIN= 0
##$MAXI= 10000
##$MC2= 0
##$MEAN= 0
##$ME_mod= 0
##$MI= 1.114404
##$NCOEF= 0
##$NC_proc= -5
##$NLEV= 6
##$NOISF1= 3.799351
##$NOISF2= 2.8
##$NSP= 0
##$NTH_PI= 0
##$NZP= 0
##$OFFSET= 15.73367
##$PC= 1
##$PHC0= -18036.88
##$PHC1= 7.600681
##$PH_mod= 1
##$PKNL= yes
##$PPARMOD= 0
##$PSCAL= 0
##$PSIGN= 0
##$REVERSE= no
##$SF= 200.130007579773
##$SI= 16384
##$SIGF1= 3
##$SIGF2= 2
##$SINO= 5.538805
##$SIOLD= 16384
##$SREGLST= <1H.CDCl3>
##$SSB= 0
##$STSI= 16384
##$STSR= 0
##$SW_p= 3612.71676300578
##$SYMM= 0
##$S_DEV= 0
##$TDeff= 16384
##$TDoff= 0
##$TI= <>
##$TILT= no
##$TM1= 0
##$TM2= 0
##$TOPLEV= 0
##$USERP1= <user>
##$USERP2= <user>
##$USERP3= <user>
##$USERP4= <user>
##$USERP5= <user>
##$WDW= 1
##$XDIM= 16384
##$YMAX_p= 332024393
##$YMIN_p= -700023
$$ End of Bruker specific parameters
$$ ---------------------------------
##NTUPLES= NMR SPECTRUM
##VAR_NAME=  FREQUENCY,     SPECTRUM/REAL,   SPECTRUM/IMAG
##SYMBOL=    X,             R,               I
##VAR_TYPE=  INDEPENDENT,   DEPENDENT,       DEPENDENT
##VAR_FORM=  AFFN,          ASDF,            ASDF
##VAR_DIM=   16384,         16384,           16384
##UNITS=     HZ,            ARBITRARY UNITS, ARBITRARY UNITS
##FACTOR=    0.220516191357247, 1,           1
##FIRST=     3148.77954332419, 0,            0
##LAST=      -463.937219681588, 0,           0
##MIN=       -463.937219681588, -700023,     0
##MAX=       3148.77954332419, 332024393,    0
$$ Real data points
##PAGE= N=1
##DATA TABLE= (X++(R..R)), XYDATA
$$ [...]
5026B3052717j535692j194015j036647j084832m98886o45579r11120p90589m75794
5017A4879563n43283o07940l04660j78797j97837j07733k8434J0519k37393M0935
5007A2724940j75438j43125J9572M8006R7461j11331J61787p4436j26638j90472
4997A2230326m73289l08052l51321m10651j14769J51935K7105j72222j31381M5598
4987A0493279L3634j62675k46309j16055O2783M3338J64356j48998J75944r8112
4977A0201185M6848J71294K68485N2687Q9548K56238K54879L86990J59673r8273
4967A1789554j28526l95536k03099k88379j46766j6340m958K74252n0144m6377
4957A0783681J38363K4611J59314r927J72840Q0662J29918N4041J3245M92055
$$ y = [23052717, 21517025, 20323010, 19286363, 18201531, 17702645, 17057066, 16145946, 15355357, 14879563, 14336280, 13728340, 13423680, 13244883, 13047046, 12939313, 12910879, 12921398, 12684005, 12724940, 12549502, 12406377, 12425949, 12473955, 12571416, 12460085, 12621872, 12547436, 12420798, 12230326, 11757037, 11448985, 11097664, 10687013, 10572244, 10724179, 10751284, 10579062, 10447681, 10493279, 10526913, 10364238, 10117929, 10001874, 10064657, 10107995, 10272351, 10123353, 10299297, 10201185, 10248033, 10419327, 10687812, 10740499, 10830047, 11086285, 11341164, 11728154, 11887827, 11789554, 11661028, 11265492, 11062393, 10774014, 10627248, 10610908, 10605950, 10880202, 10830058, 10783681, 10922044, 10946655, 11105969, 11096042, 11268882, 11349544, 11479462, 11533503, 11546748, 12038803]
4947A2038803K55969n244K40035J57973K33977K58505J27343K10168N05173N55612
4937A4578314N45385M64760L31486L86663K2911j724R4507M40360M04269M96244
4927A7763175N95452P16385Q53583J367950J401982J353812J452322J076948P98082
4918B7379691L91121M93793Q95693J422593K215444K555807K656561J297217m93851
4909C8814069j883549k347306k006856j289509p84640q52974r80750o48830o09682
4900B7409973o69387r73774j303061j492142j259091j106123p95085k48015m26338
4891A9136957l53968n00441m51154k58425k86913l41658k14232k83558k51550
4882A6195058j32873Q4052O1827k5690J66721L44077N07122N37807L00049J22753
$$ y = [12038803, 12294772, 12289528, 12529563, 12687536, 12921513, 13180018, 13307361, 13517529, 14022702, 14578314, 15123699, 15588459, 15919945, 16306608, 16329519, 16327795, 16422302, 16862662, 17266931, 17763175, 18358627, 19075012, 19928595, 21296545, 22698527, 24052339, 25504661, 26581609, 27379691, 27770812, 28264605, 29160298, 30582891, 32798335, 35354142, 38010703, 39307920, 38814069, 36930520, 34583214, 32576358, 31286849, 30502209, 29649235, 28668485, 28019655, 27409973, 26740586, 25766812, 24463751, 22971609, 21712518, 20606395, 19811310, 19563295, 19136957, 18782989, 18282548, 17831394, 17572969, 17286056, 16944398, 16730166, 16446608, 16195058, 16062185, 16146237, 16208064, 16182374, 16349095, 16693172, 17200294, 17738101, 18038150, 18160903]
4872A8160903l6821m9070j10947j25093l6197Q7718n0287j42335J39314J36177
4862A7973362J67101M09917N54932O12429O31568R46088Q27028M14410N37981
4853B3074816M18963J79959k51908l48904l74011o46514k87801o9051P6225P16239
4843B2488013P42152O35344R39032J002746R06037O72288n1383o18181q50432
4834B5865616q32258m51831j84315N8187K60181J41735M33183M75560J006105
4825B6772163J225940J405357J828028J943530K340769K066980J202725R7322
4817C8882814j110056k082320k494343k643729k196733j852434j238771q35758
4809B4428670p42458o89451p13931p69665o24200l33079p8957j5646j19864P7610
$$ y = [18160903, 18124082, 18075012, 17964065, 17838972, 17802775, 17890493, 17840206, 17697871, 17837185, 17973362, 18140463, 18550380, 19105312, 19717741, 20349309, 21295397, 22122425, 22536835, 23074816, 23493779, 23673738, 23421830, 23072926, 22698915, 22052401, 21764600, 21695549, 21771774, 22488013, 23230165, 23865509, 24804541, 25807287, 26713324, 27385612, 27334229, 26716048, 25865616, 25033358, 24581527, 24397212, 24455399, 24715580, 24857315, 25290498, 25766058, 26772163, 27998103, 29403460, 31231488, 33175018, 35515787, 37582767, 38785492, 38882814, 37772758, 35690438, 33196095, 30552366, 28355633, 26503199, 25264428, 24428670, 23686212, 22996761, 22282830, 21513165, 20888965, 20555886, 20476929, 20461283, 20341419, 20419029]
4799B0419029L41130L18433M85799O02277P14828M18223J50141N1817j66337j92493
4789B3142847R0909J10805M92710P16205O77537R63563J274136J632704K017714
4780C1119130K721731K484936J761955j36024k169922l564589l604332k661435
4772B5951450j798245j165615j153222p03189k02067m64704k99251J02265p64
4763B0266658J27782K88679K31339N02331P36974P78775J137667J294520J069138
4754B6433863J417955J562541J456790J082519N56498J08752J95134P72422R71346
4745C4557820J178573Q6483q46878j352949j183661r17475p70383q06415j131700
4736B8813415j299694j538851j701915j500171j539405j431975r53935o52890
$$ y = [20419029, 20760159, 21078592, 21564391, 22166668, 22881496, 23299719, 23449860, 23501677, 23335340, 23142847, 23233756, 23344561, 23837271, 24553476, 25231013, 26194576, 27468712, 29101416, 31119130, 33840861, 36325797, 38087752, 37951728, 35781806, 32217217, 28612885, 25951450, 24153205, 22987590, 21834368, 21131179, 20929112, 20464408, 20165157, 20267422, 20266658, 20394440, 20683119, 20914458, 21416789, 22153763, 22932538, 24070205, 25364725, 26433863, 27851818, 29414359, 30871149, 31953668, 32510166, 32618918, 32814052, 33586474, 34557820, 35736393, 35822876, 34975998, 33623049, 32439388, 31521913, 30751530, 29945115, 28813415, 27513721, 25974870, 24272955, 22772784, 21233379, 19801404, 18847469, 18194579]
4728A8194579o12065o02657l18193k22213j99616k39313k43878k29808r7749m9797
4718A5379290q8670l10634J8231n7091j47868k49584J17221P4421j16959K4271
4708A4642628q4591k2503k77880q4765P3376l1784J45617Q6350o7629m48739j9960
4697A3910120m2619r5234m3787O5922Q9926J25655P4353M68302M14706J08349
4687A5075693M71221J15201j01336j91031k21122k62125j31961k49949j40627
4678A4363964J58074L8098J9507M83914L39902J84831M24073M40430M76173O69324
4668A7598290O17740R51840J002646P14781O12695L91138k6797m10338r22359
4659B0529636j111062j049967r35249o64280n33293k53687k16673j60873j20485
$$ y = [18194579, 17582514, 16979857, 16661664, 16439451, 16239835, 16000522, 15756644, 15526836, 15429087, 15379290, 15290620, 14979986, 14998217, 14941126, 14793258, 14543674, 14660895, 14735316, 14618357, 14642628, 14558037, 14535534, 14257654, 14172889, 14246265, 14214481, 14360098, 14446448, 14378819, 13930080, 13910120, 13867501, 13772267, 13728480, 13794402, 13884328, 14009983, 14084336, 14552638, 14967344, 15075693, 15546914, 15662115, 15560779, 15369748, 15148626, 14886501, 14754540, 14504591, 14363964, 14522038, 14560136, 14579643, 15063557, 15403459, 15588290, 16012363, 16452793, 16928966, 17598290, 18216030, 19167870, 20170516, 20885297, 21497992, 21889130, 21862333, 21451995, 20529636, 19418574, 18368607, 17433358, 16769078, 16235785, 15982098, 15765425, 15604552, 15484067]
4650A5484067k50625j31890q5364K88242Q5058J65426K21771J2407J70064J17690
4640A6076846J82519K29254R9054J65479K40180J62309n2986q3497l606M46989
4630A7462541M84810M10023L39232M34379N27878N09046O41731M59914O58567
4621B1928121R82687R27316J148683R92070N80027k0690n87535p97270j115090
4612B4038319j260562j031328m16921k66001k72701j58267n87278l06423l87014
4603A9351824m17432k64491k74087r2769K06514P9062K21442M91752M77302P97068
4593B0576185Q81943J009008J222357J634572K037021K134394K637982K723820
4585C4857282Q65108j717908l985918l967389k605537j674847j333514p91032
$$ y = [15484067, 15233442, 15101552, 15016188, 15304430, 15389488, 15554914, 15776685, 15789092, 15959156, 16076846, 16259365, 16488619, 16587673, 16753152, 16993332, 17155641, 17102655, 17019158, 17015552, 17462541, 17947351, 18357374, 18696606, 19130985, 19658863, 20167909, 20809640, 21269554, 21928121, 22910808, 23838124, 24986807, 25978877, 26558904, 26538214, 25950679, 25153409, 24038319, 22777757, 21746429, 21329508, 21063507, 20790806, 20632539, 20045261, 19738838, 19351824, 18934392, 18669901, 18395814, 18303045, 18509559, 18588621, 18810063, 19301815, 19779117, 20576185, 21458128, 22467136, 23689493, 25324065, 27361086, 29495480, 32133462, 34857282, 35722390, 34004482, 30018564, 26051175, 23445638, 21770791, 20437277, 19646245]
4577A9646245p02094l34658k64513l1489R1206j96061k58476n59844o39164n00722
4567A6250430m51832m83055l86723j85672l98837m75651k48871k22510m28438
4558A2968841j17366j77278j77791m8802l301j24948J42924J49741J52436K17388
4548A2981844j9602K0828K57115M1477K26296J81068L55778L38749J83815J35419
4538A4702787J02039Q548m6263J91105Q9484L9746j08780p5627j92620k96570
4528A4413849l32566k21066k99164j56941m5279q7790j66064j977J38028j65850
4518A3075180j36125j09520j28824k99714o3356J26960K5440K36380j4675K58703
4508A2970449J88999L44212L28633K41247K71755K02746J65829K04094N523J3330
$$ y = [19646245, 18944151, 18609493, 18344980, 18313491, 18404697, 18208636, 17950160, 17390316, 16751152, 16250430, 15798598, 15315543, 14928820, 14743148, 14344311, 13868660, 13619789, 13397279, 12968841, 12851475, 12674197, 12496406, 12447604, 12444303, 12319355, 12462279, 12612020, 12764456, 12981844, 12962242, 12983070, 13240185, 13281662, 13507958, 13689026, 14044804, 14383553, 14567368, 14702787, 14804826, 14813374, 14767111, 14958216, 15047700, 15087446, 14978666, 14903039, 14710419, 14413849, 14081283, 13860217, 13561053, 13404112, 13358833, 13271043, 13104979, 13103002, 13241030, 13075180, 12939055, 12829535, 12700711, 12400997, 12337641, 12464601, 12490041, 12726421, 12711746, 12970449, 13159448, 13503660, 13832293, 14073540, 14345295, 14548041, 14713870, 14917964, 14923487, 14936817]
4498A4936817l61981k76508k19964j89552j72896l40186r8342N7272k46180n5135
4488A3033345j57426j7849N9260j9634K6110P5084l4971k74107k85623l0923n9421
4477A2313845L1610K1750l28115j61173j62768k92898p4253J24681R587O855L7733
4466A1526854l9189k65854p4466l22979j07247k84600j30736j1555j23397j82472
4456I984359q7822J02220q0509k6153J48600o523n360j59665J9909k9186N0594
4445I910464J29641j34358j91302j1982O8362j16353O4287K0922O8833r6630J13461
4434I825345J32519O2039K2618l1183L0987J43727K56995J78387J04236J61938
4424A0887608J57133n8459j56973k56834m41733j89058l8877p4192L029n1183
$$ y = [14936817, 14574836, 14298328, 14078364, 13888812, 13715916, 13375730, 13277388, 13334660, 13088480, 13033345, 12875919, 12858070, 12917330, 12897696, 12923806, 12998890, 12963919, 12689812, 12404189, 12373266, 12313845, 12345455, 12367205, 12039090, 11877917, 11715149, 11422251, 11347998, 11472679, 11482266, 11489121, 11526854, 11487665, 11221811, 11147345, 10824366, 10717119, 10432519, 10301783, 10290228, 10166831, 9984359, 9896537, 9998757, 9918248, 9892095, 10040695, 10034172, 10028812, 9869147, 9889056, 9859870, 9910464, 10040105, 9905747, 9714445, 9702463, 9770825, 9654472, 9718759, 9739681, 9808514, 9711884, 9825345, 9957864, 10019903, 10042521, 10011338, 10042325, 10186052, 10443047, 10621434, 10725670, 10887608, 11044741, 10986282, 10829309, 10572475, 10130742, 9941684, 9902807, 9828615, 9831644, 9780461]
4414I780461k00768q9681J60592j56364K13221J03406j47661J85536l9677J06985
4404I916050J08063k6615K9197J84573K91501J52499j0390J55096K07023J90141
4394A1197138K10173P4012m6481q8815O3136p0774j38507j21430n3972j47807
4384A0876673m5161K50721L786j97021m5727K9522m2788R5127J9327R7642K09531
4373A1251632K62670K3592N2374J05291J15416k9515M059K65906o3788M7237J21573
4362A2156447l1434k6942q3039Q8007R90q4775P1434J78246k610k1377L9669P787
4350A2292403o6133r828j45829k53045j26710q114K0213J335L4196q157J17185
4339A1847516J2688Q2210O0369n7305j62177M2405j17489j37606o9178J80039
$$ y = [9780461, 9579693, 9490012, 9650604, 9494240, 9707461, 9810867, 9663206, 9848742, 9809065, 9916050, 10024113, 9997498, 10026695, 10211268, 10502769, 10655268, 10644878, 10799974, 11006997, 11197138, 11407311, 11481323, 11434842, 11346027, 11409163, 11338389, 11199882, 11078452, 11024480, 10876673, 10831512, 11082233, 11086019, 10888998, 10843271, 10872793, 10830005, 10925132, 10944459, 11042101, 11251632, 11514302, 11537894, 11590268, 11695559, 11810975, 11781460, 11785519, 12051425, 11987637, 12034874, 12156447, 12125013, 12098071, 12015032, 12103039, 12104029, 12019254, 12090688, 12268934, 12266324, 12244947, 12284616, 12292403, 12226270, 12216442, 12070613, 11817568, 11690858, 11682744, 11702957, 11704292, 11738488, 11730331, 11847516, 11860204, 11942414, 12002783, 11945478, 11783301, 11825706, 11708217, 11570611, 11501433, 11681472]
4329A1681472K05220m3803j17193J17764n4209k02310j53818j0720J88144J6957
4319A1627504M6829j05551L01730J9176j71574k0724m5992j70033k53386K5178
4309A1253157o5038r1273j37719l0553P8750J13577K4481J19354J6263k7145j43809
4298A1110045j20644Q2156P445j45812J79524q0502L0298O2882J45248L203r9214
4287A1174629R4987p0211r0707K11801J43530Q7669K47280P0354J10906J11189
4277A2091427N9198O2005K29079r6822k26984R3968J511j2094j31441k69598l5859
4266A1764390J69715j14853j94643N4485P8800N0317k05145j41846P8650K53958
4256A1793828K23206J09504K1706J66625k7853R1486M04039J94676P3423M95323
$$ y = [11681472, 11886692, 11842889, 11725696, 11843460, 11789251, 11586941, 11433123, 11422403, 11610547, 11627504, 11674333, 11568782, 11870512, 11889688, 11718114, 11697390, 11651398, 11481365, 11227979, 11253157, 11188119, 11096846, 10959127, 10928574, 11007324, 11120901, 11145382, 11264736, 11280999, 11253854, 11110045, 10989401, 11071557, 11079002, 10933190, 11112714, 11032212, 11062510, 11125392, 11270640, 11273843, 11174629, 11269616, 11199405, 11108698, 11320499, 11464029, 11551698, 11798978, 11869332, 11980238, 12091427, 12150625, 12212630, 12441709, 12344887, 12117903, 12211871, 12213382, 12201288, 12069847, 11800249, 11764390, 11934105, 11819252, 11624609, 11679094, 11757894, 11808211, 11603066, 11461220, 11539870, 11793828, 12017034, 12126538, 12148244, 12314869, 12287016, 12378502, 12782541, 12977217, 13050640, 13545963]
4246A3545963K97732L40038K04661K96905O19890J40500r4229l3709J92709Q8939
4236A5599399q3635j54961j74034k55820l53365K9556p1401k232j16950l1035
4226A4385522K81746m0169o5124J85541K97599M12090K37762K39732K45307K99753
4216A6479759L71067L93303K88249J96167L61872M62049N69058K82631O57098
4207B0061253O80927N82014J236348R36907J148980J794582J889739K020905K253334
4198C2604989K437753L034432L398079L879419M148424L398856Q27788k415963
4190E1313777m839415n509766m883727m097231k931141k248747j672560j196371
4182B3934819j202055j020391q82823o68557n99196m56864o53046n29909k73577
$$ y = [13545963, 13843695, 14183733, 14388394, 14685299, 15305189, 15445689, 15351460, 15317751, 15510460, 15599399, 15515764, 15360803, 15186769, 14930949, 14577584, 14607140, 14535739, 14533507, 14416557, 14385522, 14667268, 14627099, 14561975, 14747516, 15045115, 15457205, 15694967, 15934699, 16180006, 16479759, 16850826, 17244129, 17532378, 17728545, 18090417, 18552466, 19121524, 19404155, 20061253, 20742180, 21324194, 22560542, 23497449, 24646429, 26441011, 28330750, 30351655, 32604989, 35042742, 38077174, 41475253, 45354672, 49503096, 52901952, 53729740, 51313777, 46474362, 40964596, 36080869, 31983638, 29052497, 26803750, 25131190, 23934819, 22732764, 21712373, 20829550, 20160993, 19561797, 19104933, 18451887, 17921978, 17648401]
4173A7648401k99855j01252l94330l12081k61324m30442j97607j47443l65341
4164A5138726k38565n4598k65130K5166l5132j972j42750l04321n1276l2311j88216
4153A3849621j78218q8886J4957Q9653Q2649p4058j50446J32943o1994K53910
4143A3870131j05208L0237k3842m9147J48278n6566k46405j82831R3554p2101
4133A3406100k71359J37317M30j15622J77121J11287j41499K58314J87892j0881
4123A3739100j51671M4557J76197J76828m6324J83534L94777K46845J92633r040
4113A4947436K5195K06600J21501J34508K91282K36140K2470J28538N6492J5363
4103A6185525L6077P02L63566M76830L92611M33936M36036N68255P15846Q60611
$$ y = [17648401, 17348546, 17247294, 16852964, 16540883, 16279559, 15849117, 15651510, 15504067, 15138726, 14900161, 14845563, 14580433, 14605599, 14570467, 14568495, 14425745, 14121424, 14070148, 14037837, 13849621, 13671403, 13582517, 13597474, 13687127, 13769776, 13695718, 13545272, 13678215, 13616221, 13870131, 13764923, 13795160, 13771318, 13722171, 13870449, 13813883, 13567478, 13384647, 13478201, 13406100, 13134741, 13272058, 13272488, 13156866, 13333987, 13445274, 13303775, 13562089, 13749981, 13739100, 13587429, 13631986, 13808183, 13985011, 13938687, 14122221, 14516998, 14763843, 14956476, 14947436, 14972631, 15179231, 15300732, 15435240, 15726522, 15962662, 15985132, 16113670, 16170162, 16185525, 16221602, 16222304, 16585870, 17062700, 17455311, 17889247, 18325283, 18893538, 19609384, 20469995]
4093B0469995Q27140Q14701J000940R50163P39798N76328K69737k9291l33867
4084B5285644l11182l43508l14184n30881j83574n50358j073787q47288j237710
4075A9893172o13836n40533m54344k12514k00036l30380q2285j23116j60759j90780
4065A6984589j90062O0941J74074J48403k443n6551k40054J00412J30539M5340
4055A7155188O4267j16483j55726j96695P6949o846l9677m9264l5884j2535L30449
4044A7013743J41092J45194K95352j92335j6971l1207k08515k3881j17781n1509
4034A6953182k281j52342j49027k3908o7076m7000k158j79787K8611j27051k37827
4023A5993336K26947j69952k58326k34728j4531R2899M6750M2830j48409k1540
$$ y = [20469995, 21297135, 22111836, 23112776, 24062939, 24802737, 25379065, 25648802, 25619511, 25285644, 24974462, 24630954, 24316770, 23785889, 23602315, 23051957, 21978170, 21130882, 19893172, 19279336, 18738803, 18284459, 18071945, 17871909, 17541529, 17459244, 17336128, 17175369, 16984589, 16794527, 16855468, 17029542, 17177945, 17175502, 17118951, 16878897, 16979309, 17109848, 17155188, 17219455, 17102972, 16947246, 16750551, 16827500, 16820654, 16780977, 16731713, 16695829, 16683294, 17013743, 17154835, 17300029, 17595381, 17403046, 17386075, 17354868, 17146353, 17122472, 17004691, 16953182, 16950901, 16798559, 16649532, 16625624, 16558548, 16511548, 16509390, 16329603, 16358214, 16231163, 15993336, 16220283, 16050331, 15792005, 15557277, 15542746, 15635645, 15682395, 15725225, 15576816, 15555276]
4013A5555276n175k18161k5309j47633M7937m5933p643q9351j56839j7005J81138
4002A5071302K1351M7386J20983q1145k05830j92159K1702R459J46354K08576
3992A5167979L4429k02826l22038k89308l10654k00741K172K5680k48162p029
3982A3649502K2659j48663m9329J43751P4792M2094J40493o2336O7116r510j6408
3971A3854161L9467m9185k4878K18033J57423K1835M1130K7524j44803k44969
3961A3895738k08990j56758k15468P880j02748k50089j37008j5474L6635j418
3951A2852300k62260O1111Q789m450j43973k01448R4397P2664r0389j76919k0553
3940A2189269J98383j77069P6505n0386j4652j54631q415q2152J12134R3967j51049
$$ y = [15555276, 15550101, 15331940, 15306631, 15158998, 15206935, 15161002, 15153359, 15064008, 14907169, 14890164, 15071302, 15092653, 15140039, 15261022, 15179877, 14974047, 14781888, 14803590, 14813049, 14959403, 15167979, 15202408, 14999582, 14677544, 14388236, 14077582, 13876841, 13879013, 13904693, 13656531, 13649502, 13672161, 13523498, 13474169, 13617920, 13692712, 13734806, 13875299, 13812963, 13880079, 13870569, 13854161, 13893628, 13844443, 13819565, 14037598, 14195021, 14216856, 14257986, 14285510, 14140707, 13895738, 13686748, 13529990, 13314522, 13322402, 13219654, 12969565, 12832557, 12817083, 12853718, 12852300, 12590040, 12651151, 12659940, 12655490, 12511517, 12310069, 12404466, 12477130, 12386741, 12209822, 12189269, 12387652, 12210583, 12287088, 12236702, 12222050, 12067419, 12059004, 11976852, 12088986, 12182953, 12031904]
3929A2031904N7108o8311j7662j72907N5829j22334o5124M1063l1749k89593j13365
3918A1304859Q182k3264n9205q3695J72631k4640j02028p1023M2129K3857Q7637
3907A1275440j60015l6154O4331J87164M0276j36328M312Q7246K10994K7904j16795
3896A1448375J27184J46107P8869P8024o7514j85601q3465J90458k27748k06641
3886A1298048L1152R153j28095n9483Q5209L1860j9282o8479n5410K0773m7878
3875A1097568L4187J339l1835O1709q6067n3404K09943j6729M4495J13194k36220
3864A1138180j9343Q327l2540J70452J66792n8246r3976K409N0050J01347M3695
3853A1477147Q5012J45771n3626k58645j1674K88070J70735J18041O2189j4500
$$ y = [12031904, 12089012, 12020701, 12003039, 11830132, 11885961, 11763627, 11698503, 11739566, 11707817, 11418224, 11304859, 11313041, 11289777, 11230572, 11146877, 11319508, 11294868, 11192840, 11121817, 11163946, 11187803, 11275440, 11115425, 11079271, 11143602, 11330766, 11371042, 11234714, 11239026, 11326272, 11537266, 11565170, 11448375, 11575559, 11721666, 11800535, 11878559, 11811045, 11625444, 11541979, 11732437, 11504689, 11298048, 11329200, 11338353, 11210258, 11150775, 11235984, 11267844, 11248562, 11180083, 11124673, 11145446, 11097568, 11131755, 11133094, 11101259, 11162968, 11076901, 11023497, 11233440, 11216711, 11261206, 11374400, 11138180, 11118837, 11127164, 11094624, 11265076, 11431868, 11373622, 11279646, 11282055, 11332105, 11433452, 11477147, 11562159, 11707930, 11654304, 11395659, 11383985, 11672055, 11842790, 11960831, 12023020, 12008520]
3843A2008520J93363j59568J15992K00208K94096K64783J67311M862J09705N5468
3833A3254740K32140K18677J12548L62344L60224K62920K43854K16765J2862j33498
3823A5143576j90620n7138M8448K42111J84221l4790J94707J68038K00501M68473
3813A6367527J85000M3155K98927K49945L70595K44231J98129J46246J84290L91635
3803A8679680L18777K09000N28607N62669N58877O36178L32893J12959K7788l49936
3793B1617492q15947p42850q38375m82086l95231m32313j88359M5985o228J44493
3783A7906581K39035M15627K35371P7618J33013L2872O642o9718J7780P7261l02574
3772A8769508n83424p83385o83244n74871k52964l89320k37633j60091j14958
$$ y = [12008520, 12201883, 12042315, 12158307, 12358515, 12652611, 12917394, 13084705, 13089567, 13199272, 13254740, 13486880, 13705557, 13818105, 14180449, 14540673, 14803593, 15047447, 15264212, 15277074, 15143576, 14952956, 14895818, 14944266, 15186377, 15370598, 15335808, 15530515, 15698553, 15899054, 16367527, 16552527, 16595682, 16894609, 17144554, 17515149, 17759380, 17957509, 18103755, 18288045, 18679680, 18998457, 19207457, 19736064, 20298733, 20857610, 21493788, 21826681, 21939640, 21967428, 21617492, 20801545, 20058695, 19220320, 18738234, 18343003, 17910690, 17722331, 17768316, 17762088, 17906581, 18145616, 18561243, 18796614, 18874232, 19007245, 19040117, 19046759, 18977041, 18994821, 19072082, 18769508, 18186084, 17402699, 16719455, 16144584, 15891620, 15502300, 15264667, 15104576, 14989618]
3763A4989618j84655l5583j47666n04970k59755j71490l42988k84952m4397j66953
3753A2846209p4888O8940J54777K36314M05776r5301k80788m48616k74746k55005
3743A2282672j89277o0091l6406k02018j78471k10069o0948j25888k33424p1292
3733A0914788Q0746J60704r8231k5117J44804J02131J5264j46304k82783j91759
3723A0674243l15521k26294k82665o1134K1090r1842r4315J757j63749J80635
3713I642205Q4409q9524q9890k99658n1724M2969m7481j19588j60173J57493j8917
3702I050121J70976n6124j86441J37752k39042j40577o3947k23926r6431K16591
3692H568952J22528K7168J31955J62984J09288O8112J24114J0641K434m2868m055
$$ y = [14989618, 14804963, 14769380, 14621714, 14116744, 13856989, 13685499, 13342511, 13057559, 13013162, 12846209, 12771321, 12840261, 12995038, 13231352, 13637128, 13541827, 13261039, 12812423, 12537677, 12282672, 12093395, 12033304, 11996898, 11794880, 11616409, 11406340, 11345392, 11219504, 10986080, 10914788, 10995534, 11156238, 11058007, 11032890, 11177694, 11279825, 11295089, 11148785, 10866002, 10674243, 10358722, 10132428, 9849763, 9788629, 9809719, 9717877, 9623562, 9625319, 9461570, 9642205, 9726614, 9637090, 9547200, 9247542, 9195818, 9238787, 9191306, 9071718, 8911545, 9069038, 9050121, 9221097, 9164973, 8978532, 9116284, 8877242, 8736665, 8672718, 8448792, 8352361, 8568952, 8691480, 8718648, 8850603, 9013587, 9122875, 9190987, 9315101, 9325742, 9328176, 9285308, 9281253]
3681I281253L2079r6468P6695P4752J47126K04717n9153P1069M4046k55673k85929
3670I234514N2732K17165j50001o929P3783K32347k1409k15400M1603P3145o6173
3659I465377k6430j09350k68267j27592K00050k11452N5482j6293J30791R2143
3649I184459J13457L7893L2661K8692r590J14044j87989o0275J03555K98209n07
3638I654609O306K12408J63569O0683J66278j2973M3264J03828l2382J7875J37453
3627A0520918Q5025n2687n8467j664O6478K68025J32710N0967j3278J97184J3563
3616A1208774M2830M6475J25332Q5454p0828j16713L529j50498j13818L74400
3606A1434937j29298k97888n0160p528N507K2251j46427j05063J11430k83813
$$ y = [9281253, 9313332, 9216864, 9293559, 9368311, 9515437, 9720154, 9661001, 9732070, 9776116, 9520443, 9234514, 9287246, 9504411, 9354410, 9347481, 9421264, 9653611, 9632202, 9416802, 9458405, 9531550, 9465377, 9438947, 9329597, 9061330, 8933738, 9133788, 8922336, 8977818, 8961525, 9092316, 9184459, 9297916, 9335809, 9368470, 9397162, 9387572, 9501616, 9313627, 9253352, 9356907, 9655116, 9654609, 9660915, 9873323, 10036892, 10097575, 10263853, 10250880, 10294144, 10397972, 10365590, 10383465, 10520918, 10605943, 10553256, 10494789, 10493125, 10559603, 10827628, 10960338, 11011305, 10998027, 11195211, 11208774, 11251604, 11298079, 11423411, 11508865, 11438037, 11321324, 11324853, 11174355, 11060537, 11434937, 11305639, 11007751, 10957591, 10950063, 10955570, 10977821, 10831394, 10726331, 10837761, 10553948]
3596A0553948j74728P247k86454j78965k1696k85603r8915j71730j79477k8189
3586I135438l52997j7563Q3825j04553m4815k84391k1343O673j05995j42322P421
3575H159378k13481l20534o2577j79859R89L4834p5417j85570o6257j81646L596
3564F913456J4542m416j68177J55576J24378r4829M0179k19897j08756k094j66106
3553F483856P8045q8085j86255j3546j24487K63636j23479q4452n9346K1987J52395
3542F320269k70421R157l663M1332l72484l2012P6253j64063j8654q8101j4139
3531E483474J01060r7404j9180M3528j52535L2547P9420R5272k0377k9891O0712
3520E576626N8596k9228J09026j24877m8253N1486j37375J89387j9163j81422
$$ y = [10553948, 10379220, 10386467, 10100013, 9921048, 9899352, 9613749, 9514834, 9343104, 9163627, 9135438, 8782441, 8764878, 8848703, 8744150, 8699335, 8414944, 8393601, 8400274, 8294279, 8151957, 8159378, 7945897, 7625363, 7562786, 7382927, 7383916, 7418750, 7343333, 7157763, 7091506, 6909860, 6913456, 6927998, 6923582, 6755405, 6910981, 7035359, 6940530, 6980709, 6760812, 6652056, 6649962, 6483856, 6561901, 6473816, 6287561, 6274015, 6149528, 6413164, 6289685, 6205233, 6145887, 6167874, 6320269, 6049848, 6059005, 6055342, 6096674, 5724190, 5692178, 5768431, 5604368, 5585714, 5497613, 5483474, 5584534, 5487130, 5467950, 5511478, 5358943, 5391490, 5470910, 5566182, 5545805, 5515914, 5576626, 5635222, 5605994, 5715020, 5590143, 5541890, 5593376, 5456001, 5645388, 5626225, 5444803]
3510E444803j68060J6499N9118k58372q2735N8051j89512J36392J73795P409K0920
3499E218308k70430k28687L4959O7747P7868p0828m6139k15086j14710Q01J47038
3488D600841j8518j74422N4373n9129M8314j27591l3579K785q8488q9943q8355
3477D026288o0857o926L2963m7196k0263J93963j11229R8527k26864o7968J50874
3466C961312n0319p6169N008N3741j28351M1748K741J90680j62693j3464J25913
3455C950147j05410J46299l0151q4716N7448m5541o8506K17601r2218R0953J48108
3444D184014j8651K22980J37713o5716J66935k0575J00713J49994n6243J91037
3434D992201J26847M7855j29272k61894k68172J55333m602j86561j39348k16979
$$ y = [5444803, 5276743, 5293242, 5352360, 5093988, 5011253, 5069304, 4879792, 5016184, 5189979, 5197388, 5218308, 4947878, 4719191, 4754150, 4821897, 4899765, 4828937, 4782798, 4567712, 4453002, 4453803, 4600841, 4582323, 4407901, 4462274, 4403145, 4451459, 4323868, 4290289, 4293074, 4204586, 4114643, 4026288, 3965431, 3958505, 3991468, 3944272, 3924009, 4117972, 4006743, 4105270, 3878406, 3810438, 3961312, 3910993, 3834824, 3839832, 3893573, 3765222, 3806970, 3809711, 4000391, 3837698, 3824234, 3950147, 3844737, 3991036, 3960885, 3876169, 3933617, 3888076, 3819570, 4037171, 3944953, 4035906, 4184014, 4165363, 4388343, 4526056, 4460340, 4627275, 4606700, 4707413, 4857407, 4801164, 4992201, 5119048, 5166903, 5037631, 4775737, 4507565, 4662898, 4658296, 4471735, 4332387, 4115408]
3424D115408p4569K56792q7640k1656J33300o2251k7906N8470O4800j89935j33632
3413D031181K37049m6801j05828J55335L5260j69661J7688J54080Q5619J38347
3403D532269J18473K45647J34108O3808o9546J711n0832P7332p5181k6123K41089
3392E192755n1150l9594J22009J0978P5178J656k01362j18630l97994N775J63083
3381D762704j89102j7245q6430j05574O03K57149m7117K47715k6886k56033J56939
3370D696723N2164m9057k17554K31884J3204j68352k89719N2838K53961J49817
3360D725909p1216q9575R6294l0690j13061k6150L75587j07513J13247N1411j93675
3349D730568J78045J03620J3430N086M5033J63642P7760j9595N6043R8532k07039
$$ y = [4115408, 4040839, 4297631, 4209991, 4188335, 4321635, 4259384, 4231478, 4289948, 4354748, 4164813, 4031181, 4268230, 4221429, 4115601, 4270936, 4306196, 4136535, 4154223, 4308303, 4393922, 4532269, 4650742, 4896389, 5030497, 5094305, 5024759, 5026470, 4975638, 5052970, 4977789, 4951666, 5192755, 5141605, 5102011, 5224020, 5234998, 5310176, 5311832, 5110470, 4991840, 4593846, 4599621, 4762704, 4573602, 4556357, 4469927, 4364353, 4364956, 4622105, 4574988, 4822703, 4795817, 4539784, 4696723, 4748887, 4699830, 4482276, 4714160, 4727364, 4559012, 4269293, 4322131, 4576092, 4725909, 4654693, 4565118, 4661412, 4630722, 4517661, 4491511, 4867098, 4759585, 4872832, 4924243, 4730568, 4908613, 5012233, 5025663, 5030749, 5075782, 5239424, 5317184, 5297589, 5353632, 5452164, 5245125]
3338E245125O0688M9600N8301P6715n9641J78231k7038O6943J99161M1397J27814
3327F017296R4141j08092J23228J69820O0870J18941K26237p2757J80637K49572
3317G059893Q6002K29385J42387J5615J72165L54602K31152J42845N8821J13285
3307H606152J45475N0587J44578j19161K42234K11448J3209J78967J75029k1138
3297I627380j91359K52459L14081O5089J10515K76694K43065L26352Q3629K79365
3287A1387270L99536L46128K10240Q4916N09936J63320K31305N87752M30151O49786
3277A5000340N78296L09565N4432p2695R5148J84255J80606M23609N31446O25688
3267A7910690L83245N38082P62445N18518O53604K29499M80457N57686P42857
$$ y = [5245125, 5305813, 5355413, 5413714, 5490429, 5430788, 5609019, 5581981, 5648924, 5848085, 5889482, 6017296, 6111437, 6003345, 6126573, 6296393, 6357263, 6476204, 6702441, 6629684, 6810321, 7059893, 7145895, 7375280, 7517667, 7533282, 7705447, 8060049, 8291201, 8434046, 8492867, 8606152, 8751627, 8802214, 8946792, 8827631, 9069865, 9281313, 9294522, 9473489, 9648518, 9627380, 9436021, 9688480, 10002561, 10067650, 10178165, 10454859, 10697924, 11024276, 11107905, 11387270, 11786806, 12132934, 12343174, 12428090, 12938026, 13101346, 13332651, 13920403, 14350554, 15000340, 15578636, 15888201, 15942633, 15869938, 15965086, 16149341, 16329947, 16753556, 17285002, 17910690, 18293935, 18832017, 19594462, 20112980, 20766584, 20996083, 21476540, 22034226, 22777083]
3258B2777083O41934R61416J237033J265757J188436J382971J592380J742577
3250C2789587J775387J795621K069704K379777K373942K005975J163070J38272
3242D6491335j203435k440004k752576k568458k348223k433314j933203j571197
3234B9240925j457851r07859q37206j327469j370810j334392j004574o76051o64339
3225A9660374m76740n22877n65027j62374j33763m3730k42399j86378l33867n68385
3215A6424834n04911k20571l44973l95847m63758n21289k81851p3136l81897k15367
3205A3021234k78502P259r1083J9082j3789k01605m36740m98258m27177l53885
3195A0746536l88696m27070J58336k1740J00974k63231l24785j07104l41719n21168
$$ y = [22777083, 23419017, 24380433, 25617466, 26883223, 28071659, 29454630, 31047010, 32789587, 34564974, 36360595, 38430299, 40810076, 43184018, 45189993, 46353063, 46491335, 45287900, 42847896, 40095320, 37526862, 35178639, 32745325, 30812122, 29240925, 27783074, 26875215, 26038009, 24710540, 23339730, 22005338, 21000764, 20324713, 19660374, 19183634, 18660757, 18095730, 17933356, 17799593, 17755863, 17513464, 17327086, 16993219, 16424834, 15919923, 15699352, 15354379, 14958532, 14494774, 13973485, 13691634, 13618498, 13236601, 13021234, 12742732, 12749991, 12658908, 12677990, 12664201, 12462596, 12025856, 11527598, 11100421, 10746536, 10357840, 9930770, 10089106, 10067366, 10168340, 9905109, 9580324, 9473220, 9131501, 8610333]
3185H610333j92389k10947k67940j16910m26542j66552j56546j46947r0144j41408
3175F694008o828j14742j22393j79831p4436Q1084j04124j67779j84959j38433
3165E681567j55578m8662j39770j11893p2580q0313J9883j00375j55568M9790
3155D886501l06479n1964p1426m2443m6078o6037L6208o0108O4665j28245o8990
3144D145604J86955j06223k55158o6041p2267J68322n4503k03843J1564k19135
3134C535275o6289O2822j45089j09201l3628L8644k81144J85042l4739n7442k0697
3123C073554k2409P3419q6899k36076J38460m5821r4465J30214J1616j14052J26898
3112B954439m2152Q030m5698j54573q206P1771n7567j09623L9776p6253j52273
$$ y = [8610333, 8417944, 8206997, 7939057, 7822147, 7395605, 7229053, 7072507, 6925560, 6835416, 6694008, 6687180, 6572438, 6450045, 6270214, 6195778, 6276862, 6172738, 6004959, 5820000, 5681567, 5525989, 5477327, 5337557, 5225664, 5153084, 5072771, 5092654, 4992279, 4836711, 4886501, 4580022, 4528058, 4456632, 4414189, 4368111, 4302074, 4338282, 4278174, 4342839, 4214594, 4145604, 4332559, 4226336, 3971178, 3905137, 3832870, 4001192, 3946689, 3742846, 3754410, 3535275, 3468986, 3531808, 3386719, 3277518, 3243890, 3282534, 3001390, 3186432, 3151693, 3094251, 3073554, 3051145, 3124564, 3037665, 2801589, 2940049, 2894228, 2799763, 2929977, 2941593, 2827541, 2954439, 2912287, 2920317, 2874619, 2720046, 2711840, 2783611, 2726044, 2616421, 2656197, 2579944, 2427671]
3101B427671K88643L314k24608k7338j91498j1613J28128k6491l2887L8419j14082
3090B257658l8152J36091N9434q3706j08057K99791j3932m3573j21987k30560
3080B113007n191l3051J30010j74476J719L06221m5728k59818J24455k4306l6292
3069B096550o4724R6982O8087o5606K0180p3416N735k4174J10887L9118j40348
3058B069271k23925L300R9134j01486k06191j7982P3469J21643Q8493N4912q4884
3047A875754k60930R2824L9102J35486o0285j88785K3931l510n0222J12542M6356
3036A762263k225j01723j12451m1741J96511P7722j21974k09616N7499K9733K01390
3025A735388n1547N3650J9734Q6063O0860j42873j07135j03768P8367J73042K22412
$$ y = [2427671, 2716314, 2719628, 2495020, 2467682, 2276184, 2264571, 2392699, 2366208, 2333321, 2371740, 2257658, 2219506, 2355597, 2415031, 2331325, 2223268, 2523059, 2509127, 2465554, 2343567, 2113007, 2107816, 2074765, 2204775, 2030299, 2032018, 2338239, 2292511, 2032693, 2157148, 2132842, 2096550, 2031826, 2128808, 2196895, 2131289, 2151469, 2078053, 2083788, 2059614, 2170501, 2209619, 2069271, 1845346, 1848646, 1947780, 1846294, 1640103, 1622121, 1695590, 1817233, 1905726, 1960638, 1875754, 1614824, 1707648, 1746750, 1882236, 1821951, 1633166, 1657097, 1653587, 1603365, 1715907, 1762263, 1760038, 1658315, 1545864, 1504123, 1700634, 1778356, 1656382, 1446766, 1504265, 1533998, 1735388, 1683841, 1737491, 1757225, 1843288, 1904148, 1761275, 1654140, 1550372, 1628739, 1801781, 2024193]
3014B024193q1541k41173M6953P6689L6207J43623L9878o7015p7088r9223J18551
3003A920054J39199j08222p029j30405K0282J02937R4259n1085j63911l0797J87632
2992A972914M8076q2422M5638J3395l7187j17108k5317R2662R3251J30762j06753
2981B027911K08650J25814K18102J74928N4042M8778r3402j0382j50458p613P7543
2970B673913N5533j73130j19062J22135J10808J1581j14710J03603K78444p6376
2960B872739J8150K38557j30294j10000J13419J9499j11569M1345J18801J68097
2950C238744P5349j7478r7349J42156K58182J50589J3880K79471K5640L9092n141
2939D103135J840J07037Q023J4177n5940J45170L45816L31904O6021k9054j30754
$$ y = [2024193, 1942652, 1701479, 1748432, 1825121, 1861328, 2004951, 2044829, 1977814, 1900726, 1801503, 1920054, 2059253, 1951031, 1944002, 1813597, 1833879, 1936816, 2031075, 1979990, 1816079, 1785282, 1972914, 2020990, 1938568, 1984206, 1997601, 1960414, 1843306, 1817989, 1910651, 2003902, 2134664, 2027911, 2236561, 2362375, 2580477, 2755405, 2809447, 2858225, 2764823, 2754441, 2603983, 2596370, 2673913, 2729446, 2556316, 2437254, 2559389, 2670197, 2681778, 2567068, 2670671, 2949115, 2872739, 2890889, 3129446, 2999152, 2889152, 3002571, 3022070, 2910501, 2951846, 3070647, 3238744, 3314093, 3296615, 3199266, 3341422, 3599604, 3750193, 3764073, 4043544, 4069184, 4108276, 4103135, 4104975, 4212012, 4220035, 4234212, 4178272, 4323442, 4669258, 5001162, 5067183, 5038129, 4907375]
2928D907375K9579Q8206J32958j6775Q3819R8664j06076P173L4670J8049O0588
2917E338230K26792K61882n9041J58194P5209J61726K47279K92954K30092L20237
2907G253554K22123N7512L04685K01427l9262J69662p9328l44124l36082m47638
2897F962529k43718k09304q6951j75842k25257q1473N0231K23634l6219Q690K51219
2886F437539R247K07936J44164J52328K10821R2645L0758J32258J41183l728M5583
2875G600734j21384j61412j98649o1665j82588k53700l53320l79500j44284r1019
2865E653213p6990q5395k75672N702N8742j41170M9706Q020k62516l252K02378
2854E132766p9014j9024n6270k46889r0111k38342j07340o2920k51327j74043
$$ y = [4907375, 4936954, 5025160, 5158118, 5141343, 5225162, 5323826, 5217750, 5224923, 5259593, 5277642, 5338230, 5565022, 5826904, 5767863, 5926057, 6001266, 6162992, 6410271, 6703225, 6933317, 7253554, 7475677, 7533189, 7837874, 8039301, 8000039, 8169701, 8090373, 7746249, 7410167, 6962529, 6718811, 6509507, 6422556, 6246714, 6021457, 5939984, 5990215, 6213849, 6177630, 6186320, 6437539, 6446786, 6654722, 6798886, 6951214, 7162035, 7254680, 7285438, 7417696, 7558879, 7555151, 7600734, 7479350, 7317938, 7119289, 7057624, 6875036, 6621336, 6268016, 5888516, 5744232, 5653213, 5576223, 5490828, 5215156, 5220858, 5279600, 5138430, 5188136, 5196156, 4933640, 4930388, 5132766, 5053752, 5034728, 4978458, 4731569, 4641458, 4403116, 4295776, 4232856, 3981529, 3807486]
2844C807486k79939k63038l6913K8360j42231q2441j06328j88964j31066j01852
2834B503074j56435r0140J41519m4180j58445N1757j08318J15732n8881j8489
2824B177194j23573p3665l44767J5968J27237j59707N5754k09567j45609J67226
2814A486491k24800P9424j43856j46408q5727K0059K01956j8747j57156m7957
2804I63279J30567J5105j26863m9357L7803M2154K22698k93597N8882P5734j09307
2793I67098K7174k4573r0073j10245j04445J36475M4292k05767J88808N1240l045
2782H76939j22303o9330M5122j17833q7943J0507j16373m5453M9486M0459p3394
2771C89884j43793K9206K4948K304j40846K29903j24639k6489O1783j32330P7278
$$ y = [3807486, 3527547, 3264509, 3227596, 3255956, 3113725, 3031284, 2924956, 2735992, 2604926, 2503074, 2346639, 2256499, 2398018, 2353838, 2195393, 2247150, 2138832, 2254564, 2195683, 2177194, 2053621, 1979956, 1635189, 1651157, 1778394, 1618687, 1674441, 1464874, 1319265, 1486491, 1261691, 1341115, 1197259, 1050851, 965124, 985183, 1187139, 1168392, 1011236, 963279, 1093846, 1108951, 982088, 932731, 970534, 1012688, 1235386, 941789, 1000671, 1076405, 967098, 994272, 969699, 879626, 769381, 664936, 801411, 845703, 639936, 828744, 879984, 876939, 754636, 685306, 730428, 612595, 524652, 535159, 418786, 373333, 422819, 463278, 389884, 246091, 275297, 300245, 302549, 161703, 391606, 266967, 240478, 302261, 169931, 247209]
2760B47209P3569j07905m0301J1526J86800K9841j56098j39368J29381j2889l9013
2749A82752o1933k24734Q4886O8090k6845p810j66168J36654k1114J06631K34290
2738C04699j01434m6837j05044J684k7171n3414J7670j646r037N0938J90961k17531
2726C838P0190K9657l35926m3965K60747K8005J06144M3843k63040J04257j6063
2715a2313J1592J92441r2338k9234L8261n065n6386k05521j14545N2196K04425
2704a6487m1193m2330j43101N4632J62949j98295m2327J18533R2379J99923o0862
2693H3821r5006k52320k5653o0718J0757J94814L2968j93833j2917J0695j11807
2682d19199J30036J19671P1169N9596K3765o8940k06962j502M8265K2289Q4001
$$ y = [247209, 320778, 212873, 172572, 184098, 370898, 400739, 244641, 105273, 234654, 221765, 182752, 120819, -103915, -19029, 49061, 22216, 14406, -151762, -15108, -36222, 70409, 304699, 203265, 156428, 51384, 53068, 25897, -27517, -9847, -11493, -20530, 30408, 221369, 3838, 74028, 103685, -232241, -276206, -15459, 12546, 118690, 162533, -100507, 3750, -12313, -721, 191720, 99382, 70148, 108409, 103344, 46958, -158563, -273108, -220912, -16487, -57680, -100010, -243111, -188479, -25530, -223825, -266152, -147619, -55240, 144683, 83821, -11185, -263505, -289158, -349876, -339119, -144305, -111337, -305170, -318087, -307392, -419199, -289163, -169492, -98323, -38727, -14962, -83902, -290864, -292366, -244101, -221812, -137811]
2671a37811j06633n6279k6903k1955R7107M2638j77498J70870m1277N6492p8306
2660b79555k3318J61054j60256p9966K44218m5390l3941r8612M4655J33708m4769
2649a82172K5191J9571Q9064j48405m6450L4757J7648o7735J5020J6566R3821
2638a33124J3513o0221j7201R3117j12831m5906q6062O9250P1034J74827O0037
2627B6433k46620n6692J94844o6444K0720P2536J10678o9018k03852L34433l4239
2616H2779k14863j3340n0344J30592m0261j01857o8550N8472J34254j23391r664
2605b16173L1834j4179o5660P6555J13694M8231j67790p3975Q5687j33679J81430
2594a34025R4987j14942n8470O8313K1025J17057l618j20905L0747j078Q2176
$$ y = [-137811, -244444, -300723, -327626, -349581, -252474, -209836, -387334, -216464, -257741, -201249, -279555, -302873, -141819, -302075, -382041, -137823, -183213, -217154, -315766, -271111, -137403, -182172, -156981, -137410, -48346, -196751, -243201, -208444, -190796, -258531, -243511, -226945, -133124, -119611, -179832, -197033, -103916, -216747, -262653, -348715, -279465, -208431, -33604, 26433, -220187, -276879, -82035, -148479, -127759, -55223, 55455, -13563, -217415, 117018, 82779, -132084, -145424, -195768, -65176, -105437, -207294, -275844, -217372, -83118, -206509, -216173, -184339, -198518, -264178, -187623, -73929, -25698, -193488, -267463, -181776, -315455, -134025, -39038, -153980, -212450, -144137, -123112, -6055, -9673, -130578, -99831, -100909, -18733]
2583a8733q1045j03703K0632j9257j18692O886N3799m72J72915j22352j46555
2572c56577l3617P5147O9268M4097O6698Q6194L1786r501j39844M0659J00430
2561b5260k27188l4060J65332N8957p802j19772L4538q0393M7914J03353k01820
2550b86201M3608J20754n4655n2r5853O402Q6230J20900q3888k3568J32184j03103
2538a37242q7715k04641R5312j25578P0278q6701M681P5036J32300p6413n429
2527c46112J49506N5551p9361j58228J3228J59789J5802R6613j57713j06465j49985
2516e07375O1410m952J8332R2951O7793R8066O6737r0776j76371K25987J05762
2505d2436j48365O0737K2615o9480p5601K8694n2411P950n918L0851J56164n9082
$$ y = [-18733, -99778, -203481, -182849, -202106, -320798, -313912, -260113, -260585, -87670, -210022, -356577, -390194, -315047, -245779, -201682, -134984, -48790, -17004, -26505, -166349, -125690, -25260, -252448, -286508, -121176, -62219, -70021, -189793, -155255, -235648, -187734, -84381, -286201, -242593, -121839, -176494, -176546, -272399, -265997, -179767, -58867, -142755, -166323, -34139, -137242, -224957, -429598, -334286, -459864, -389586, -476287, -471606, -396570, -264270, -340683, -346112, -196606, -141055, -220416, -378644, -365416, -205627, -189825, -93212, -250925, -357390, -507375, -445965, -450917, -432585, -339634, -271841, -173775, -107038, -197814, -374185, -148198, -42436, -190801, -130064, -107449, -176929, -252530, -223836, -276247, -268297, -274215, -243364, -87200, -146282]
2493a46282P450m5500l562r3096P90k4626q735j09954o2284M882k1133n9241K47734
2480c13557P9353K7249q5499j23558j9718K6423J34392R2054J31309k2396q7929
2469a61877N0130k1525O5765Q2264j03352J7892M7104l8978O9797q0377k64669
2458c37826J99255O2289j25476l02N3750P8928o3024K33061o8589l47500m3887
2447c59321L67622K7756k10559R6650m1839m0286m5757j55250J00792R2133n0654
2436b18713o5308J65915q7375O4041M1423J2737r023j25926L37520J02752k26814
2425h771j72675n855k38894O7729J72219R1886r4061q5887J06208K6909k4174
2414a65366k0738m5968q8392K40495K02195k57901j18829K07800n475j4479J92112
$$ y = [-146282, -138832, -184332, -187894, -280990, -280200, -304826, -313561, -423515, -485799, -480917, -502050, -561291, -313557, -234204, -206955, -292454, -416012, -435730, -409307, -274915, -182861, -51552, -73948, -161877, -111747, -133272, -67507, 14757, -88595, -70703, -23599, -62577, 7220, -73157, -337826, -138571, -76282, -201758, -202060, -148310, -69382, -132406, 100655, 32066, -315434, -359321, 8301, 36057, -174502, -77852, -119691, -159977, -205734, -360984, -260192, -168059, -218713, -284021, -118106, -205481, -141440, -100017, -87280, -96303, -222229, 115291, 218043, -8771, -181446, -187301, -426195, -358466, -186247, -94361, -188422, -274309, -168101, -141192, -165366, -186104, -232072, -320464, -79969, 122226, -135675, -254504, -46704, -52179, -66658, 125454]
2403A25454o3905o8166M39l8553n7847o6437k8928J12804O5542j24889J38797
2392e689O5820J11290j90835q1794J19335O596M8425R2342J16414m4659J55184
2381C92429p4582j29845J44812J90413Q2325J16601n5356K30480L27003o9317
2371A154963K56575O0757k85509j75616R84j50396r7617q4597k3365l18856J8281
2360C55604k05228m4597j28489J128J25079m1288J07821l4108J75735q8222r1701
2349A31734l607J68701j38360j59818O1252J37798K28563j91706k16414p13K07265
2338B24695L4955J0465R0102j29941j7372o8693n1530K2251K32173l5162K1455
2327C33398O1970L8282j3038k0117M6611o3603j41122j61208j02493M4212J62420
$$ y = [125454, 61549, -6617, -6178, -44731, -102578, -169015, -197943, -85139, -19597, -144486, -5689, 60131, 171421, -19414, -101208, 18127, 24723, 73148, 165490, 281904, 237245, 392429, 317847, 188002, 332814, 523227, 605552, 722153, 666797, 897277, 1224280, 1154963, 1411538, 1472295, 1186786, 1011170, 1012154, 861758, 764141, 679544, 656179, 337323, 355604, 150376, 105779, -22710, -21582, 103497, 62209, 170030, 135922, 311657, 223435, 131734, 128127, 296828, 158468, -1350, 59902, 197700, 426263, 234557, 18143, 17430, 224695, 259650, 270115, 360217, 230276, 212904, 144211, 92681, 114932, 347105, 311943, 333398, 395368, 433650, 420612, 400495, 447106, 383503, 242381, 81173, -21320, 22892, 185312]
2316A85312o2565J51663J40694n4641J38241j08057j51207J14379p2828L0389
2306C11380N4625N243J0569n6960J4395J98692j32385j91896j18810J08621Q7336
2295B90810J520J33744j3106J02421J9354m6146O5268l7887j12569p4044r085
2284C20280L23179j21399j16369J71259n5746m6941P2271J6371j778P6372q670
2273F28829j42805P1552J11417J9658J87475j11089J19049N2210k65817K09751
2263H80230J27111q9815j36693M9822j10657J34411K9260N4763M9093j12904j43301
2252G31320K31472J97321r5188o0287N7093K1647O6569J21806J84235j76189J9000
2241A298799P1342q5774n575j17354J62260M8612p2477Q921k9941o0899k8334
$$ y = [185312, 122747, 274410, 415104, 360463, 498704, 390647, 239440, 353819, 280991, 311380, 366005, 371248, 381817, 324857, 339252, 537944, 405559, 213663, 94853, 203474, 290810, 292330, 426074, 412968, 515389, 534743, 488597, 553865, 515978, 403409, 329365, 320280, 643459, 522060, 405691, 576950, 521204, 474263, 546534, 562905, 561127, 637499, 628829, 486024, 557576, 668993, 688651, 876126, 765037, 884086, 936296, 670479, 880230, 1007341, 917526, 780833, 830655, 719998, 854409, 883669, 938432, 987525, 874621, 731320, 962792, 1160113, 1064925, 1004638, 1061731, 1083378, 1149947, 1271753, 1455988, 1279799, 1298799, 1370141, 1284367, 1278792, 1161438, 1323698, 1372310, 1299833, 1308754, 1278813, 1217914, 1189580]
2230A189580P5150r176K6988o1379J72675o487J33221l8174Q9853r3872J72057
2219A650436J64873J03683m6473J09556m0280j41688K91007L976j19210J5133
2209A991013J73112N1606Q6630J24402O4938k7478O0808j00675J34559q324k6100
2198B524491J98522O451r311J68424L4530m8869J61443R9422K12002L60721k8371
2187C679455N369m2690K50510L6447O6195J99142K11903J60734K92274K87308
2177E146647J51060R8868K05654J12888J14206K60131K11857J41259J29547r0047
2167F482070K42206L12537J65846J39102K61525R8176L24008M6086J44632K87049
2157H503237L11603K77595M38628J98118J85102L15157M63526K31438K51094K23202
$$ y = [1189580, 1264730, 1255554, 1282542, 1221163, 1393838, 1387351, 1520572, 1482398, 1572251, 1478379, 1650436, 1815309, 1918992, 1872519, 1982075, 1941795, 1800107, 2091114, 2095090, 1975880, 1991013, 2164125, 2215731, 2302361, 2426763, 2491701, 2464223, 2525031, 2424356, 2558915, 2550591, 2524491, 2723013, 2729464, 2720153, 2888577, 2923107, 2874238, 3035681, 3135103, 3347105, 3707826, 3679455, 3684824, 3642134, 3892644, 3929091, 3995286, 4194428, 4406331, 4567065, 4859339, 5146647, 5297707, 5396575, 5602229, 5715117, 5829323, 6089454, 6301311, 6442570, 6572117, 6482070, 6724276, 7036813, 7202659, 7341761, 7603286, 7701462, 8025470, 8071556, 8216188, 8503237, 8814840, 9092435, 9531063, 9729181, 9914283, 10229440, 10692966, 10924404, 11175498, 11398700]
2147A1398700L80990M80181N54189K72285O05156N57112O27302N47124Q31806
2138A6254845M94024Q17162Q39242J163133Q66298J076772R87983J295789J112207
2129B4907455J512574J413777K041059J834964K171898K548455K893283K777406
2121D2100871L717919M048811N177636M757897M467286M852878O732356Q485675
2113H4341329J0910806J2750292J4452968J6099458J8671968K2595044K9140508
2106B08962373L7333383M6464210L9264427p598163m4379499o3770197n0429590
2099A65846944l1846576k2336828j6614268j3484563j0249379p937604n816121
2092E7561605m544683l422130k675941k040643l069405l430214l516929k982082
$$ y = [11398700, 11779690, 12259871, 12814060, 13086345, 13691501, 14248613, 14875915, 15423039, 16254845, 16748869, 17566031, 18405273, 19568406, 20434704, 21511476, 22499459, 23795248, 24907455, 26420029, 27833806, 29874865, 31709829, 33881727, 36430182, 39323465, 42100871, 45818790, 49867601, 55045237, 59803134, 64270420, 69123298, 75855654, 84341329, 95252135, 108002427, 122455395, 138554853, 157226821, 179821865, 208962373, 246295756, 292759966, 332024393, 324426230, 280046731, 216276534, 165846944, 134000368, 111663540, 95049272, 81564709, 71315330, 63377726, 57561605, 53016922, 49594792, 46918851, 44878208, 41808803, 38378589, 34861660, 31879578]
2084C1879578k399522j803248j853776j282250j235407j037415j474069r63503
2076A9830388q73978q84768r08039o17676q84116p79252p08971n93012p01464
2067A2879112n11499l09824l58904m82767m18111n17624l88165k90686k64946
2058I336586k31751k24256l63358l30121l55970r8083l11048r3699k24516j26813
2048F976971k15005k63762j81255k32671j90684j95682j80582j34909o5178j00530
2038E216713o5801j16957j97541k60179j23786j40289r6657j9934j78091j3383
2028D004095k04437L075k44053R1171m9697k97706q0265P4293j95938j19892j57212
2017B823434k03117J45322J225k95071K6702n3716P6855j61952r4889j81587L5776
$$ y = [31879578, 29480056, 27676808, 25823032, 24540782, 23305375, 22267960, 20793891, 19830388, 18956410, 18071642, 17163603, 16545927, 15661811, 14882559, 14173588, 13580576, 12879112, 12367613, 12057789, 11698885, 11216118, 10798007, 10280383, 9892218, 9601532, 9336586, 9104835, 8880579, 8517221, 8187100, 7831130, 7733047, 7421999, 7328300, 7103784, 6976971, 6761966, 6498204, 6316949, 6084278, 5893594, 5697912, 5517330, 5382421, 5317243, 5216713, 5150912, 5033955, 4836414, 4576235, 4452449, 4312160, 4215503, 4195569, 4017478, 4004095, 3799658, 3802733, 3558680, 3649851, 3600154, 3302448, 3222183, 3296476, 3100538, 2980646, 2823434, 2620317, 2765639, 2766864, 2471793, 2498495, 2444779, 2521634, 2359682, 2264793, 2083206, 2118982]
2006B118982j00293q6493j34299j26351O6085L0998j60433O181P1584r5588j10386
1995A479987l4780M8955j4577k34799J31785j13016j39958R0145J19985k3872
1985A309855n4218k54410M1704j33438J760j29050j17098K57114R5111p0998R8463
1974A044795M037k26596R3654j48251J58582r561r7441K7613K8690m6523K9392
1963H58391j0426k27086j60979k5796J52791j29813r5457K6397J11655Q4377j48048
1952D36006j18042p5189K37350o008m9385j34170O5553P8708m063k09990J9714
1941B40484K79600J16501j44334j72807R7147n6354n8046j19358l9138J00273
1931B43968j46633n7130o0400q5324M6308m850q2883J79722P4267J19618l2048
$$ y = [2118982, 2018689, 1932196, 1797897, 1671546, 1737631, 1768629, 1608196, 1614377, 1685961, 1590373, 1479987, 1445207, 1494162, 1479585, 1244786, 1376571, 1263555, 1123597, 1213742, 1333727, 1309855, 1255637, 1001227, 1042931, 909493, 911253, 782203, 665105, 922219, 1017330, 946332, 1044795, 1048832, 822236, 915890, 767639, 926221, 916660, 819219, 846832, 875522, 828999, 858391, 847965, 620879, 459900, 434104, 586895, 457082, 361625, 388022, 499677, 584054, 436006, 317964, 242775, 480125, 474117, 424732, 290562, 356115, 434823, 430760, 220770, 240484, 520084, 636585, 492251, 319444, 416591, 360237, 302191, 182833, 143695, 243968, 97335, 40205, -20195, -105519, -59211, -64061, -146944, 32778, 107045, 226663, 194615]
1920A94615M231J00397J8417J10689o5515o6634l5624j2742L9288j72761j03119
1909A1242J8921J15050n5544P7324M4685k2905j17261p989P9533j04630m0557
1898b131K60349j4486M1548p6116j65470r921P391q0725L6100L4381R5757k23572
1886i6895j58101J36918O5268q7548J27163J47438j86933p6643J92810j31472
1876f7995n5352O5206J78424o4753r0426o751J67795J42921r2672k68433j6597
1865a08633J48940J34244j65790o1304R4820J21905r3996m8048p287n8283j9177
1854f2609j21583K10850M6586K6776J40962J10970k07248K5236n3542k8406R1594
1843A79586O1082M7853K49695J03691J10410Q1779J73422R6736L5416J30981J5168
$$ y = [194615, 198846, 299243, 317660, 428349, 362834, 296200, 260576, 247834, 287122, 114361, 11242, 30163, 145213, 89669, 166993, 211678, 188773, 71512, 63523, 143056, 38426, -2131, 258218, 243732, 285280, 209164, 43694, 33773, 41164, -39561, -3461, 30920, 126677, -96895, -254996, -118078, -52810, -140358, -13195, 134243, -52690, -129333, 63477, -67995, -123347, -58141, 120283, 55530, -34896, -41647, 126148, 269069, 176397, -92036, -108633, 40307, 174551, 8761, -52543, 42277, 164182, 70186, 22138, 14851, -43432, -62609, -184192, 26658, 73244, 100020, 240982, 351952, 144704, 169940, 116398, 87992, 179586, 240668, 288521, 538216, 641907, 752317, 834096, 1007518, 1104254, 1139670, 1270651, 1285819]
1832A285819k25442k41511l45169j2602M9179k8947j08431k1135L9251k72165
1822A18847j84965m7970J11615M7594j06583R4017P3395k9871p1795j8094m2669
1811e6479M6924j07879J51531p1159l8911l2645j01529j3694o9223O3017J13692
1800a16355q1298J8577r1321R7093K5365L5655p607K3303j38105L2845J77057
1789b4791o913l9599j78454J78851J70951O683K8650k6872l86702R2046n51N1277
1777a35424Q40Q0381P691j60037J45657j28881j48593q1829n1109O0262J14767
1766b96275Q2027k4205J15062J48738j70230p3447r334J55328j45393j77393N0193
1755c44929K8525O0367J25679j4373k6791o5809j23450j06891J49488J70785j43567
$$ y = [1285819, 1060377, 818866, 473697, 461095, 510274, 481327, 372896, 351761, 391012, 118847, -66118, -114088, -2473, 45121, -61462, 32555, 105950, 76079, 4284, -13810, -56479, -9555, -117434, 34097, -37062, -75973, -108618, -210147, -223841, -293064, -230047, -116355, -197653, -179076, -270397, -173304, -147939, -112284, -119891, -96588, -234693, -201848, -24791, -31704, -71303, -249757, -70906, 100045, 106728, 135378, 108506, -278196, -186150, -186701, -135424, -134584, -54203, -46512, -206549, -60892, -189773, -338366, -420195, -471304, -411042, -296275, -214248, -238453, -123391, 25347, -144883, -218330, -227664, -72336, -217729, -395122, -344929, -316404, -256037, -130358, -144731, -171522, -237331, -360781, -467672, -318184, -147399, -290966]
1744b90966j18500N6315J76410j65287l7268K07132N3082Q782p9590j72176L9499
1733c22567j35842j07245K62910K29468P9409j45110p2631j05387J14319O9848
1723a32828k11696k8036P8228J2370J24036j1093k1097L5317m0381R8454j84806
1712b81532j36726j35389J49319P3090J70829r2969m8718J82958j48729l0141
1702b98008j1644N7532j35237J332P8758j19594J63474J28689q849N9999R4680
1691A1132l9166o9325k58946o746J14934j7484p7776l9665P2949K29854p0590
1680a50829m6082k70950o8351K4125J18953O8771n2884L3411J84422j23345r9789
1669c82548J19051j65762m7877O5637R2305J03985P4785j58595j330J19673l7031
$$ y = [-290966, -409466, -353151, -176741, -342028, -379296, -172164, -119082, -110300, -189890, -362066, -322567, -458409, -565654, -302744, -73276, 6133, -138977, -211608, -316995, -202676, -132828, -344524, -372560, -294332, -281962, -157926, -169019, -190116, -154799, -195180, -96726, -281532, -418258, -553647, -404328, -331238, -160409, -253378, -302096, -119138, -267867, -298008, -309652, -252120, -387357, -386025, -307267, -426861, -263387, -134698, -143547, -83548, 11132, -28034, -97359, -356305, -363051, -248117, -265601, -343377, -383042, -310093, -80239, -150829, -196911, -467861, -536212, -512087, -393134, -324363, -377247, -343836, -159414, -282759, -382548, -263497, -429259, -477136, -411499, -319194, -215209, -140424, -299019, -300349, -180676, -217707]
1658b17707r5560N7759j4358J52905j82404o789R894J5827J72067j34176J812
1647b40730J38479k42122k01761K89313K4911O4485l8592r1857P2501l8262J06085
1636a57550R8085j78894P3196k6163k36243J31264j25839K7627M6442J58437l7429
1625b27067j4083J82852N4972m8538j45218J21166p6711j08234r025J19894K1426
1614a28566L3087k9823L0270J10983L8571j32906L2826j30314j32332o2179M3315
1603c27068K35415M4649J00452o4144J41062j67553j29343K02023n6477p613N2605
1592B4008k63633m9084q6771J50967J97036o6843j11639o6381J49457j12681P8726
1581a56838o9596j0430p7930J1885k4543l3514J96586R8773j5757j82292J24790
$$ y = [-217707, -313267, -255508, -269866, -116961, -299365, -306154, -296260, -280433, -108366, -242542, -240730, -102251, -344373, -546134, -256821, -231910, -167425, -206017, -297874, -225373, -263635, -157550, -59465, -238359, -165163, -191326, -427569, -296305, -422144, -394517, -348075, -189638, -227067, -241150, -58298, -3326, -51864, -197082, -75916, -152627, -260861, -269886, -149992, -128566, -95479, -125302, -95032, 15951, 54522, -78384, -45558, -175872, -308204, -370383, -327068, -91653, -47004, 53448, -10696, 130366, -37187, -166530, 35493, -20984, -28597, 24008, -239625, -288709, -375480, -224513, -27477, -94320, -205959, -272340, -122883, -235564, -156838, -226434, -236864, -314794, -302909, -327452, -360966, -164380, -65607, -81364, -263656, -138866]
1570a38866r3694O9552P546p9766j55384J27724P0456m4149Q5783j64951n019
1559c20768K56767r6460n8452O0876q6100Q5015J3171j61470k0637J5300N0558
1548b62200j3893J1323K2498n3179j2287o0791P755J03350J8108m9663j6448K27099
1536g8328J20438j6694o8604j46980o0137R857L7151J65749r2902L1303j5922
1525a15069k36944J78826J97899k09248k4109J08545l8713M7969p429o1159L7386
1514a22046k4968M7852p0930k59589Q3518L8914J52103j06230J36572R3370j93295
1503b24729o5095O8639J72922q4407j47818m3444o9180O3085O1951P5774M5244
1492a47058l1009J3393j51572j62938J94518R4486J04321J4754M7693j26258j73219
$$ y = [-138866, -232560, -163008, -155462, -235228, -390612, -262888, -192432, -236581, -150798, -315749, -320768, -64001, -160461, -218913, -158037, -244137, -159122, -145951, -307421, -328058, -312758, -262200, -276093, -264770, -242272, -295451, -307738, -368529, -360774, -257424, -239316, -288979, -305427, -78328, 42110, 25416, -43188, -190168, -250305, -240448, -203297, -37548, -130450, -99147, -115069, -352013, -173187, 24712, -184536, -208645, -100100, -138813, -90844, -98273, -159432, -122046, -147014, -99162, -170092, -429681, -346163, -307249, -155146, -261376, -124804, -31434, -224729, -289824, -221185, -48263, -132670, -280488, -323932, -393112, -330027, -268076, -192302, -147058, -178067, -164674, -316246, -479184, -284666, -190180, -85859, -71105, -23412, -149670, -322889]
1481c22889J9451J03948J0705Q9130K92k51168P5130J20112q0636q6169J75978
1470a46116J38698j46883m8510L3617K9508K227O5676p1765k7028o7383Q1525
1459a56434q680O1985n8829J5806q4q1026q8991j46303J10883O9604n6051k1558
1447c59678J48189o953M2787l3733j6865q040k49J63590j21285P3863J49368r7312
1435f6318j16927j06666r4311P3227R4166q3352J98208p0398R3891k459j02559
1424a83498R4306J13539m5744J5658j21153K2580n4833J70948j36464M1822j2877
1413i5716r3643l2812k89242K86279N5348J59999J29053n7133L977j20285N4156
1402a9J75373j92917j03172m7398R2349j239L5247n8287P4795j9700m1413J0318
$$ y = [-322889, -303438, -199490, -188785, -99655, -99363, -350531, -275401, -155289, -235925, -322094, -146116, -7418, -154301, -202811, -169194, -139686, -137459, -71783, -143548, -170576, -237959, -156434, -165114, -103129, -161958, -146152, -146236, -227262, -316253, -462556, -351673, -282069, -338120, -359678, -211489, -218442, -175655, -209388, -226253, -234293, -234542, -70952, -192237, -118374, 30994, -66318, -183245, -289911, -384222, -310995, -216829, -300181, -101973, -172371, -78480, -80939, -183498, -89192, 24347, -21397, -5739, -126892, -104312, -159145, 11803, -124661, -82839, -95716, -189359, -222171, -511413, -225134, -169786, -9787, 119266, 62133, 66110, -54175, -19, 175354, -17563, -120735, -168133, -75784, -77023, -41776, -100063, -25268, -44968, -86381, -76063]
1390g6063j31436K32917o9186j63918m0789K00150m1607Q8060q5546q3398l2187
1379b03003m7497J18668O2863q2011j35126J86826Q667r1020j16690J92881J8798
1368h6644j8672M7359N3024j15097j22173r0952N3160J44127j06873J00852J2442
1357a29447j13175J67837O5946j49251n2192J07913P1610n8938j28163J16292
1347a01568J9979J03397M0967j4219K0725j7508K1387r4538J34107j77384j6115
1336h0770M3679j10392J856j49692J52938K56807n3906l0962k12087q2045J58194
1325a06380K7033k24418P9934J01404O6732J04888j83335j91132j3451J13925
1315b24800R9948j0831l9730J18838N3811j80673J07606J65484R2150n5499j80874
$$ y = [-76063, -207499, 25418, -43768, -207686, -248475, -48325, -89932, -1872, -87418, -170816, -203003, -250500, -131832, -68969, -150980, -286106, -99280, -90613, -181633, -298323, -105442, -86644, -105316, -57957, -4933, -120030, -242203, -333155, -279995, -135868, -242741, -141889, -129447, -242622, -74785, -8839, -158090, -210282, -102369, -30759, -89697, -217860, -101568, -81589, 21808, 62775, 48556, 69281, 51773, 73160, -21378, 112729, -64655, -80770, -37091, -147483, -145627, -295319, -142381, 114426, 60520, 29558, -182529, -264574, -106380, -79347, -303765, -223831, -122427, -55695, 49193, -134142, -325274, -338725, -224800, -124852, -135683, -175413, -56575, -2764, -183437, -75831, 89653, 181803, 126304, -54570]
1304e4570p841Q1983m7747j35771J26972n6498J9664l2690k8530J46512R0669
1293A02153l5780j44648p1741J22279n3299k46826J11080J89468k05842N5816
1283a77340k6929K22713Q8113j62932K15401J23459j77120j02394k8566l54569
1273c80164J92860R4859n3815l0076k1723J11055m1996J0156j24525O5226J08073
1262g0070j13089j03334k1421O5001J16774q209J27902L4367k70261J18844J39660
1251A6164k9581O8052J2374N2353L4325q3112K8983k0289J28718j52673k36276
1240a80962R3832N7450p3401L779K64908p3572k14592j5227j7391j14100N7002
1229b12274J70379J01741Q5466J5921k28773j8368M1546j80856J38265k01664
$$ y = [-54570, -62411, 19572, -28175, -163946, -36974, -93472, -73808, -106498, -135028, 11484, 102153, 66373, -78275, -150016, -27737, -81036, -327862, -216782, -27314, -233156, -177340, -204269, 18444, 106557, -56375, 159026, 282485, 105365, 2971, -25595, -380164, -187304, -92445, -146260, -176336, -198059, -87004, -129000, -118844, -243369, -178143, -70070, -183159, -286493, -307914, -242913, -126139, -134348, -6446, 27921, -242340, -123496, 16164, -13417, 54635, 67009, 119362, 153687, 70575, 99558, 79269, 207987, 55314, -180962, -87130, -29680, -103081, -99302, 165606, 92034, -122558, -137785, -155176, -269276, -212274, -41895, 59846, 145312, 161233, -67540, -85908, -44362, -225218, -86953, -288617]
1219b88617N0407J06833l9132J45778Q6202K5307O456R3454J66375j82163o0097
1208A10803J1849J1148j42578k23677o9568J63817K15761Q5778j69479j13611
1198a19757J5718j23998n5326K5342K016J548L19393j68276J7307R1464k07486
1187b02055o3335O1074o844N7475M4170J38370L5980j06225K4973J15640j3648
1176H5575J59920l6292j62132k97768K09980J01786j12524j0060j19005J5203
1166a65317J59747M7168L6369k6131M776M3240j33501j39739n2663K26117Q9309
1155H9375j2329l8602p6417J65433k5285k10514J7908r2401l8768J64286P7798
1144B0484p5895J31661l7724o1763o6977Q8568n0145J24346L5174j72790l2426
$$ y = [-288617, -238210, -131377, -170509, -24731, 61471, 86778, 93234, 186688, 353063, 170900, 110803, 122652, 133800, -8778, -232455, -302023, -138206, 77555, 163333, -6146, -119757, -104039, -228037, -283363, -258021, -256005, -254457, 64936, -103340, -86033, 5431, -202055, -265390, -204316, -211160, -153685, -109515, 28855, 64835, -41390, -16417, 99223, 85575, 245495, 209203, 47071, -250697, -40717, 61069, -51455, -61515, -180520, -165317, -5570, 41598, 77967, 51836, 56612, 99852, -33649, -173388, -226051, 66, 89375, 77046, 38444, -37973, 127460, 102175, -108339, -90431, -182832, -221600, -57314, 20484, -55411, 76250, 38526, -23237, -90214, -1646, -51791, 72555, 107729, -65061, -97487]
1133i7487J52225j40440J35234J67684j36147j57852M3851J2578L5769N5749j18893
1122d7729k0941n796l4296m509K13276j76110R4067O0606k50643J46366M4330
1111A8621j39768k4472O9717r862O904P2401L8177o0229M8247J00215k4785N5271
1099A50437j21968r0900N4190J30792j26408L3606O1380J05897j70193j07842
1089h1009o3644k7420o7426O7554J2409J30601k3114k9700J9088j0472J00322
1078B7189k14277J25316J51325m1085j01168K7583k5936J3279p4763Q0388O3030
1067C0881K5981q7528R568J03909J05985j41233o3027L4355O4183R5096O1351
1056B39521J7236k44134K6340P1276l49856J09946M4097P9421L3197J925k00200
$$ y = [-97487, 54738, -85702, 49532, 217216, 81069, -76783, -32932, -20354, 15415, 71164, -47729, -68670, -74466, -108762, -113271, 100005, -76105, 17962, 78568, -172075, -25709, 18621, -121147, -145619, -75902, -85764, -78860, -6459, 31718, -28511, 19736, 119951, 95166, 150437, 28469, -62431, -8241, 122551, -3857, 29749, 91129, 197026, 26833, -81009, -144653, -172073, -239499, -171945, -159536, -28935, -52049, -81749, -62661, -73133, 27189, -187088, -61772, 89553, 48468, -52700, -25117, -51053, -37774, -112537, -32149, 30881, 56862, -30666, -21098, 82811, 188796, 47563, -15464, 18891, 83074, 178170, 239521, 256757, 12623, 38963, 110239, -239617, -129671, -85574, -6153, 27044, 28969, -171231]
1045a71231m5786Q0159N9377K5775l7726q0510n7570N0606L8294R1818P4017R2159
1033A19382n627j10255j80816J26392p3882O1856j63508R3523M6496j2094Q7259
1022a1274K7676j1269M9927j04290R0950n0686j09738J72464M4503P8068j84319
1011g988Q2939l1237j04490N8772p8343k675M6205M7759N1904J41007p3001j0210
999A20642L952j41863M3947l4375j56622J15891R4791O0445n4549j61849q822
988a18412J64225M6963J0157J3799j40417j27877N5591M8699M1953j88853j61935
977c56107K42493K02710J2530o1053r1974j4646J01689j22292L0667m700j41325
966b02008J23747n5620k2836K26638j25859n8759m503Q4996J4481Q9493q3660
$$ y = [-171231, -217017, -136858, -77481, -51706, -89432, -169942, -227512, -176906, -138612, -46794, 27223, 119382, 113755, 3500, -177316, -50924, -124806, -62950, -226458, -132935, -86439, -98533, -11274, 16402, 5133, 55060, -49230, 41720, -8966, -118704, 53760, 98263, 176331, -7988, 74951, 43714, -60776, -2004, -80347, -83022, -36817, 10942, 62846, 203853, 130852, 120642, 124594, -17269, 26678, -7697, -164319, -48428, 46363, 106808, 52259, -109590, -118412, 45813, 92776, 102933, 116732, -23685, -151562, -95971, -47272, -5319, -194172, -356107, -113614, 89096, 101626, 40573, -51401, -66047, 35642, -86650, -55983, -60683, -202008, -78261, -133881, -156717, 69921, -55938, -114697, -119200, -34204, -19723, 69770, -13890]
955a3890p5825R7246R0074j15420k17911J16034J87413N6378R116k29913n2331
944a49029j02388K54537O9336r2778l9172l5605J98737o1893J95616j5282k29144
933g065j978j9813j9348J17021J53697r3762j54691l115l6117L0848m257J33243
921I4663j69763L8075K64139N9522j35342j33930J38747j4517j69375o2998J51851
910F1072j6901Q8676P319n7050l4128j67028K6110L6573K19677r9227n6255J14717
898A23555J6229k72213j088K34590m334J23045j06053J29644k861m5012r152o1081
886A25269j4990q5817q827Q5715N8573J6067j7974j32097O4675m4545o1364M3391
874B8076J24396j56948n9194j04013L8120K210J33852R516M5920j15347N4112
$$ y = [-13890, -89715, 7531, 97605, -17815, -235726, -119692, 67721, 124099, 133215, -96698, -149029, -251417, 3120, 72456, -20322, -59494, -95099, 103638, 41745, 237361, 222079, -7065, -9043, -28856, -48204, 68817, 222514, 128752, -25939, -29054, -65171, -34323, -38580, 94663, -75100, -37025, 227114, 286636, 151294, 17364, 156111, 141594, -27781, -90779, 61072, 44171, 132847, 140166, 83116, 48988, -118040, -91930, -55357, 164320, 65093, 8838, 123555, 139784, -132429, -133517, 101073, 96739, 219784, 113731, 243375, 240514, 195502, 186350, 125269, 110279, 24462, 15635, 101350, 159923, 175990, 158016, 25919, 90594, 46049, -15315, 28076, 152472, -4476, -63670, -167683, -129563, -127353, 6499, 16015, 61935, -53412, 700]
863G00Q5117r1974j46919l7932J48817j15518J26822O6322J21452L3137j03801
852H6223j92539K83733O103p0093J82154o1109J06709l8253o567N8443j80233
841A74571k14702J04521J53235n7336j87483O3396P2389K4069j60338l3430p0060
830a31168J13904N5986q4527N0328Q0926j24153k60167J61250J65624J37283o9761
819I5525k178k48167J36287O7941O6206o5981m2097J1585K74540J09130k33640
808A69151L5920R947j51763J12492o8881q2467n3880J01665j2251J3032M3737
797A16702J2023j13825q9888O3778m0436J11638j45789k5783J06537K16408j29307
786H2058J24272M5920J483j4864j38391R2188K4249k6616j35937P8596J59882
$$ y = [700, 85817, -6157, -153076, -191008, -42191, -157709, -30887, 35435, 156887, 190024, 86223, -106316, 177417, 183520, 113427, 295581, 234472, 341181, 302928, 296361, 354804, 174571, -40131, 64390, 217625, 160289, -27194, 36202, 108591, 132660, -27678, -61108, -131168, -17264, 38722, -45805, 4523, 85449, -38704, -298871, -137621, 28003, 165286, 95525, 93347, -154820, -18533, 49408, 115614, 49633, 7536, 19121, 293661, 402791, 169151, 205071, 215018, 63255, 175747, 106866, 24399, -29481, 72184, 59933, 72965, 116702, 128725, 14900, -74988, -11210, -51646, 59992, -85797, -111580, -5043, 211365, 82058, 206330, 252250, 253733, 238869, 100478, 192666, 216915, 190299, 54362, 132958, 292840]
775B92840j13278j31571j9744N5040J12628P8719j58440M0236L842J1913J40655
764C12840k60336o1753J73033R380L8755o5613o6888k1052j60138R5834m0023
753d5961J00628L7022J36754N9450j05217k10818M846J7499j1385o0444j34923
742b12549J38924P9635J01024L9551m4192L266r5381J34503K33761k45438k21665
731h8561L5323J58051m3764N6385N7670M1497p1404N3338q5087k6444Q2631K7080
719A96715j07656L818o0105K58419L3835p2449r2915j8730j7355k48664P3911
708e1176j9342O6255J58109R8861q2542k10446k6648J19217J71615N2055j51010
697A24948O7342r1606O0174K9753r1464n3144P5869J21565k01094j12845j52758
$$ y = [292840, 179562, 47991, 28247, 83287, 195915, 274634, 116194, 156430, 160272, 172185, 312840, 52504, -9249, 163784, 173164, 211919, 146306, 79418, 58366, -101772, -5938, -45961, 54667, 91689, 228443, 287893, 182676, -28142, -23296, -5797, -17182, -77626, -212549, -73625, 6010, 107034, 146585, 102393, 105659, 10278, 144781, 378542, 133104, -88561, -53238, 104813, 61049, 117434, 175104, 216601, 145197, 198535, 113448, 87004, 169635, 196715, 89059, 92877, 32772, 291191, 325026, 252577, 159662, 140932, 123577, -125087, -51176, -70518, -4263, 153846, 252707, 170165, -40281, -66929, 52288, 223903, 275958, 124948, 192290, 100684, 160858, 190611, 99147, 46003, 121872, 243437, 42343, -70502, -223260]
686b23260J94016P6113n1117j5356J14378Q3580j06784n432N3331J19026j73627
675F4868l3452J56146p4119K5129n502o2160J1880J00849o8591j23155M0965n8344
663b5486r5951O5168J6049O0009O8553p7239j08483K05080J18338p0830R3321
652B48529r2958j52209k7013O9956P115J52439q1987j43460j56294J91116O6711
641H1945J38122n1938l9965J03474p404Q6656m8324j7206r6079K19980J4598j8656
629C65203j30377j04104j22041r5264P1164m202K15814P4750l8679J94013k18652
618B07625r1507k0687j2167J65481j19126Q5398J99432j91640j42203R9399n4429
607A25576O5515q625j22508R8724N8680r060j96890J7173N9787N3380j02416m633
$$ y = [-223260, -29244, 46869, -4248, -19604, 94774, 178354, 71570, 66138, 119469, 238495, 64868, 31416, 187562, 113443, 138572, 133070, 70910, 82790, 183639, 115048, -8107, 32858, -25486, -121437, -56269, -40220, 19789, 88342, 11103, -97380, 107700, 226038, 155208, 248529, 155571, 3362, -23651, 46305, 53420, 205859, 123872, -19588, -175882, 15234, 81945, 220067, 168129, 128164, 231638, 224234, 310890, 262566, 245360, 149281, 369261, 383859, 365203, 234826, 130722, 8681, -86583, -15419, -19621, 196193, 270943, 232264, 426277, 207625, 116118, 95431, 83264, 248745, 129619, 215017, 414449, 222809, 80606, 180005, 125576, 191091, 182466, 59958, 158682, 217362, 208302, 11412, 28585, 88372, 141752, 39336, 34703]
595C4703L20583r6801j00833j83376J32363k14821J11254M6956j9316r0224M416
584e5096J07510k94672J83259j1098r2390J15921K32965j28589j47511J17905
574B8204O5275L3353Q5446k156j41729O3795q904k2941r5246M9470j482N7857
562A10942J27974q458j42226k6663J9430J11216n257j94648K06766j46845O0816
551A13047Q8354k00750K5506M1555j20057J70073P2132J14756m6620r4111K70248
540D34133j94271q7960J39588q0088j11491J48872j96415J34249j00422M2584
530A28779Q5028N8281j10959Q8196o426j41396O7369J7501P8096n8303l9683N114
518A71597L7448J3022K4570K5006J62537j27507j49622k5596J40175N5918k08387
$$ y = [34703, 355286, 258485, 157652, -25724, 106639, -108182, 3072, 50028, 30712, -59512, -55096, 52414, -242258, -58999, -70097, -162487, -46566, 186399, 57810, -89701, 28204, 93479, 126832, 212278, 210122, 68393, 132188, 123284, 100343, 5097, 54567, 53085, 110942, 238916, 230458, 88232, 61569, 80999, 192215, 186958, -7690, 199076, 52231, 113047, 201401, 651, 26157, 67712, -52345, 117728, 189860, 304616, 257996, 163885, 434133, 239862, 151902, 291490, 211402, 99911, 248783, 52368, 186617, 86195, 128779, 213807, 272088, 161129, 249325, 242899, 101503, 168872, 186373, 264469, 206166, 166483, 171597, 209045, 222067, 246637, 271643, 434180, 306673, 157051, 131455, 271630, 327548, 119161]
507A19161q2245O2907j0750N1233O4209j77274M4266J4224j01706L865P9983P9014
495A46887j39712Q8713j78489J8896j38414L7801J38585J63408K4917l9939j17741
484D912J69326q3632k63387J22435J85451l4358K6808j46996j7389J10832j9796
473E4206o2477J62420Q2986j40046j41452Q5433J57548o8282R179O6960j46447
462F0028o351L4511J9940r0805K38899n0062j5054K3550j2770J33692k3205q1880
450B30493o350n8193k00176m3910k1326P1454M1072Q2851p7974K4795k7247N3486
438F8975K02555J39328k60141O8869k32768j49114N942n994J51018Q8142o9362
427G450J34721J53799k7618j73140J07485J38113R358m4646N1893J20205k9458
$$ y = [119161, 36916, 99823, 89073, 140306, 204515, 27241, 71507, 85731, -15975, -12110, 67873, 146887, 7175, 95888, -82601, -63705, -202119, -164318, -25733, 137675, 162592, 122653, 4912, 174238, 90606, -172781, -50346, 135105, 100747, 127555, -19441, -36830, 74002, 54206, -8271, 154149, 237135, 97089, -44363, 41070, 198618, 130336, 139515, 206475, 60028, 53677, 88188, 108128, 17323, 256222, 206160, 191106, 214656, 201886, 335578, 312373, 230493, 224143, 165950, -34226, -78136, -99462, -28008, 13064, 95915, 17941, 42736, 15489, 68975, 271530, 410858, 150717, 219586, -13182, -162296, -156354, -162348, -11330, 76812, 7450, 142171, 295970, 268352, 95212, 202697, 340810, 350168, 305522, 357415, 477620, 448162]
416D48162j49075j27210k48539J05940J28914M9237q3132K4467L772O2523n0669
405A64390L8518J22576q1654N667q0042k22495J61785r592j35787K22302J37732
394C23400J55107j68594j27126j4134R4132J94120J19939j34604j23452r7436
384B21352q2662l3810R3890J65906o4996P9985J03147j76699M6373r3104R4811
373C54193J504P9032m6756j57387r0615P4622j68906J3323K6974Q4469J99127
362C69580j2484j48184N1147p623J05837q9010k85399M33J74264J16909K2209
351B97679j47512j11119J99106K015L9733n9518R870n4817P3937j5699M0558R2119
339C66352N0535j52028L7171J51607Q4555j63256j9766r8552p8215m8312J53950
$$ y = [448162, 299087, 171877, -76662, 29278, 158192, 207429, 124297, 148764, 152536, 215059, 164390, 202908, 325484, 243830, 249497, 169455, -53040, 108745, 99153, -36634, 185668, 323400, 478507, 309913, 182787, 168653, 262785, 456905, 576844, 442240, 318788, 221352, 138690, 104880, 198770, 364676, 299680, 379665, 482812, 306113, 352486, 259382, 354193, 355697, 434729, 387973, 230586, 139971, 214593, 45687, 59010, 85984, 170453, 369580, 357096, 208912, 260059, 252436, 358273, 269263, -16136, -15703, 158561, 275470, 297679, 150167, 39048, 238154, 240169, 279902, 220384, 230254, 175437, 249374, 233675, 274233, 366352, 416887, 264859, 302030, 453637, 538192, 374936, 355170, 256618, 178403, 130091, 284041]
328B84041J88630j81976m8792R1419j11982q1328R6530J72279j40000o9939j08659
317I0223n2566k40781K39105K98690j37792K9284L3617l1497N3343q821p0890
306B01915K5475l1883k768M6724j32796J01415J9077l48654K28898O4365K74162
295D45930J5590q4345L9073j41763k10954m8484J21434O3585K3858n3220n4306
284A16398R693J10478J9736k07336r469J92664k11330N1690J39938L6880l0692
273B18650o4265J88621j47612Q5982J03051l9328j12023p345L0382M376O724p9152
261A88061j27200J0578J7931O4906J75668k0814r2023n1707J19012Q5879L7526
250D07817J14493k23617q2272P7516k0531R090J9011l8678J61516o8417k7444
$$ y = [284041, 472671, 290695, 241903, 333322, 221340, 140012, 236542, 408821, 268821, 198882, 90223, 37657, -203124, 35981, 334671, 196879, 226163, 259780, 228283, 281626, 272805, 201915, 227390, 195507, 192739, 239463, 106667, 208082, 227159, -121495, 107403, 171768, 445930, 461520, 377175, 416248, 274485, 63531, 15047, 136481, 200066, 223924, 170704, 116398, 126091, 236569, 256305, 48969, 39500, 232164, 20834, 72524, 212462, 249342, 218650, 154385, 343006, 195394, 281376, 384427, 345099, 233076, 225731, 256113, 260489, 267213, 188061, 60861, 71439, 89370, 154276, 329944, 309130, 217107, 165400, 284412, 370291, 407817, 522310, 298693, 216421, 293937, 273406, 282496, 301507, 262829, 424345, 355928, 328484]
239C28484m0673N8928r1884r4526O3260O3588J8848j11133J28348q104J9525M7270
227C81931n6223q7718K6559Q9016J3928j02547o3735J3320p1438O77O7605P4655
215B86030M1334n2637k3028J685q5231N1095J29561K00782j73023j13886j05501
204A57181P3413r5205m1443N0711p767K4060J65535m0984j56456o4670J15670
193A80045J16810j27241P70R9953K00418j19993N485r4169k3281R330n6030N1099
181B43196J07888q6883M3588j04780L4691j37143j58639O8531N661K14523J14189
170C44822j54844M5493N4345O0861Q6501k13544j09339K8528J1311K73540n8452
159C69222M7763l3605N6932m4721J46592K5807r8475j37269J4930r8298o599j78319
$$ y = [328484, 287811, 346739, 254855, 160329, 223589, 287177, 306025, 194892, 323240, 315136, 334661, 381931, 325708, 237990, 264549, 353565, 367493, 264946, 201211, 214531, 143093, 143770, 211375, 286030, 327364, 274727, 251699, 253384, 168153, 219248, 348809, 549591, 376568, 262682, 157181, 230594, 135389, 93946, 144657, 136890, 160950, 326485, 285501, 129045, 64375, 180045, 296855, 169614, 170384, 270337, 470755, 350762, 356247, 262078, 238797, 248127, 192097, 243196, 351084, 264201, 307789, 203009, 237700, 100557, -58082, 10449, 16110, 230633, 344822, 189978, 235471, 289816, 350677, 437178, 223634, 114295, 142823, 154134, 427674, 369222, 416985, 383380, 440312, 395591, 542183, 567990, 469515, 332246, 347176, 248878, 242279, 63960]
147F3960n69J87235p2670Q365M4740j15767k3590J24672N3188O8227J1024j71538
135A77277n4307O5112O2251L4929k2911j39299q4565L3368L8102J19427J04216
124C33600J4725j73115J05566k2463n6360K765q8461j4102L9486O8019J23823
113C33483k1303j13366j4702J55987P4977J0410j04514P3852j03877l6986n8643
102A95318j64857J073L12368r1173m1675J50731m9152m6986k5948o4337k0559
91A54803m1400Q2767R4029O8323n5560q835j07541L2715K5281M4197P8385j00808
79B66356m9256o0593K5252r244L1811R0829K5912q7859m940p0431l0211Q2924
67B10550N5649q2765k5497P2012j1295p5475Q989J69242M8341o3233j05475l4487
$$ y = [63960, 63391, 250626, 177956, 186321, 231061, 115294, 91704, 216376, 269564, 337791, 348815, 177277, 122970, 188082, 250333, 285262, 262351, 123052, 38487, 71855, 109957, 229384, 333600, 348325, 175210, 280776, 258313, 201953, 204718, 116257, 102155, 141641, 209660, 333483, 312180, 198814, 184112, 340099, 415076, 425486, 320972, 394824, 290947, 253961, 195318, 30461, 31534, 343902, 252729, 211054, 361785, 312633, 265647, 239699, 175362, 154803, 113403, 196170, 290199, 358522, 302962, 294127, 186586, 219301, 244582, 288779, 367164, 266356, 217100, 156507, 181759, 172515, 204326, 295155, 321067, 233208, 228268, 157837, 127626, 210550, 266199, 183434, 157937, 229949, 218654, 143179, 152168, 321410, 369751, 306518, 201043, 166556]
55A66556m1275L5658J07189n6774J43980o5559m2810M1953l8742P0890j1717K5539
43C34888M397K4617n8167l0427J4568P4657j58846P1101J41377n302r8417M0760
31C55206j40931j9453J18295n5811p4495Q871k8461J3964J27794r3553j5101K2161
19B18486M7880M8105j16079l8992J50645j05615M1103n3662k4182J75659n3013
8B90335j45451N5955K8910Q390O4009m5595j25050K01968
0C33471
$$ y = [166556, 125281, 160939, 268128, 211354, 355334, 289775, 246965, 288918, 250176, 321066, 309349, 334888, 339285, 363902, 305735, 275308, 289876, 364533, 205687, 276788, 418165, 412863, 314446, 355206, 214275, 194822, 313117, 257306, 182811, 191682, 163221, 177185, 304979, 211426, 196325, 218486, 266366, 314471, 198392, 159400, 310045, 204430, 245533, 191871, 167689, 343348, 290335, 144884, 200839, 229749, 238139, 302148, 256553, 131503, 333471]
$$ Imaginary data points
##PAGE= N=2
##DATA TABLE= (X++(I..I)), XYDATA
16383a636901R1728K6500L7733R2690n3592j9804J06623L0287J2904J24909j8195
16372a205118M0071l2664R959l005J3994R4343l3497o4611n4303K5683N5132L9920
16360a114096J8877M5641O2059M5908J56269J29068l2530q0790k7538m6532n3511
16349h97175J84386m213J04322J33023o4042j18678J00966J34818m6185L4536
16339d38242o2115k7870R4397J5254M9164j43737K8055P5598n3063J28232J23010
16328b11317Q6363j33166K3167M487J42766J78080j58056l3009J33623N054j5856
16317B2136M7882L6908N1413j29237j0085O511Q3622M4945P8301J0230j6946P4521
16305C00201M2458q9539p8150O9021K06997J01879j35003j4342m1978j10223Q8407
$$ y = [-1636901, -1545173, -1518673, -1480940, -1388250, -1441842, -1461646, -1355023, -1324736, -1311832, -1186923, -1205118, -1165047, -1197711, -1187752, -1190757, -1176763, -1082420, -1115917, -1180528, -1234831, -1209148, -1154016, -1114096, -1095219, -1049578, -987519, -941611, -785342, -656274, -688804, -769594, -797132, -843664, -897175, -712789, -717002, -612680, -479657, -543699, -662377, -561411, -426593, -472778, -438242, -500357, -528227, -433830, -418576, -369412, -513149, -485094, -409496, -462559, -334327, -211317, -124954, -258120, -234953, -230466, -87700, 90380, -67676, -100685, 32938, 37992, 22136, 70018, 106926, 158339, 29102, 19017, 25528, 109150, 154095, 232396, 242626, 225680, 300201, 342659, 253120, 174970, 243991, 450988, 552867, 417864, 403522, 361544, 251321, 339728]
16294C39728q331m8754L2870L2154K988m0179L4319J08490J27667L6678K820k7370
16282E93080j4632k6103K3000N5540l713O4486J07388j05437Q7626M447J1430
16271G97112M6468Q271J06122J67131j81317M9720m4754n0419o3436K8774k4274
16260H39398l1979J28728J15653J71384p3965P1485o3410j382K5300m0251n3232
16249A087729O0493L8964P4787o8380M2922J0500J04212J4349j16288O0804L3476
16238A343568r5993j4574J67011J89518M3354n9821p1921J28340k6364j45155
16228A457963J61046o0168j89698K14977j9134J20291o6002j6663Q2054l7811
16218A646855K9353j06078n3880n6491o1614R9923J59026Q762j40434j59426Q1507
$$ y = [339728, 331397, 282643, 315513, 347667, 350655, 310476, 344795, 453285, 580952, 617630, 620450, 593080, 578448, 552345, 575345, 630885, 627172, 691658, 799046, 693609, 781235, 785682, 797112, 843580, 851851, 957973, 1125104, 943787, 993507, 948753, 898334, 834898, 863672, 839398, 807419, 936147, 1051800, 1223184, 1149219, 1220704, 1157294, 1155912, 1181212, 1140961, 1087729, 1148222, 1187186, 1261973, 1193593, 1236515, 1247015, 1351227, 1365576, 1249288, 1310092, 1343568, 1247575, 1233001, 1400012, 1589530, 1632884, 1573063, 1501142, 1629482, 1603118, 1457963, 1619009, 1558841, 1369143, 1584120, 1564986, 1685277, 1619275, 1602612, 1684666, 1646855, 1676208, 1570130, 1516250, 1459759, 1398145, 1498068, 1657094, 1665856, 1525422, 1365996, 1447503]
16207A447503R8376M5029R2850l6490n4128J10967J6812R5185j54617j6718K40528
16196A885297O5316q1500j00171J91446N6035m1773n8870l0926n1625R4374l0527
16185A897076q2270O1060q1379P4439K6625M7690j76526o8809p4974j2837J67561
16174A777656R2400K6760K10339M2693p327r3318l413n6357o7745J67678l9164
16163B050202K9783q8051q1090o135J38975J97434o5126l1174r7344m1579k7733
16152A978162J13168Q8960k342k3873p847K4276k00774J41183K8590j07159p479
16141B024865J27284K3530J11461n3981o2928k0579m6581k854N2829M1296O3601
16130B257943J68081l5465j00722j69007q3283Q0160P3290j37501L5411J01555
$$ y = [1447503, 1545879, 1590908, 1683758, 1647268, 1593140, 1704107, 1720919, 1816104, 1661487, 1644769, 1885297, 1950613, 1869113, 1768942, 1960388, 2016423, 1974650, 1915780, 1884854, 1833229, 1927603, 1897076, 1814806, 1875866, 1794487, 1868926, 1895551, 1943241, 1766715, 1697906, 1622932, 1610095, 1777656, 1870056, 1896816, 2107155, 2149848, 2142521, 2049203, 2045790, 1989433, 1921688, 2089366, 2050202, 2079985, 1991934, 1910844, 1904709, 2043684, 2241118, 2175992, 2144818, 2047474, 2005895, 1978162, 2091330, 2180290, 2177948, 2154075, 2146228, 2170504, 1969730, 2110913, 2139503, 2032344, 2024865, 2152149, 2175679, 2287140, 2233159, 2170231, 2149652, 2103071, 2100217, 2153046, 2194342, 2257943, 2426024, 2390559, 2289837, 2120830, 2037547, 2117707, 2190997, 2053496, 2088907, 2190462]
16120B190462N4776J41617l9733k93143P1717J54762J2593r6277j07627P3666
16110B162813J30429k69211M7596J12286P1014m0293k128J73314j6646j41083
16100B228091J9462o2924L6860j78088p8514O4965j8709N3168p4806j0500K40699
16089B219704M9109K37357J01958R325m2019l31620M2300L191j244j61229P9025
16078B205857p6447n8584J9844Q1919L0109L3430j05051K8553J29013o8610N851
16067B225884o6173J70504J50707j93729m1746m7604J58980P2133l4065j5499
16057B379392N4362r8658j33833L4349R8183q739r8173Q9200j25198N483M0620
16046B236988j4168j165j31883J63104j5411j5734j69636N4031J71833N8430N4923
$$ y = [2190462, 2245238, 2386855, 2347122, 2053979, 2125696, 2280458, 2293051, 2196774, 2089147, 2162813, 2293242, 2024031, 2071627, 2183913, 2254927, 2214634, 2212506, 2385820, 2369174, 2228091, 2247553, 2184629, 2221489, 2043401, 1964887, 2029852, 2011143, 2064311, 1989505, 1979005, 2219704, 2268813, 2506170, 2608128, 2617453, 2575434, 2243814, 2286114, 2289305, 2288061, 2126832, 2205857, 2129410, 2070826, 2090670, 2172589, 2202698, 2236128, 2131077, 2159630, 2288643, 2220033, 2225884, 2159711, 2330215, 2480922, 2287193, 2245447, 2197843, 2356823, 2428956, 2394891, 2379392, 2433754, 2335096, 2201263, 2235612, 2333795, 2325056, 2226883, 2316083, 2190885, 2196368, 2236988, 2222820, 2221655, 2089772, 2252876, 2237465, 2221731, 2052095, 2106126, 2277959, 2336389, 2391312]
16035B391312J18626m1211p8820M5552k78430j06196J18827K05361q798J13576
16025B479799J769k59346j63288J36848J92734n0632J15246O2190j79989j30856
16015B204475K4726J47591N2859j25967r1693J82913P748l29966J58339j02415
16005B128610M9883M5571J68664k6705j86146K68095n5995j30696j05536L4138
15995B189883n9065J07729K15873K5402j7829p8518O371J4644j68806l7596J7629
15984B215717r6903J19941k6102O0692K13180j71469j31855j6290K39988r0407
15974B316492k36639k1659P5784j2649M0670K05438M9765k3667K5609j94958L8760
15963B262946p3815J28779M56P3190q664k81810l8682K67350N8115j03583P9113
$$ y = [2391312, 2509938, 2468727, 2389907, 2435459, 2157029, 2050833, 2169660, 2375021, 2366223, 2479799, 2481568, 2222222, 2058934, 2195782, 2388516, 2337884, 2453130, 2515320, 2335331, 2204475, 2229201, 2376792, 2429651, 2303684, 2211991, 2394904, 2402652, 2072686, 2231025, 2128610, 2178493, 2224064, 2392728, 2366023, 2179877, 2447972, 2391977, 2261281, 2155745, 2189883, 2130818, 2238547, 2454420, 2479822, 2461993, 2383475, 2389846, 2404490, 2235684, 2198088, 2215717, 2118814, 2238755, 2212653, 2273345, 2486525, 2315056, 2183201, 2166911, 2406899, 2316492, 2079853, 2058194, 2133978, 2121329, 2161999, 2367437, 2417202, 2393535, 2419144, 2224186, 2262946, 2189131, 2317910, 2318366, 2391556, 2382892, 2101082, 2062400, 2329750, 2387865, 2284282, 2363395]
15952B363395r7317P4121J14719J26612o9522j33856m9101o1354j97224M8950
15942B119423K43154R0489P3230j9187k41957l1163J7097Q9963o3830k7445L9202
15931B288976J06863j3968l2679O280l3237m928Q252k809m8983r8702p0060J56692
15919B261697L9006m4695L2391J33155j3460P9585N6243j26256j37696r218r4738
15908B176014L6885j15724k9289J33775p5418k0589q461J1186J68554k2381J3377
15897B267929J57561J7897P4488o4475j68085j5245M2137N6787m5867p0205j6894
15886B236028J00038o0978o4628J17088j8739o2580P6091j0469J3877N8862j22898
15875B261692P1721j8610J64824p6816O7030j02711R9757j12081n9188k5705j10171
$$ y = [2363395, 2266078, 2340199, 2454918, 2581530, 2512008, 2378152, 2329051, 2267697, 2070473, 2119423, 2362577, 2453066, 2526296, 2507109, 2265152, 2233989, 2251086, 2341049, 2277219, 2249774, 2288976, 2395839, 2381871, 2349192, 2355472, 2322235, 2317307, 2325559, 2322750, 2273767, 2175065, 2105005, 2261697, 2300703, 2256008, 2288399, 2421554, 2408094, 2487679, 2543922, 2417666, 2279970, 2270752, 2176014, 2212899, 2097175, 2067886, 2201661, 2126243, 2105654, 2097193, 2108379, 2276933, 2254552, 2267929, 2425490, 2443387, 2517875, 2453400, 2285315, 2270070, 2312207, 2368994, 2323127, 2252922, 2236028, 2336066, 2275088, 2210460, 2327548, 2308809, 2246229, 2322320, 2311851, 2325728, 2384590, 2261692, 2333413, 2314803, 2479627, 2402811, 2469841, 2367130, 2466887, 2354806, 2295618, 2269913, 2159742]
15864B159742J55020j10584m011l8812J92580n6499J74171J1741J8792J83633
15854B685773o8027j98869j42796N4773j2620J50119M827j37956R7397j07694
15844B324927q0614J35163J531l6752J08715j41555r043K6806r4633P914n8846
15833B183613R1552J13856J50550k51402r4024J76022j47296k6323m722K02623
15823B394449R4712R630L824j87320j22100N8513k122j0608q400R6261k8961k47304
15811B050574K35405k5279l1342K49240j07726n4788R9101K757o9621q058o0100
15800B280163j21397p6380Q3921M8421J24179j5297R7725p5485k0640P9804n6503
15789B348511Q0154j18022J67919q7982l3361J58597K9802J32501l6206k11257
$$ y = [2159742, 2314762, 2204178, 2200167, 2161355, 2353935, 2297436, 2471607, 2483348, 2502140, 2685773, 2617746, 2418877, 2276081, 2330854, 2318234, 2468353, 2473180, 2335224, 2432621, 2324927, 2244313, 2379476, 2381007, 2344255, 2452970, 2311415, 2302372, 2329178, 2234545, 2242459, 2183613, 2275165, 2389021, 2539571, 2288169, 2194145, 2370167, 2222871, 2196548, 2191826, 2394449, 2489161, 2498791, 2502615, 2315295, 2193195, 2251708, 2249586, 2238978, 2230578, 2326839, 2297878, 2050574, 2285979, 2260700, 2229358, 2478598, 2370872, 2316084, 2415185, 2417942, 2348321, 2340263, 2280163, 2158766, 2082386, 2166307, 2214728, 2338907, 2323610, 2421335, 2345850, 2325210, 2405014, 2348511, 2428665, 2310643, 2478562, 2390580, 2357219, 2515816, 2545618, 2678119, 2641913, 2430656]
15779B430656j03620p4836n6492L9434P1687o279K5202L8978Q8576j6865o6290
15768B370151m0622L1536j50747j9546N0924N2994J1195J23959P590j12029j15549
15757B209856N7965O6036J0323j11223J1316J73531l1677M3882J90926q3057l09063
15746B228815j6476K43260K7119p3268Q4961j76269j1625P1169K2960l6718K6385
15735B390313J79043o7827P0704k7005j14287j08734j87209L76164J22704r1202
15725B542664J11585j87881M5793L5867p6817L5674j35068j00854r7917Q6456
15715B259502J38105N3906N9583p908m0960J39302l0462j10603o3395j33906l6702
15704B226462K09373J07632M1931o1640k51258M6657K54085k4365p4039q2616
$$ y = [2430656, 2327036, 2252200, 2195708, 2235142, 2306829, 2300550, 2325752, 2364730, 2453306, 2436441, 2370151, 2329529, 2361065, 2210318, 2190772, 2241696, 2294690, 2305885, 2429844, 2437434, 2325405, 2209856, 2267821, 2333857, 2344180, 2232957, 2244273, 2417804, 2386127, 2430009, 2620935, 2537878, 2228815, 2212339, 2455599, 2482718, 2409450, 2494411, 2318142, 2306517, 2377686, 2400646, 2363928, 2390313, 2569356, 2501529, 2572233, 2545228, 2430941, 2322207, 2134998, 2511162, 2633866, 2542664, 2654249, 2466368, 2512161, 2548028, 2471211, 2506885, 2371817, 2270963, 2173046, 2259502, 2397607, 2451513, 2511096, 2503188, 2462228, 2601530, 2571068, 2460465, 2397070, 2263164, 2226462, 2435835, 2543467, 2585398, 2523758, 2272500, 2319157, 2573242, 2548877, 2474838, 2392222]
15694B392222Q4992K980m6840R1520J9115k26490O5007j37398p832J88511K0925
15683B446712O0871k9089p2817p4557j3977k4887J14185j41834l396J93159J73529
15672B627899N2813j29888j57327q1444L2427j91527R8623K8635K91J39348r13
15661B418937o9750p6601J60580N3307L1634l6364q7119O696l1394l4231L2296
15650B367991k46016J72729M58717j12829p2950j11461j26075K3070J7865K8956
15640B399997k26309K09585J56146L3484m559K4252m9221L4385o8522k26687Q5348
15629B367899J42719m2149L3738M0113k7541J45603k90817n2986m5227O1712J43281
15618B476345j7753O3159q2947q7549p9175R5064R9221k1084m1005n8269J58352
$$ y = [2392222, 2477214, 2480194, 2433354, 2524874, 2543989, 2317499, 2382506, 2245108, 2237276, 2425787, 2446712, 2507583, 2478494, 2405677, 2331120, 2317143, 2292256, 2406441, 2264607, 2261211, 2454370, 2627899, 2680712, 2550824, 2393497, 2312053, 2344480, 2152953, 2251576, 2280211, 2280502, 2419850, 2418937, 2349187, 2272586, 2433166, 2486473, 2518107, 2481743, 2394624, 2401320, 2369926, 2335695, 2367991, 2121975, 2294704, 2753421, 2640592, 2567642, 2456181, 2330106, 2353176, 2371041, 2399997, 2173688, 2383273, 2539419, 2572903, 2568344, 2592596, 2543375, 2577760, 2509238, 2282551, 2367899, 2510618, 2468469, 2502207, 2542320, 2514779, 2660382, 2369565, 2316579, 2271352, 2333064, 2476345, 2458592, 2521751, 2438804, 2351255, 2272080, 2367144, 2466365, 2445281, 2404276, 2346007, 2504359]
15607B504359L1796n068l1303J2252j38595m9280J55798j5191k33945K9834k2121
15596B238536J03713K8484J7539J16311j92449K5547R7863J15000m5389p1836
15586B433319Q4644m9395L6646n5973J41110K58040k9395k74428j5554j02399
15576B426615j16879J02215r653M9648q7574K09230n1908q6724n1006K53568j0518
15565B627014J0041p8689N2232o2534P6564Q7217k56929k23244J90490P56o4377
15554B358541L9355k06492O1357Q6596j8994N8848J21577j33802q7758o5114L8751
15543B252865J25610J8970R2639r9153J3624n0969p5429Q0071P8791J06987N4369
15532B598375O9056p0140j61328o1517J20897l8809k6525l6423j7332r8537j7206
$$ y = [2504359, 2536155, 2531087, 2499784, 2512036, 2373441, 2324161, 2479959, 2464768, 2230823, 2260657, 2238536, 2342249, 2370733, 2388272, 2504583, 2312134, 2337681, 2435544, 2550544, 2505155, 2433319, 2517963, 2468568, 2505214, 2449241, 2590351, 2848391, 2818996, 2544568, 2529014, 2426615, 2309736, 2411951, 2402298, 2451946, 2364372, 2573602, 2521694, 2434970, 2383964, 2637532, 2627014, 2637055, 2558366, 2610598, 2548064, 2624628, 2711845, 2454916, 2231672, 2422162, 2422918, 2358541, 2397896, 2191404, 2252761, 2339357, 2320363, 2379211, 2500788, 2366986, 2279228, 2214114, 2252865, 2378475, 2397445, 2490084, 2390931, 2404555, 2353586, 2278157, 2358228, 2437019, 2544006, 2598375, 2667431, 2597291, 2435963, 2374446, 2495343, 2456534, 2430009, 2393586, 2376254, 2277717, 2260511]
15521B260511l3912P3632P5893J47537K0821k60690M2284J0257r494M125J50300
15510B481264l707J9512m3318j29266n3694N5392k5556k8253J65507M4162j27383
15499B354660R166n6948J31919j8353j59982k3006j1959K00007j02756J45422
15489B468170J91891L0769m554k94389K0779M3061k17582J1672J30006n3165K2823
15478B349481Q4470r1220M6946j92271J09629J1970R8611M7826Q816m6864O1987
15467B489381j8845j11242n1669Q4039k9970K6327j67097J82097L9909L8452K7741
15456B509123j12257j77187J04524q850J63648J19349j64600j36223J3171N7987
15446B368685J0713L7653j19838N5892j34450L42711o8923j15991j1212J14818
$$ y = [2260511, 2226599, 2300231, 2376124, 2523661, 2544482, 2283792, 2326076, 2336333, 2326839, 2330964, 2481264, 2477557, 2497069, 2453751, 2324485, 2270791, 2326183, 2300627, 2272374, 2437881, 2482043, 2354660, 2363826, 2306878, 2438797, 2420444, 2260462, 2237456, 2225497, 2425504, 2322748, 2468170, 2660061, 2690830, 2686276, 2391887, 2412666, 2455727, 2238145, 2249817, 2379823, 2326658, 2349481, 2433951, 2342731, 2389677, 2197406, 2307035, 2319005, 2417616, 2465442, 2474258, 2427394, 2489381, 2470536, 2359294, 2307625, 2391664, 2361694, 2388021, 2220924, 2403021, 2442930, 2481382, 2509123, 2396866, 2219679, 2324203, 2315353, 2479001, 2598350, 2433750, 2297527, 2310698, 2368685, 2379398, 2417051, 2297213, 2353105, 2218655, 2561366, 2492443, 2376452, 2365240, 2480058]
15436B480058M8688j02751N444K6445n7519j36998J47129M273P1761j5605j30007
15425B340918l1645N0718L8774j13104J37774N329J136J8134r2581J33943J8307
15414B507703J98854r256j42828o3859j12258R263p5242O726k7620K52736k04385
$$ y = [2480058, 2528746, 2425995, 2431439, 2457884, 2400365, 2263367, 2410496, 2414769, 2486530, 2470925, 2340918, 2309273, 2359991, 2398765, 2285661, 2423435, 2428764, 2429900, 2448034, 2355453, 2489396, 2507703, 2706557, 2697301, 2554473, 2490614, 2378356, 2387619, 2312377, 2319103, 2291483, 2544219, 2339834]
$$ [...]
##END NTUPLES=NMR SPECTRUM
##END=
