##TITLE=1H_EC-3029(VI-3)
 CDCl3
 8 sc, 
 7.07.2022
##JCAMPDX= 6.0         $$ Bruker NMR JCAMP-DX V2.0
##DATA TYPE= NMR SPECTRUM
##DATA CLASS= NTUPLES
##ORIGIN= UXNMR, Bruker Analytische Messtechnik GmbH
##OWNER= root
$$ XWIN-NMR		Version 3.5
$$ Thu Jul  7 13:51:02 2022 Russian Standard Time (UT+4h)  she@DPX200
##.OBSERVE FREQUENCY= 200.1313499994
##.OBSERVE NUCLEUS= ^1H
##.ACQUISITION MODE= SIMULTANEOUS
##.ACQUISITION SCHEME= undefined
##.AVERAGES= 8
##.DIGITISER RES= 18
##SPECTROMETER/DATA SYSTEM= spect
##.PULSE SEQUENCE= zg30
##.SOLVENT NAME= CDCl3
##.SHIFT REFERENCE= (INTERNAL, CDCl3, 0, 15.7458)
##AUDIT TRAIL= $$ (NUMBER, WHEN, WHO, WHERE, WHAT)
$$ ##TITLE= Audit trail, XWIN-NMR		Version 3.5
$$ ##JCAMPDX= 5.01
$$ ##ORIGIN= Bruker BioSpin GmbH
$$ ##OWNER= she
$$ F:/spectra/data/she/nmr/H-F/1/pdata/1/auditp.txt
$$ ##AUDIT TRAIL=  $$ (NUMBER, WHEN, WHO, WHERE, WHAT)
(   1,<2022-07-07 13:49:43.28 +0400>,<she>,<DPX200>,
      <created by zg, POWCHK disabled, PULCHK disabled
       configuration hash MD5:
       00 E9 B6 7A A2 85 ED C7 34 08 36 98 17 FE 4E 26
       data hash MD5: 16K
       3A 98 95 A6 28 BA 87 B8 E8 55 9B 43 EB 52 0A 3C>)
(   2,<2022-07-07 13:49:51.48 +0400>,<she>,<DPX200>,
      <Start of raw data processing
       efp BC_mod = 2 LB = 0.24 FT_mod = 6 PKNL = 1 PHC0 = -18057.62 PHC1 = 11.00069 SI = 16K 
       data hash MD5: 16K
       F4 98 4B FB 83 2B 1C B8 84 DF 2A EB A1 41 30 62>)
(   3,<2022-07-07 13:50:17.10 +0400>,<she>,<DPX200>,
      <pk PHC0 = 4.760142 PHC1 = -6.199999 
       data hash MD5: 16K
       BC 82 F8 49 CB B4 B4 01 BA 16 B2 C0 93 7F C3 05>)
(   4,<2022-07-07 13:50:20.43 +0400>,<she>,<DPX200>,
      <abs ABSG = 5 
       data hash MD5: 16K
       01 98 31 26 CF 0E E5 B1 3E AB C3 5A 8C 4B 31 CA>)
$$ ##END=
$$ 
$$ hash MD5
$$ AF 89 BD 23 AF 91 96 77 07 97 1B 57 FD 1C 17 91
##$RELAX= 
##$RELAX= 
##$RELAX= 
##$RELAX= 
##$RELAX= 
##$RELAX= 
$$ Bruker specific parameters
$$ --------------------------
##$DU= <F:/spectra>
##$EXPNO= 1
##$NAME= <H-F>
##$PROCNO= 1
##$TYPE= <nmr>
##$USER= <she>
##$AMP= (0..31)
100 100 100 100 100 100 100 100 100 100 100 100 100 100 100 100 100 100 
100 100 100 100 100 100 100 100 100 100 100 100 100 100 
##$AQSEQ= 0
##$AQ_mod= 1
##$AUNM= <au_zg>
##$AUTOPOS= <>
##$BF1= 200.13
##$BF2= 200.13
##$BF3= 200.13
##$BF4= 200.13
##$BF5= 200.13
##$BF6= 200.13
##$BF7= 200.13
##$BF8= 200.13
##$BYTORDA= 1
##$CFDGTYP= 0
##$CFRGTYP= 5
##$CHEMSTR= <none>
##$CNST= (0..31)
1 1 145 1 1 1 1 1 1 1 1 1 1 1 1 1 1 1 1 1 1 1 1 1 1 1 1 1 1 1 1 1 
##$CPDPRG= <>
##$CPDPRG1= <>
##$CPDPRG2= <>
##$CPDPRG3= <>
##$CPDPRG4= <mlev>
##$CPDPRG5= <mlev>
##$CPDPRG6= <mlev>
##$CPDPRG7= <mlev>
##$CPDPRG8= <mlev>
##$CPDPRGB= <>
##$CPDPRGT= <>
##$D= (0..31)
0 1.2 0 0 0 0 0 0 0 0.06 0 0.03 0 0 0 0 0.0002 0 0 0 0 0 0 0 0 0 0 0 0 
0 0 0 
##$DATE= 1657187382
##$DBL= (0..7)
120 120 120 120 120 120 120 120 
##$DBP= (0..7)
150 150 150 150 150 150 150 150 
##$DBP07= 0
##$DBPNAM0= <>
##$DBPNAM1= <>
##$DBPNAM2= <>
##$DBPNAM3= <>
$$ [...]
##$SUBNAM2= <"">
##$SUBNAM3= <"">
##$SUBNAM4= <"">
##$SUBNAM5= <"">
##$SUBNAM6= <"">
##$SUBNAM7= <"">
##$SUBNAM8= <"">
##$SUBNAM9= <"">
##$SW= 18.0517283424941
##$SWIBOX= (0..15)
0 0 2 0 0 0 0 0 0 0 0 0 0 0 0 0 
##$SW_h= 3612.71676300578
##$TD= 16384
##$TD0= 1
##$TE= 0
##$TE2= 300
##$TE3= 300
##$TEG= 300
##$TL= (0..7)
0 120 120 120 120 120 120 120 
##$TP= (0..7)
150 150 150 150 150 150 150 150 
##$TP07= 0
##$TPNAME0= <>
##$TPNAME1= <>
##$TPNAME2= <>
##$TPNAME3= <>
##$TPNAME4= <>
##$TPNAME5= <>
##$TPNAME6= <>
##$TPNAME7= <>
##$TPOAL= (0..7)
0.5 0.5 0.5 0.5 0.5 0.5 0.5 0.5 
##$TPOFFS= (0..7)
0 0 0 0 0 0 0 0 
##$TUNHIN= 0
##$TUNHOUT= 0
##$TUNXOUT= 0
##$USERA1= <user>
##$USERA2= <user>
##$USERA3= <user>
##$USERA4= <user>
##$USERA5= <user>
##$V9= 5
##$VALIST= <valist>
##$VCLIST= <CCCCCCCCCCCCCCC>
##$VD= 0
##$VDLIST= <DDDDDDDDDDDDDDD>
##$VPLIST= <PPPPPPPPPPPPPPP>
##$VTLIST= <TTTTTTTTTTTTTTT>
##$WBST= 1024
##$WBSW= 4
##$XGAIN= (0..3)
0 0 0 0 
##$XL= 0
##$YL= 0
##$YMAX_a= 142522
##$YMIN_a= -210470
##$ZGOPTNS= <>
##$ZL1= 120
##$ZL2= 120
##$ZL3= 120
##$ZL4= 120
##$ABSF1= 15.76341
##$ABSF2= -2.28844
##$ABSG= 5
##$ABSL= 3
##$ALPHA= 0
##$AQORDER= 0
##$ASSFAC= 0
##$ASSFACI= 0
##$ASSFACX= 0
##$ASSWID= 0
##$AUNMP= <proc_1d>
##$AZFE= 0.1
##$AZFW= 0.1
##$BCFW= 0
##$BC_mod= 2
##$BYTORDP= 0
##$COROFFS= 0
##$CY= -3
##$DATMOD= 1
##$DC= 0
##$DFILT= <>
##$DTYPP= 0
##$F1P= 0
##$F2P= 0
##$FCOR= 1
##$FTSIZE= 16384
##$FT_mod= 6
##$GAMMA= 0
##$GB= 0
##$INTBC= 1
##$INTSCL= 0
##$ISEN= 128
##$LB= 0.24
##$LEV0= 0
##$LPBIN= 0
##$MAXI= 10000
##$MC2= 0
##$MEAN= 0
##$ME_mod= 0
##$MI= 1.114404
##$NCOEF= 0
##$NC_proc= -7
##$NLEV= 6
##$NOISF1= 3.799351
##$NOISF2= 2.8
##$NSP= 0
##$NTH_PI= 0
##$NZP= 0
##$OFFSET= 15.74579
##$PC= 1
##$PHC0= -18052.86
##$PHC1= 4.800692
##$PH_mod= 1
##$PKNL= yes
##$PPARMOD= 0
##$PSCAL= 0
##$PSIGN= 0
##$REVERSE= no
##$SF= 200.130005152886
##$SI= 16384
##$SIGF1= 3
##$SIGF2= 2
##$SINO= 5.538805
##$SIOLD= 16384
##$SREGLST= <1H.CDCl3>
##$SSB= 0
##$STSI= 16384
##$STSR= 0
##$SW_p= 3612.71676300578
##$SYMM= 0
##$S_DEV= 0
##$TDeff= 16384
##$TDoff= 0
##$TI= <>
##$TILT= no
##$TM1= 0
##$TM2= 0
##$TOPLEV= 0
##$USERP1= <user>
##$USERP2= <user>
##$USERP3= <user>
##$USERP4= <user>
##$USERP5= <user>
##$WDW= 1
##$XDIM= 16384
##$YMAX_p= 301854814
##$YMIN_p= -920604
$$ End of Bruker specific parameters
$$ ---------------------------------
##NTUPLES= NMR SPECTRUM
##VAR_NAME=  FREQUENCY,     SPECTRUM/REAL,   SPECTRUM/IMAG
##SYMBOL=    X,             R,               I
##VAR_TYPE=  INDEPENDENT,   DEPENDENT,       DEPENDENT
##VAR_FORM=  AFFN,          ASDF,            ASDF
##VAR_DIM=   16384,         16384,           16384
##UNITS=     HZ,            ARBITRARY UNITS, ARBITRARY UNITS
##FACTOR=    0.220516191357247, 1,           1
##FIRST=     3151.2049393535, 0,             0
##LAST=      -461.511823652282, 0,           0
##MIN=       -461.511823652282, -920604,     0
##MAX=       3151.2049393535, 301854814,     0
$$ Real data points
##PAGE= N=1
##DATA TABLE= (X++(R..R)), XYDATA
$$ [...]
7144B1954715O46580N43736J58805J98300K56717K56233l15381o31827m81916
7135B2585962l37035p37073q00811r79925o24917o84050p15609r59909r65500
7126A5781133r00032p13933m74059o90772p94877o37484m15853l92315q08683
7117I953125m38311j85936o05482m46153l13113j11559n26721o60461m00762j97089
7107F067538k00658r3741k25738r6580j5817j22221k95619m26528n4221M20276
7097D956691j29420p13170k95021N6988J00972j60505m39343k17746j9328j62811
7087B977307j26850K07170J63924m32860n03062j10292K71411O2141k20321j64105
7077B124463J61398K90340j01837m00847l84441j51807M76597L80879l05149m74904
$$ plain form
7144 21954715 22601295 23145031 23303836 23502136 23758853 24015086 23699705 23067878 22585962
7135 22585962 22248927 21511854 20711043 19731118 19106201 18422151 17706542 16746633 15781133
7126 15781133 14881101 14167168 13693109 13002337 12207460 11569976 11154123 10761808 9953125
7117 9953125 9514814 9328878 8723396 8277243 7964130 7852571 7325850 6665389 6264627 6067538
7107 6067538 5866880 5773139 5547401 5450821 5435004 5312783 5017164 4590636 4536415 4956691
7097 4956691 4827271 4114101 3819080 3876068 3977040 3816535 3377192 3159446 3140118 2977307
7087 2977307 2850457 3057627 3221551 2788691 2285629 2175337 2446748 2508889 2288568 2124463
7077 2124463 2285861 2576201 2474364 2073517 1689076 1537269 2013866 2394745 2089596 1614692
7067A614692k61730L44742J52699k29914o4092o6527j9665K58381j7832p0881
7057A639873k82808O6431J82878k14018l41913k9187J51097o0067j51856M554
7047I64984P2460j7157j40969q1538N3250J01047L291k01266P8011K32337J24526
7036A188976p112j1621k27369l55683j08071J13314M21500J19224j85682n33208
7026D14268j13365L69899J52028J03709k52795l34429Q2397K61490j2907k58049
7016D12246j59224L48522M06507k06329l14172k30929J10182k0499N0729n5010
7006C42023k87983J52515O8073K46562J25984l05988j23814j22773L49477J95122
6996F39198j80686k01733N8609K08948J38308j75314l21988n9493k9302P9482
$$ plain form
7067 1614692 1352962 1697704 1850403 1620489 1556397 1489870 1470205 1728586 1710754 1639873
7057 1639873 1357065 1423496 1606374 1392356 1050443 1021256 1172353 1112286 960430 964984
7047 964984 1037444 1020287 879318 797780 851030 952077 955368 754102 832113 1064450 1188976
7036 1188976 1181864 1170243 942874 587191 479120 592434 1013934 1133158 947476 414268
7026 414268 300903 670802 822830 926539 673744 339315 421712 683202 670295 412246
7016 412246 253022 601544 1008051 801722 487550 256621 366803 346304 397033 342023
7006 342023 54040 206555 274628 521190 647174 341186 217372 94599 444076 639198
6996 639198 458512 256779 315388 524336 662644 487330 165342 105849 76547 156029
6986A56029K66609L21919j14416l05633l21326J14674Q5063j74376p6835J13629
6976F5337J01491J45023r0706K7687l4148j38922J26754k7819J72225q1432k42352
6965B3138l3323J43543K18735j6949J867j95973j40213R7478o7956J21709r378
6954A42678R714M5469k89753p6196K76793K22361o6930J19167j83957j41601j6458
6943D1287K66656K47444k91160l45091J15030L00396K09323k2497j27522m00045
6933f179k13293J02736L99184J52607k27124l8473Q1623l2685r6153k54256k1605
6922a53618J55326K8636J10766k09572m21854J53581M05440R5604o9205K9932
6912A25036j37171K01857j10064m33825R8349K81414M0911k05999r06K61662J80207
$$ plain form
6986 156029 422638 744557 630141 324508 3182 117856 202919 28543 -48292 65337
6976 65337 166828 311851 221145 248832 214684 75762 202516 174697 346922 265490 23138
6965 23138 -10185 133358 352093 335144 337011 141038 825 98303 30347 152056 142678
6954 142678 152392 197861 -91892 -168088 108705 331066 264136 383303 199346 57745 41287
6943 41287 307943 555387 264227 -80864 34166 334562 543885 521388 393866 -6179
6933 -6179 -219472 -116736 282448 435055 207931 169458 251081 218396 122243 -132013 -153618
6922 -153618 1708 30344 141110 -68462 -490316 -336735 68705 164309 95104 125036
6912 125036 -12135 189722 79658 -354167 -255818 25596 66507 -139492 -140398 121264 301471
6901C01471j92169k50943P2688K31879J32830M7233j20898l1972k58041J54754
6891H6832k1919j76076p017K20910J78589j09557j19867o8235k7120j95057k73772
6880e12289J88563L74227J75447N0957J01389j67788l84109k85799K81927L12089
6870A34614p0527j64663k7757K74566J95914l29104j27850L06075K72994l36648
6860A27614m10623k6437J4860M62260p5799k18042k14342J4098J97825m4329n988
6849a78903N1863R8411J10679q2233j91963j9480M2549M6002K8477Q4584j26111
6838a36125k9079r905L981L1212J87963k28386j84392J15725M18919K20298m37514
6827d7303l96374L5862K33977O38818L5383k30760j81923l97267j21320J5987
$$ plain form
6901 301471 109302 -141641 -68953 162926 295756 342989 222091 190119 -67922 86832
6891 86832 64913 -111163 -118180 102730 281319 171762 51895 -16340 -43460 -238517 -512289
6880 -512289 -323726 50501 225948 276905 378294 210506 -173603 -459402 -177475 134614
6870 134614 64087 -100576 -128333 146233 342147 13043 -114807 191268 464262 127614
6860 127614 -283009 -309446 -294586 167674 91875 -126167 -340509 -326411 -128586 -172915 -178903
6849 -178903 -127040 -28629 82050 -183 -192146 -211626 -169077 -123075 -94598 -10014 -136125
6838 -136125 -165204 -175109 -171128 -139916 48047 -180339 -364731 -249006 169913 390211 -47303
6827 -47303 -443677 -407815 -173838 464980 500363 269603 87680 -309587 -430907 -414920
6817d14920K96508j11135j49958J55218K96529j00956m41258l00371L17670L20502
6807a32171P529J9947L2684j0835P1499k07769j58506K36933J76174L7154l44781
6796b72142M7742J41608r0407j65634m3411N11673K7179k07883j68354j60227
6786c79856m2805J7359J05901K69453J43782k12262l3120K80598j04152m49230
6776d04332n375K67621J40823k7111j35942j23495K9305j3905M6463J38859r4234
6765a81323L226K83554K59875j85565m14183k97729L439K86002L44964P1028l834
6754A69454k72631N2510L3057k60860k13094J18599L34365J45313l74764k30343
6744d98394L05235J38334J2589L08894k38246k09876K64218J47930N0807j10919
$$ plain form
6817 -414920 -118412 -229547 -379505 -224287 72242 -28714 -469972 -770343 -452673 -132171
6807 -132171 -124642 -104695 -72011 -82846 -11347 -219116 -377622 -140689 35485 72639 -272142
6796 -272142 -224400 -82792 -173199 -338833 -382244 129429 156608 -51275 -219629 -379856
6786 -379856 -422661 -405302 -299401 -29948 113834 -98428 -131548 149050 44898 -404332
6776 -404332 -409707 -142086 -1263 -28374 -164316 -287811 -258506 -272411 -225948 -87089 -181323
6765 -181323 -178097 105457 365332 179767 -234416 -532145 -528706 -242704 102260 173288 169454
6754 169454 -103177 -50667 -17610 -278470 -491564 -372965 -38600 106713 -268051 -498394
6744 -498394 -193159 -54825 -42236 266658 28412 -181464 82754 230684 281491 170572
6734A70572k38249m25261J09530L73925K57577k95959j48834J0700J98625o7271
6724e4645K8697L5443l2394j36355P628K91764J33622j64643l12144k44697K99019
6713a48705K91170k46573j54453l6273L04673J39688o3057r2084M5083J091l2369
6702H191j19029l3534k45079j19582L40099M54530p1219k93111k89167k344K35000
6691a35245J04334j81443m8001M52390J31218r2136j60333j89409p4683N072J27644
6680f0592L2928J90613J44456n6433k2889o9371P9773R930l764k10766k17998
6669a84113n1563J75712J99836J19557o0233j70762O0437M08886l4820k53456
6659B09481m70009O5096K65201J45817j42410Q0901P1712k93001L4997o443J10995
$$ plain form
6734 170572 -67677 -492938 -383408 -9483 248094 -47865 -196699 -185999 12626 -54645
6724 -54645 -25948 9495 -22899 -159254 -151626 140138 273760 109117 -203027 -447724 -148705
6713 -148705 142465 -104108 -258561 -294834 9839 149527 86470 -5614 39469 40560 8191
6702 8191 -110838 -144372 -389451 -509033 -168934 285596 214377 -78734 -367901 -370245 -135245
6691 -135245 -30911 -212354 -260355 192035 323253 231117 70784 -118625 -193308 -188236 -60592
6680 -60592 -27664 162949 307405 250972 228083 158712 238485 248415 244651 33885 -184113
6669 -184113 -235676 -59964 139872 259429 199196 28434 88871 497757 462937 209481
6659 209481 -260528 -195432 69769 215586 73176 154077 225789 -67212 -32215 -38658 72337
6648G2337r3726J47304N5515M41275k616l67388j75531L1286J67650J16740k27822
6637A65024l12675K751J97974J60728N9127R624P3131k39127M4004K51471m9097
6626C62935m90509l08435K19200N73536l386l48055k7071J54568K81424M313k69140
6615A49380m17419K83392L42598L50134k35224m36880L3666J59206l51128j23023
6605b45298K31107L75775L3034l5646j57885j86441l46216K02029K85205K01483
6595C57147k51659o5537N12498O0004n12273m45203J11747K84091K34746Q9041
6585C74602L4346j38750j04928l98184J06631N01437L26686l98065l28962j37248
6575a62435N81784L64415n04060m35328j26114j07563O3395K05769K76987J85191
$$ plain form
6648 72337 -21389 125915 181430 622705 620089 252701 77170 108456 276106 392846 165024
6637 165024 -147651 -144900 53074 213802 272929 282553 355684 116557 160561 412032 362935
6626 362935 -127574 -436009 -216809 356727 353341 5286 -21785 132783 414207 418520 149380
6615 149380 -268039 15353 357951 708085 472861 35981 69647 228853 -122275 -245298
6605 -245298 -14191 361584 394618 358972 201087 14646 -331570 -129541 155664 357147
6595 357147 105488 39951 552449 612453 100180 -345023 -233276 50815 285561 374602
6585 374602 408948 270198 165270 -232914 -126283 375154 701840 303775 -25187 -162435
6575 -162435 419349 783764 279704 -155624 -281738 -389301 -325906 -120137 156850 342041
6565C42041j08515P1637J76925J6931l89483k50727J18967J15392N1051n1127
6555I3092P5959j12164q3042K58945J14398n6926j94924j00739N7446N3178K30262
6544C35485J2519q8812j68702J31085K08993p6065j66377k88353K9974J97525
6534A27272J38313r8182k78919k37989L14527L57451o8094k24372J16374L87748
6524E34129O2759n33971l63127L80892L63439k26510k324P0338o510k0171j44729
6513A14215m646N3201K10781Q4347k23475k47145M5892K6954R2579n9464K44789
6502C38028L2497m07695l7974J30493J40809N3407L8195K4600J22983j64723o3615
6491B07005k57200j40085L43757P3744o8455j14973J09506J07542q2928j95507
$$ plain form
6565 342041 233526 305163 482088 499019 109536 -141191 -22224 93168 144219 93092
6555 93092 169051 56887 -26155 232790 347188 290262 95338 -5401 52045 105223 335485
6544 335485 348004 259192 90490 221575 430568 354503 188126 -100227 -70253 127272
6534 127272 265585 167403 -111516 -349505 -34978 322473 254379 30007 146381 534129
6524 534129 596888 62917 -300210 80682 444121 217611 215287 285625 279115 258944 114215
6513 114215 109569 162770 373551 457898 234423 -12722 33170 60124 152703 93239 338028
6502 338028 370525 -37170 -75144 55349 196158 249565 287760 312360 435343 270620 207005
6491 207005 -50195 -190280 153477 227221 158766 43793 153299 260841 177913 -17594
6481a7594K14255L29780R2358j42117j20443j55527R5541l29615j93751K28856
6471A743K99984J25197j08089j58408k745J25876P9439l01180l43234J89484M28264
6460C36331O3837l80585Q2244K6794m9386j75526J27800K97092K72734o1911k18246
6449C21178l2113k13701n305K21488j00787j50570k7660N0772J69797J70233r0770
6438C12562O7513r8711k35487j10792O85733M03079k11690m33841p1968O4420
6428C70818M728J8620j8514K26333J38537J93555m01973k46405L33682L76812
6418I96193k70928m56696k36528N02851M21100m3987k86782l65567J51769J89138
6408F00563J45659p6374r0179Q6250q6070j98116K3258L59360K16775j77994k48925
$$ plain form
6481 -17594 196661 526441 618799 476682 356239 200712 296253 -33362 -227113 1743
6471 1743 301727 426924 318835 160427 157682 283558 362997 61817 -281417 -91933 336331
6460 336331 400168 19583 101827 128621 79235 -96291 31509 328601 601335 539424 321178
6449 321178 289065 75364 70059 291547 190760 40190 12530 63302 233099 403332 312562
6438 312562 380075 281364 45877 -64915 620818 1023897 812207 378366 306398 370818
6428 370818 375546 394166 375652 601985 740522 934077 532104 285699 619381 996193
6418 996193 725265 268569 32041 534892 955992 912005 625223 259656 411425 600563
6408 600563 746222 669848 579669 665919 579849 381733 404991 764351 981126 803132 554207
6397E54207k35743K35783K11567K19921k8374k49940j97141J04966K39419J02812
6387I57477r7458k07434L71658K45959J85222p6316m02246m31459r2644K93202
6377G45961J75689r1425j74401N3223L47874J35190j25380l83792k24705M48376
6367I06610L15697k34087l16156K37560L31987k20912n29227j33338M06038L33240
6357A097412j01353k12964K08220N01549j06630j92898j67165j08298J51936l8583
6347A031226n4048j517K42726K32762J97952l17512j51639r7043l6918J85665
6337A231654J44738K96962J95979k8869q2964O3164j04590J95371m342K8318R6822
6326B032243L72006M67437N4545J82040k44284k32651n821j49887j74901j76612
$$ plain form
6397 554207 318464 554247 765814 985735 957361 707421 510280 615246 854665 957477
6387 957477 860019 652585 1024243 1270202 1455424 1379108 976862 545403 452759 745961
6377 745961 921650 830225 655824 709047 1056921 1192111 1066731 682939 458234 906610
6367 906610 1222307 988220 672064 909624 1241611 1020699 491472 358134 764172 1097412
6357 1097412 996059 783095 991315 1492864 1386234 1193336 1026171 917873 1069809 1031226
6347 1031226 977178 975661 1218387 1451149 1649101 1331589 1179950 1082907 1045989 1231654
6337 1231654 1376392 1673354 1869333 1840464 1757500 1820664 1716074 1911445 1907103 1935421 2032243
6326 2032243 2404249 2871686 2926231 3108271 2863987 2631336 2625515 2475628 2300727 2124115
6316B124115k64759j96697O1329K55827J06018l19088k80959j30306J73186N25083
6306B053749o5321l57488j79696M5498L0655p7278l91853j63866K32184K98068
6296A424652J40050j09191k80516p4547J85399J25746l8442J11008L33833J20015
6286A938007j76171k64447r0848k5725K01326n8110J13167J39579j32163J20115
6276A764730K34j91996j47860o3278K02424J77985n4685J684k7551j16208M6572
6265A592051M5561J93725q6407p7621K03379J90009j759j72366K21197K9465j1753
6254B125481j18936j16582J81507J7599J54162K24490O0682J7986o0308K6543
6244B512624J27408j21449m5325J99178r463P3097L2600j52096M2664L47020L65652
$$ plain form
6316 2124115 1859356 1662659 1723988 1979815 2085833 1766745 1485786 1355480 1528666 2053749
6306 2053749 1988428 1630940 1451244 1496742 1527397 1450119 1058266 894400 1126584 1424652
6296 1424652 1564702 1455511 1174995 1100448 1285847 1411593 1373151 1484159 1817992 1938007
6286 1938007 1761836 1497389 1406541 1380816 1582142 1524032 1637199 1776778 1644615 1764730
6276 1764730 1764964 1572968 1425108 1361830 1564254 1742239 1687554 1689238 1661687 1545479 1592051
6265 1592051 1637612 1831337 1744930 1667309 1870688 2060697 2058938 1886572 2107769 2137234 2125481
6254 2125481 2006545 1889963 2071470 2089069 2243231 2467721 2528403 2546389 2486081 2512624
6244 2512624 2640032 2518583 2473258 2672436 2662973 2736070 2768670 2616574 2659238 3006258 3371910
6233C371910J49462l71967k03035L58457M29698J55145l01667m35949l049O10345
6223C759350L81557P3424k36527j4817K89636L3684k11877R9267p169L66494M06644
6212D939666L44929K46637n18573k81123K36272N64088J32351j67170q6927K76187
6202E686337L59473N5081l6691k02967P5781L38143M34617K47070j08530o315
6192F841999j00605M13260O44788R9676K25267N6967J95249K63520L89592p2063
6182H957650J52269N81704K95278M44273M05232N18902O09035P95587O45064O59864
6172A4064858J079820J318114J203231J746682J576326J568263K357748L313741
6164B8228783M995973P135543R542027J0914034R850231N771403q54593p412590
$$ plain form
6233 3371910 3521372 3149405 2946370 3304827 3734525 3889670 3588003 3152054 3149005 3759350
6223 3759350 4140907 4214331 3977804 3962987 4252623 4286307 4074430 4173697 4166528 4533022 4939666
6212 4939666 5284595 5531232 5012659 4731536 4967808 5531896 5664247 5497077 5410150 5686337
6202 5686337 6045810 6100891 6064200 5861233 5937014 6275157 6709774 6956844 6848314 6841999
6192 6841999 6741394 7154654 7799442 7899118 8124385 8181352 8376601 8640121 9029713 8957650
6182 8957650 9109919 9691623 9986901 10431174 10836406 11355308 11964343 12759930 13404994 14064858
6172 14064858 15144678 16462792 17666023 19412705 20989031 22557294 24915042 28228783
6164 28228783 33224756 40360299 49902326 60816360 70666591 76437994 75583401 68170811
6156F8170811j1028432j0273797q474743o229919m139466l240773k540836k134008
6148B0108837j398893j048281p00752o42630l82695n93600o48435l90412J1190
6139A4314329k12729p92190m46801N0186L70572L56221k69163j81240M2521j37655
6129A3094051k33772m7064k29535j9852J64578J20033o6429j46928l1276K36859
6119A2840665N93094j04673K3237K00914J030558J349198J531205P41586K88475
6110A8494259K43543m34358o04811j120612j238338r68169n09799k66034L9693
6101A3635374L5846k48266o1484M81891R84603J038595J169219R22266R07997
6092A8866041M67344L41421K760m55107p45156p53212j315540j139105q84966
$$ plain form
6156 68170811 57142379 46868582 38393839 32163920 28024454 24783681 22242845 20108837
6148 20108837 18709944 17661663 16960911 16318281 15935586 15341986 14693551 14303139 14314329
6139 14314329 14101600 13309410 12862609 12912795 13283367 13639588 13370425 13189185 13231706 13094051
6129 13094051 12860279 12813215 12583680 12563828 12728406 12848439 12782010 12635082 12603806 12840665
6119 12840665 13433759 13329086 13352323 13553237 14583795 15932993 17464198 18205784 18494259
6110 18494259 18737802 18303444 17698633 16578021 15339683 14371514 13861715 13595681 13635374
6101 13635374 13671220 13422954 13361470 13843361 14827964 15866559 17035778 17958044 18866041
6092 18866041 19333385 19674806 19677566 19222459 18477303 17724091 16408551 15269446 14384480
6083A4384480q23681m57956o69445m50673k73890L61647P219j10769p814l6992
6073A1922126O2364K76680J28169N07957N94583Q95528Q57946P22450Q93895P31224
6063A7592922N46816p7847l34923o64798r49319r91989j050472q08681n30735
6054A2730974n75537n41897k13644n9739K0628J08702N05873P72859J022418J101446
6044A4872083N30600Q0423k44286l70864r13546j389028j115548q47935l42338
6035A0259561m68494o44949l42459J43733j15721n94842l37498j43020J17319
6026G873630j05551j21315r7718l28578j29829l2421J59634P2235j04816l52713
6016F832558o90504k94024J62363J13943K7173k4212k62783k00843m26129m50415
$$ plain form
6083 14384480 13560799 13102843 12433398 11982725 11708835 12070482 12077701 11966932 11959118 11922126
6073 11922126 11984490 12261170 12389339 12897296 13491879 14387407 15245353 15967803 16861698 17592922
6063 17592922 18139738 18061891 17726968 17062170 16112851 15120862 14070390 13261709 12730974
6054 12730974 12155437 11613540 11399896 11340157 11360785 11469487 11975360 12748219 13770637 14872083
6044 14872083 15402683 15483106 15238820 14867956 13954410 12565382 11449834 10601899 10259561
6035 10259561 9791067 9146118 8803659 8947392 8831671 8236829 7899331 7756311 7873630
6026 7873630 7768079 7646764 7549046 7220468 7090639 7058218 7217852 7290087 7185271 6832558
6016 6832558 6142054 5848030 6010393 6124336 6151509 6127297 5864514 5663671 5237542 4787127
6006D787127o5887j59122Q370K01305k8562j14358m07369l69468r1148n5096j5230
5995C690562O7337j28932j58948j50777O6206j20690k28147P4069N8806L21821
5985C491307J61330l71215l54260j29851K26781K66913j82819k05114M3004l9113
5975B906963n9721j48584O6708J15263j65716Q3833J28044N2024l4448j94717
5965B749649j44338K04761J5443O7909J72477k20698J6670J1116R7345K06509
5955C176843k35973p6163Q5381j9848K7250k8697J89102q0641j85668M061N0740
5944B906387N3805k251l79216n36543J51981M66088M35526k14538n57826j04362
5934B219051L59310K50802j31000k09618r8009M33471K50437j96481j94687k94158
$$ plain form
6006 4787127 4721240 4562118 4570488 4771793 4743231 4628873 4221504 3852036 3760888 3705792 3690562
5995 3690562 3757899 3628967 3470019 3319242 3385448 3264758 3036611 3110680 3169486 3491307
5985 3491307 3652637 3281422 2927162 2797311 3024092 3291005 3108186 2903072 2946076 2906963
5975 2906963 2847242 2698658 2765366 2880629 2714913 2798746 2926790 2978814 2944366 2749649
5965 2749649 2605311 2810072 2825515 2893424 3065901 2845203 2861873 2872989 2970334 3176843
5955 3176843 2940870 2864707 2950088 2930240 2957490 2928793 3117895 3037254 2851586 2855647 2906387
5944 2906387 2960192 2957941 2578725 2042182 2194163 2660251 3095777 2881239 2323413 2219051
5934 2219051 2578361 2829163 2698163 2488545 2390536 2824007 3074444 2877963 2683276 2389118
5924B389118K45582J80476J96495l36507j34394m7494k10290n5901j69720j74897
5914A882468m4046J66622R8723k4387k38163O9428K36765j26520l47868l43552
5904A329470O6297Q6903o7990K5878K49751R4316j10171Q0734L9166J93168j91336
5893A796186l05541P6251K78352K7491k9362k5712j44740j08162q9547j92156
5883A283060J10377O5183L16516J83369j33564j78474l5427j51249j62835N7117
5873A354073K89216K64368K70l13613o8540j32974j00572P3226K45439O4828k81740
5862A393981j10302K52141M75792j02692l63051P4436N1819k55105R030L60953
5852A787002K9436J41458r038M4008j17433n08064J82L82678J70421k48343j95264
$$ plain form
5924 2389118 2634700 2815176 3011671 2675164 2540770 2493276 2282986 2227085 2057365 1882468
5914 1882468 1838422 2005044 2103767 2079380 1841217 1910645 2147410 2020890 1673022 1329470
5904 1329470 1395767 1482670 1414680 1440558 1690309 1784625 1674454 1755188 1794354 1987522 1796186
5893 1796186 1490645 1566896 1845248 1872739 1843377 1817665 1672925 1564763 1475216 1283060
5883 1283060 1393437 1458620 1775136 1958505 1824941 1646467 1611040 1459791 1296956 1354073
5873 1354073 1643289 1907657 1907927 1594314 1525774 1392800 1292228 1365454 1610893 1675721 1393981
5862 1393981 1283679 1535820 2011612 1908920 1545869 1620305 1672124 1417019 1426049 1787002
5852 1787002 1816438 1957896 1948858 1992866 1875433 1367369 1367551 1750229 1920650 1672307 1477043
5841A477043K562M90568Q6880l01854o9828J4350M9134o584j66369K86886M08570
5830B271358J37959j63043k30104k57779q3705K35874M52636j63185k12153n5015
5820A932843Q8556J83494l8101j7835o0821j00346K92029J96825m0670j88275
5810B247699j56978J31663J00654j07350K24972L20769j36766l95613K60391J22519
5800B611960m4075k2409K63060N95698L03154q4348M2368J91569n35094n53682
5790B768201o8058J51346N2562j22384J26997M8072K4869r5562q9388K2857L0936
5779B850448J13207J50369N7500k35447j41305K4736J54995j08751L7700K10562
5769C114014R4480J3742J6891k53605n1678L7521K74971j43029J68165L1051P6639
$$ plain form
5841 1477043 1479605 1970173 2057053 1755199 1685371 1699721 1748855 1742271 1575902 1862788 2271358
5830 2271358 2409317 2246274 2016170 1758391 1674686 1910560 2363196 2200011 1987858 1932843
5820 1932843 2021399 2204893 2166792 2148957 2088136 1987790 2279819 2476644 2435974 2247699
5810 2247699 2090721 2222384 2323038 2215688 2440660 2761429 2624663 2229050 2489441 2611960
5800 2611960 2567885 2545476 2808536 3404234 3707388 3623040 3665408 3856977 3321883 2768201
5790 2768201 2700143 2851489 2904051 2781667 2908664 2956736 2981605 2886043 2796655 2819512 2850448
5779 2850448 2963655 3114024 3171524 2936077 2794772 2819508 2974503 2865752 2903452 3114014
5769 3114014 3208494 3222236 3239127 2985522 2933844 2971365 3246336 3103307 3271472 3302523 3379162
5758C379162p3444K6550q0543j89129J3861R6131J62142J99335R9880O398j93116
5747C447227j59993k77174J85776L76818N6284M17517J74266N60252j30523k50170
5737D400280L40146J52799j43917k28972l7696K61921O5863j02745k08007j92116
5727D307556k5620O4557m4409l6408J18788K21043k46793m01848l3629L95610
5717D318847L38731R388l84506j67198M6953n5820L0877n8505r0365k00363j77461
5706C610578j42756J727R9136J54462k3449k94022P0289L10350l6117n793r9976
5695C644429L6478j1750M4362j05518m51693J43272K95821R4873O9261j02066
5685C657469j6624K92235J62340r3191j06198K13020j49292j5160j08739j13998
$$ plain form
5758 3379162 3305718 3332268 3251725 3062596 3076457 3172588 3334730 3534065 3633945 3640343 3447227
5747 3447227 3287234 3010060 3195836 3572654 3628938 4046455 4220721 4780973 4650450 4400280
5737 4400280 4740426 4893225 4749308 4520336 4482640 4744561 4810424 4707679 4499672 4307556
5727 4307556 4281936 4346493 4302084 4265676 4384464 4605507 4358714 3956866 3923237 4318847
5717 4318847 4657578 4666966 4282460 4115262 4162215 4106395 4137272 4078767 3988402 3788039 3610578
5706 3610578 3467822 3469549 3568685 3723147 3699698 3405676 3475965 3786315 3750198 3744405 3644429
5695 3644429 3680907 3669157 3713519 3608001 3156308 3299580 3595401 3690274 3759535 3657469
5685 3657469 3640845 3933080 4095420 4002229 3896031 4109051 3959759 3944599 3835860 3721862
5675C721862J48852j80476m66306j30448K40730K42868K16649l7133j17047K43169
5665C882720l6595k51217J32437L18501K25523k49767o3432J17199k8029l38432
5655C708908k05007L02671K53293r8063n54673j39436L72678L82909j61433n31708
5645C330139j59566J83485K14312n7123j73597j02743j08547N1133L987J37591
5635C319071L43962p5792k3536N8406R8282q1960k30168j12354K97927R6975l30301
5624C360512k08677K82805K22444J5473m93004j80486M05906J04685J06705r5805
5614C520558k65529K38240N75832L36421r5158j4057J79371K30202R0424k25942
5604D570362p2947J95282K96282K8936k56584k77345M3325J70286K2645j63487
$$ plain form
5675 3721862 3870714 3690238 3223932 3093484 3334214 3577082 3793731 3756598 3639551 3882720
5665 3882720 3846125 3594908 3727345 4045846 4271369 4021602 3958170 4075369 4047340 3708908
5655 3708908 3503901 3806572 4059865 3961802 3407129 3267693 3640371 4023280 3861847 3330139
5645 3330139 3170573 3354058 3568370 3511247 3337650 3234907 3126360 3177493 3181480 3319071
5635 3319071 3663033 3587241 3563705 3622111 3720393 3638433 3408265 3295911 3593838 3690813 3360512
5624 3360512 3151835 3434640 3657084 3672557 3179553 2999067 3404973 3509658 3616363 3520558
5614 3520558 3255029 3493269 4069101 4405522 4310364 4296307 4475678 4705880 4796304 4570362
5604 4570362 4497415 4692697 4988979 5017915 4761331 4483986 4527311 4697597 4720242 4556755
5594D556755l77191n6999J16552N7537j16228l92749j50188J86022J69210R6753
5584D089474n39757l62130P1706J19053L86239K96m42549p3952K21179J22406
5574C591965J89867l50260k17753K09782J86074K95646n137k78398j11578Q5678
5564C595886R5940L1562J54757J4210j57953j70364P4578K84359K3653k0279J56132
5553D082481R3104R9884J13228P6573K55814L88800L00800J84357l4379l12476
5543E248186n75026j81351j40081m7295j11840m8956k7962N5974k34231m75811
5533C461607K8190N43393K02907l34323k01539J60634N35317O9515n98382k31022
5523C636297J40174K36292Q0759J4568K48716K05954P8506p0543k10984K48405
$$ plain form
5594 4556755 4179564 4122565 4239117 4296654 4180426 3787677 3637489 3823511 3992721 4089474
5584 4089474 3549717 3187587 3259293 3378346 3764585 3764881 3322332 3248380 3469559 3591965
5574 3591965 3781832 3431572 3213819 3423601 3609675 3905321 3900184 3621786 3510208 3595886
5564 3595886 3691826 3723388 3878145 3892355 3734402 3564038 3638616 3922975 3946628 3926349 4082481
5553 4082481 4175585 4275469 4388697 4465270 4721084 5109884 5410684 5595041 5560662 5248186
5543 5248186 4673160 4491809 4351728 4304433 4192593 4143637 4115675 4171649 3937418 3461607
5533 3461607 3489797 4033190 4236097 3901774 3700235 3860869 4396186 4465701 3867319 3636297
5523 3636297 3776471 4012763 4093522 4108090 4356806 4562760 4641266 4570723 4359739 4608144
5513D608144M25131J48605J36563R8778L44240O24568N31884J23857K20611M15822
5503G678203j16722p01152l91509k99186k43646k91590o8962K93013R7477n25146
5493E430780n52491K22590N39383J03006q1977J87285M05127o0619j38807K59486
5483F313763Q14485N90517r1731k3284M63897J126665J383229J452038J427734
5474A3457313J499367R40866L2116o74236j599949j559479j396551j111015n49405
5465I039027k53075k27505l37617j96365O8347J84073l52546l23353J87605N41756
5455H330347Q5367l58023q8058K2327M07130M03925K23554K71450N33719R82156
5445A0813894J140858J290300J525250J268834P36518j84304j114656j554566
$$ plain form
5513 4608144 5033275 5181880 5318443 5417221 5761461 6386029 6917913 7041770 7262381 7678203
5503 7678203 7561481 6860329 6468820 6169634 5925988 5634398 5565436 5858449 5955926 5430780
5493 5430780 4878289 5100879 5640262 5743268 5661291 5848576 6253703 6193084 6054277 6313763
5483 6313763 7128248 7718765 7627034 7603750 8067647 9194312 10577541 12029579 13457313
5474 13457313 14956680 15897546 15929662 15255426 13655477 12095998 10699447 9588432 9039027
5465 9039027 8785952 8558447 8220830 8024465 8092812 8276885 7924339 7600986 7788591 8330347
5455 8330347 8415714 8057691 7969633 7991960 8399090 8803015 9026569 9298019 9831738 10813894
5445 10813894 11954752 13245052 14770302 16039136 16775654 16591350 15476694 13922128
5437A3922128j306658j090841j254271o18395l35516j95675k29724m49672j8115
5428H423261K05490K41044j05640l24032l750J26358K33101j75383l50055L09785
5418H580179M94157K57672k97390O4136M73396O42742Q681j07563N39841R85906
5408A1641757M02555p01982q19871k29308p1594o20366m80188K4834K88157L13952
5398I747946K6469k99039P5202L51733L51814M7474J1125L39484N53008L00640
5388A1505856J53449K55975N29672M93005L97340N45897M65022M46605R45277
5379A5738098J187773Q09722L68488P25402J141178J102067O77550J036080J118174
5370B3904532J419306J104804J004581J494641J829963J911291J304232K98335
$$ plain form
5437 13922128 12615470 11524629 10270358 9651963 9316447 9120772 8891048 8441376 8423261
5428 8423261 8628751 8869795 8764155 8440123 8436373 8562731 8795832 8620449 8270394 8580179
5418 8580179 9074336 9332008 9034618 9098754 9572150 10214892 10223573 10116010 10655851 11641757
5408 11641757 12044312 11342330 10522459 10293151 10221557 9601191 9121003 9145837 9433994 9747946
5398 9747946 9774415 9475376 9550578 9902311 10254125 10301599 10312724 10652208 11205216 11505856
5388 11505856 11659305 11915280 12444952 12937957 13335297 13881194 14346216 14792821 15738098
5379 15738098 16925871 17735593 18104081 18829483 19970661 21072728 21750278 22786358 23904532
5370 23904532 25323838 26428642 27433223 28927864 30757827 32669118 33973350 34271685
5362C4271685k22095j053419j522179j661920j618322j647011j661610j756326
5354B3128803j531379j432459j149104r06903j161409r85716j032741p76437m02642
5345A3750013o37110o57558p00887n58551k48669m47994m54897m23490j67434
5336I453423k27754p4161r4720l8259k03054k09539l15139L52546J44536l77903
5326H409976l99523o1905J7144J51267j40911l35166j99986N4996J96625j40408
5316G552109k70057J8292k67686K13099R3398j38105k04263k454J26933n6691
5306G064575K2266k25763j58307j01059j07560K0497j37248j24150O8081J2045
5296F333377J10785j72608l71590k7214M05900J30601j4698k26498j46092J14455
$$ plain form
5362 34271685 34049590 32996171 31473992 29812072 28193750 26546739 24885129 23128803
5354 23128803 21597424 20164965 19015861 18108958 16947549 15961833 14929092 14152655 13750013
5345 13750013 13112903 12455345 11754458 11195907 10947238 10499244 10044347 9620857 9453423
5336 9453423 9225669 9151508 9056788 9018529 8815475 8605936 8290797 8643343 8787879 8409976
5326 8409976 8010453 7948548 7965692 8116959 7976048 7640882 7440896 7495892 7692517 7552109
5316 7552109 7282052 7300344 7032658 7245757 7339155 7201050 6996787 6994333 7121266 7064575
5306 7064575 7086841 6861078 6702771 6601712 6494152 6514649 6377401 6253251 6321332 6333377
5296 6333377 6444162 6271554 5899964 5872750 6278650 6409251 6394553 6168055 6021963 6136418
5286F136418L39564K20062L25468j28003j9105J26250P9657M0005l5422M2555
5276G127449Q5146R3726K92478J71013N7652m3781M591K05348J95363K73499p5550
5265H386934Q0035J58713J41987O7152J53533M16448N75487J35874j24600m5208
5255I946355M57319N00060P17043Q97670Q74842Q82751O73895J374542J284155
5246A7608632J463006J311207J889250L719435N437855P046593Q247214Q726633
5238E5449825P115228L017438k817462p761828r168539q103209o621830n117274
5230B5992349l473734k388625j961689j665157j512014j273883r11407p28085
5222A2077755o92213n15732p12216o32678k03107j28985q8456n6748m19414r24866
$$ plain form
5286 6136418 6475982 6696044 7021512 6893509 6874404 7000654 7080311 7120316 7084894 7127449
5276 7127449 7212595 7306321 7598799 7769812 7827464 7783683 7788274 7993622 8188985 8462484 8386934
5265 8386934 8466969 8625682 8767669 8834821 8988354 9404802 9980289 10116163 9991563 9946355
5255 9946355 10403674 10903734 11620777 12518447 13393289 14276040 14949935 16324477 17608632
5246 17608632 19071638 20382845 22272095 25991530 31429385 38475978 46723192 55449825
5238 55449825 62565053 65582491 62765029 55003201 45834662 37731453 31109623 25992349
5230 25992349 22518615 20129990 18168301 16503144 14991130 13717247 12805840 12077755
5222 12077755 11385542 10869810 10157594 9524916 9321809 9192824 9104368 9047620 8628206 7703340
5212G703340o67212R6402J77975j72135o04365k72560K93908K52555o35630n69015
5202E603263J42528J68537j35934m56731j70594K62154J10867k44837l41757j37326
5192D800170K06501K6811j6145j73929J38344J41348k38947l88228j58399L15177
5182D652703M30783J52087k96748n02499r0913K50678J43383j03319k17227K486
5172D421414N18579J10825j69110k39637l49257N2591M28907j16807n7229j96383
5162D403893j72451j25246N9871J70054j12422o7279j51666N377J48607K68648
5152D427386j9355n711l85532k21356K5367Q7502J12693l8576j51906n8859n7100
5141C714553J405k20939j90571j58834J97156M13202J84584k04704l71534r8970
$$ plain form
5212 7703340 7036128 7132530 7310505 7138370 6534005 6261445 6555353 6807908 6172278 5603263
5202 5603263 5745791 5914328 5778394 5321663 5151069 5413223 5524090 5279253 4937496 4800170
5192 4800170 5006671 5033482 5017337 4843408 4981752 5123100 4884153 4495925 4337526 4652703
5182 4652703 5083486 5235573 4938825 4436326 4345413 4596091 4739474 4636155 4418928 4421414
5172 4421414 4939993 5050818 4881708 4642071 4292814 4345405 4774312 4657505 4600276 4403893
5162 4403893 4231442 4106196 4166067 4336121 4223699 4156420 4004754 4010131 4158738 4427386
5152 4427386 4408031 4402320 4016788 3795432 3820799 3908301 4020994 3982418 3830512 3771653 3714553
5141 3714553 3715958 3495019 3304448 3145614 3342770 3755972 3940556 3735852 3364318 3265348
5131C265348M8691Q2150k03900K5931N55600K75347Q4376l05662m27162r521J31511
5120C522709J3077j09720J05590K0148n160J38532m3444k16228k75652p7355J43200
5109C215697J14024J38453l43005j62527L48680n3195k71120Q2959K51541J54062
5099C475569j21633o9910J80749L42594J03385k75042k60474K84802M00140Q7354
5089D147534o7088m95378j09235L45662R2160k34583k21567J55121K82376M5350
5079C940352r4589j48121J99920L1752K9219N967p6325j28118J5561K47795L92332
5068D415745j13416j85380r9777k59392L2170K34400Q5885J7346K85219K09124
5058D621924J76467R305n3347N3614k06081j37766Q1135Q4978K41720M7353K58374
$$ plain form
5131 3265348 3314039 3396189 3192289 3218220 3773820 4049167 4133543 3827881 3400719 3391198 3522709
5120 3522709 3535786 3426066 3531656 3551804 3546644 3685176 3641732 3425504 3149852 3072497 3215697
5109 3215697 3329721 3468174 3125169 2962642 3311322 3258127 2987007 3069966 3321507 3475569
5099 3475569 3353936 3284026 3464775 3807369 3910754 3635712 3375238 3660040 4060180 4147534
5089 4147534 4080446 3585068 3475833 3821495 3913655 3679072 3457505 3612626 3895002 3940352
5079 3940352 3845763 3697642 3897562 3929314 3958533 3964500 3888175 3760057 3775618 4023413 4415745
5068 4415745 4302329 4116949 4017172 3757780 3789950 4024350 4110235 4127581 4412800 4621924
5058 4621924 4798391 4807696 4754349 4807963 4601882 4464116 4545251 4630229 4871949 4919302 5177676
5047E177676k7945l06469k30079J63063K29303J22122L3028K58741J54203j31351
5037E442292J04937K67292J31379J4041J78642K51123L79780L42658m7061l6903
5027G028180K42512N91546M80580J74462M4688m846K49438K9843l6539K55603
5017I055467N83342L81978j22559L52694J008427Q26131O10105L52889K98009
5008A3346483N02353L31437R6085L47026j2180k70800l06681l51850L22502K06522
4998A4210897J64550K34841L48614O42176L57886j23578j25729k05378j56323
4989A5347956m06793l91875p3308j95098l45167j87002n4796J69808Q4148J74556
4979A4122429K12050J83431N05522P61178O78661M05008P57562J169526J235765
$$ plain form
5047 5177676 5149731 4843262 4613183 4776246 5005549 5127671 5160699 5419440 5573643 5442292
5037 5442292 5547229 5814521 5945900 5959941 6138583 6389706 6769486 7112144 7065083 7028180
5027 7028180 7270692 7862238 8342818 8517280 8561968 8557122 8806560 8836403 8799864 9055467
5017 9055467 9638809 10020787 9898228 10250922 11259349 12085480 12695585 13048474 13346483
5008 13346483 13848836 14180273 14276358 14623384 14611204 14340404 14033723 13681873 14004375 14210897
4998 14210897 14375447 14610288 14958902 15601078 15958964 15835386 15709657 15504279 15347956
4989 15347956 14941163 14549288 14475980 14280882 13935715 13748713 13693917 13863725 13947873 14122429
4979 14122429 14334479 14517910 15023432 15784610 16463271 16868279 17625841 18795367 20031132
4970B0031132J347506J332102Q51367J043500J010786O23056J48681j38134K0606
4961B6270602M77710L53664k90766j21895M29162O06023J15931l73903l62480
4952B7104048m08725p92113r25850j147957r46370q58977p82461l19966l28350
4943B0593279p27660n81992L0515L46450N68374J41737N66438N94021R80231J035673
4933B3547066O66475P39768Q93883Q86867P05893N49020L96590L96108K38739
4924B9020409L67621L08235j46586n5369J51903L36060O90201N29968O39942J159318
4914C3001702J785574J965362J803330J911843K299970L752810N988206Q987583
4906F1496380J2711335J5876495J6312321J2775632M631724o130828j4447845
$$ plain form
4970 20031132 21378638 22710740 23562107 24605607 25616393 26239449 26388130 26249996 26270602
4961 26270602 26748312 27101976 26811210 26689315 27118477 27724500 27840431 27466528 27104048
4952 27104048 26695323 25903210 24977360 23829403 22883033 22024056 21241595 20921629 20593279
4943 20593279 19865619 19283627 19314142 19660592 20228966 20370703 20937141 21531162 22511393 23547066
4933 23547066 24213541 24953309 25847192 26734059 27439952 27988972 28385562 28781670 29020409
4924 29020409 29388030 29696265 29549679 29494310 29646213 29982273 30672474 31202442 31842384 33001702
4914 33001702 34787276 36752638 38555968 40467811 42767781 46520591 52508797 61496380
4906 61496380 74207715 90084210 106396531 119172163 123803887 117673059 103225214
4899A03225214j7292466j4961592j1599938q482792o718743m902212l044010k258705
4891C3964756k172758k281535j963108j464876r75696j233797r54628r00425o90256
4882B1327677m45913k67437j57837m2998J47432L56333M88859j66333n80265r81551
4872A9677967j256892j337047j060031o12267m35503m71254l65871j03555m65015
4863A3570532n02871k97998m66078k69392k30231q6266J26325j93791m24063j54488
4853A1071679J44565k8510k57140n3423J47160k03318m9373L5318j53691j04143
4843A0549124k29343j47591K09768L19270l3628k81956k62546K6724K99484L0398
4833A0479704J80422p0246J8619J67460k06375k50162k08299L52357L38979O664
$$ plain form
4899 103225214 85932748 70971156 59371218 50888426 44169683 39267471 36223461 33964756
4891 33964756 31791998 29510463 27547355 26082479 25106783 23872986 22918358 22017933 21327677
4882 21327677 20881764 20614327 20456490 20413492 20560924 20917257 21406116 21239783 20659518 19677967
4872 19677967 18421075 17084028 16023997 15411730 14976227 14504973 14139102 14035547 13570532
4863 13570532 13067661 12769663 12303585 12034193 11803962 11717696 11844021 11650230 11226167 11071679
4853 11071679 11216244 11187734 10930594 10877171 11024331 10821013 10771640 10806958 10653267 10549124
4843 10549124 10319781 10172190 10381958 10701228 10667600 10385644 10123098 10149822 10449306 10479704
4833 10479704 10660126 10589880 10608499 10775959 10569584 10319422 10111123 10463480 10802459 10809123
4823A0809123l06474j00437K16719L39552J45953K02803L3608j22992L3334J98953
4813A1450142K51729K6707J67884J7089m4998j16222o5757J47513j167j12566
4803A1720354m92239O4775M01746J16193k8529q9771K07373L73073K93225K4072
4793A2590272J46306L50051M84713K9743m47085o3915K62642N30796L33551k2016
4783A4195058j50315q9591j51930J86317N93392K39919k15680p9557O32007Q37488
4773A5997108Q63893O70138P05106J227667J077473M17479q01020j143473k34327
4764A8780044m36640q73776n78854l59733l2177k22026m54511k69451K89477M77379
4754A6319732K6919r1785j5701K61880M63828J71867j43684k76015l2716K93559
$$ plain form
4823 10809123 10502649 10402212 10618931 10958483 11104436 11307239 11340847 11217855 11251189 11450142
4813 11450142 11701871 11728578 11896462 11913551 11868553 11752331 11686574 11834087 11832920 11720354
4803 11720354 11228115 11292890 11694636 11810829 11782300 11692529 11899902 12272975 12566200 12590272
4793 12590272 12736578 13086629 13571342 13601085 13154000 13090085 13352727 13883523 14217074 14195058
4783 14195058 14044743 13955152 13803222 13989539 14582931 14822850 14607170 14527613 15159620 15997108
4773 15997108 16861001 17531139 18236245 19463912 20541385 20958864 20157844 19014371 18780044
4764 18780044 18343404 17469628 16890774 16531041 16498864 16276838 15822327 15552876 15842353 16319732
4754 16319732 16346651 16254866 16239165 16501045 16964873 17136740 16993056 16717041 16684325 16977884
4744A6977884K56642M66240K15452L33592J97589K21799M09806J82814J31284
4735A9393102K80265M39315M29240M77366M15649J98372L51787M23730M70673
4726B2879499L22628m3835K48010O09951Q88072N86107L70421Q52148R96152J131370
4716B8840523J274175J487953J230102J722900K400397K427596K017577K028137
4708D3429360K524217L032193L106970L031881K973024L089616K556029J866720
4700F5610010J648244J564183J208799O57144p7946r86502j562164j864117k084160
4691F4113491j986383j984415j893685j362977j429850j674854j915330k111195
4683D9754802k296259k116103j899089j828989j867849j572897j170735r77288
$$ plain form
4744 16977884 17234526 17700766 17916218 18249810 18447399 18669198 19079004 19261818 19393102
4735 19393102 19673367 20112682 20541922 21019288 21434937 21633309 21985096 22408826 22879499
4726 22879499 23202127 23158292 23406302 24016253 24904325 25490432 25860853 26713001 27709153 28840523
4716 28840523 30114698 31602651 32832753 34555653 36956050 39383646 41401223 43429360
4708 43429360 45953577 48985770 52092740 55124621 58097645 61187261 63743290 65610010
4700 65610010 67258254 68822437 70031236 70688380 70610434 69623932 68061768 66197651 64113491
4691 64113491 62127108 60142693 58249008 56886031 55456181 53781327 51865997 49754802
4683 49754802 47458543 45342440 43443351 41614362 39746513 38173616 37002881 36025593
4675C6025593q82771m50368m55238j62753J87992N26728M20786P58309J227649
4666C7195927J923762J734956J529492J553149J802902J612599J009460N13631
4658D8875878J52007m58648j135966j681560k244857k541773k785512k555202
4650C5624367k293204k228881k117929j725098j493543j531206j167249j004175
4642B2063082q19795m11781m08742n89171n61662m38514r2257l65068o67232n35266
4632A7173594l42439J80619j77096l09328J5626l35700l54714j6283q7975J39123
4622A5885427l39020P3623L47468J84683j81540j65178K01663P7489m38959m56784
4612A5188872l1204L73290l0026l32575q5872J60225K97700K26776L72632R5095
$$ plain form
4675 36025593 35142822 34692454 34237216 34074463 34262455 34789183 35209969 35968278 37195927
4666 37195927 39119689 40854645 42384137 43937286 45740188 47352787 48362247 48875878
4658 48875878 49027885 48569237 47433271 45751711 43506854 40965081 38179569 35624367
4650 35624367 33331163 31102282 28984353 27259255 25765712 24234506 23067257 22063082
4642 22063082 21243287 20831506 20422764 19833593 19271931 18833417 18741160 18376092 17708860 17173594
4632 17173594 16831155 17011774 16834678 16525350 16540976 16205276 15850562 15834279 15746304 15885427
4622 15885427 15546407 15620030 15967498 16152181 15970641 15805463 16007126 16084615 15645656 15188872
4612 15188872 15157668 15530958 15500932 15168357 15082485 15242710 15540410 15767186 16139818 16234913
4602A6234913N4082j90466o75315k58679m8782R8979n7071k94923R1909N6355
4592A5011002m8510q6923J04629p4397k14655J43886N70893L09318k82870n955
4582A5426418j52424n2709j06361M1966K16144k49491q1600J84035j48082R3575
4572A5171471O6559J28108P4265q5000J27504L43225L22493J41760J01921k5186
4562A6367120j31759L57247N2944m92959k96876M7872O03585L16686m28035j85829
4552A6209996L50092M08991l1861k58130J95044N1240L75576L94926J41174n0237
4542A7786811j18784P09686M49272l5700n170M20305P25522M19193K9947k65045
4532B0116037M9301J73738L49222L14163N49235K45022n6778j20559M54537O64819
$$ plain form
4602 16234913 16288995 16098529 15423214 15164535 15115753 15214732 15157661 14862738 14954647 15011002
4592 15011002 14962492 14875569 14980198 14905801 14691146 14835032 15405925 15715243 15432373 15426418
4582 15426418 15273994 15221285 15114924 15156890 15373034 15123543 15041943 15225978 15077896 15171471
4572 15171471 15238030 15366138 15440403 15355403 15482907 15826132 16148625 16290385 16392306 16367120
4562 16367120 16235361 16592608 16645552 16152593 15855717 15903589 16507174 16823860 16395825 16209996
4552 16209996 16560088 16969079 16937218 16679088 16874132 16925372 17300948 17695874 17837048 17786811
4542 17786811 17668027 18377713 18826985 18791285 18786115 19206420 19931942 20351135 20381082 20116037
4532 20116037 20165338 20339076 20688298 21002461 21551696 21796718 21739940 21619381 22073918 22738737
4522B2738737M31933J98268K85015M95199Q88526M73666J53378N70216J165399
4513B7400337J565752J373223Q43134J245939J569304K458106L448160M498006
4505D4401961O285498Q167542Q095855N787486J362788l357253o459073p716202
4497E6568602o539799n298712l933055k984598j925323j437721j214827q44162
4489C2390405p75033l83807o15882o21478j75370J56323j3782j9414p1612m2099
4479B9828251K85001K80700J47681J41438J63626K94640M57090O02320L09804
4470C2510551J07383N49201L40150K73654K69143O75128R12784J011468R38747
4461C7588209J114513J763253J805865J454152R10780O05743J212757J881358
$$ plain form
4522 22738737 23170670 23368938 23653953 24149152 25037678 25511344 25664722 26234938 27400337
4513 27400337 28966089 30339312 31182446 32428385 33997689 36455795 39903955 44401961
4505 44401961 50687459 58855001 66950856 72738342 74101130 70743877 64284804 56568602
4497 56568602 50028803 44730091 40797036 37812438 35887115 34449394 33234567 32390405
4489 32390405 31615372 31231565 30615683 29994205 29818835 29975158 29961376 29941962 29870350 29828251
4479 29828251 30113252 30393952 30541633 30683071 30846697 31141337 31598427 32200747 32510551
4470 32510551 32617934 33167135 33507285 33780939 34050082 34725210 35637994 36649462 37588209
4461 37588209 38702722 40465975 42271840 43725992 44636772 45242515 46455272 48336630
4453D8336630K656430L067452L786908M114697M411187L452135J714200n03567
4445G1036072j783865k874910m132096m213296l520611k514241j943475j979948
4437D8073630j974666j330360k91788P9121l39903p21118m06458K136M41484K80274
4427D3812352K57610M94500Q84114P68600N57834P82965J525596J746119J875550
4418E2705240J855734K111259K740713L529694M675522N498057O738047P904890
4410H7759156Q087642O453377L553846M79538j748665l645138m846175m964679
4402I1128902n028580n038305m738386m381354l325387k577566k091644k545427
4394F1402253k884447k928356k483836k359275j992462j991051j664533r77316
$$ plain form
4453 48336630 50993060 54060512 57847420 61962117 66373304 69825439 71539639 71036072
4445 71036072 69252207 66377297 62245201 58031905 54511294 51997053 50053578 48073630
4437 48073630 46098964 44768604 44476816 44555937 44216034 43494916 43088458 43090594 43532078 43812352
4427 43812352 44069962 44564462 45448576 46217176 46775010 47557975 49083571 50829690 52705240
4418 52705240 54560974 56672233 59412946 62942640 67618162 73116219 79854266 87759156
4410 87759156 95846798 102300175 105854021 106333559 104584894 100939756 96093581 91128902
4402 91128902 86100322 81062017 76323631 71942277 68616890 66039324 63947680 61402253
4394 61402253 58517806 55589450 53105614 50746339 48753877 46762826 45098293 44120977
4386D4120977n51176p20656m45071j43960m20424r23484j166232r52595m63468
4377C8333911m28860r51062o33895l61447j33620L3764k89750N1496J76012O53341
4367C6449890N08723K56190N35247Q76382J271938J184957J396436J662354J965470
4358D6107587K126761K145360J783672J029813L63626r69898j972357k534765
4350D8079799k521959k304837k268959k096744j651513p64788m70599q69901q98136
4341C4232363m79003l0465k92647l82079o9110L88474N54629K04403L15840M98782
4331C4941187M00556N54885J026346P52384R18420R63688J048312J432654J488324
4322D3526756J478214J780970K105775K024168J230174Q42372P29354L20426m11677
$$ plain form
4386 44120977 43569801 42849145 42404074 42260114 41839690 40916206 39749974 38797379 38333911
4377 38333911 37905051 36953989 36320094 35958647 35825027 35858791 35569041 35620537 35796549 36449890
4367 36449890 36958613 37214803 37750050 38626432 39898370 41083327 42479763 44142117 46107587
4358 46107587 48234348 50379708 52163380 53193193 53556819 52586921 50614564 48079799
4350 48079799 45557840 43253003 40984044 38887300 37235787 36470999 36000400 35130499 34232363
4341 34232363 33753360 33722895 33430248 33048169 32979059 33367533 33922162 34126565 34442405 34941187
4331 34941187 35341743 35896628 36922974 37675358 38593778 39557466 40605778 42038432 43526756
4322 43526756 45004970 46785940 48891715 50915883 52146057 52988429 53717783 54038209 53626532
4313E3626532n79111m16929l8282l78600p78772p10400l14138p3588L83516O87996
4303E1408224Q04826R43065J308793J779312K148633K647904L504194M364822
4295F8909773M925379N376863N701049O135215P056004Q651853J1599986J5360494
4287A33716616K0030280K4138471K6119743K3679148J5652795L342499j0633678
4280B36045874k1753195k6214942k5131063k1565828j7893261j4841911j1794422
4273I6851252r821298q360163p307193n680794m814812m619965m107576l131741
4265D9007710k470660k589358k567304j923096j600954j497612j332938r01657
4257C4124131j064770j092872q47947o58637l18927n11486n56342q29133q84826
$$ plain form
4313 53626532 53047421 52630492 52592210 52213610 51434838 50724438 50410300 50336712 50720228 51408224
4303 51408224 52213050 53156115 54464908 56244220 58392853 61040757 64544951 68909773
4295 68909773 73835152 79212015 84913064 91048279 98104283 106756136 118356122 133716616
4287 133716616 153746896 177885367 204005110 227684258 243337053 246679552 236045874
4280 236045874 214292679 188077737 162946674 141380846 123487585 108645674 96851252
4273 96851252 87029954 78669791 71362598 65681804 60866992 56247027 52139451 49007710
4265 49007710 46537050 43947692 41380388 39457292 37856338 36358726 35025788 34124131
4257 34124131 33059361 31966489 31118542 30459905 30140978 29629492 29073150 28244017 27359191
4248B7359191k95534q6752O1708j56698m40684K5824M30610K37830K59025P8106
4238B7472626Q82850J484099J730351J397620R00272M89003J57713k82657j403163
4229C2828714j855046j518396q67216p75780r30058o77520o5487L20639O41113
4220B7100963O03365Q36356P29019j73463q64711j503697j747131j597142j196727
4211B2186832o96893r69190p92075q35263n58453j55464j72068k34359k01451
4202A7571616o2047K66486L843k3197K86076M73979L18027O78701O46223N18024
4192B0677731N71091J91504k17150l37374n44121q03445p30662n21948o4521M1850
4182A8262955O6019k7568N30179Q92714M20694k37720l79334m73875n14513n74623
$$ plain form
4248 27359191 27063657 26976905 27038613 26881915 26441231 26467055 26897665 27135495 27394520 27472626
4238 27472626 28355476 29839575 31569926 32967546 33867818 34356821 34514534 34231877 32828714
4229 32828714 30973668 29455272 28588056 27812276 26882218 26204698 26139211 26459850 27100963
4220 27100963 27704328 28540684 29269703 29096240 28231529 26727832 24980701 23383559 22186832
4211 22186832 21489939 20520749 19728674 18893411 18334958 18179494 18007426 17773067 17571616
4202 17571616 17509569 17776055 17779898 17756701 18042777 18516756 18834783 19513484 20159707 20677731
4192 20677731 21248822 21440326 21223176 20885802 20341681 19538236 18807574 18285626 18221105 18262955
4182 18262955 18328974 18301406 18831585 19724299 20144993 19907273 19527939 19054064 18539551 17964928
4172A7964928q05487n49058o37109m81167j43188l16891k24841j36037q0291n34818
4162A4056041n86684j54797P429j04561j66760l1270p1694j99853M63061M30084
4152A3640996j14909J1077p659M83810K38605l32535k63856J88753M95511K17917
4142A4557710j5021l89969j11269n9954O3356P959j53293q1532J18301Q1125k47025
4131A3770388l65835K74846M67571J76975l4017k3309N3641N0647J08256K19977
4121A4699140j7587O912N5177J27907K39434N80451N37349K77354K82654R0020
4111A6878811K77469N21500P91440M30805j9638N1055O36222Q21704L83671N5232
4101B0828271J98084N50038P85833N70957K36755N27233P67496P31204O95693
$$ plain form
4172 17964928 17159441 16610383 15973274 15492107 15348919 15032028 14807187 14671150 14590859 14056041
4162 14056041 13469357 13314560 13321989 13217428 13050668 13019398 12947704 12747851 13210912 13640996
4152 13640996 13526087 13537164 13529505 14013315 14251920 13919385 13655529 13844282 14339793 14557710
4142 14557710 14542689 14152720 14041451 13981497 14044853 14052812 13899519 13817987 13936288 14017413 13770388
4131 13770388 13404553 13679399 14146970 14323945 14289928 14266619 14320260 14370907 14479163 14699140
4121 14699140 14681553 14688465 14743642 14871549 15110983 15691434 16228783 16506137 16788791 16878811
4111 16878811 17156280 17677780 18469220 18900025 18880387 18931442 19567664 20389368 20773039 20828271
4101 20828271 21026355 21576393 22362226 22933183 23169938 23697171 24464667 25195871 25891564
4092B5891564N99504P05469Q77677J103351J149491J201997J529367J490220R82401
4083C5531041J009058J623727K370037K739930L232293M122922M563385N347665
4075F0540058N527121N854018N635735N967932Q620551J4698455K3361403L3734148
4067A63939421M4169555M5662489L6122258J1961091j7191052m1788246m7721484
4060A95154032m0584931l0825258k1043469j5532467j1793667r398584p066275
4053E8909381n444238l906029l543131l487499l374651k885016k609603k093535
4045C1565679j876037j663073j536679j321928j189470o77158k57033m77913n79274
4036B1987114m67900j124018r99977o86606l13969l54590m57467m75518k51068
$$ plain form
4092 25891564 26491068 27196537 28074214 29177565 30327056 31529053 33058420 34548640 35531041
4083 35531041 36540099 38163826 40533863 43273793 46506086 50629008 55192393 60540058
4075 60540058 66067179 71921197 77556932 83524864 92145415 106843870 130205273 163939421
4067 163939421 208108976 253771465 289893723 301854814 284663762 242875516 195154032
4060 195154032 154569101 123743843 102700374 87167907 75374240 65975656 58909381
4053 58909381 53465143 49559114 46015983 42528484 39153833 36268817 33659214 31565679
4045 31565679 29689642 28026569 26489890 25167962 23978492 23301334 23044301 22566388 21987114
4036 21987114 21519214 20395196 19395219 18708613 18394644 18040054 17582587 17107069 16856001
4027A6856001l1680j14701k96725k26719r5720J1767j71168l79031k16015j54570
4017A5181439k02399p14592r47170l97707L6997K05874l12213m08280Q900k24980
4007A2225869m36936n58801J376J78304P073k00972p5043R9356K46074l16380
3997A1169920n30783L17627N26854j4309L8198J72891j75013N2662J67952O63377
3987A2389376Q70915P24368N63983N95093P51915O34301J38949K06054K78387
3978A7153341J49208k19211l83371j021739r80029o16879m35615m84077l99534
3969A2762094j1346j36764l12444j85116J11460Q2557o726J03411K93900M49751
3959A3150777M78516R04690J361844J297365R79515J072823J409427J347990R54780
$$ plain form
4027 16856001 16824321 16709620 16412895 16186176 16090456 16102223 15931055 15552024 15336009 15181439
4017 15181439 14979040 14264448 13317278 12919571 12956568 13162442 12850229 12441949 12450849 12225869
4007 12225869 11788933 11230132 11231508 11409812 11416885 11215913 11140870 11240226 11486300 11169920
3997 11169920 10639137 10956764 11483618 11469309 11507507 11680398 11505385 11558047 11725999 12389376
3987 12389376 13260291 13984659 14548642 15143735 15895650 16529951 16668900 16874954 17153341
3978 17153341 17302549 17083338 16699967 15678228 14698199 14081320 13645705 13161628 12762094
3969 12762094 12750748 12613984 12301540 12116424 12227884 12310441 12303715 12407126 12701026 13150777
3959 13150777 13629293 14533983 15895827 17193192 18172707 19245530 20654957 22002947 22957727
3950B2957727K70268k11640m66321j006163j415377j303803j540160j290572j061255
3941A4932704p34419r49532l74073j92364p1552l5987p8833L85566N01417L59922
3931A3742849M05489J78641M85962L36093K385k84262l09932j99785j49350k22973
3921A3985117j55068J63307J51690j2531m0482L33834J6849l3720K7593K00422
3911A4637011n4412n31453q88355p25477o79776M0805K90626J11049K35650n6033
3901A2379635K59683K79720n0597o0700J96169J41162j28833r7429M7682j37158
3891A2829334j63916k85656k39337k47396m81432o44036r83976q72744n15536
3882H395305l29901o30246p37694k85964l6544r5643k68977j50535J7135q5535
$$ plain form
3950 22957727 23227995 23016355 22550034 21543871 20128494 18824691 17284531 15993959 14932704
3941 14932704 14198285 13248753 12874680 12682316 12610764 12574777 12495944 12881510 13382927 13742849
3931 13742849 14148338 14326979 14812941 15149034 15151419 14867157 14557225 14357440 14208090 13985117
3921 13985117 13830049 13993356 14145046 14132515 14092033 14425867 14442716 14408996 14436589 14637011
3911 14637011 14582599 14051146 13162791 12437314 11757538 11798343 12088969 12200018 12435668 12379635
3901 12379635 12639318 12919038 12868441 12807741 13003910 13145072 13016239 12918810 12966492 12829334
3891 12829334 12665418 12379762 12140425 11893029 11411597 10767561 9783585 8910841 8395305
3882 8395305 8065404 7435158 6697464 6411500 6374956 6279313 6010336 5859801 5876936 5791401
3872E791401k07496n2472R0841K57848J27955n5619J36600Q6315r4640M5623K86161
3861F412517K44443N47123N33684N43050J16194N854J18513k57580k02831l09528
3851G751439k42798m52891p19637n78889o97411m21657k2273j6567m51065l74530
3841C773721J69171L32503k07340p95468p7628K01179n4028k34860k9439J02072
3831C179883k1738l52789k05315O132J19008j73193M0265j4810J13129L03049
3821B993621k49993K9797k54140j25485r514J75656J70855l57604k11066K20389
3811B382516K98907J19080k25617k42280J38903L52388m36633m35763j5219P7625
3801B013907k26240N317j9975K28005K6457k10805Q6814M14137L8966l43013j96981
$$ plain form
3872 5791401 5583905 5531433 5622274 5880122 6008077 5952458 6089058 6175373 6080733 6126356 6412517
3861 6412517 6656960 7204083 7737767 8280817 8397011 8402865 8521378 8263798 8060967 7751439
3851 7751439 7508641 7055750 6336113 5757224 5059813 4638156 4615883 4599316 4148251 3773721
3841 3773721 3942892 4275395 4068055 3272587 3194959 3396138 3342110 3107250 3077811 3179883
3831 3179883 3158145 2805356 2600041 2606173 2725181 2551988 2592253 2577443 2690572 2993621
3821 2993621 2743628 2773425 2519285 2393800 2384286 2559942 2730797 2373193 2162127 2382516
3811 2382516 2681423 2800503 2574886 2332606 2471509 2823897 2387264 1951501 1936282 2013907
3801 2013907 1787667 1792984 1773009 2001014 2027471 1816666 1903480 2317617 2356583 2013570 1816589
3790A816589J82237K51349K3195k33261n3306J47850n2460M2008Q1574K06682
3780B412457K32789j28755l18131J55129K64154L58768J21586j58902k19011j70456
3770B549628l64569M5759p6099j31026M0597J72655j23326k32958r162k7323o5148
3759A779028j24526J94799J65945l15320l17764J67267M13363j3734j64450j16168
3749A668440J65181k29721m68117K23382M43495r5843k6271k69504j54465K11018
3739A467595J19028l1123j51428j31109N6315Q6242J34765k80599P420L12815
3729A589921P909n766J71456K062m86213j95252J95423K83905O057k15867n938
3718A347697K43623q6390O7566M058K054o2181J4318J1466Q416k07593p5045K95105
$$ plain form
3790 1816589 1998826 2250175 2273370 2040109 1986803 2134653 2082193 2124201 2205775 2412457
3780 2412457 2645246 2516491 2198360 2353489 2617643 2976411 3097997 2939095 2720084 2549628
3770 2549628 2185059 2230818 2154719 2023693 2064290 2236945 2113619 1880661 1871499 1844176 1779028
3759 1779028 1654502 1849301 2015246 1699926 1382162 1549429 1962792 1949058 1784608 1668440
3749 1668440 1833621 1603900 1135783 1359165 1802660 1706817 1680546 1411042 1256577 1467595
3739 1467595 1586623 1555500 1404072 1272963 1329278 1415520 1550285 1269686 1277106 1589921
3729 1589921 1597830 1592064 1763520 1765582 1279369 1084117 1279540 1563445 1569502 1353635 1347697
3718 1347697 1591320 1504930 1572496 1576554 1578608 1516427 1530745 1542211 1550627 1343034 1267989 1563094
3706A563094J78470j68508j45136J49658L34249Q5744R2295O0088k21267k17639
3696A711048r6810L03644L52467q7458k3977K06109K52565K61640p937J35444
3686C006735L06623o6645k85830l55978q9664K20637R3622l18965m76830k15615
3676A818090J48451p3821j34547m6432J96792R4992j15243q0924J34617N4911
3666A996886j56717k48360J43820N65252j26492k06168j0573L88793J42023K30175
3656B718639J48854N3568p026j7341M5251o2178k01012l60397j96516K46509m9948
3645B318403l48963j76192j01498J44843k10519l96574J5957N663L05410K2363
3635A578893m43907j14430J84391N19096O2765l40713m34880J20779Q8317J57107
$$ plain form
3706 1563094 1741564 1573056 1427920 1577578 1911827 1997571 2089866 2149954 1928687 1711048
3696 1711048 1614238 1917882 2270349 2182891 2158914 2365023 2617588 2879228 2871291 3006735
3686 3006735 3313358 3246713 2960883 2604905 2515241 2735878 2829500 2510535 2033705 1818090
3676 1818090 1966541 1892720 1758173 1711741 1908533 2003525 1888282 1807358 1941975 1996886
3666 1996886 1840169 1591809 1735629 2300881 2174389 1968221 1957648 2346441 2488464 2718639
3656 2718639 2867493 2921061 2914035 2896694 2941945 2879767 2678755 2318358 2121842 2368351 2318403
3645 2318403 1969440 1793248 1691750 1836593 1626074 1229500 1245457 1251120 1556530 1578893
3635 1578893 1134986 1020556 1204947 1724043 1786808 1446095 1011215 1131994 1220311 1377418
3625A377418J94608j53726k12992j55345L07346R8353l55141j19828K8819P9405
3615A088917N3150j65037m7182J53871J08621j7791N5500O6172n2722O2620j33940
3604A172179k42551j58026L17325K50393k55452k11315q7059J96117j75202j97869
3594F08540N8123N50398m5230n00283K63539K88935K3745k46738l32605q042J59675
3583H20057K85732k1915q2888J55651j59525l1867l4198m1451p1398Q3828k0375
3572H81651j40314J37533J34349J19544j09529k94306j09210R0813J86433J1176
3562I08140q1456n3149P5549J69142R4463l79406k36949J27185K02145J22541
3552I48205k58398j09586p0901N2678J21517L00803J82249l02974k83019L9688
$$ plain form
3625 1377418 1572026 1418300 1205308 1049963 1357309 1455662 1100521 980693 1009512 1088917
3615 1088917 1142067 977030 929848 1083719 1192340 1174549 1230049 1296221 1243499 1306119 1172179
3604 1172179 929628 771602 1088927 1339320 1083868 872553 785494 981611 806409 608540
3594 608540 666663 1217061 1171831 671548 935087 1224022 1247767 1001029 668424 660382 820057
3583 820057 1105789 1083874 1000986 1156637 997112 965245 931047 889596 818198 902026 881651
3572 881651 741337 878870 1013219 1132763 1023234 728928 619718 710531 896964 908140
3562 908140 826684 773535 849084 1018226 1112689 733283 496334 623519 825664 948205
3552 948205 689807 580221 509320 561998 683515 984318 1166567 863593 580574 620262
3542F20262L96934k0m48113N5919L96640j09574m44101O048M50280n700l61217
3531E57358k72875K88406J64439j88934p1879M25797N01081m06648l81070O4798
3521F80473J25099M1889N5095k65008k49957j17122j5854K63267K47047Q0789
3511H45718j14863j57262j00427K57620Q8624j21527k03799J42944M18620j40742
3501I14906k23036j34687R866p9094q1642K64688L6849k86046j81943K17153M53586
3490I10600j22176m58438L590K08954J25710j05182j81809J1841j9901J32629
3480E05818J29641j25559l16649K781K57308K97487k88375K5200P8764L24614
3470H91030j92145m55015J75527M57390P6567l57356k26417K34217N0105j43527
$$ plain form
3542 620262 1017196 1017176 569063 624982 1021622 912048 467947 473995 924275 918575 557358
3531 557358 284483 572889 737328 548394 476515 902312 1403393 996745 615675 680473
3521 680473 805572 847461 902556 637548 387591 270469 254615 517882 764929 845718
3511 845718 730855 573593 473166 730786 819410 697883 494084 637028 1055648 914906
3501 914906 691870 557183 567049 487955 406313 671001 707850 421804 239861 457014 910600
3490 910600 788424 329986 333576 542530 668240 563058 381249 393090 373189 505818
3480 505818 635459 509900 193251 196032 453340 750827 462452 487652 566416 891030
3470 891030 698885 243870 419397 876787 953354 595998 369581 603798 653903 510376
3460E10376J08723r6438j13343J11830K23214j55689j05585k63568K32639L8964
3450D91123k25069K49062M60425j67394l19842m1510K39135j34219j01324Q1676
3440E32063J57065l12380k47337K72165M22196J00933m98699k9887J25287J16582
3430F37988J57781P2322k17355n17495J41744N28337J08777l64072j70025K65297
3420F43299L2933k27894j06983K17413J16379k23686Q23J33423j47854j07745
3410C30108Q0209J71070K15319K8109l03187k36946J92493K94433O2595r4797
3400G39406j05891J73616P3812j72410j95965L21030J42206j39612n09938j0661
3390C15593M26728J36182j13368q1544J75526K15711j05761m45760k74094K35732
$$ plain form
3460 510376 619099 522661 409318 521148 744362 588673 483088 219520 452159 491123
3450 491123 266054 515116 975541 808147 488305 446795 685930 551711 450387 532063
3440 532063 689128 376748 129411 401576 823772 924705 426006 396119 521406 637988
3430 637988 795769 868091 650736 133241 274985 803322 912099 548027 378002 643299
3420 643299 676232 448338 341355 558768 675147 451461 452284 585707 437853 330108
3410 330108 410317 581387 796706 824815 521628 284682 477175 771608 834203 739406
3400 739406 633515 807131 880943 708533 512568 833598 975804 836192 326254 315593
3390 315593 742321 878503 765135 683591 859117 1074828 969067 523307 249213 484945
3380D84945K24404j94904l54805J79482N75362k0017l20949k01490J38548J34031
3370F44607k44507l14090K60284M09770L1386k63118j16500j58880L95210K94954
3360I39116m823k46829k18369J35778J13325j25663o1874K25173J63668M6904
3350I66406r0062k95233o6495K33691j01837l17222R8885L68703K88887k46352
3340H39371k53597j18539J05892J76397j57047J46638J82399j58779J21985J68423
3330A053143J64048r9532l45824m9338J10970K42240j37521k11409j39061O5289
3320F53005K91103L18980N9389k0228K19591n256m34511k83356K07831K28739
3310A235287M0117N0113K4033J14009J21298k4196n5120k52512o2862J44883N22413
$$ plain form
3380 484945 709349 514445 159640 339122 914484 894467 573518 372028 510576 644607
3370 644607 400100 86010 346294 756064 787450 524332 407832 248952 644162 939116
3360 939116 934293 687464 469095 604873 718198 592535 530661 755834 919502 966406
3350 966406 876344 581111 514616 748307 646470 329248 428133 796836 1085723 839371
3340 839371 585774 467235 573127 749524 592477 739115 921514 762735 884720 1053143
3330 1053143 1217191 1117659 771835 722497 833467 1075707 938186 726777 587716 653005
3320 653005 944108 1263088 1322477 1302249 1521840 1516584 1082073 798717 1006548 1235287
3310 1235287 1275404 1325517 1349550 1463559 1584857 1560661 1505541 1253029 1190167 1335050 1857463
3299A857463P6479m99374j81084J82334M79628J19556R1414J52955o3405j91889
3289B024077J1199j70250O9796j59455l58319N17784N25353K66082l22842j78592
3279B224833J79748l1858K17094k95869j00097K92026L33606j48707j78407K03645
3269B696014M46056j32235j40657Q9114M09356j01761j47018j6446N02164P16503
3259D321090J09529j2306k31451K94668Q03001M18424K26570M86348P54988J159686
3249H330547J342281J629830J638658J210294K08801n19235j312340j492116j323937
3240I712783q23096l70419l13537k78094j02093R96r9889j54990O4037j38349
3230G497349l09123j03808P715J94424L42984L08731J49448L05873K27766N75310
$$ plain form
3299 1857463 1933942 1434568 1253484 1435818 1915446 2035002 2126416 2279371 2215966 2024077
3289 2024077 2035276 1865026 1934822 1775367 1417048 1934832 2460185 2726267 2403425 2224833
3279 2224833 2404581 2372723 2589817 2293948 2193851 2485877 2819483 2670776 2492369 2696014
3269 2696014 3142070 3009835 2869178 2958292 3367648 3265887 3118869 3102423 3604587 4321090
3259 4321090 4430619 4418313 4186862 4481530 5284531 5702955 5929525 6415873 7170861 8330547
3249 8330547 9672828 11302658 12941316 14151610 14360411 13841176 12528836 11036720 9712783
3240 9712783 8889687 8519268 8205731 7927637 7825544 7826540 7726651 7571661 7635698 7497349
3230 7497349 7188226 7084418 7092133 7286557 7629541 7938272 8087720 8393593 8621359 9196669
3220I196669J023238J279407J809479K661278L012215K744316J849066l03768
3212B3271900k170376l008497l222338k605342j892632j481682o67770o85313
3204G537950o68473m52938q7835l29482o06478n33258J55368L55359j28032m06817
3194D835364k04781K53063K64397o6658J07453J26229Q82106J237221Q77840O02785
3184H915019J061028J229675O32035k59008j031518j211116j358237j494032j178017
3175E305829n30926n99695o94194m00342r2981j17265K428k29969j55473j88107
3165B299305k80445P6875j26562l53195J9372M7523L3066l89335o3724J11662
3155A374542o361m5016J0081L5061k9038j52831p1555J57434k14006j15955j08696
$$ plain form
3220 9196669 10219907 11499314 13308793 15970071 18982286 21726602 23575668 23271900
3212 23271900 21101524 18093027 14870689 12265347 10372715 8891033 8223263 7537950
3204 7537950 6869477 6416539 6328704 5999222 5392744 4859486 5014854 5370213 5242181 4835364
3194 4835364 4630583 4883646 5148043 5081385 5188838 5315067 6197173 7434394 8312234 8915019
3184 8915019 9976047 11205722 11837757 11578749 10547231 9336115 7977878 6483846 5305829
3175 5305829 4774903 4175208 3481014 3080672 2987691 2870426 2872854 2642885 2487412 2299305
3165 2299305 2018860 2095735 1969173 1615978 1635350 1682873 1715939 1326604 1262880 1374542
3155 1374542 1368181 1323165 1333246 1368307 1339269 1186438 1114883 1272317 1058311 942356 833660
3144H33660K48546K10931m0726l24028p4833k0471J22852j54143J776J20804K5138
3133I49506k40218Q0675l6427r1560O7280q9968l8132j42658K55627J33346P6336
3122I23807N0975j66142j64822K05216k75048j63544j02545L4934K54764L06206
3112I03801k83458l6710K324N501k04319k20083L20770N05792o1738m56618j92289
3101B82973J73612L48616m491m43291k70148K20985J66611N57K57244r2476k98429
3090C41763j75262o1384J64880L2034J02725N7499m9400k00821J8955N4480J48939
3079D34408j13934k13705Q5690p5459j40500j23007J75893M15848J60311l10333
3069B95212m123k19968n3758J34087J60328l45744m92575N4209O11006M70014
$$ plain form
3144 833660 1082206 1293137 1252411 928383 853550 833079 955931 801788 803564 924368 949506
3133 949506 709288 789963 753536 661976 729256 639288 601156 458498 714125 847471 923807
3122 923807 974782 808640 643818 849034 573986 410442 307897 342831 597595 903801
3112 903801 620343 583633 585957 591458 387139 167056 487826 993618 931880 475262 282973
3101 282973 456585 805201 800710 357419 87271 308256 474867 475424 732668 640192 341763
3090 341763 166501 105117 269997 302031 404756 462255 412855 212034 230989 285469 434408
3079 434408 320474 106769 192459 117000 -23500 -146507 29386 445234 605545 295212
3069 295212 291089 71121 17363 151450 311778 -33966 -526541 -472332 138674 608688
3059F08688j58836k25557Q1968L63847m3424k98608j91006m61606K2545K35168
3049f6821J39583K3501l17967K29541J97221J99988j84286q9783L1373r3077j50060
3038h0787J52559K0945j48467k01599o0812M68689L66431J0224k90228j05924
3028A31031n2409O9138K01268L7727n7088k33773m9245l2120N6001N5633N1100
3017A77263J38554j07423j03651j38442N1310K73198m8821q1386l02675m5228
3007a87301P9795K43230J46000M8057n6580k16854N318J63822j2633l98125k2136
2996b07407M09644J35908j6479j67736n1438Q014j15356R2755n8549j62955n5267
2985a88866L4222K12881J79239j81259k55712j6389K49845L24737r8442k37507
$$ plain form
3059 608688 449852 224295 306263 670110 626686 328078 137072 -324534 -301989 -66821
3049 -66821 72762 96263 -221704 7837 205058 405046 220760 130977 162350 69273 -80787
3038 -80787 71772 92717 -55750 -257349 -318161 150528 516959 527183 236955 131031
3028 131031 78622 147760 349028 386755 329667 95894 46649 14529 70530 126163 177263
3017 177263 315817 208394 104743 -33699 17611 290809 241988 160602 -142073 -187301
3007 -187301 -107506 135724 281724 329781 273201 56347 61665 225487 212854 -185271 -207407
2996 -207407 202237 338145 321666 153930 102492 110506 -4850 87905 29356 -133599 -188866
2985 -188866 -154644 58237 237476 56217 -199495 -215884 33961 358698 260256 22749
2975B2749j41151L04022K02052j47332l52335L5182O53972k2771k07678j38028
2965B08682n4054J89161J5010j6318k98862j4970M06486K96505m67750l78692
2955a14802l10906K39393P54112K0103l40778j36479j74625K6279O5143n8500
2945c1060J32011R3681J20470j75136M0591l3031p1090K259K49148O7613p3760
2934C21696j8225k76749j66036K66031J97982r2443j00737j3552L38210J44385
2924F00562l15661l31027j41160L89873k9056j44838n3365J20392j15963o5020
2914h5263K22310O1099P5112K23650J92226q1601m11057q9639L53759L02786j99182
2903E64200m78832L9206K57905K63342k59581l40142l495L36230J83763j26314
$$ plain form
2975 22749 -118402 185620 387672 240340 -111995 -76813 577159 554388 346710 208682
2965 208682 154628 343789 358799 342481 43619 28649 435135 731640 263890 -114802
2955 -114802 -425708 -186315 567797 587900 247122 110643 -63982 -37703 27440 -31060
2945 -31060 100951 194632 315102 139966 180557 147526 76436 78695 327843 395456 321696
2934 321696 303471 26722 -139314 126717 324699 232256 131519 117967 456177 600562
2924 600562 284901 -46126 -187286 202587 173531 28693 -24672 95720 -20243 -85263
2914 -85263 137047 198146 273258 496908 689134 607533 196476 106837 460596 763382 564200
2903 564200 85368 124574 382479 645821 386240 46098 42603 378833 562596 436282
2893D36282K1830k58945j18032P8202O5077J84104J09882j97854k04083Q9953
2883B06416L56370J60008n35969l16924K98408J27733P1558j01363j13440J66803
2873C19600J08712j20626R6049R808J14166j15280k06517M1303j83295M272K01895
2862B70087l8089o2310j91954j05948Q6347J21651K1560K7590J20368j70501N6543
2851A35344R2343J11103j53565j14774j487j69146n4068p9150K82678J22059l3436
2840A37901N8423P3629j1078k20120k57007Q1219J24920R4528o9154l07547N4263
2829b40023J29219K50513K89317k20403k26065Q2425k3015j02647q1214J93004
2819E1111J528Q4121j91164N1836J84574j00144l4767j32624r7713P3815Q9191
$$ plain form
2893 436282 458112 199167 81135 159337 224414 408518 518400 320546 116463 206416
2883 206416 562786 722794 186825 -130099 168309 296042 367600 266237 152797 319600
2873 319600 428312 307686 403735 413543 527709 412429 205912 247215 63920 68192 270087
2862 270087 231998 169688 -22266 -128214 -41867 79784 101344 128934 249302 78801 135344
2851 135344 227687 338790 185225 70451 68964 -100182 -154250 -233400 49278 171337 137901
2840 137901 196324 269953 258875 38755 -218252 -137033 -12113 82415 13261 -294286 -240023
2829 -240023 -110804 139709 429026 208623 -17442 64983 41968 -60679 -141893 51111
2819 51111 52639 136760 -54404 -2568 182006 81862 47095 -85529 -183242 -109427 -20236
2808b0236J73860O1351K53243k12676k75465J8621n8215j0431l6198j69888J68512
2797a07522K95823j08931l27877K1228K78391J37577j72307j89249k2030M3126
2787a51771J56320R3747J38740r1155k33109j42641Q2581J42987k82766m1099
2777c28166J37434j6365L9791J49491J93077j66267l73056j63469L31067K98770
2767A02307J1931m30404k29816K43833M14478J60647p3539l25123k21467J82690
2757a64463J55200R8874j86109k17355N5295O5392R5261J66837J07420o2491k68388
2746a54527p7854k02284J60616L82574j14110m17790N5787J28061K97274N7274
2736A15021m96225j99135K24401L52231N8587n36074k11243N28231K35652M6524
$$ plain form
2808 -20236 153624 214975 468218 255542 -19923 -1302 -59517 -69948 -106146 -276034 -107522
2797 -107522 188301 79370 -248507 -227279 51112 188689 16382 -172867 -194897 -151771
2787 -151771 4549 98296 237036 145881 -87228 -229869 -147288 -4301 -287067 -328166
2777 -328166 -190732 -207097 -167306 -17815 175262 8995 -364061 -527530 -196463 102307
2767 102307 114238 -316166 -545982 -302149 112329 272976 199437 -125686 -347153 -164463
2757 -164463 -9263 89611 -96498 -313853 -258558 -193166 -97905 68932 176352 113861 -154527
2746 -154527 -232381 -434665 -274049 108525 -5585 -423375 -367588 -239527 57747 115021
2736 115021 -381204 -580339 -355938 -3707 54880 -481194 -692437 -164206 71446 117970
2726A17970n47336k84989M64294M44569j80958k72673r9895M11700L12461j97723
2716A67420l79272l39286J64036L00423Q4790j86978q0771J3337k0544J77070
2706i9775R1909K1865Q6039o3367j48101R5777j2973j97841j18016K04390K48577
2695A08484N0089m33780R238K12615o6194l8511O0111N6531l53166k26437J73302
2684d47718K79374J84157k69592j91254J02260J17127J29410J03664k02975j37639
2674c33186L1720K1033k57158J05346M73260j77911j09181k84420J14384M40478
2664B4365j2625l44787k0034M99357l6145l00649k3599R1822j73519j2717L41338
2653C2807j25826k01822J50778q1648K2767N8830r7068Q7317j12987m62832j25031
$$ plain form
2726 117970 -429366 -714355 -250061 194508 13550 -259123 -359018 52682 365143 167420
2716 167420 -211852 -551138 -387102 -86679 -1889 -188867 -269638 -256301 -276845 -99775
2706 -99775 -7866 13999 100038 36671 -111430 -15653 -28626 -226467 -344483 -140093 108484
2695 108484 158573 -275207 -265969 -53354 -119548 -158059 -97948 -41417 -394583 -621020 -447718
2684 -447718 -168344 15813 -253779 -445033 -342773 -225646 -96236 7428 -195547 -333186
2674 -333186 -301466 -280433 -537591 -432245 41015 -136896 -246077 -530497 -416113 24365
2664 24365 11740 -333047 -353081 146276 110131 -190518 -214117 -122295 -295814 -308531 32807
2653 32807 -93019 -294841 -144063 -225711 -202944 -144114 -241182 -153865 -266852 -729684 -854715
2642h54715M28146L24556K6306j56911Q5862K91939J6185j43314Q065j16711j38349
2631b28941P6209J05115k42385j81270J10074L62061K8304k36387k13914J44474
2621b76660L95704k639l34236j37744o2833K06222J13299l1183J7708j65687L4196
2610b43853k2550P2420L04178o2470k00640p3726J24427N1187j23478l90587j93986
2599g59078J91891P1306k1709K58048M08832J15307l30210j46400J93670J21638
2589A03295j7214r9832O9784j17767l87412m6795K02762L76984n0299m18944j05566
2578d91004M34366K66231k15413k49426k2282K15413j92582j4561J49988m4817
2568a64087p8422J29992L35306r5327l70038k67853J56177L24540K12651k82923
$$ plain form
2642 -854715 -426569 -102013 -75707 -232618 -146756 145183 161368 18054 26119 -90592 -228941
2631 -228941 -152732 -47617 -290002 -471272 -361198 863 29167 -207220 -421134 -276660
2621 -276660 119044 116405 -217831 -355575 -418408 -212186 -98887 -130070 -112362 -278049 -243853
2610 -243853 -266403 -193983 110195 47725 -152915 -226641 -102214 -51027 -174505 -565092 -759078
2599 -759078 -567187 -495881 -517590 -259542 149290 264597 -65613 -212013 -18343 103295
2589 103295 86081 -13751 56033 -61734 -449146 -495941 -293179 83805 33506 -385438 -491004
2578 -491004 -56638 209593 -5820 -255246 -277528 -62115 -254697 -269258 -119270 -164087
2568 -164087 -242509 -112517 222789 127462 -242576 -510429 -354252 -29712 182939 -99984
2558i9984k89959J83368J89044Q4686k96095j70132R8001K72986j34607L2791
2548a29901j5116Q4035L0531m1646M8093O5476j37749k19922j37611L80905L87361
2537C14456l37496m95518J33173K91410L242j53565j43694L50555R5025k80402
2527b22814k52456M6880J26687R7006L23617L907l3661j87605J8059J99320j49618
2516c0678l68505J38211L15452j04696j99173j07966j17203N5462P1981J72083
2506a75032J01234k03076Q1130j80559r3529J39398K62513L9961j67178m14275
2496f09413K99231L66261l97352m65358L26956N43125N0928k65215K21061L6349
2486A06573k55444l49792K96534L85785J14467j99141j55719k32006k02513J19344
$$ plain form
2558 -99984 -389943 -206575 -17531 67155 -228940 -399072 -301071 -28085 -162692 -129901
2548 -129901 -145017 -60982 -30451 -72097 -24004 41472 -96277 -316199 -453810 -72905 314456
2537 314456 -23040 -518558 -385385 -93975 -90733 -244298 -387992 -37437 57588 -222814
2527 -222814 -475270 -428390 -301703 -204697 118920 122827 89166 -98439 -80380 118940 -30678
2516 -30678 -399183 -260972 54480 -50216 -249389 -357355 -474558 -419096 -347115 -175032
2506 -175032 -73798 -276874 -195744 -376303 -469832 -330434 -67921 -27960 -195138 -609413
2496 -609413 -310182 56079 -341273 -806631 -479675 63450 114378 -150837 70224 106573
2486 106573 -148871 -498663 -202129 183656 298123 98982 -56737 -288743 -491256 -371912
2476c71912O5010K3963J3175M90021P889k80054m53408P127L09497M81828j20731
2465A72405m67585l66841P1150K37154M56002M4528m04853j68021p5184K10872
2455b90373Q6779l5864M4149N8191m1804l37051j45843L45210L03927j06523j65166
2444b84368K52455K179j27202j28334j21452J98923L54705k6349m30768j76404
2434d86615J93929M10815J59462o89239l42341K06493L83521L75365R86l18803
2424a06427j51193J27639L24577p2794m12648k95591R4564M20361J33744k09443
2414a47211k06244J41816L07945l90296j67733P35303O9559l35980p2209J79204
2404A14154J56984m27090n93048K00098O18631J17353l35947k94853K26030J25994
$$ plain form
2476 -371912 -306902 -282939 -269764 220257 228146 -51908 -505316 -498189 -188692 293136 172405
2465 172405 -295180 -662021 -590871 -353717 102285 146813 -258040 -426061 -501245 -290373
2455 -290373 -203594 -239458 -195309 -137118 -178922 -515973 -661816 -316606 -12679 -119202 -284368
2444 -284368 -31913 -29734 -156936 -285270 -406722 -207799 146906 120557 -310211 -486615
2434 -486615 -292686 118129 277591 -411648 -753989 -547496 -163975 211390 212376 -106427
2424 -106427 -257620 -129981 194596 121802 -290846 -586437 -491873 -71512 62232 -147211
2414 -147211 -353455 -211639 96306 -293990 -461723 273580 343139 7159 -65050 114154
2404 114154 271138 -155952 -749000 -548902 69729 187082 -148865 -443718 -217688 -91694
2394i1694j44371n0038P9436M06577K37066P111o06187m66428N12968N40844k32604
2383A92680k31570k69754L1714P6329J48185o1372R1909k2436k70177P7011J36892
2372a00589l4325K62355K17351k98299K5291K7038J32849J50544l6998p9981j09711
2361A55525k90014R8819J66371L0211L1027k98173k55767J01817L07334J73613
2351B20763k04321m72475K16531L61461r3771j23201J11663J15658j52757j98713
2341b19162N0606J82356l444j31409j01804L09772K06593l87827j55581L6586
2331b13314P1567L11540l50133k67002L01956L73869J32404k32357m04717K70154
2321f033K71274j19494k47626r7554K24472M6759k83134N8110L84684K6280k42012
$$ plain form
2394 -91694 -236065 -286103 -206667 199910 436976 444087 -162100 -628528 -115560 425284 192680
2383 192680 -38890 -308644 -276930 -200601 -52416 -113788 -21879 -44315 -314492 -237481 -100589
2372 -100589 -134914 127441 344792 46493 71784 98822 231671 382215 345217 265236 155525
2361 155525 -134489 -35670 130701 160912 191939 -106234 -362001 -260184 47150 220763
2351 220763 16442 -456033 -239502 121959 28188 -95013 16650 132308 -20449 -219162
2341 -219162 -168556 13800 10356 -121053 -222857 86915 293508 -94319 -249900 -213314
2331 -213314 -141747 169793 -180340 -447342 -145386 228483 360887 128530 -276187 -6033
2321 -6033 265241 145747 -101879 -199433 25039 71798 -211336 -153226 231458 257738 15726
2310A5726q0328J60873K96181r6773l60564l31633J50099K09856J62494k4799
2300A01132j98447L2631J16599P8127R3105j1579j08834m2507k69436M002L83150
2289A77943M0054J15738j51239l07768j96964J0851J67861L93757L80365k87935
2279C42663m69074j9936K54786O042j8913j70132l9825O6276J53227P3920j6567
2268A62467j16774j66842j3669K39706k1234j41033K33623K40105j74462l38291
2258i6404K06806L91635j23355l44333j79986K06633R7904P3309k76305K5389
2248a8707L40765P1894j28759j65845L8435K32914K44689l46908m04621R2802
2238d3341L72601K51295l2043j29170k54500J3878J4268K09590p2243l00011J0169
$$ plain form
2310 15726 -64602 96271 392452 295679 -64885 -396518 -246419 -36563 125931 101132
2300 101132 -97315 -64684 51915 130042 223147 211568 102734 60227 -209209 -205207 177943
2289 177943 217997 333735 182496 -125272 -322236 -311385 -143524 250233 630598 342663
2279 342663 -126411 -146347 108439 114481 95568 -74564 -114389 -48113 105114 179034 162467
2268 162467 45693 -121149 -134818 104888 83654 -57379 176244 416349 241887 -96404
2258 -96404 110402 502037 378682 34349 -145637 60996 158900 232209 -44096 -18707
2248 -18707 322058 393952 265193 99348 137783 370697 615386 268478 -136143 -43341
2238 -43341 329260 580555 548512 419342 164842 178720 192988 402578 330335 30324 40493
2227D0493L58736K95160j32434k55688K41065l8325l34939q3330N2588L11054
2217D54380K37536K12151O0061k43031m50346l74021K81975L37753J35207o9121
2207E82544k78106J75963J10794P8534K51029N538l70284J22676R8216Q835j62832
2196F22907o2950O5280L41041K13682k11955j14268j68784R5608J53423K26864
2186A160848m612k58406j14637K72647L25070j21542l1197K5047K64578k3442
2176A494354l87092J0295j17770n9328K27035L46010M52068n6232l08928j03392
2166A497020j07109K12060L03694J38100K9897j67294o9107r3641J82447K34256
2156B160323K90360j64720k80303P8448K88039J28203k44842m2681J49834N46560
$$ plain form
2227 40493 399229 694389 561955 306267 547332 509007 174068 90738 143326 454380
2217 454380 691916 904067 964128 721097 270751 -103270 178705 516458 651665 582544
2207 582544 304438 480401 591195 669729 920758 926296 556012 678688 776904 785739 622907
2196 622907 559957 625237 966278 1179960 968005 853737 684953 780561 933984 1160848
2186 1160848 1156236 897830 783193 1055840 1380910 1259368 1228171 1253218 1517796 1494354
2176 1494354 1107262 1117557 999787 940459 1167494 1513504 1965572 1909340 1600412 1497020
2166 1497020 1389911 1601971 1905665 2043765 2073662 1906368 1837261 1743620 1926067 2160323
2156 2160323 2450683 2285963 2005660 2084108 2372147 2500350 2255508 2212827 2362661 2909221
2146B909221L43919l1651q1410o9919K27962N21731L74214j86133o80140M4344
2136C372138N41717J05155j37696q9831K39933L60913n2238q057N84424P23365
2126E639823o67j22420J12179N11308M46065J04783R5513K68068M69741L49204
2116G873597M24269J94714N26758N52316O76897R58170Q20717R60168P14786Q67626
2106A4570018J052881J522933J673016J584316J588579J915897L052201N258485
2098C2218326P833583J1098657J2359445J0803851O541890n48781q134354j2943787
2090E9228830j2224086r840001o688341m861060l872822l126212k202439j502592
2082A4911277j120537q92016l21410o03321j126395j378894j220170o57791l41386
$$ plain form
2146 2909221 3253140 3221489 3140079 3070160 3298122 3819853 4194067 4007934 3327794 3372138
2136 3372138 3913855 4019010 3881314 3791483 4031416 4392329 4340091 4332034 4916458 5639823
2126 5639823 5639156 5516736 5628915 6140223 6586288 6691071 6786584 7054652 7524393 7873597
2116 7873597 8297866 8492580 9019338 9571654 10248551 11206721 12027438 12987606 13702392 14570018
2106 14570018 15622899 17145832 18818848 20403164 21991743 23907640 26959841 32218326
2098 32218326 40051909 51150566 63510011 74313862 80855752 80306971 72172617 59228830
2090 59228830 47004744 37164743 30476402 25615342 21742520 18616308 16413869 14911277
2082 14911277 13790740 12898724 12577314 11973993 10847598 9468704 8248534 7590743 7249357
2073G249357l01570p97633p85162l26839M16966o037m18624l80022j42666j66503
2063D341267l88532m75989k18315p9517k75045R6878J07144j57019l97715k04452
2053B348705N791r5860J20373Q5444j42096l53405J32643J75539j42982k87347
2043A846805m14631j7999N5409j1718J43066k2274k6761m22140k89518K84118
2033A124357K16598P1811L7559k25657m06425L6890L51544N597j46677j27217
2023I38380P4662N2961j55295j59482l5473N7259J59451K08158P750j71138j25305
2012H51928q158P3024r7384j07398j69938R12J03832n2776p8950N4258J69233
2001G38583p1051j97236j71919j51976J28882L41114P1533J1590K6731j946l09665
$$ plain form
2073 7249357 6947787 6150154 5364992 5038153 5455119 5449082 5030458 4650436 4507770 4341267
2063 4341267 3952735 3476746 3258431 3178914 2903869 3000747 3107891 2950872 2553157 2348705
2053 2348705 2354496 2258636 2379009 2464453 2322357 1968952 2101595 2277134 2134152 1846805
2043 1846805 1432174 1414175 1469584 1457866 1600932 1578658 1551897 1129757 840239 1124357
2033 1124357 1340955 1412766 1450325 1224668 818243 855133 1206677 1212274 1065597 938380
2023 938380 1013042 1066003 910708 751226 715753 773012 932463 1140621 1148371 977233 851928
2012 851928 843770 916794 819410 712012 542074 542986 646818 594042 515092 569350 738583
2001 738583 667532 470296 298377 146401 275283 616397 687930 699520 726251 724305 414640
1990D14640j66067J29705K06353m8780m49678m58773M76905M81069K9674k22210
1980C92838k00177l3123J25038J61817k18814j03660j26049J31360L64640r9739
1970C94131k85255q3156J94528L68876j64335k78819j42450J58194M7693M9668
1960B59075J44915k34572k31310j8532J76542K36325k53015l9924M3942O802K5283
1949A15531o144j95891j05786j43228K21624K55042Q6609q6831j07686K7680k04086
1938a43166q278M40083P8143l53296j44791J65688K60881j60276j47463j03377
1928a15852M60942J85806m54979m70859J36552L79572l5020k12108m42984l9077
1918f08007M95944L96460m6265m55271O7063N29821R1453n40785l27580L91877
$$ plain form
1990 414640 248573 378278 584631 535851 86173 -372600 104305 585374 615048 392838
1980 392838 192661 159538 284576 446393 227579 123919 -2130 129230 493870 394131
1970 394131 108876 25720 220248 589124 424789 145970 3520 161714 209407 259075
1960 259075 403990 169418 -61892 -80424 96118 332443 79428 39504 83446 90248 115531
1949 115531 109387 -86504 -192290 -335518 -113894 141148 227757 140926 33240 60920 -143166
1938 -143166 -151444 288639 366782 13486 -131305 34383 295264 134988 -12475 -115852
1928 -115852 345090 530896 75917 -394942 -258390 121182 86162 -125946 -568930 -608007
1918 -608007 -112063 284397 238132 -217139 -150076 379745 471198 -69587 -397167 -5290
1908e290M67692k67716k59657j94064K62301K25280n6903k06618J06664K42884
1898C14573J09435q3455k25117j97758n1382l9157K74026o9812J585K41347m4150
1887B30135j60556j82834J31398J40663j08106r8285K88847K27729j15246l83697
1877b9952k22162K24357P8640k0505J48413J02631O3257r5519k71615j70325M5707
1866a47073N17153J30884m55024l14447L1093M18436O4879l78244k34924K73671
1856i3596K25942K85049j34495n4578k80062o7337j1254R7729l3348J8142L14318
1845B66510N813l36258j71211l5447K25779N8554k25409j14068J92906L19690
1835A86859j21216q2234K22350K40982l61l04099l03235J54922K76372M3828q7627
$$ plain form
1908 -5290 462402 194686 -64971 -259035 3266 228546 171643 -34975 71689 314573
1898 314573 424008 340553 115436 -82322 -133704 -172861 101165 31353 32938 274285 230135
1887 230135 69579 -113255 18143 158806 50700 -47585 241262 468991 353745 -29952
1877 -29952 -252114 -27757 50883 30378 178791 281422 344679 249160 -22455 -192780 -147073
1866 -147073 370080 500964 45940 -268507 -237414 181022 245901 -132343 -367267 -93596
1856 -93596 132346 417395 282900 228322 -51740 -119077 -130331 -32602 -65950 -47808 266510
1845 266510 272323 -63935 -235146 -270593 -44814 13740 -211669 -325737 -132831 186859
1835 186859 65643 -16591 205759 446741 446380 142281 -160954 -6032 270340 314168 226541
1824B26541l175K52891J37158k90692k23794j74522J00158k579q613k1004J23802
1813A16171l7179m0288O7904k45642k14178K19726N01563L194o77918k9868N49619
1802B13104J03520k15888k33575L9287J19518l1627k63619J463K01825J67386
1792A01394j38076j28658o0031K07925Q9097M1411j47729k1991j05864j44362
1782c06884K34173L8214R0781J33688n1960m10793p9083J42512Q6677J82509L934
1771F3768j36635m3317J30141n5603p9803J5954j59558J22860K33380k46705r7455
1760b52973O5327K01877K32088j26301k08719j64833R3518L46411J76019k56560
1750A05854n11097j95774O30530J81293l33925r7307L93932J87078m62183m79387
$$ plain form
1824 226541 223366 476257 613415 322723 98929 -75593 24565 21986 13373 -7631 116171
1813 116171 78992 38704 106608 -139034 -353212 -133486 368077 371271 -306647 -336515 213104
1802 213104 316624 100736 -132839 -93552 25966 -5661 -269280 -267817 -65992 101394
1792 101394 -36682 -165340 -225371 -17446 71651 113062 -34667 -56658 -162522 -306884
1782 -306884 -72711 -34497 56284 189972 138012 -272781 -351864 -209352 -122675 59834 63768
1771 63768 -72867 -116184 13957 -41646 -121449 -105495 -265053 -142193 91187 -155518 -252973
1760 -252973 -187646 14231 246319 120018 -88701 -253534 -160016 186395 362414 105854
1750 105854 -405243 -601017 29513 210806 -123119 -220426 173506 360584 -101599 -580986
1740e80986J32328L63988j34905j90203K14202J76169Q8951j24512N7987K98053
1730C01072l14746j05031K67047J8927j42882o9308j17437k57440K44183L49475
1720A73860M0967k94356j74313L33748J45042k85327J20302O4646j09304k42132
1710b26867j1323J90475K21779k70501j65982l97j77857K4452J14367K62305O0671
1699B1122J13227p7826k99499p2128J69994L05130K97894j89404l99156l13875
1689d44521N13418L30440l75386m62213r7054M63935L57486J20468j88960q5548
1679A32065k10732m98214m1583L27464R9801K01286J0680k08254J35612n841m9219
1668a06935j78154K40849p6543L0746k8940k30140Q9033N7668l6381n6631J46813
$$ plain form
1740 -580986 -448658 -84670 -219575 -409778 -195576 -19407 69544 -54968 3019 301072
1730 301072 -13674 -118705 148342 167269 24387 -44921 -162358 -419798 -175615 173860
1720 173860 214827 -79529 -253842 79906 224948 -60379 59923 124569 15265 -226867
1710 -226867 -238190 -47715 174064 -96437 -262419 -262816 -440673 -416221 -301854 -39549 21122
1699 21122 134349 56523 -242976 -315104 -145110 160020 457914 268510 -130646 -444521
1689 -444521 68897 399337 23951 -438262 -535316 -71381 286105 406573 217613 132065
1679 132065 -78667 -576881 -618464 -291000 -191199 10087 20767 -187487 -51875 -57716 -106935
1668 -106935 -285089 -44240 -120783 -90037 -118977 -349117 -260084 -202416 -238797 -295428 -148615
1657a48615L42706J35877k55904k18279j40479J34269K42792L85877M2447m20367
1647A00324m34851O1172J67324P1675N1940P1140J63689j49716k59421n0184n2258
1636b59166J6184m4819Q6224J20905J04237j23653j69858K8384l9069L11807M31101
1625D62277k02914n93375j02355J23353Q9960q3675J13090L85032j9376k24411
1615e2394j9177k244J31012k9239K4676k12899k03592K01951O6294O992p7007
1604a65627Q0159J22822k48028j88987M7996J36028r1731O8934K37162R2926m05832
1593c14178j82157N50765M97954j75400n50780r5080K75814K6153j96905j05766
1583b69580J01070K02098R0582j9798j52627m8149J11851m3019k70913J5459J61807
$$ plain form
1657 -148615 194091 329968 74064 -144215 -284694 -150425 92367 478244 520691 100324
1647 100324 -334527 -273355 -106031 -34356 17584 88724 252413 102697 -156724 -206908 -259166
1636 -259166 -242982 -287801 -201577 -80672 23565 -100088 -269946 -241562 -280631 31176 462277
1625 462277 259363 -334012 -436367 -313014 -223054 -306729 -193639 191393 172017 -52394
1615 -52394 -71571 -73815 57197 27958 52634 -160265 -363857 -161906 -95612 -88620 -165627
1604 -165627 -85468 37354 -210674 -399661 -351665 -215637 -307368 -238434 -1272 91654 -314178
1593 -314178 -496335 54430 552384 376984 -173796 -268876 6938 33091 -163814 -269580
1583 -269580 -168510 33588 124170 104372 -48255 -96404 15447 -27572 -298485 -283026 -121219
1572a21219M66051J46055k29859j91530k70672j29786r1734J98004M44831L3222
1562B53363j27754l23785j9410M42816j33114k30798R716M0913m1748r2247O899
1551b15149L29012K59515l26183l03408K7081K52065O4671j42808k92393n3759
1541d01356L66629K38194l70620j57780K36282J98481N158k00841r6770q9955
1531b72578j62686L01067K22748q3669j30064q3753K96554K49495m6573m01705
1521a11164k14943K37164L64032p2345k64235j89853r2367K53146L79004j59062
1511A29377l36193l56563J10262O31392R1163k19614k19760L7355L69909K93277
1501E30605k42502j54525j63026k66615k99727K62046L13869J58938O4182r9889
$$ plain form
1572 -121219 344832 490887 261028 69498 -201174 -330960 -422694 -224690 220141 253363
1562 253363 125609 -198176 -217586 225230 92116 -138682 -128966 -88053 -129801 -222048 -215149
1551 -215149 113863 373378 47195 -256213 -229132 22933 87604 -55204 -347597 -401356
1541 -401356 -34727 203467 -167153 -324933 -88651 109830 114988 -85853 -182623 -272578
1531 -272578 -435264 -134197 88551 4882 -125182 -208935 87619 337114 290541 -111164
1521 -111164 -326107 -88943 275089 202744 -61491 -251344 -343711 -90565 288439 129377
1511 129377 -206816 -563379 -453117 178275 269438 49824 -169936 -132581 237328 530605
1501 530605 288103 133578 -29448 -296063 -595790 -333744 -19875 139063 203245 103356
1491A03356N2499N4935k3393j18092l27422k27179K21973L26202n2669k16464
1481b06254L5549J96172K7332l14181k43871J35689K32284J42553j41978j49076
1471b85781J58139N6490J021O1763J97440O6381j18822j68512j42383j44416L10004
1460h676M5448j57563r7117J24675J99012J59477k95533l78487J57646J77802
1450g3316J04687r4910j21781K50950J51770Q9333q5826j97401j01577m6590R7504
1439b7157K25617N3318l28295j13353J46844k5345M0501j00502K36837J0627m1284
1428G7808p8380k50552j40484m16K97697J46143j03577r3703J94475J18910k4319
1417A43602k77691j72834J91051K09941k14412r7156O0360J47610J28145J94965
$$ plain form
1491 103356 155855 210790 187397 69305 -258117 -485296 -263323 62879 10210 -206254
1481 -206254 -170705 25467 52799 -261382 -505253 -369564 -137280 5273 -136705 -285781
1471 -285781 -127642 -71152 -70131 -8368 189072 255453 136631 -31881 -174264 -318680 -8676
1460 -8676 36772 -120791 -217908 -93233 105779 265256 -30277 -408764 -251118 -73316
1450 -73316 31371 -63539 -185320 65630 217400 306733 220907 23506 -78071 -124661 -27157
1439 -27157 198460 251778 -76517 -189870 -43026 -68371 -27870 -128372 108465 119092 77808
1428 77808 -572 -251124 -391608 -392024 -94327 51816 -51761 -145464 49011 167921 143602
1417 143602 -134089 -306923 -115872 94069 -120343 -217499 -157139 -9529 118616 313581
1407C13581l34796l84752K06663M12741M8350k25085j19318K706J14846O9114
1397A04050j23259j76245J15081p7472L0283j65834j27978J71441L08389j41266
1387h2810k45848M3805K64435J92624l7393Q5788j60321n9241N9543R7728j66484
1376h174n9083N2846P5245K65353m4343o81277k87473L69234J27386k8280J54101
1365f4465K77057K44354q5839l69166m3470K20995J25513o4757l31834k06216
1355b97828J27432J51973O5930n9220p0865k8310n1984j80049m4042J57992M2152
1344a86819Q1010o9797M8925J27182R129j44568k2906K18853K4777o9752j84258
1333a68224j07320L59253K19435J16138l47124m53732k00461L14201K50528k7585
$$ plain form
1407 313581 -21215 -405967 -199304 213437 261787 36702 -82616 -79910 34936 104050
1397 104050 -19209 -195454 -80373 -157845 -127562 -293396 -421374 -249933 58456 -82810
1387 -82810 -328658 -284853 -20418 172206 134813 220601 60280 1039 60582 158310 -8174
1376 -8174 -67257 -14411 60834 326187 281844 -399433 -686906 -317672 -190286 -218566 -64465
1365 -64465 212592 456946 371107 1941 -41529 179466 304979 240222 -91612 -297828
1355 -297828 -170396 -18423 47507 -11713 -82578 -110888 -162872 -342921 -386963 -228971 -186819
1344 -186819 -105809 -175606 -126681 501 9630 -134938 -157844 61009 85786 16034 -168224
1333 -168224 -275544 83709 303144 419282 72158 -381574 -582035 -267834 -17306 -44891
1323d4891K8107J67252p4525k06770k11394K74538M50513k73092m33745m7800
$$ plain form
1323 -44891 -16784 150468 75943 -130827 -342221 -67683 382830 109738 -324007 -371807
$$ [...]
##END NTUPLES=NMR SPECTRUM
##END=
