##TITLE=1H_EC-3029(VI-2)
 CDCl3
 8 sc, 
 6.07.2022
##JCAMPDX= 6.0         $$ Bruker NMR JCAMP-DX V2.0
##DATA TYPE= NMR SPECTRUM
##DATA CLASS= NTUPLES
##ORIGIN= UXNMR, Bruker Analytische Messtechnik GmbH
##OWNER= root
$$ XWIN-NMR		Version 3.5
$$ Wed Jul  6 13:59:15 2022 Russian Standard Time (UT+4h)  she@DPX200
##.OBSERVE FREQUENCY= 200.1313499994
##.OBSERVE NUCLEUS= ^1H
##.ACQUISITION MODE= SIMULTANEOUS
##.ACQUISITION SCHEME= undefined
##.AVERAGES= 8
##.DIGITISER RES= 18
##SPECTROMETER/DATA SYSTEM= spect
##.PULSE SEQUENCE= zg30
##.SOLVENT NAME= CDCl3
##.SHIFT REFERENCE= (INTERNAL, CDCl3, 0, 15.7656)
##AUDIT TRAIL= $$ (NUMBER, WHEN, WHO, WHERE, WHAT)
$$ ##TITLE= Audit trail, XWIN-NMR		Version 3.5
$$ ##JCAMPDX= 5.01
$$ ##ORIGIN= Bruker BioSpin GmbH
$$ ##OWNER= she
$$ F:/spectra/data/she/nmr/H-F/1/pdata/1/auditp.txt
$$ ##AUDIT TRAIL=  $$ (NUMBER, WHEN, WHO, WHERE, WHAT)
(   1,<2022-07-06 13:57:52.15 +0400>,<she>,<DPX200>,
      <created by zg, POWCHK disabled, PULCHK disabled
       configuration hash MD5:
       00 E9 B6 7A A2 85 ED C7 34 08 36 98 17 FE 4E 26
       data hash MD5: 16K
       7C AD 38 6F 10 23 5A 38 D8 3C 0C D3 56 AA 9E 11>)
(   2,<2022-07-06 13:57:55.54 +0400>,<she>,<DPX200>,
      <Start of raw data processing
       efp BC_mod = 2 LB = 0.24 FT_mod = 6 PKNL = 1 PHC0 = -18056.46 PHC1 = 9.40069 SI = 16K 
       data hash MD5: 16K
       5A 28 A3 3C 36 BA 29 2A BC 91 F7 E4 05 CE 2C C4>)
(   3,<2022-07-06 13:58:10.90 +0400>,<she>,<DPX200>,
      <pk PHC0 = -0.9188433 PHC1 = 0 
       data hash MD5: 16K
       9E E0 A8 E0 D3 F0 75 7B 70 0C DC DF 9D CA D6 22>)
(   4,<2022-07-06 13:58:13.90 +0400>,<she>,<DPX200>,
      <abs ABSG = 5 
       data hash MD5: 16K
       C7 FE CC DC 58 C8 1A 17 D1 10 32 A4 81 60 83 B1>)
$$ ##END=
$$ 
$$ hash MD5
$$ 8F 38 D9 72 01 6D 1A 02 56 5E 8D F7 49 D8 A9 69
##$RELAX= 
##$RELAX= 
##$RELAX= 
##$RELAX= 
##$RELAX= 
##$RELAX= 
$$ Bruker specific parameters
$$ --------------------------
##$DU= <F:/spectra>
##$EXPNO= 1
##$NAME= <H-F>
##$PROCNO= 1
##$TYPE= <nmr>
##$USER= <she>
##$AMP= (0..31)
100 100 100 100 100 100 100 100 100 100 100 100 100 100 100 100 100 100 
100 100 100 100 100 100 100 100 100 100 100 100 100 100 
##$AQSEQ= 0
##$AQ_mod= 1
##$AUNM= <au_zg>
##$AUTOPOS= <>
##$BF1= 200.13
##$BF2= 200.13
##$BF3= 200.13
##$BF4= 200.13
##$BF5= 200.13
##$BF6= 200.13
##$BF7= 200.13
##$BF8= 200.13
##$BYTORDA= 1
##$CFDGTYP= 0
##$CFRGTYP= 5
##$CHEMSTR= <none>
##$CNST= (0..31)
1 1 145 1 1 1 1 1 1 1 1 1 1 1 1 1 1 1 1 1 1 1 1 1 1 1 1 1 1 1 1 1 
##$CPDPRG= <>
##$CPDPRG1= <>
##$CPDPRG2= <>
##$CPDPRG3= <>
##$CPDPRG4= <mlev>
##$CPDPRG5= <mlev>
##$CPDPRG6= <mlev>
##$CPDPRG7= <mlev>
##$CPDPRG8= <mlev>
##$CPDPRGB= <>
##$CPDPRGT= <>
##$D= (0..31)
0 1.2 0 0 0 0 0 0 0 0.06 0 0.03 0 0 0 0 0.0002 0 0 0 0 0 0 0 0 0 0 0 0 
0 0 0 
##$DATE= 1657101471
##$DBL= (0..7)
120 120 120 120 120 120 120 120 
##$DBP= (0..7)
150 150 150 150 150 150 150 150 
##$DBP07= 0
##$DBPNAM0= <>
##$DBPNAM1= <>
##$DBPNAM2= <>
##$DBPNAM3= <>
##$DBPNAM4= <>
$$ [...]
##$SUBNAM2= <"">
##$SUBNAM3= <"">
##$SUBNAM4= <"">
##$SUBNAM5= <"">
##$SUBNAM6= <"">
##$SUBNAM7= <"">
##$SUBNAM8= <"">
##$SUBNAM9= <"">
##$SW= 18.0517283424941
##$SWIBOX= (0..15)
0 0 2 0 0 0 0 0 0 0 0 0 0 0 0 0 
##$SW_h= 3612.71676300578
##$TD= 16384
##$TD0= 1
##$TE= 0
##$TE2= 300
##$TE3= 300
##$TEG= 300
##$TL= (0..7)
0 120 120 120 120 120 120 120 
##$TP= (0..7)
150 150 150 150 150 150 150 150 
##$TP07= 0
##$TPNAME0= <>
##$TPNAME1= <>
##$TPNAME2= <>
##$TPNAME3= <>
##$TPNAME4= <>
##$TPNAME5= <>
##$TPNAME6= <>
##$TPNAME7= <>
##$TPOAL= (0..7)
0.5 0.5 0.5 0.5 0.5 0.5 0.5 0.5 
##$TPOFFS= (0..7)
0 0 0 0 0 0 0 0 
##$TUNHIN= 0
##$TUNHOUT= 0
##$TUNXOUT= 0
##$USERA1= <user>
##$USERA2= <user>
##$USERA3= <user>
##$USERA4= <user>
##$USERA5= <user>
##$V9= 5
##$VALIST= <valist>
##$VCLIST= <CCCCCCCCCCCCCCC>
##$VD= 0
##$VDLIST= <DDDDDDDDDDDDDDD>
##$VPLIST= <PPPPPPPPPPPPPPP>
##$VTLIST= <TTTTTTTTTTTTTTT>
##$WBST= 1024
##$WBSW= 4
##$XGAIN= (0..3)
0 0 0 0 
##$XL= 0
##$YL= 0
##$YMAX_a= 391464
##$YMIN_a= -551512
##$ZGOPTNS= <>
##$ZL1= 120
##$ZL2= 120
##$ZL3= 120
##$ZL4= 120
##$ABSF1= 15.66866
##$ABSF2= -2.383187
##$ABSG= 5
##$ABSL= 3
##$ALPHA= 0
##$AQORDER= 0
##$ASSFAC= 0
##$ASSFACI= 0
##$ASSFACX= 0
##$ASSWID= 0
##$AUNMP= <proc_1d>
##$AZFE= 0.1
##$AZFW= 0.1
##$BCFW= 0
##$BC_mod= 2
##$BYTORDP= 0
##$COROFFS= 0
##$CY= -3
##$DATMOD= 1
##$DC= 0
##$DFILT= <>
##$DTYPP= 0
##$F1P= 0
##$F2P= 0
##$FCOR= 1
##$FTSIZE= 16384
##$FT_mod= 6
##$GAMMA= 0
##$GB= 0
##$INTBC= 1
##$INTSCL= 0
##$ISEN= 128
##$LB= 0.24
##$LEV0= 0
##$LPBIN= 0
##$MAXI= 10000
##$MC2= 0
##$MEAN= 0
##$ME_mod= 0
##$MI= 1.114404
##$NCOEF= 0
##$NC_proc= -4
##$NLEV= 6
##$NOISF1= 3.799351
##$NOISF2= 2.8
##$NSP= 0
##$NTH_PI= 0
##$NZP= 0
##$OFFSET= 15.76562
##$PC= 1
##$PHC0= -18057.38
##$PHC1= 9.40069
##$PH_mod= 1
##$PKNL= yes
##$PPARMOD= 0
##$PSCAL= 0
##$PSIGN= 0
##$REVERSE= no
##$SF= 200.130001184286
##$SI= 16384
##$SIGF1= 3
##$SIGF2= 2
##$SINO= 5.538805
##$SIOLD= 16384
##$SREGLST= <1H.CDCl3>
##$SSB= 0
##$STSI= 16384
##$STSR= 0
##$SW_p= 3612.71676300578
##$SYMM= 0
##$S_DEV= 0
##$TDeff= 16384
##$TDoff= 0
##$TI= <>
##$TILT= no
##$TM1= 0
##$TM2= 0
##$TOPLEV= 0
##$USERP1= <user>
##$USERP2= <user>
##$USERP3= <user>
##$USERP4= <user>
##$USERP5= <user>
##$WDW= 1
##$XDIM= 16384
##$YMAX_p= 439214749
##$YMIN_p= -56629
$$ End of Bruker specific parameters
$$ ---------------------------------
##NTUPLES= NMR SPECTRUM
##VAR_NAME=  FREQUENCY,     SPECTRUM/REAL,   SPECTRUM/IMAG
##SYMBOL=    X,             R,               I
##VAR_TYPE=  INDEPENDENT,   DEPENDENT,       DEPENDENT
##VAR_FORM=  AFFN,          ASDF,            ASDF
##VAR_DIM=   16384,         16384,           16384
##UNITS=     HZ,            ARBITRARY UNITS, ARBITRARY UNITS
##FACTOR=    0.220516191357247, 1,           1
##FIRST=     3155.1735956268, 0,             0
##LAST=      -457.543167378982, 0,           0
##MIN=       -457.543167378982, -56629,      0
##MAX=       3155.1735956268, 439214749,     0
$$ Real data points
##PAGE= N=1
##DATA TABLE= (X++(R..R)), XYDATA
$$ [...]
8261G59007P672j2665K0067q339j5735J4987J0018n494o278P636J3877J2514M324
8248H01591L416R906N400J06J5248K0171j0685k016L2567L856J2533J8056Q389
8235I18538K0172L115m678J5733L0991M2985K4310L2758J0272M0452L2092K3051
8223A189791K2995J1364L7383O4304L7626M1035N7011O9403Q4051J06165J22604
8212A843732J32620J40167K17482L10935M17739N57439P82319R05015L27131k82727
8202E351852m89364p25711o59937n48362l82421k68018j74545j48889p7061j65774
8192A711770l56983K87714J87448O0977O4995O8040J37292J08752J74163K35895
8182B680063L10593M40446O48273Q78615Q37235J6509m21957o27029p96413o83712
$$ plain form
8261 759007 766679 754014 774081 765742 750007 764994 775012 769518 763240 770876 784753 797267 801591
8248 801591 805007 814913 820313 820419 835667 855838 845153 843137 875704 879560 892093 910149 918538
8235 918538 938710 941825 937147 952880 983871 1026856 1051166 1083924 1094196 1134648 1166740 1189791
8223 1189791 1212786 1224150 1261533 1325837 1363463 1404498 1461509 1530912 1614963 1721128 1843732
8212 1843732 1976352 2116519 2334001 2644936 3062675 3620114 4402433 5307448 5634579 5351852
8202 5351852 4862488 4136777 3476840 2928478 2546057 2278039 2103494 1954605 1877544 1711770
8192 1711770 1354787 1642501 1829949 1890926 1955921 2023961 2161253 2270005 2444168 2680063
8182 2680063 2990656 3431102 4079375 4957990 5795225 5811734 5389777 4762748 3966335 3282623
8172C282623n10983l60535k42411j63135j30410r3828n6314l9630l7488k0223
8162A627666j150j2347j9159J4831O5262J3595L9393N8369R2369P8274R8292J17146
8150B172541J39610K22727K70476L49547N80913P70335J036407N72049k18790
8141E895815m86084p65080q31063o33711m80337l36804k07661j63966q5202o8478
8131A837429o891l5884K1742J7670L9860Q3495O8651J12131J37369J92938L10631
8120B779141M40952O46488Q56778R30751K42243l55153n98704q72252q16665o48654
8110B604925m50322l09502k10575j66853j51400j30767o3117o9403m8362l8138
8100I66486k2569l0143n1444k9322j1713k2453k5740j4231m3250m1651j5353k3640
$$ plain form
8172 3282623 2771640 2411105 2168694 2005559 1875149 1781321 1725007 1685377 1647889 1627666
8162 1627666 1626516 1614169 1595010 1609841 1675103 1688698 1728091 1786460 1878829 1957103 2055395 2172541
8150 2172541 2312151 2534878 2805354 3154901 3735814 4506149 5542556 6114605 5895815
8141 5895815 5409731 4644651 3813588 3179877 2699540 2362736 2155075 1991109 1905907 1837429
8131 1837429 1830538 1794654 1816396 1834066 1873926 1957421 2026072 2138203 2275572 2468510 2779141
8120 2779141 3220093 3866581 4723359 5654110 5896353 5541200 4942496 4070244 3253579 2604925
8110 2604925 2154603 1845101 1634526 1467673 1316273 1185506 1122389 1052986 1004624 966486
8100 966486 943917 913774 862330 833008 821295 798842 773102 758871 715621 673970 658617 634977
8088F34977q631j1556k1064j2528k8511J133k9496l3112P129j984R929J1494L8
8075E17818j7750k4418j9258k6331j3779Q816m479j6057M474L489j9697k8159
8063C64669K658m280l121j2749K267J2990k9409k55j2951k492L219K7786j9708
8050C28624k7402J3143k449q081q519j2135J3247n115R999p570n819k7042q982
8037B51899Q247j1436j608l175M060k4526Q049P453j5756k4822M3661Q171n898
8024B44319l1866J044k124K102Q511J012k192J1326L984q699k657Q092q743J097
8010B25206J990j1177j4614j5762K7947J086j5568j1752J7189l933k2105j0104
7998A68403J444P213J0912L997j7539J8356r163j7235j4207q590J5305J548N334
$$ plain form
8088 634977 626346 614790 593726 581198 552687 553820 524324 491212 498341 496357 506286 517780 517818
8075 517818 500068 475650 456392 430061 416282 425098 420619 404562 409036 412525 392828 364669
8063 364669 367327 363047 359926 347177 349444 362434 333025 332770 319819 317327 320546 348332 328624
8050 328624 301222 314365 311916 303835 295316 283181 296428 291313 301312 293742 287923 260881 251899
8037 251899 260146 248710 247102 243927 247987 223461 231510 238963 223207 198385 242046 250217 244319
8024 244319 212453 213497 211373 213475 221986 222998 220806 232132 236116 227417 224760 232852 224109 225206
8010 225206 227196 216019 201405 185643 213590 214676 199108 187356 204545 200612 178507 168403
7998 168403 169847 177060 187972 191969 174430 192786 183623 166388 152181 143591 158896 160444 165778
7985A65778Q638l877P458j5162q207j6713o743K8792P414j0350l9714J4828j564
7972A30578L0942J1569k2576j1788k671j4647m393J5212q14o624j8105M018j232
7959A09469R960N017M778K0245j4141l497q782m351M842K4737r251M87O786k6143
7945A20156R554k0956o126K6125p847l247J5035J8552k8562j0850p42l254J0463
7932A18301J5241Q330j2840N090P245j2843j6036m51j8800J6579J6496j5267O267
7919A17312L797k2216k0701M38M418J7056o411Q754J3689l095j8923m726N05M866
7905I4763l561O427R875j3803L624j7751K2724J3718j7720K795j6902J0540P778
7892A02507K719O644J081m062j0694j1430K722j1900n711o571o07R450o148n910
$$ plain form
7985 165778 174416 170539 177997 162835 154628 137915 131172 159964 167378 157028 117314 132142 130578
7972 130578 161520 173089 150513 138725 136054 121407 117014 132226 131412 124788 106683 110701 109469
7959 109469 119429 124446 129224 149469 135328 131831 123049 118698 123540 148277 139026 139513 146299 120156
7945 120156 129710 108754 102628 128753 120906 117659 132694 151246 122684 111834 111092 107838 118301
7932 118301 133542 141872 129032 134122 141367 128524 112488 112037 93237 109816 126312 111045 117312
7919 117312 121109 98893 78192 78630 83048 100104 93693 102447 116136 113041 94118 89392 89897 94763
7905 94763 91202 97629 107504 93701 97325 79574 102298 116016 98296 101091 84189 94729 102507
7892 102507 105226 111870 112951 108889 98195 86765 89487 77587 71876 65305 64698 74148 68000 62090
7878F2090P446L456m968P515l397K861m648J1974R396L480N67j6993K277J0761
7864I1817k241K3202K677j0134M022q746M186p197j8315M150k5214j464J9968
7851G6711n93J2483R224j0915j1151K2325J4095k1494k3269J5479M736m905J1079
7838I3805o783q797M348O713j7011J5857Q912J4138j147K975L120j3172j3257
7825H9701R797o837n433J805J504l2097K3023p3314M7671P6481k9018j0705j342
7812I1236J4140k2271J0480j8102j420j178j988J4889K273J4510n4068P12L1146
7799H0359k6483K5436j111q040Q389j1305L475M1073R128j1616P214n970j6854
7786I3695r818k5841N560j954R071J0823j2468j8244J1311K3205j1445j2136L529
$$ plain form
7878 62090 69536 72992 68024 75539 72142 75003 70355 82329 91725 95205 95772 78779 81056 91817
7864 91817 89576 112778 115455 105321 109343 100597 104783 97586 79271 83421 58207 56743 76711
7851 76711 76118 88601 97825 86910 75759 98084 112179 90685 67416 82895 87631 82726 93805
7838 93805 87022 78225 82573 89286 72275 88132 97044 111182 110035 113010 116130 102958 89701
7825 89701 99498 92661 87228 89033 90537 58440 81463 8149 55820 132301 103283 92578 91236
7812 91236 105376 83105 93585 75483 74063 72885 70897 85786 88059 102569 48501 49213 80359
7799 80359 53876 79312 78201 70161 78550 67245 70720 111793 120921 109305 116519 110549 93695
7786 93695 83877 58036 63596 61642 70713 81536 69068 50824 62135 85340 73895 61759 65288
7773F5288L216j0003P613k491k4658K446J5001P792j3427O463p042m110m723J958
7759D3323N218L2035q370o481J0200P441j2114k4596K1679J564M859r440r421
7746E5897J4502j5441l025k640K9726p319n957K4271o673P980M029l1251R267
7733G3366K1568j5261k8737K2759M532k0846o140q713M660J3214J2739J1693q075
7720G6759k0895k7590M338J7178O643o990Q080j7611J394K0112K4880l880j6281
7707F6137Q701j1604k3479J2453Q195L131N766J0469J3101j3496L0315j3172n004
7694I1513K446j8930J4533J36j0969k4989Q05K0112k0218j9673j520O40J4368
7681D8254J5438K2751n803k4266j4130j185P748M887K4026j2777R619j1462J8374
$$ plain form
7773 65288 68504 58501 66114 63623 38965 41411 56412 64204 50777 57240 50198 46088 41365 43323
7759 43323 48541 80576 72206 65725 75925 83366 71252 46656 68335 69899 74758 65318 55897
7746 55897 70399 54958 51933 49293 79019 71700 65743 90014 83341 91321 95350 64099 73366
7733 73366 94934 79673 50936 73695 78227 57381 51241 42528 47188 60402 73141 84834 76759
7720 76759 55864 28274 32612 49790 56433 49443 57523 39912 41306 61418 86298 82418 66137
7707 66137 74838 63234 39755 52208 60403 63534 69300 79769 92870 79374 109689 96517 91513
7694 91513 93959 75029 89562 89698 78729 53740 54545 74657 54439 34766 33246 33886 48254
7681 48254 63692 86443 80640 56374 42244 41059 48807 53694 77720 64943 74562 63100 81474
7668H1474j2520Q575P344j6955j9239K3872k0426o768J7524q184k3896R12J8808
7655E0521j770j4590J181p147J0399R508L805l871n969k3194K427JL606l464J0852
7640C2295P586J093J0680n349j5339l947K1794k5000J0647K1171k3245j9704K2723
7627C5405L596r453J4393m865J2676J1481k1430j0521O186K641p237o57J2104
7614D4319J4039K1352o624m1047K1626j1393j1590j9834n698J4128J2477m770
7602B6985K0112k01R890k9831j085L121q193L862j1844q890J1092J5954n295j9096
7588F581K3402K7903l0066k1276J1881j512m294j390R358J8239j5479n884j362
7575A6101J7499R9J3218n984k757P537j9902L204m096q779Q017K4164p059j2580
$$ plain form
7668 81474 68954 77529 84873 67918 48679 72551 52125 45357 62881 54697 30801 31713 50521
7655 50521 48751 34161 35342 28195 38594 48102 51907 48036 42067 18873 21300 21301 24907 21443 32295
7640 32295 39881 40974 51654 46305 30966 27019 48813 23813 34460 55631 32386 12682 35405
7627 35405 39001 29548 43941 39076 51752 63233 41803 31282 37468 40109 32872 32215 44319
7614 44319 58358 79710 73086 32039 53665 42272 30682 10848 5150 19278 31755 26985
7602 26985 47097 46896 56786 26955 25870 28991 20798 24660 12816 3926 15018 30972 25677 6581
7588 6581 29983 57886 27820 6544 18425 16913 12619 11229 20587 38826 23347 17463 16101
7575 16101 33600 33699 46917 40933 38176 45713 25811 29015 24919 16140 24157 48321 41262 28682
7561B8682j0237r676k0211K0490K7231k4633J3632J3686N29j621p513j6967J7194
7548C0586M047j6147J4339o343q542J0499K330J0116J6744K49j8445q605P319
7535C8147K0470R524p090j0091j785o118r534r774L405J972r159R350k93l172
7521B5852j0070O814K7l317J3772k9298O502P402l481J5416L768j8637J4310K5425
7507E4485j6333J4755O724j1460j4655j0888K2736m64K759K3970k334j6618J030
7494E3707k219j6355j5545p082q903J0654K9475k2361j2159Q617P083J6890K558
7481D4360j1723M776r59n961j589m520P032J1836J2588j1683j6521j1185l341
7468A3110J9794O759l069K824O737J2991k1094j206J06k2969p021L1207J6073
$$ plain form
7561 28682 18445 8769 -11442 9048 36279 11646 25278 38964 39493 37872 30359 13392 30586
7548 30586 34633 18486 32825 26482 17940 28439 30769 40885 57629 57878 39433 30828 38147
7535 38147 58617 68141 61051 50960 49175 43057 33523 23749 27154 29126 19967 29317 29024 25852
7521 25852 15782 22596 22623 19306 33078 3780 10282 17684 14203 29619 33387 14750 29060 54485
7507 54485 38152 52907 59631 48171 33516 22628 45364 44900 47659 71629 69295 52677 53707
7494 53707 51488 35133 19588 12506 3603 14257 43732 21371 9212 17829 24912 41802 44360
7481 44360 32637 37413 36454 30493 28904 24384 31416 43252 55840 44157 27636 16451 13110
7468 13110 32904 39663 36594 39418 46155 59146 38052 36846 36952 13983 6962 38169 54242
7455E4242J1296J0469l0085Q802k756q099Q422J256k8727k2780M866J6951J0539
7442C4396j9434J50m071j56J9808P937k3180J6865J2019N649j1720j0589R651
7429C7325q442L600k842M848K611r228n362O148j7292Q917j2368J5185M794k934
7415B4960k179j0992K5570r815k3191M549k664j906K0414J2141j8203j2352J9239
7402B5571L5645j4191k5966j4837j228j958K523J2870K6495K1209o360l48l9535
7389A9890o174j7319K5645M3372k0968j3434J0519k0501L034N861l086R156O638
7376D2633j6885p162J5282j4220Q194O970J9211k4413m462L3361q936k1364K318
7363C0527j0561l279j2195J1876L5095k9156O491n920o663K6334L865j030j633
$$ plain form
7455 54242 65538 76007 45922 54724 51968 43869 52291 53547 24820 2040 6906 23857 34396
7442 34396 14962 15112 11041 10885 30693 38630 15450 32315 44334 49983 38263 27674 37325
7429 37325 28883 32483 29641 34489 37100 27872 22510 28658 11366 20283 7915 23100 27894 24960
7415 24960 22781 11789 37359 27544 4353 8902 6238 4332 24746 36887 18684 6332 25571
7402 25571 61216 47025 21059 6222 4994 3036 5559 18429 44924 66133 59773 59425 19890
7389 19890 13716 -3603 22042 65414 44446 31012 41531 21030 24064 29925 26839 35995 42633
7376 42633 25748 18586 33868 19648 27842 34812 54023 29610 25148 58509 49573 28209 30527
7363 30527 19966 16687 4492 16368 51463 22307 28798 22878 16215 42549 46414 45384 43751
7350D3751p191J1300r949k1166o887J2762J5563J4934j088l50o686l285N304J1166
7336E8178J5154n012k8541j0415J5656K2453j1569k0248k360J8169q447l85J0297
7323E2930q875J547k0165o268K2967l3007j698M3058j9884n579o762N155j1918
7310A1501o38J7688J156j5319K1304K516M2o176k984P698M049j0215j9729J9121
7296C0014j1956P320L538j2005M478J55l047R435j719K7876J0766k7090K5097
7283F2862o11l6636R190J4721k6528j0672J9307J3754O345K5748j0532k4185k341
7270D0422K6256K0350j5917k0986j5017m662R165p274J41k3668K6935J3110k0758
7257B8097n535k109J545K3367N380r263k469j4529K8975k8771j57K4156M505l5445
$$ plain form
7350 43751 36560 47860 37911 16745 9858 22620 38183 53117 52029 51679 44993 41708 47012 58178
7336 58178 73332 68320 39779 29364 45020 67473 55904 35656 33296 51465 43018 42633 52930
7323 52930 44055 45602 25437 19169 42136 9129 7431 50489 30605 25026 18264 23419 11501
7310 11501 10863 28551 29707 14388 35692 38208 38250 32074 29090 36788 40837 30622 10893 30014
7296 30014 18058 25378 28916 16911 21389 21544 18497 27932 26213 54089 64855 37765 62862
7283 62862 62251 25615 34805 49526 22998 12326 31633 45387 51732 77480 66948 42763 40422
7270 40422 66678 87028 71111 50125 35108 30446 39611 32337 32478 8810 35745 48855 28097
7257 28097 22562 20453 21998 45365 50745 41482 39013 24484 53459 24688 24531 48687 53192 17747
7243A7747j768K4553l697j2038Q004j5629j789K5444N831j2563K1671m67k0242
7230C5057J3684j1323M622k7488J3095J7841J2900J359q227P717j6920j3108L112
7217C2321J0973r407K0510n079j760j6233j240J0745J1488J0146j9657j6856N233
7204C1184j227k875l645L147J0658O541L896R371j7514k6685p69K7087m811k3462
7190A0896K1520m100L1073j3806j2182l0606J0947J3009J0433Q904J4927r640
7178E1375M686K002p167r427K1984q820l834j079J0589M785k2020J494j0880L649
7164C7337j8860K8079K6540k0709k1924P734o337p473Q129j179R283O962k1943
7151B5639K0825J7567J3609j1099r171q00k967j1887o174J2679n93j2631l820
$$ plain form
7243 17747 15979 40532 36835 24797 32801 17172 15383 40827 46658 34095 55766 55299 35057
7230 35057 48741 37418 42040 14552 27647 45488 58388 59747 51520 59237 42317 29209 32321
7217 32321 43294 33887 54397 49318 47558 31325 30085 40830 52318 62464 42807 25951 31184
7204 31184 29957 27082 23437 26584 37242 43783 47679 57050 39536 12851 12082 39169 34358 10896
7190 10896 32416 28316 59389 45583 33401 2795 13742 26751 37184 46088 61015 51375
7178 51375 56061 58063 50896 41469 63453 54633 50799 49720 60309 65094 43074 44568 33688 37337
7164 37337 18477 46556 73096 52387 30463 38197 31860 24387 32516 31337 40620 47582 25639
7151 25639 46464 64031 77640 66541 57370 56570 53603 41716 35542 48221 47628 34997 31177
7138C1177o752J5773J2563J4763K035j8676p412l008J4302k489j2291O97M926
7125D5608j14n887Q467j7788K8764N734j9158j7887J2174k438Q824k446o041K0486
7111E8298l075R879J4982J064m047J1653k3842o617K2232j1688m425J3483j0640
7098F7257n434Q453J5305J1979r138k9042j3117j466R363j834K553J6833j1786
7085E9926Q411p500R522j627j0545K352l245j7113p511J3140j7177l744K0971
7072D5860j498Q882K0366N702L962j2652j1678m43R965K785K3928K458j9614K000
7058H0023O141n546j0406J7173j898M680K210J7153K0446j6863j896q282j745
7045A01190j3364J2950n437j3143q592O155Q45K311q48J9583O709j2694j8490
$$ plain form
7138 31177 24425 40198 52761 67524 69559 50883 43471 40463 54765 52276 39985 40682 45608
7125 45608 45494 39607 48074 30286 59050 64784 45626 27739 39913 37475 46299 43853 37812 58298
7111 58298 55223 65102 80084 81148 77101 88754 64912 58295 80527 68839 64414 77897 67257
7098 67257 61823 70276 85581 97560 88422 59380 46263 44797 54160 52326 54879 71712 59926
7085 59926 68337 60837 70359 68732 58187 60539 57294 40181 32670 45810 28633 24889 45860
7072 45860 44362 53244 73610 79312 83274 70622 58944 58501 68466 71251 95179 97637 78023 80023
7058 80023 86164 80618 70212 87385 85487 90167 92377 109530 129976 113113 111217 102935 101190
7045 101190 87826 100776 95339 82196 73604 79759 80604 82915 82067 101650 108359 95665 77175
7032G7175j0608Q598L053q57J330j996j9419j2743j4916J3471J5169n191L031
7019E6097Q825J037n985J0697Q140M886L103j3467K892k372o654o016k1200K8498
7005F8481l82j0020j055l447K3970l365j0212j0159k3116J1785M624J3864j5946
6992D5022M0955j398J1324L516o405j687q156r242o6O731j7673m782J2030j2714
6978E7455q558J9017J4382o168r027L4571r377l342q735L70r577j2593K0857P086
6964H6361l0556J4383K4799J4333M208j1642J396K4457l3292j335J885r920j0745
6951G4332K4018J0900o073J122r883j670Q007O275j273o344L342P160J0834j367
6937A19380J5681l746o487p697n198J0022K869k3289l555R272M961J6489j5404
$$ plain form
7032 77175 66567 75165 78218 77361 78691 76695 57276 44533 29617 43088 58257 53066 56097
7019 56097 64922 65959 59974 70671 78811 83697 86800 73333 76225 73853 67199 61183 39983 68481
7005 68481 68099 58079 57024 53577 77547 74182 63970 53811 30695 42480 47104 60968 45022
6992 45022 85977 84579 95903 99419 93014 91327 83171 73929 73863 80594 62921 58139 70169 57455
6978 57455 48897 67914 82296 76128 67101 101672 92295 88953 80218 80588 71011 58418 79275 86361
6964 86361 55805 70188 94987 109320 113528 101886 103282 127739 94447 93112 94997 85077 74332
6951 74332 98350 109250 103177 104299 94416 92746 100753 107028 105755 99411 102753 109913 120747 119380
6937 119380 135061 131315 124828 117131 111933 121955 124824 101535 97980 107252 112213 128702 113298
6924A13298k2222K5721L5114k5333j2436L055m622j9267L736J1937r686J9704
6912A18999n396L040P428J7752j95j0139j403l004Q291K1785K3716L9900p202
6899B13572j2165J1116j8143K2221k3395j4779o356j9212o537j5212k618P980
6887A36472k443O353J8871r43m99r632k7227J1056K3620p153O792j722N007N461
6873A64013N339J234k751J8622Q846r133o65l270j7736j3096J9139L7452k1948
6860A86046M786J4283K6979j2987o372j0357o740p890q779j3883K5986J5201l0891
6847A75382o89m097j996K5342M4558q904j595j3122J3141J2365q423o190M991
6834B30763J9878P831r504J2163K0974q401Q453N076k078j3941K1496J4780l2067
$$ plain form
6924 113298 91076 116797 151911 126578 114142 117197 112575 93308 97044 108981 99295 118999
6912 118999 113603 116643 124071 141823 141628 131489 130086 127082 135373 157158 180874 220774 213572
6899 213572 201407 212523 194380 216601 193206 178427 172071 152859 146322 131110 128492 136472
6887 136472 134029 140382 159253 158310 157811 148179 120952 132008 155628 148475 155267 153545 158552 164013
6873 164013 169352 170586 167835 186457 195303 186170 185505 182235 164499 151403 170542 207994 186046
6860 186046 190832 205115 232094 219107 212735 202378 195638 187748 178969 165086 191072 206273 175382
6847 175382 174693 170596 168600 193942 238500 229596 228001 214879 228020 240385 231962 225772 230763
6834 230763 250641 258472 248968 261131 282105 273704 282157 287233 285155 271214 292710 307490 275423
6821B75423j1915J3038K374L0193k4988p37l371J3210M4036k3024q068K7888J991
6808C36050L089J9393N337J6905O616P89%K3086J0050J6763L3586j3364k1617
6795D36683j3300L1309L1595o41K1149K8672O587O073K656M4410J2056M07K9804
6782F37460J8609J9756M041j0677M139K075J3016J5835M6048L0286L627M3811
6770H28026M2696L6769J0242J1393N8461L5563J7457N1476M3599N7439M0149M8776
6758A282046N1534R8830J03981J14835J45576J50168J60994J87898K49274L18039
6748B863175M74228O82911Q95122J056886M33507j90516n45782p41481n65733
6739D362317l95301j55717M6802L34013N73282Q60585R02654Q6725m97783q20225
$$ plain form
6821 275423 263508 276546 278920 309113 284125 283388 280017 293227 337263 314239 306171 334059 336050
6808 336050 339139 358532 363869 380774 387390 388179 388179 411265 421315 438078 471664 458300 436683
6795 436683 423383 454692 486287 485646 506795 535467 542054 548127 550783 595193 607249 607656 637460
6782 637460 656069 675825 679866 669189 673328 675403 688419 704254 750302 780588 784215 828026
6770 828026 870722 907491 917733 929126 987587 1023150 1040607 1092083 1135682 1193121 1233270 1282046
6758 1282046 1333580 1432410 1536391 1651226 1796802 1946970 2107964 2295862 2545136 2863175
6748 2863175 3337403 4020314 4915436 5972322 6405829 6215313 5669531 4928050 4362317
6739 4362317 3967016 3811299 3858101 4192114 4765396 5625981 6528635 6615360 6117577 5297352
6729E297352r47340p98779o25300m44471l54677k23219j54788j24802r9019p6264
6719A448693m3727l8474n2996k4713n351L687k135p52k7160j5809R32o15P170
6706A248750l59o466J2144O782J8038M2686M5940L1802K7565K0599O2848Q8208
6694A598537Q8682J00807J14349J37132J60047J84245K73604L80205N46379P31575
6684D315562R87900N50066j08695m18756o21845n54723m32185k26431K4485K46302
6674C761680M69699P17847Q99194L12049l75886p09383r09933q16531o51611m74831
6664B222294l24459k17638j64469j40684r2889r1467o5031n2493n8523n2808l7379
6653I24454k5678k7298j2970m6655j0089j0950l7469k5617p821l2385l2985l1956
$$ plain form
6729 5297352 4350012 3551233 2925933 2481462 2126785 1903566 1748778 1623976 1524957 1448693
6719 1448693 1404966 1366492 1313496 1288783 1283432 1287119 1284984 1284232 1257072 1241263 1242195 1241580 1248750
6706 1248750 1248391 1241925 1254069 1260851 1278889 1321575 1367515 1399317 1426882 1447481 1510329 1598537
6694 1598537 1687219 1788026 1902375 2039507 2199554 2383799 2657403 3037608 3583987 4315562
6684 4315562 5303462 5853528 5744833 5326077 4704232 4149509 3717324 3490893 3515378 3761680
6674 3761680 4231379 4949226 5848420 6160469 5784583 5075200 4165267 3348736 2697125 2222294
6664 2222294 1897835 1680197 1515728 1375044 1282155 1190688 1125657 1073164 1014641 961833 924454
6653 924454 898776 871478 858508 811853 801764 790814 753345 727728 719907 687522 654537 622581
6641F22581N286q380j663k3184k5705j7787n869k083j5952o225j6845o40k179
6628E01355j6279K5018k8221r813j2826j4809L907j5206n434J5618J4532L718
6616D61560j2169K991j6300O78k6865K625J8685J6229J4570r676p327k3053n20
6603D21428j6204L497j749k5392J8050K0171m167j0862q804J127O829l811O22
6590D00735J3604o797P833J3018J4120K326l378N472O973l864l542r812J5594
6577D52282L764J6632M027N662J2196J4116J6620K194j7167J5899j9559K2935
6565E29601K7528P312J6803p31N282N359J8989k288O869O786J3652K0406J3853
6552F69421L6699m209J2115M7858N401L8640K6511J8098J4329Q569Q085j2480
$$ plain form
6641 622581 627867 619487 617824 594640 568935 551148 545279 543196 527244 521019 504174 503534 501355
6628 501355 485076 510094 481873 472060 459234 444425 448332 433126 427692 443310 457842 461560
6616 461560 449391 452382 436082 436760 409895 412520 431205 447434 462004 452328 445001 421948 421428
6603 421428 405224 408721 406972 381580 399630 419801 415634 404772 395968 397095 403924 400113 400735
6590 400735 414339 407542 415375 428393 442513 444839 441461 446933 453906 450042 446500 436688 452282
6577 452282 456046 472678 476705 482367 494563 508679 525299 527493 510326 526225 506666 529601
6565 529601 557129 564441 581244 580513 585795 591154 610143 607855 614724 621510 635162 655568 669421
6552 669421 706120 701911 714026 761884 767285 805925 832436 850534 864863 873432 881517 869037
6540H69037R942J4868N403o851K9644K3505L3301J8517M1051M7359K7954M2125
6528A155855M4127M5124L2720M7256O1678P0481N5092O2687L3228K2673J3038
6517A643959L3976K3292N9526P9854O5572J11223J16048J33925J46611J87145
6507B601131K04690K40814L10095M02405N65731P88243J031413J141447N12394
6498G798363j58120o51726q22875o72067m73378j96102L0976K87692N34522Q39590
6488F516875Q31765K13371l55874p11020p74101o32885m30007k35971j04711j8697
6478D298745Q3120K45305M30739O44505R56828R23923J79328l87730q22537q30631
6468E721595o54439m23201j54957L9925K89640N56845Q09749N87784j21497o06462
$$ plain form
6540 869037 878979 893847 899250 892399 922043 945548 978849 997366 1038417 1085776 1113730 1155855
6528 1155855 1199982 1245106 1277826 1325082 1386760 1457241 1512333 1575020 1608248 1630921 1643959
6517 1643959 1677935 1701227 1760753 1840607 1906179 2017402 2133450 2267375 2413986 2601131
6507 2601131 2805821 3046635 3356730 3759135 4324866 5113109 6144522 7285969 7798363
6498 7798363 7640243 6988517 6165642 5493575 5020197 4824095 4855071 5142763 5677285 6516875
6488 6516875 7348640 7562011 7206137 6495117 5721016 5088131 4658124 4422153 4317442 4298745
6478 4298745 4381865 4627170 5057909 5702414 6659242 7583165 7762493 7374763 6552226 5721595
6468 5721595 5067156 4643955 4488998 4528923 4818563 5375408 6185157 6772941 6651444 6044982
6458F044982r00052q82890p37701n33555m00516k74601j98415j54131j81127j31924
6448A650070n4082o0060p0996l4558n3421n5597j9331n0918j4502k3366n6222
6437A157017m0509j2265k9580k7044l8829l3160j9967j3497j4856j518L1608j7921
6425I39479m3812q680O879n383k3439m115J167j9961o898K2967k7573p167Q743
6412H32207J777l1540j0225m518Q770L771k3575J771K2585J7613k915R42L699
6399H20362o771J1062R478J8348k531M778p729o935J2075P32R594o238L478j3560
6385H46143l944j9196p978J9358J3106K341J8121j994N494K1686j7508j4059N261
6372H66831J9459O279J6504L184l043l611L3874K068J7414m346R314M693p997
$$ plain form
6458 6044982 5144930 4262040 3524339 2990784 2590268 2315667 2117252 1963121 1781994 1650070
6448 1650070 1595988 1535928 1464932 1430374 1376953 1321356 1302025 1251107 1236605 1213239 1157017
6437 1157017 1116508 1104243 1074663 1047619 1008790 975630 955663 942166 927310 925792 957400 939479
6425 939479 895667 886987 893866 888483 865044 860929 862096 842135 835237 858204 830631 823464 832207
6412 832207 833984 802444 792219 787701 796471 800242 776667 778438 801023 818636 815721 816663 820362
6399 820362 813591 824653 834131 852479 849948 854726 846997 840062 852137 852869 862463 856225 859703 846143
6385 846143 842199 823003 815025 834383 847489 849830 867951 865957 871451 893137 875629 861570 866831
6372 866831 886290 892569 909073 912257 909214 905603 939477 941545 958959 954613 963927 968620 960623
6359I60623j3099o306M359K4091J5782K77j116j4004k7688r103o796j20j3335
6346I13565j1634q9k010K063L3458j8362J3812K8069j1672K0541l117n8J426p220
6332I58772O240J2179J2391M040j3107j8429J5377R879J912j5893k2277J0309
6320I61393K8064K9556L9931O0119K4743J7252L0134P374j8979L794O279J8324
6308A207984K3756L9932K5515L270J2524K1922J2094M1996L2016J8792K0457J582
6296A461840J5285k1251J8712K3385L3704M1510J2200P794n353J3038J1178L055
6284A615097K0700M938j1627J5891j4510O109K0656o250k6124k2936k5883m4607
6272A531454j8244J9452M380K1768N6614P5029M2408Q9716N8688Q0496R5769O4381
$$ plain form
6359 960623 947524 941218 945577 969668 985450 985727 984611 970607 942919 933816 927020 926900 913565
6346 913565 901931 901842 899832 901895 935353 916991 930803 958872 947200 967741 964624 964566 965992 958772
6332 958772 965012 977191 989582 993622 980515 962086 977463 987342 989254 973361 951084 961393
6320 961393 989457 1019013 1058944 1119063 1143806 1161058 1191192 1198566 1179587 1183381 1189660 1207984
6308 1207984 1231740 1271672 1297187 1300457 1312981 1334903 1346997 1388993 1421009 1439801 1460258 1461840
6296 1461840 1477125 1455874 1474586 1497971 1531675 1573185 1585385 1593179 1587826 1600864 1612042 1615097
6284 1615097 1635797 1640735 1629108 1644999 1630489 1636598 1657254 1651004 1624880 1601944 1576061 1531454
6272 1531454 1513210 1532662 1537042 1558810 1615424 1690453 1732861 1822577 1881265 1961761 2057530 2121911
6260B121911N1517L0196J8178M1278K5918K9845L2782L5387O4536N5889K6324
6249B533761N7037N3717K8853K7507O1807N58R510J1534O593J4445J7858M2730
6237B865910N1488N0312N1502N6676J01768R7532O3931P0633P4758J12204J36635
6226C733349J36642J59657J41126J27796J22671J34993J02280O9863J06397J25235
6216D960009J10868J26799J14148J01381J29876J17426J29094J02309J35902J30856
6206F158668J20212J53142J60329J69196J75410J65478J38383J62453J79994J88154
6196G771419J53280J82593K13237K33000K13127J95964J93175K05974K40531K68369
6186I870669L24408L28263L53673L85834L83567L95409M34639M46296N13027N16356
$$ plain form
6260 2121911 2173428 2203624 2221802 2263080 2288998 2318843 2351625 2387012 2451548 2507437 2533761
6249 2533761 2590798 2644515 2673368 2700875 2762682 2763240 2772750 2784284 2790877 2805322 2823180 2865910
6237 2865910 2917398 2967710 3019212 3075888 3177656 3275188 3339119 3409752 3484510 3596714 3733349
6226 3733349 3869991 4029648 4170774 4298570 4421241 4556234 4658514 4728377 4834774 4960009
6216 4960009 5070877 5197676 5311824 5413205 5543081 5660507 5789601 5891910 6027812 6158668
6206 6158668 6278880 6432022 6592351 6761547 6936957 7102435 7240818 7403271 7583265 7771419
6196 7771419 7924699 8107292 8320529 8553529 8766656 8962620 9155795 9361769 9602300 9870669
6186 9870669 10195077 10523340 10877013 11262847 11646414 12041823 12476462 12922758 13435785 13952141
6176A3952141N65244N40788N56105O08077O20411O64136P81422Q64162Q85472
6167B0037958Q92533R07468Q85177R70175R71209J052568J091602J200468J264666
6158B9273824J424417J562413J923684K275918K709173L154713L753545M369227
6150E0446914N007709N720311O845454P991528R696600J2077525J5940743K1581157
6142A35307941K9765451L8420486M3393635K4545080o394941k3405155l5852597
6135B05779900l9204720l4311041k7097766j9747113j4185412j0439304p893333
6128E2901211o038583m725435l813658l084713k588327k241976j965609j797966
6120B6644944j613941j459675j322205j209692j080731j016796r62222r14363
$$ plain form
6176 13952141 14517385 15058173 15614278 16222355 16842766 17506902 18288324 19152486 20037958
6167 20037958 20930491 21837959 22723136 23693311 24664520 25717088 26808690 28009158 29273824
6158 29273824 30698241 32260654 34184338 36460256 39169429 42324142 46077687 50446914
6150 50446914 55454623 61174934 68020388 76011916 85708516 97786041 113726784 135307941
6142 135307941 165073392 203493878 246887513 271432593 265037652 241632497 205779900
6135 205779900 166575180 132264139 105166373 85419260 71233848 60794544 52901211
6128 52901211 46862628 42137193 38323535 35238822 32650495 30408519 28442910 26644944
6120 26644944 25031003 23571328 22249123 21039431 19958700 18941904 17979682 17065319
6112A7065319q37846p02972o57769n52401m47483m00808m20548m23502m44664
6103A2177326n29027n32381m31822m03331l90579l42563l64425k90154k63942
6094H629102k38199k39374k38243k37447k46582k30473j92056k04936k07391j64873
6084F429528j65938j61570j21341j11841j02555j07105o5997p6410o3083n1478
6074E402210j3493n3094n0394j02973j24112j48357j40351j35840j08948j02218
6064D422430r6515j01850q6915j10920p8496m2144l8641m2479J443K2097J4950
6053C862960M0495l283m5895q6730j60482j63094j65072j44083r3620q8150o6314
6042B886732n5753p6587l6471m0269l8374l3495l709M09Q720j9559q0687r4819
$$ plain form
6112 17065319 16227473 15524501 14866732 14314331 13866848 13466040 13045492 12621990 12177326
6103 12177326 11648299 11115918 10684096 10280765 9890186 9547623 9183198 8893044 8629102
6094 8629102 8390903 8151529 7913286 7675839 7429257 7198784 7006728 6801792 6594401 6429528
6084 6429528 6263590 6102020 5980679 5868838 5766283 5659178 5593181 5516771 5453688 5402210
6074 5402210 5388717 5335623 5285229 5182256 5058144 4909787 4769436 4633596 4524648 4422430
6064 4422430 4325915 4224065 4137150 4026230 3947734 3905590 3866949 3824470 3825913 3848010 3862960
6053 3862960 3903455 3900172 3854277 3767547 3607065 3443971 3278899 3134816 3041196 2953046 2886732
6042 2886732 2830979 2754392 2717921 2677652 2639278 2605783 2602074 2602483 2611203 2591644 2510957 2416138
6030B416138q5606q2722p2575q3141q5490n5199l9086j9045j2838m6786n3557
6019A780093n4987l3989l1133k7195K8029M1242K3066L5608M1070J6567J8435
6008A836806K487p895k6798l9100n9582q1134n9966k9929p5275j2670q651K3305
5996A461598O1227R557j9717l6290p7302p6325n0572m9247l9292m0310l3960N438
5984A114805j567j6332j8809m75p663m1079q282j3147q149J2870L6019J2156k0294
5971A040053J1202K3584J0988L8468M8475J3532K2789M1524N9527K058M396m7581
5959A269015l2971k8215Q781j7872m7395j2816m962k4298k4284j3123k9141k5593
5947A017126m6862J992j8363l003p987K332j9960Q067j08N658J0548J0310L1087
$$ plain form
6030 2416138 2330532 2247810 2175235 2092094 2006604 1951405 1912319 1893274 1880436 1833650 1780093
6019 1780093 1725106 1691117 1659984 1632789 1660818 1702060 1725126 1760734 1801804 1818371 1836806
6008 1836806 1839293 1831398 1804600 1765500 1705918 1624784 1564818 1534889 1459614 1446944 1438293 1461598
5996 1461598 1522825 1532382 1512665 1476375 1399073 1322748 1272176 1222929 1183637 1143327 1109367 1114805
5984 1114805 1113238 1096906 1078097 1077622 1069959 1028880 1020598 1007451 999302 1012172 1048191 1060347 1040053
5971 1040053 1051255 1074839 1085827 1124295 1172770 1186302 1209091 1250615 1310142 1312200 1316596 1269015
5959 1269015 1236044 1207829 1216610 1198738 1151343 1138527 1133565 1109267 1084983 1071860 1042719 1017126
5947 1017126 970264 972256 953893 950890 942903 945235 925275 933342 933234 938892 949440 959750 990837
5934I90837J2048L7283J1536J7418K9072L4736M6305K5646J0802p558k0303n6054
5922A131768n1972n8948l2423n077Q715k7210J4270L057l4665k4203k7321j316
5910H94675l0349J6161j435L2335M0473J9764O1321N3801M6877J3291p251l6926
5898A102737n9133n3879q5754p6592m0293n8516m5155k1166o269j4871k8385p908
5886F04816l752J0695m493K7653j8865j024L6802l7355J984l983k0997M80j3732
5873E78229q502M679K1120k5118k3864k549n451J0880k502j2364n323J0279R483
5860E48997J7003j170j5403O705j2180O826j7669j9110J6297J6874p185J320J0292
5847E51597q631j0540N076l870R656o31j1120j4372j708Q160j8585m969m82p622
$$ plain form
5934 990837 1002885 1040168 1051704 1069122 1098194 1132930 1179235 1204881 1215683 1208125 1187822 1131768
5922 1131768 1079796 1020848 988425 983348 992063 964853 979123 982180 947515 923312 895991 894675
5910 894675 864326 880487 879052 911387 951860 971624 1032945 1086746 1133623 1146914 1139663 1102737
5898 1102737 1043604 989725 903971 827379 787086 728570 683415 662249 655980 641109 612724 604816
5886 604816 601064 611759 607266 634919 616054 615030 651832 614477 616461 612478 591481 591961 578229
5873 578229 569727 574406 595526 570408 546544 543995 538544 549424 546922 534558 529235 539514 548997
5860 548997 566000 564830 549427 556132 543952 550778 533109 513999 530296 547170 539985 541305 551597
5847 551597 542966 532426 537502 533632 543288 542657 531537 517165 515457 523617 505032 500063 499581 491959
5833D91959j81J4139J7765K5980K7304l472J2753J2143J5427J5843J841M1550
5821F73051J402j3441R501J2005M8082M1670K6097N8252L7596M7804L3075J015
5809I76109k9066k0795p368j8477j1295K7647J8529N7026P2618N3714j239r118
5797A108285k635p433J5490K8635M7979O3167N2993L6569Q9979R2484R6932N8971
5785A681416k6550j27081j44801j39034j13955j00291r1989k2786j4339j0014
5775H90576J915M0746L1860j1453k2338j6606j1931k1792p0749l3024k1107k5736
5763G30361l0397l6561l0869Q708L863j4509k0003K836J4631k93j7786k2404n528
5750E82049R779n881l074n989J8275L2729j6738r795r273l4176j8186p208j5156
$$ plain form
5833 491959 491778 505917 523682 549662 576966 573494 586247 598390 613817 629660 631501 673051
5821 673051 674453 661012 670513 682518 730600 772270 798367 856619 894215 942019 975094 976109
5809 976109 947043 926248 918880 900403 889108 916755 935284 992310 1064928 1118642 1117403 1108285
5797 1108285 1105650 1098217 1113707 1142342 1190321 1253488 1306481 1343050 1433029 1525513 1622445 1681416
5785 1681416 1654866 1527785 1382984 1243950 1129995 1029704 937715 914929 900590 890576
5775 890576 892491 933237 965097 953644 931306 914700 902769 880977 810228 777204 756097 730361
5763 730361 699964 663403 632534 641242 645105 630596 610593 613429 628060 627767 609981 587577 582049
5750 582049 591828 585947 582873 576884 595159 627888 611150 601355 592082 557906 539720 532512 517356
5737E17356K5r082j273K776J1203j659r810n958k0139K5611J8339o133k4905r289
5723D87062J5111p578L620j1128L2526J1365Q214J5717R83j689J8144J788P88
5710E74923j4161n476r602j9812l3295k5292J829K801n001J5550O160r947j2895
5697D65782J020L512K6380k5151n536J4669M737R608J6638K2265L857K5884K1060
5684E84725M0903P09L1205M7225k0676k2314k0083k6560l6045L50q225k3994q176
5671E39044k1061o057M2255J3962K686K3804L6162L7117M8645N4861l371j3397
5659G54650k1251l8854m3587l5844l4325k0856l926J3369L9383l6807R984N476
5647E87412j0455L624N722K2239J0526K2886k72q859k779J9202M631M53j1840
$$ plain form
5737 517356 517381 508299 507026 509802 521005 519346 509536 503578 483439 509050 527389 521256 496351 487062
5723 487062 502173 494595 498215 487087 519613 530978 539192 554909 555892 554203 572347 574135 574923
5710 574923 560762 555286 545684 525872 492577 467285 469114 471915 466914 482464 488624 478677 465782
5697 465782 466802 470314 496694 471543 466007 480676 485413 495021 511659 533924 537781 563665 584725
5684 584725 625628 626337 657542 704767 684091 661777 641694 615134 579089 579439 571214 547220 539044
5671 539044 517983 511926 554181 568143 570829 594633 630795 667912 716557 771418 768047 754650
5659 754650 733399 694545 650958 615114 580789 559933 556007 569376 608759 571952 581936 587412
5647 587412 576957 580581 586303 608542 619068 641954 641682 632823 630044 649246 653877 654330 642490
5634F42490k5537k9563j1369k8888k0719j7824m080p880l106m68J9524J8389J9122
5621E50091L2022K064L9712P1417K6724J0706l4883r107l27m7995m5765j4393
5609E80266j8895m7893j4111j578k0060j7531J5036J0838J3355p484J1441J5973
5597E19357J5775P914p344k0757j4445J4246k1681P146M471J4717k7486j6921
5585D74992k2979n340J7112M425k4757J1781k6888o136L46K074N784k651L7589
5572D65352P679l2441K22R755K8900n655J7662J2218J5081M050O476j1221l5710
5559D82368Q339O159K3297j5990k4107k8821m277K7331J3385M806J3189p514p123
5546D91042P623L2512K8746J434j5106j8776J531p840K1022J9893j2724J1500
$$ plain form
5634 642490 616953 587390 576021 547133 526414 508590 504510 496630 493524 493056 512580 530969 550091
5621 550091 582113 584177 623889 695306 722030 732736 697853 688746 688419 640424 594659 580266
5609 580266 561371 513478 499367 497789 477729 460198 475234 486072 499427 491943 503384 519357
5597 519357 535132 543046 535702 514945 500500 514746 493065 500211 504682 519399 491913 474992
5585 474992 452013 446673 463785 468210 443453 455234 428346 422210 422556 424630 430414 427763 465352
5572 465352 473031 440590 440812 450567 479467 473812 491474 503692 518773 522823 529299 518078 482368
5559 482368 490707 496866 520163 504173 480066 451245 446968 474299 487684 492490 505679 498165 491042
5546 491042 498665 531177 559923 561357 546251 527475 529006 521166 542188 562081 549357 560857
5534E60857J5515K0845K5065M2851R051O3783P6160R7148J06902J76771J95234
5523A390182J08072j5419q8534j76021j71652j30730j04386n5399q7283k7895
5513F40935j7446l4899N919J6288j7828k2125l441r260J2236j2062j382K0048
5501E76983N3029L1188R755l043L0612K2037R031J257J0081J4921J4664j4891
5489G55624k0848n837j9574j8286l865l2554p165P634J8549R877j3518K918L9835
5476G12790L7731n960j8596O276J9476j184J155L8501j576M0741M1183K7632J3398
5463I11567k3791k5203k7336l8145l2766j0150l4154j5263L118q209r537n631
5451F84500j5062p114k232J3501k0992J7025p111K2071J1503m1597L981J1534
$$ plain form
5534 560857 576372 597217 622282 665133 674184 737967 814127 911275 1018177 1194948 1390182
5523 1390182 1498254 1482835 1394301 1218280 1046628 915898 811512 756113 668830 640935
5513 640935 623489 588590 594509 610797 592969 570844 567403 558143 570379 558317 556935 576983
5501 576983 630012 661200 670955 667912 698524 720561 729592 730849 740930 755851 770515 755624
5489 755624 734776 728939 709365 691079 687214 654660 647495 655129 673678 683555 670037 672955 712790
5476 712790 750521 744561 725965 732241 751717 750533 751688 790189 788613 829354 870537 898169 911567
5463 911567 887776 862573 835237 797092 764326 754176 720022 704759 707877 699668 690131 684500
5451 684500 669438 662324 660092 673593 652601 669626 662515 684586 696089 654492 658473 670007
5439F70007j8376j0273o129K7216J8553j2621j5794m7486m0642q594k8093j1832
5427E15936j4988l0167n756Q354j4953r352J9491k022m149K0149K4342j1471k6084
5414D69330o138k4322m099Q185q98k7909J0594j1417o111p620j9016J3975K24
5401C94778K7847j4085l4885j8336R860J7593j042m867k429R446j3100J0619l175
5388C78224p757j406L3872j4257p982p188K0853K4855Q894M760l029k6479k477
5375D00883j2383m179L426k3028L2K7495K0877Q383J214l107J2532j8341p80p805
5361D05219o085J2006j439j458l0810K8797J1761J5931L2601r901j786j4664j662
5348D38510J1601L4220n078l914j3531n266K4926j062P624n363k0058p60j5079
$$ plain form
5439 670007 651631 641358 635229 662445 680998 668377 652583 605097 564455 555861 527768 515936
5427 515936 500948 470781 465025 473379 458426 449074 468565 466543 462394 482543 506885 495414 469330
5414 469330 463192 438870 434771 442956 442058 414149 424743 413326 407215 399595 380579 394554 394778
5401 394778 422625 408540 373655 355319 365179 382772 381730 376863 374434 383880 370780 381399 378224
5388 378224 370467 369061 402933 388676 380694 373506 394359 419214 428108 432868 429839 403360 400883
5375 400883 388500 384321 387747 364719 364751 392246 413123 421506 422720 419613 432145 413804 413024 405219
5361 405219 399134 411140 409701 408243 377433 406230 417991 433922 466523 456622 454836 440172 438510
5348 438510 450111 484331 479253 475339 461808 456542 481468 480406 488030 482667 462609 461849 446770
5335D46770q96j6292j9020J6714R462M527R333j6732P159r011J0250k0760j5364
5322D06140J8863P804K2608L129K3940j672K0421k040o735M303j573J345J1001
5309E07534o25P250M331M958J1932j6083R078J067K4813k6603j714K6024M0224
5296E92186J617O794j8046Q00J1484r718m7673k8022K0826j9363J8889K499J7121
5283E49394L1303J6129L4814r870O489K4210j5318k6667K6341j7910k2699k8893
5271E67323k1933k7683l301l692l603N204o292j7946p77K0000J0854K0758J1483
5258E50395p644N413L4820n490l4160J8798j0686j774K3072o784J0741K2611K588
5245F01900J2394J4004K069J3235J3227M375K6400L5987K5697M0456K8090M889
$$ plain form
5335 446770 445874 429582 410562 427276 436738 441265 450598 433866 441025 432014 442264 421504 406140
5322 406140 425003 432807 455415 458544 482484 480812 501233 499193 492458 496761 495188 496533 507534
5309 507534 506909 514159 518490 523448 535380 519297 528375 529442 554255 527652 525938 551962 592186
5296 592186 593803 600597 582551 583351 594835 585117 537444 509422 530248 510885 529774 532273 549394
5283 549394 580697 596826 631640 621770 628259 652469 637151 610484 636825 618915 596216 567323
5271 567323 545390 517707 514406 510714 507111 512315 506023 488077 487300 507300 518154 538912 550395
5258 550395 542751 548164 582984 577494 543334 562132 551446 549672 572744 565960 576701 599312 601900
5245 601900 614294 628298 630367 643602 656829 661204 687604 723591 749288 789744 817834 822723
5233H22723l4149o342P6R951N566o542K1261J9388K0467J0258J0103L2232J6915
5220I21907L159N3916K0919M2235L3757M3979Q1594P6980P3284N5271O6925J6051
5208A489977K4685N1418M5582P2142J07241J58244K56340L16916L90277K82735
5198C195557J9592j88487k94938k85041k69991k20655j64582j77057j51177r2205
5188A371016o6097p5530n2712o2449k0934j7382K633l7962o4k7695m4508j7978
5176I50338K508J8748K102M98J7733K502J8566L740O210Q795m560K341j8097j908
5162A009516J8052K407L422l3803K419O400K57k5379j932M733k1929m877J5859
5149I75145K0271J7102n181l969R083P290K438Q119J5411K1176K6464P555j2807
$$ plain form
5233 822723 788574 782232 782308 792259 797825 791283 812544 831932 852399 862657 872760 904992 921907
5220 921907 925066 978982 999901 1042136 1075893 1119872 1201466 1278446 1351730 1407001 1473926 1489977
5208 1489977 1514662 1566080 1611662 1683804 1791045 1949289 2205629 2522545 2912822 3195557
5198 3195557 3215149 3026662 2731724 2446683 2176692 1956037 1791455 1614398 1463221 1371016
5188 1371016 1304919 1229389 1176677 1114228 1093294 1075912 1078545 1040583 1040519 1012824 968316 950338
5176 950338 952846 971594 973696 974194 991927 994429 1012995 1016735 1022945 1031740 1027180 1029521 1011424 1009516
5162 1009516 1027568 1029975 1033397 999594 1002013 1008413 1008670 983291 981359 986092 964163 959286 975145
5149 975145 995416 1012518 1007337 1003368 1012451 1019741 1022179 1030298 1045709 1066885 1093349 1100904 1088097
5136A088097R302L6397J890R691M089J2667K8606P969j531J8301R524P970K747
5123A235719j2900J9964J0959k950r566K1783J8891L0827K6751O581J1619K8523
5111A386201k840J3403K4959K1369K4061j6935l3244j0029J8329L9119J1741q207
5099A467927L3496J7625L0283j1084k207m620k1218J5241J801j857Q944j15J9947
5086A554163O310J0950l811k93J3073K1386k4806k365r828J4752L030n768k9131
5073A547662O160m298l330K2905O528K4690J6723J9788O4309O8091J12459N9286
5061A940973P0849N5788K5605J4158k1451P288Q69o261K0909L0124Q739J0781
5049B158371L0038J5990L7089N0692M1669J2199L7861O701M283N308M9429M6175
$$ plain form
5136 1088097 1097399 1133796 1135686 1145377 1149466 1162133 1190739 1198708 1197177 1215478 1225002 1232972 1235719
5123 1235719 1222819 1242783 1253742 1250792 1241226 1263009 1281900 1312727 1339478 1346059 1357678 1386201
5111 1386201 1383361 1396764 1421723 1443092 1467153 1450218 1416974 1406945 1425274 1464393 1476134 1467927
5099 1467927 1501423 1519048 1549331 1538247 1536040 1531420 1510202 1525443 1527244 1525387 1534331 1534216 1554163
5086 1554163 1560473 1571423 1567612 1567319 1580392 1601778 1576972 1574607 1564779 1579531 1582561 1576793 1547662
5073 1547662 1553822 1549524 1546194 1569099 1575627 1600317 1617040 1636828 1701137 1769228 1881687 1940973
5061 1940973 2011822 2067610 2093215 2107373 2085922 2093210 2094079 2087818 2108727 2138851 2147590 2158371
5049 2158371 2188409 2204399 2241488 2292180 2333849 2346048 2383909 2390610 2394893 2400201 2449630 2495805
5037B495805L2669P1820O6128K15L0940L9453M6435L7531O4542M9088K5974K0339
5025B980939j2957q529l7488o4291n2859q3087m6722o1499l7857L437L7102M3804
5013B659993O6095P2918R3619J23058J46347J40427R6210J10229P6453P2406P0621
5002C728376N1465O6618O9414Q2576J15329P0763P2585Q9944Q7129P8557L5211
4991D547967L1053N3967K8110L2041L4979L9759N4693P9158M0697N7558O6095
4980E066077O8930J10557J21574J26386J22406J01830J29715J72087K02554K44275
4970F466391K63185K54067K30865J64600K11376J67233J82249J94107K11483J96411
4960H541967J88452J76603K09971J87089K16119K12197K25185J82524J90286K42916
$$ plain form
5037 2495805 2528474 2600294 2666422 2666637 2697577 2737030 2783465 2820996 2885538 2934626 2960600 2980939
5025 2980939 2967982 2959453 2921965 2857674 2804815 2721728 2675006 2613507 2575650 2579087 2616189 2659993
5013 2659993 2726088 2799006 2892625 3015683 3162030 3302457 3398667 3508896 3585349 3657755 3728376
5002 3728376 3779841 3846459 3915873 3998449 4113778 4184541 4257126 4347070 4434199 4512756 4547967
4991 4547967 4579020 4632987 4661097 4693138 4728117 4767876 4822569 4901727 4942424 4999982 5066077
4980 5066077 5135007 5245564 5367138 5493524 5615930 5717760 5847475 6019562 6222116 6466391
4970 6466391 6729576 6983643 7214508 7379108 7590484 7757717 7939966 8134073 8345556 8541967
4960 8541967 8730419 8907022 9116993 9304082 9520201 9732398 9957583 10140107 10330393 10573309
4950A0573309K75338K58639K76425K39054K81469K64279L06200K70025K83125
4941A3027863L13090L71481L40112L66894L28358L59306L58258L92414L95711
4932A6253487M84010M77783N73497N98836O53321O55940P15256P11514Q19546
4923B1943190Q43648Q86608R04380R48832R10388J004456J053404J222109J316489
4914C1033504J410585J448291J462228J389466J468197J502393J619352J731757
4906D3065773J872646J980380K186296K366105K750078L294646L960909M701361
4898F6178194N555155O470740P560390Q481711J0048981J1885018J4052770J7089101
4890A47322060K1861798K8997675M0506246N4180903O8631549O2443082J5271436
$$ plain form
4950 10573309 10848647 11107286 11383711 11622765 11904234 12168513 12474713 12744738 13027863
4941 13027863 13340953 13712434 14052546 14419440 14747798 15107104 15465362 15857776 16253487
4932 16253487 16737497 17215280 17788777 18387613 19040934 19696874 20412130 21123644 21943190
4923 21943190 22786838 23673446 24577826 25526658 26437046 27441502 28494906 29717015 31033504
4914 31033504 32444089 33892380 35354608 36744074 38212271 39714664 41334016 43065773
4906 43065773 44938419 46918799 49105095 51471200 54221278 57515924 61476833 66178194
4898 66178194 71733349 78204089 85764479 94246190 104295171 116180189 130232959 147322060
4890 147322060 169183858 198181533 238687779 292868682 361500231 423943313 439214749
4883D39214749k1708489m2600390n2713691m4740232l9501277l5823454l1173503
4876A70953713k7591457k2613593j7874091j3802060j0371506q161807o507733
4869F4031466n370293m415377l840882l263831k849067k499265k202126j854755
4861C7735870j626871j251356j150359j265177j454180j527130j509014j276900
4853B6674883j205918j055822j035156r80263j032352r62983q98027p71447p02612
4844A8030303o87105o69670n77258n63152m95296m71866m51563m73520m37636
4835A3203237m37077l98968m19267l96919l84261l01522k99214k34384k32926
4826A0098699k25155k21517j69197k03899j69416j85560j15340j33794j11910
$$ plain form
4883 439214749 417506260 374905870 322192179 277451947 237950670 202127216 170953713
4876 170953713 143362256 120748663 102874572 89072512 78701006 70539199 64031466
4869 64031466 58661173 54245796 50404914 47141083 44292016 41792751 39590625 37735870
4861 37735870 36108999 34857643 33707284 32442107 30987927 29460797 27951783 26674883
4853 26674883 25468965 24413143 23377987 22397724 21365372 20402389 19504362 18732915 18030303
4844 18030303 17343198 16673528 16096270 15533118 15037822 14565956 14114393 13640873 13203237
4835 13203237 12766160 12367192 11947925 11551006 11166745 10865223 10566009 10331625 10098699
4826 10098699 9873544 9652027 9482830 9278931 9109515 8923955 8808615 8674821 8562911
4817H562911j35071j19564j33448j52208j24818m5992m3674P0581P8929m1428
4807G916218k37628l31015l91272l96842l48292k92254k14744j69305j14870q8077
4797E331919r2379q6696j31917j13118r5001r4002p6645q4483q8374p6028j00207
4786D293069j14924j02170r4666q6981o7257r4829j06576j13756j01290q3555
4776C327065q0863q9909n5294o4168o6156o7460l7415k9578m1421j5802p3545
4765B705454n9413p0536o0708k0908O545M3002N3409M1559K5215M0889K8528J9321
4753B752357k860j9829m9441o8723r8119j12018q9324j24911p8495r2211o9685
4742A946741o1402l3125m6322l6867l7525n8669k9520j1719l4608L970k0075m145
$$ plain form
4817 8562911 8427840 8308276 8174828 8022620 7897802 7851810 7808136 7878717 7957646 7916218
4807 7916218 7678590 7347575 6956303 6559461 6211169 5918915 5704171 5534866 5419996 5331919
4797 5331919 5239540 5152844 5020927 4907809 4812808 4718806 4642161 4557678 4469304 4393276 4293069
4786 4293069 4178145 4075975 3981309 3894328 3827071 3732242 3625666 3511910 3410620 3327065
4776 3327065 3246202 3156293 3100999 3036831 2970675 2903215 2865800 2836222 2794801 2778999 2705454
4765 2705454 2646041 2575505 2514797 2493889 2500434 2543436 2596845 2638404 2663619 2704508 2733036 2752357
4753 2752357 2749497 2729668 2680227 2611504 2513385 2401367 2312043 2187132 2108637 2016426 1946741
4742 1946741 1885339 1852214 1805892 1769025 1731500 1672831 1643311 1631592 1596984 1600954 1580879 1576734
4730A576734J3493J0436k3563n190l9463k9963k6697j412M170l0960k7427L7449
4718A457607j3082J049o739N435J4863j7972K2032k2366l5208j0148n555M532
4706A394448J5912K3836N8697L6041j7315J655j2164m13k1115k1068K264m1785
4694A418993m3288k7727k1431p731k7231m15m9649l8498j0015J9094l61J8937
4682A230678j6833k8664o183j920l0945l6258l0931j9125k1191k3104j4983k2977
4670I77564n790j8260j1376L840J092J4476o970J567o112k0389j3520k994q132
4657I04996l4656j9452O206L1168K0849K7427P098L6325r988k0362M2666M1895
4645A034172M1155P2999J02235J16541O5083L407j5654l7870q2747j00258r4282
$$ plain form
4730 1576734 1590227 1600663 1577100 1571910 1532447 1502484 1475787 1474375 1478545 1447585 1420158 1457607
4718 1457607 1444525 1445574 1438835 1444270 1459133 1441161 1463193 1440827 1405619 1395471 1389916 1394448
4706 1394448 1410360 1434196 1492893 1528934 1511619 1513274 1501110 1500697 1479582 1458514 1460778 1418993
4694 1418993 1375705 1347978 1326547 1318816 1291585 1291170 1241521 1203023 1193008 1212102 1211741 1230678
4682 1230678 1213845 1185181 1178998 1177078 1146133 1109875 1078944 1059819 1038628 1015524 1000541 977564
4670 977564 971774 953514 942138 945978 947070 961546 954576 956143 950031 929642 916122 913128 904996
4657 904996 870340 850888 857094 888262 909111 936538 943636 979961 969973 949611 992277 1034172
4645 1034172 1075327 1148326 1250561 1367102 1432185 1435592 1419938 1382068 1299321 1199063 1104781
4634A104781o6577m3429m5798j6013j8088k1844K2880K4090j1539j3344j886J4681
4622I27914k406J7235L037K6222P300J0508M2944j2679J551l0551n3632k3193
4610I14250k233j0804K6341r688j3817l2079J7096L4319j0949m0046O025R630
4598H88045j0267J5413P044r634J3780m476O796L102J5958R437J7621K4448J5173
4585I92440J487j7410o85L223J4113K8406K7349L2912M5126P8701O5436Q3320
4573A354418Q9931J31696J64007K02393K76424L44616L26116O5237j49100k38711
4563B567027l04845k64281k08571j65399j73170j32490j18764j21724p2330n1339
4553I54114n5160k8109k9333l1842k2019l6850l0616j0023j1261l306j2586M717
$$ plain form
4634 1104781 1038204 994775 948977 932964 914876 893032 915912 940002 928463 915119 913233 927914
4622 927914 925508 942743 945780 972002 979302 989810 1032754 1020075 1021626 991075 937443 914250
4610 914250 912017 901213 927554 917866 904049 871970 889066 923385 912436 872390 878415 888045
4598 888045 877778 893191 900235 890601 904381 899905 906701 909803 925761 935198 952819 977267 992440
4585 992440 993927 976517 975832 979055 993168 1021574 1048923 1081835 1126961 1205662 1271098 1354418
4573 1354418 1444349 1576045 1740052 1942445 2218869 2563485 2889601 2954838 2805738 2567027
4563 2567027 2262182 1997901 1789330 1623931 1450761 1318271 1199507 1077783 1005453 954114
4553 954114 898954 870845 841512 809670 787651 750801 720185 710162 698901 695595 683009 687726
4541F87726j095j9304M132N084k6418K184k2046n230k570P989L406k0045R211
4528F23024R378j6966K562Q898j6542L10m837m027q562r818j1068J151m3579j829
4514E28095o293j189o602j188N637L647r893J0878q967J9317k1869l905l97R098
4500E16369J3675l830q581n405k0191j3838l732m163K54J7982K000O079K906N621
4486E05146J1062O571O33j8533q685J3305k2641k8227j928j5660K0589J3262j3388
4473D61506J4064j1458Q852K4846k7550J586N242q778j4987M631k3484n53P137
4460D41054Q650k423J9031k1355j1963K0943p911L0864J3555J6326o875j272K2422
4447E21046K3669K1104J4404r921j4427R255Q204J3176J6535K8769K4371l6573
$$ plain form
4541 687726 686631 667327 671459 676543 650125 652309 630263 625033 622463 630452 633858 613813 623024
4528 623024 632402 615436 617998 626896 610354 610664 605827 601800 593238 583420 572352 573503 529924 528095
4514 528095 521802 520613 514011 512823 518460 522107 512214 523092 514125 533442 511573 507668 507271 516369
4500 516369 530044 526214 517633 512228 492037 478199 474467 470304 470558 488540 490540 496619 499525 505146
4486 505146 516208 522779 523412 504879 496194 509499 486858 458631 456703 441043 461632 474894 461506
4473 461506 475570 464112 472964 497810 470260 471846 477088 468310 453323 457954 434470 433917 441054
4460 441054 449704 447281 466312 444957 432994 453937 446026 476890 490445 506771 499896 498624 521046
4447 521046 544715 565819 580223 570302 555875 565130 573334 586510 603045 631814 656185 619612
4435F19612j0735n435k1019j1588j618j8100j970j8193j1803j1293o35K921K1037
4422E31181j8894k3634J3837Q327j0103j010J1853J4347K606L429L5920J7789
4410E85648Q372J083K056l8505j381J5881o81j3165L3094K6158K7044j8213m578
4397F22813J6171k1035m3222l1918k1984k0787M709j6869k5162j2363r208m097
4385D37048p805N285j6260j5394r591R878n254J0227k4757o564k8704n626O108
4372C48591n191J4892o706R788j7375m995k1868r664K341J3357L4164j6705p461
4359C33168j2543j9221J4305p388K1606J769J662N008L255R85j2379K261N960
4346C38448k3449m034j2215J7613K6701j1717k711K789q529r919j903q531M798
$$ plain form
4435 619612 608877 603442 582423 570835 569217 551117 549147 530954 519151 507858 507223 510144 531181
4422 531181 512287 488653 502490 510817 500714 499704 511557 525904 528510 531939 567859 585648
4410 585648 594020 595103 597159 558654 557273 573154 572473 559308 592402 618560 645604 627391 622813
4397 622813 638984 617949 574727 542809 520825 500038 504747 487878 462716 450353 441145 437048
4385 437048 429243 434528 418268 402874 393283 403161 397907 408134 383377 376813 348109 342483 348591
4372 348591 343400 358292 351586 361374 343999 339004 317136 307472 309813 323170 357334 340629 333168
4359 333168 320625 301404 315709 308321 329927 331696 333358 338366 341621 342606 330227 332488 338448
4346 338448 314999 310965 298750 316363 343064 331347 328636 331425 322896 312977 311074 302543 307341
4333C07341k5585j0422j3158J7468j0646R622P296J1442J0296L941K5734o267
4321C27062j1490J254k57J0029K6801p561J9756J015k9225O600M931l4056k8243
4308B86616K0759M210j5903J6500J4437j7001j0890j818j4694J195J8783o843
4296B95351j6653J3139q965p679K8939k575r713n082N384J9827j1560j959j7383
4283B81071j2365o096J5756j0343q901j85m130J5969M381j976k280J2324J160
4270B84385R083L8130m169p966J509J0724n858R11j0440R769M632k2029J2367
4257C21048l1469k3141M022q496R752R354p086K45J1062m414k113M418m425k6092
4243B52665J2945J4037l454Q553o071k1248Q758j0962J279M6804j9200j6229N551
$$ plain form
4333 307341 281756 271334 258176 275644 264998 274620 281916 293358 303654 307595 333329 327062
4321 327062 315572 316826 316569 326598 353399 345838 365594 366609 337384 343984 348915 314859 286616
4308 286616 307375 311585 295682 312182 326619 309618 298728 296910 282216 283411 302194 295351
4296 295351 278698 291837 282872 275193 304132 301557 291844 286762 292146 311973 300413 298454 281071
4283 281071 268706 262610 278366 268023 259122 258937 254807 270776 275157 273181 270901 283225 284385
4270 284385 293468 331598 327429 319463 320972 331696 325838 326749 316309 326078 330710 308681 321048
4257 321048 289579 266438 270460 261964 271716 281070 273984 274229 285291 280877 278764 283182 278757 252665
4243 252665 265610 279647 276193 284746 278675 257427 266185 255223 256502 303306 284106 267877 273428
4230B73428J8594K1014k0099k7028J9030K431j3117j3845j5645K4075J9120M046
4218B92004j2531J396N089k2654j946q902J2122J1757j9275N599K0415j5271k372
4205B65431J3099n671r634n648J9691K110L227P314r227j7911K318J1161J7282
4192B93542O769j7206r07O315n225J2391K101j5884k178O293J4676n484M781j0438
4178B89546o088K6896j0155J1321R152j2332Q779N009M997J696K8124N925O575
4165C69445J8467o774j0204L627N37l6699q381J6483l0018j4726L7517J8237l6445
4152C21066j4234J7260J0962Q88k4931j6144n755j0584L22J9094r83j4894J2829
4139B94896n608R666m129K5300K0772j6476L1535K305O716K2429J8615K0267P264
$$ plain form
4230 273428 292022 313036 292937 265909 284939 287370 274253 260408 244763 268838 287958 292004
4218 292004 279473 280869 285958 263304 261358 252456 264578 276335 257060 262659 283074 267803 265431
4205 265431 278530 272859 263225 257577 277268 279378 282605 289919 280692 262781 265099 276260 293542
4192 293542 300311 283105 282198 288513 283288 295679 297780 281896 279718 286011 300687 295203 299984 289546
4178 289546 283458 310354 300199 311520 320672 308340 317119 322128 327125 328821 356945 362870 369445
4165 369445 387912 381138 370934 374561 375098 338399 330018 346501 316483 301757 339274 357511 321066
4152 321066 306832 324092 335054 335942 311011 294867 289112 278528 278850 297944 296961 282067 294896
4139 294896 289288 298954 294825 320125 340897 324421 355956 358261 364977 387406 406021 426288 433552
4126D33552m716k9065j7069j7947l2631j0828j844j5348n666J9546k053r849n70
4113C05512k80J1586L085k0307j5712j0001J8169K900m309l537J2366j2210N085
4100B92347M825j4938J7696j1153j6083j1188R948j0980K5098O797R219j0663
4088B90925p003J6037l948j1445j9573J4185K7270l5193M212L742j358O673r588
4075B74936K648J2739k128m337q318K171o590J3751O80Q365r496j4887J8991J3289
4061C01814J5380l161o977j0871K2456J2318N500r678J5588J9658K3521l2493
4049C53055P528L3094k4007m213k4120l2454J8408K0078m046P283k5487r317k605
4036C13197q429O258j850L3287J5864L204j7835j1409j4763r451J2484K7198k1497
$$ plain form
4126 433552 428836 399771 382702 364755 332124 321296 319452 304104 298438 317984 315931 306082 305512
4113 305512 305232 316818 319903 299596 283884 273883 292052 294952 290643 287106 299472 287262 292347
4100 292347 297172 282234 299930 288777 272694 261506 271454 260474 285572 292369 301588 290925
4088 290925 283922 299959 296011 284566 264993 279178 306448 271255 275467 279209 277851 284524 274936
4075 274936 277584 290323 288195 283858 275540 277711 271121 284872 285552 293917 284421 269534 288525 301814
4061 301814 317194 314033 307056 296185 318641 330959 336459 326781 342369 362027 385548 353055
4049 353055 360583 393677 369670 365457 341337 308883 327291 347369 343323 350606 325119 315802 313197
4036 313197 304768 311026 309176 342463 358327 361531 343696 332287 317524 308073 320557 347755 326258
4023C26258k6108O89J0478K5490J4566P426j6266N567J4795J503k572k5412n463
4010C30951k7946J7011P034j0783K3119J0939l230p890O541O032r673K1435Q759
3997C72299j2392P153n67j6078J4824j075K707M706J6211k0312L363k112n443
3984C63284P468K1936k5554k3826j0768p277N508K7437R770j8107k939k9815K5569
3971C42686J3310J6869j9888J5455J4338O227j15j4603j1641L0715l798K9340
3959D18895J9658k1096J3032o208l8507j1194N923J4642R711K022j9842O874k474
3946C91436r788J7276J113Q817j184P952J1638l383j8231N136Q577L410J02J72
3932D23043N892r172o196j2387j5638J903L6501m674j8755L479Q257j0546J0791
$$ plain form
4023 326258 300150 300839 311317 336807 351373 358799 342533 348100 362895 364398 361826 336414 330951
4010 330951 303005 320016 327050 316267 339386 350325 347095 339205 345746 351778 342105 363540 372299
3997 372299 359907 367060 366493 350415 365239 364164 366871 371577 387788 367476 370839 368727 363284
3984 363284 370752 392688 367134 343308 332540 325263 330771 358208 367978 349871 346932 317117 342686
3971 342686 355996 372865 352977 368432 382770 388997 388882 374279 362638 393353 389555 418895
3959 418895 438553 417457 430489 424281 385774 374580 380503 395145 404856 406878 387036 393910 391436
3946 391436 381648 398924 400037 408854 407670 415622 427260 423877 405646 410782 419359 422769 422871 423043
3932 423043 428935 419763 413567 401180 385542 387445 423946 419272 400517 403996 412253 401707 412498
3919D12498M840O703j3277J1858o79O932N632k6063k9244L2107R729m047L1869
3906D48858l307q983m742j8804k475J962K381M660k135Q26r474l201q339K1815
3892D19042L463n896n853R487j5652P531Q258Q390J7202p394p075J0366k273k063
3878D37533j300l877j0129j0659r27J4403j7053j4853l988L9540P763j1498Q10
3865D25765j7790K2127r020j2650q850j0398k462J4905N969K0812L370l110q902
3852D19766q746O239j5717J511k2217P610L3292J914j4188L235j4999K108J7472
3839D17280J9908l2366k680K3176O332r227k3566K0508L809r336n977M890R649
3826D22400k265J7860l742k0943J0381k665J358Q110J181L731q663L169J7020
$$ plain form
3919 412498 417338 424041 410764 422622 421943 428875 434507 408444 379200 411307 421036 416989 448858
3906 448858 445551 436568 431826 413022 410547 412509 414890 419550 417415 418241 408767 405566 397227 419042
3892 419042 422505 416609 410756 420243 404591 412122 420380 428770 445972 438578 431503 441869 439596 437533
3878 437533 436233 432356 422227 411568 410641 425044 407991 393138 389150 428690 436453 424955 425765
3865 425765 407975 430102 421082 408432 399582 389184 386722 401627 407596 428408 431778 428668 419766
3852 419766 411020 417259 401542 403053 380836 388446 421738 423652 409464 412699 397700 399808 417280
3839 417280 437188 404822 402142 425318 431650 422423 398857 419365 423174 413838 407861 412751 422400
3826 422400 420135 437995 434253 413310 423691 421026 422384 430494 431675 435406 426743 429912 446932
3813D46932O913j9734o311J2153K9877j6435K133j9989L82J5060r444l436M013
3800D42114K034K1881L025o763K2358j1019R170L4074M903J2080R98J5634J2993
3787E63482K1619K1095L2964K8435j4021M542j4115k2143k1226j2020j4688K7075
3775F00999J8495J9442p874M7629L2530J2830K1986J1123j6056K916p442K353
3763G38931j2217M252J1025J2057K1492L4397O3946O2626L2295R940j7880l2519
3751I28345n8656n4530k5945n8946k5610N43j8244k660l755O471J0652p626j1350
3738F78689j0060k5573o063k9541j9797j6582j3157M91k5989R178L0823N636j413
3725E76642P029p596j8848j3706j7428m4276k4683j3250O375P456o831L942k4494
$$ plain form
3813 446932 453845 434111 427800 439953 469830 453395 455528 435539 435921 450981 441537 438101 442114
3800 442114 444148 466029 469054 462291 484649 473630 482800 516874 521777 533857 534855 550489 563482
3787 563482 585101 606196 639160 667595 653574 658116 644001 621858 600632 588612 573924 600999
3775 600999 619494 638936 631062 678691 711221 724051 746037 757160 741104 744020 736578 738931
3763 738931 726714 730966 741991 754048 775540 809937 873883 936509 968804 978744 960864 928345
3751 928345 869689 815159 789214 730268 704658 705201 686957 684297 680542 687013 697665 690039 678689
3738 678689 668629 643056 636993 607452 587655 571073 557916 558407 532418 541596 572419 578055 576642
3725 576642 583671 576075 557227 543521 526093 481817 457134 443884 450259 457715 450884 454826 430332
3712D30332Q111J3197j4509j7244j4772K3838M988l0855k669Q559n30j583l977
3699D02886j2213j2792J1747J1231L608K396J6626j5120P868p629J5875N525j8368
3686D11640l568j3605P086r905J82K1976O511J608k2011K1910l0k7229L904J0225
3672D08694J119J7459k587m063K1259j3514k6555K2396N541j6969J9307J2399
3660D44486k0842P976L4363J3193k852k1384N159K3645J1088n706k5738J5143
3648D78531k042m069n938J4834K626l197j1082k5780Q200J6855J008M465o923
3635D67488N171R109J9074m884L3568N139Q790l412k9080j0933l3051K4118K7974
3622E19071j2727l1931P663q24J8099R806J2049k0174r906J7423M453r987Q05
$$ plain form
3712 430332 438443 451640 437131 419887 405115 428953 433941 403086 400417 408976 408446 406863 402886
3699 402886 390673 377881 389628 400859 404467 406863 423489 408369 416237 408608 424483 430008 411640
3686 411640 408072 394467 401553 391648 391830 413806 420317 421925 399914 421824 421794 394565 398469 408694
3672 408694 409813 427272 424685 420622 441881 428367 401812 424208 429749 412780 432087 444486
3660 444486 423644 431620 465983 479176 476324 454940 460099 483744 494832 489126 463388 478531
3648 478531 476489 472420 466482 481316 483942 480745 469663 443883 452083 468938 469946 474411 467488
3635 467488 472659 481768 500842 495958 529526 534665 543455 540043 510963 500030 466979 491097 519071
3622 519071 506344 474413 482076 481252 499351 509157 521206 501032 491126 508549 513002 503015 503820
3609E03820K919M229j4468k22K9647j0600n774J2437O657q017j1946p091p627
3596D93964J5654Q368J6742j4016j3951j7732J6182J3573l5857j4245L0474L398
3584E02554O66j1424p792J7502J6828r991N539p289L761R220O003J392j1450j1813
3570E03706M160J3409j1912l829J5750j239n342J3470P368m528l1279J47M552
3557E04433n697j9188K2457K1575m76l166L823p250j184k2691j0603K6322Q54
3544E09209M343j8823l772J448l248j8472N5837J4225k0252N963p508j4790K4297
3531E28457n416r845J7750n042r837J7911k0580J6070M145K189J6206r898L674
3518E45784j1747L0215L729q964K074j3722k3515J7164r090M1377n593K4389p191
$$ plain form
3609 503820 506739 510968 496500 496278 525925 515325 509551 521988 528645 520628 508682 501591 493964
3596 493964 509618 517986 534728 520712 506761 489029 505211 518784 482927 468682 499156 502554
3584 502554 503220 491796 484004 501506 518334 508343 513882 506593 510354 519574 525577 526969 515519 503706
3570 503706 507866 521275 509363 505534 521284 520045 514703 528173 535541 531013 499734 499881 504433
3557 504433 498736 479548 502005 523580 523104 519938 523761 516511 515327 492636 482033 508355 509209
3544 509209 513552 494729 490957 492405 489157 470685 526522 540747 520495 526458 518950 504160 528457
3531 528457 523041 513196 530946 525904 516067 533978 513398 529468 533613 535802 552008 542110 545784
3518 545784 534037 564252 567981 559017 561091 547369 523854 541018 531928 573305 567712 592101 584910
3505E84910k0006J704k006o749j1520M84J0422K412N606J8439l046J0441j5784
3492E75307r21J8570k151R096R570J2496l439L287M899k222K953j7565R490j6370
3478F03000M032L8653j4058j701Q632q859lM901j0526R471q558K4514R74n653
3464F44819J444J2779l8268P047K9060P619L010j5019l15K1275k685j074k286
3451F67406k844L1587K619j7851k990K43L101p908J074J3755j8317K0149l114
3438F86910J6896j4590k491n231Q667j0662J7319K3674j410j680J4062J0578J3459
3425G55501m562K911J3240P162J1961K617o086N414M867j7501j4963K0279n260
3412G75580L047j7142j357K8294L114K6413m55k1013J8144L5097K9784J5645K1441
$$ plain form
3505 584910 564904 566608 564602 557853 546333 546817 557239 559651 565257 583696 580650 591091 575307
3492 575307 574386 592956 590805 599901 609471 621967 618528 621815 626714 624492 627445 609880 619370 603000
3478 603000 607032 645685 631627 629926 638558 629699 629696 634597 624071 633542 624984 649498 650472 644819
3464 644819 646263 659042 620774 627821 656881 664500 667510 652491 652176 673451 670766 669692 667406
3451 667406 664562 696149 698768 680917 677927 678170 681271 673363 674437 688192 669875 690024 686910
3438 686910 703806 689216 686725 681494 690161 679499 696818 720492 719082 717402 731464 742042 755501
3425 755501 750939 753850 767090 774252 786213 788830 782744 788158 793025 775524 760561 780840 775580
3412 775580 778627 761485 760128 788422 791536 817949 817494 796481 814625 849722 879506 895151 916592
3399I16592R696L7640M2649R2600P7119J0445j4024n9797m6583o2608m4972n750
3387I53007j0956k3905K955J1814m670l4166O705L4583M890Q694L5353L480j8817
3374I68967j3144M5989M3402K3796J0644L5514M5036L5871P0384R3315J21806
3363A481580J42238L3919n3498q7708r6954q4074o8727o1027l3328m713l8263
3352A129445j4557J2923p171K1064o77L1104J4932r712l168J3065J945Q134J3386
3339A210713K0845L3153J9368J5499L3107N2706K3914N8399R2548M4567n278r921
3327A589620p2902n5995l0676j8937j792M0626m729m023J8238l747Q448K1997
3315A486128l107K1073j66K0670j877K6597K6487r03L3672M709K4258M1851J2376
$$ plain form
3399 916592 926288 963928 1006577 1099177 1176296 1186741 1172717 1112920 1066337 1003729 958757 953007
3387 953007 942051 918146 921101 932915 928245 894079 900784 935367 940257 948951 984304 987784 968967
3374 968967 955823 1001812 1045214 1069010 1079654 1115168 1160204 1196075 1266459 1359774 1481580
3363 1481580 1623818 1657737 1604239 1516531 1419577 1335503 1266776 1205749 1172421 1167708 1129445
3352 1129445 1114888 1127811 1120640 1141704 1141027 1172131 1187063 1177351 1174183 1187248 1189193 1197327 1210713
3339 1210713 1231558 1264711 1284079 1299578 1332685 1385391 1409305 1467704 1560252 1604819 1599541 1589620
3327 1589620 1516718 1460723 1430047 1411110 1409318 1449944 1445215 1441192 1459430 1455683 1464131 1486128
3315 1486128 1483021 1504094 1503928 1524598 1522721 1549318 1575805 1574902 1608574 1613283 1637541 1679392 1691768
3302A691768L2791L2030J0287K3988K6201L2803L2848L6781M1399J7014N089K8437
3290B011436K5312J3125L6150M7109M7513N0564L7604M0001O2123P0958N0952
3279B492847P5372J13445J17074R1848M2313K2541R922p485k0595j8235J9484
3268B938531M2722L7637M2835P1612Q2024N1380J4342O2365N5675N9658N1537
3257C510318P1446P9179O7964R5826R6877R0784R4603J24609J46520J40213J52991
3246D671330J02921R2385N5121L7645M7770O7487J01281R0299J19510J69162J56368
3235E711279J75941K02873K15331K33808K65547K68753L24906L47685L89105M17897
3225H553125M66338M90104N35104N88397N85456N83110N50167N19128M13720K67950
$$ plain form
3302 1691768 1724559 1756589 1766876 1790864 1817065 1849868 1882716 1919497 1960896 1977910 1982999 2011436
3290 2011436 2036748 2049873 2086023 2133132 2180645 2231209 2268813 2308814 2370937 2441895 2492847
3279 2492847 2568219 2681664 2798738 2890586 2932899 2955440 2965362 2957877 2937282 2919047 2938531
3268 2938531 2981253 3018890 3061725 3133337 3215361 3266741 3281083 3343448 3399123 3458781 3510318
3257 3510318 3581764 3660943 3728907 3824733 3921610 4012394 4106997 4231606 4378126 4518339 4671330
3246 4671330 4774251 4866636 4921757 4959402 5007172 5074659 5175940 5266239 5385749 5554911 5711279
3235 5711279 5887220 6090093 6305424 6539232 6804779 7073532 7398438 7746123 8135228 8553125
3225 8553125 9019463 9509567 10044671 10633068 11218524 11801634 12351801 12870929 13284649 13552599
3215A3552599L3626j58882m24945n52333o24003o47578n89457n60126m98591m15210
3205I115100l58198l41097l25755k92271k67283k56584k29937j97963j81618j83939
3195F480455j49337j25759j10756j24747p4578q0150p7291n3695q1594p2993q6387
3184E443168r7694r4647j06562o9102n9727q9124p3858p3066n4175n7495j8327
3173D649391m1286r0772r7311r5421j36028j50294j37513j17999j43626j21430
3163C517711q4929o2799o1161p4244n9778n3613n1566m4465l8165o4640m634m7480
3151B870237r3575n1613j2278m0735m7749j3787k2657k6477k0350l672J5281R038
3139B561663m4868p0241m2061p4285m2856l9891o5540k8352m4063l4559n2750
$$ plain form
3215 13552599 13586225 13427343 13002398 12450065 11826062 11178484 10589027 10028901 9530310 9115100
3205 9115100 8756902 8415805 8090050 7797779 7530496 7273912 7043975 6846012 6664394 6480455
3195 6480455 6331118 6205359 6094603 5969856 5895278 5815128 5737837 5684142 5602548 5529555 5443168
3184 5443168 5345474 5250827 5144265 5075163 5015436 4926312 4852454 4779388 4725213 4667718 4649391
3173 4649391 4608105 4517333 4420022 4324601 4188573 4038279 3900766 3782767 3639141 3517711
3163 3517711 3432782 3369983 3308822 3234578 3174800 3121187 3069621 3025156 2986991 2922351 2917717 2870237
3151 2870237 2776662 2725049 2712771 2672036 2624287 2610500 2587843 2561366 2541016 2537344 2552625 2561663
3139 2561663 2516795 2446554 2404493 2330208 2287352 2247461 2181921 2153569 2109506 2074947 2022197
3128B022197j9628k4912P12j9217l6952m1594j1885J5375k5330j7319k2134m4017
3116A775296K027k9444l9365k051o937o924j7988l8069L460j7158l0385l631j2101
3103A576730j2541l0390n776r339k8115j300k4131N817o768j9218j3189k1466
3091A410314n466o435p882m104j2148j7097m592k3229J3950k370O306j0779l458
3078A333010j7439k1311j2399J8158j1419m975j8622k859J7605P404j754k1649
3066A263750j4085n114l899l777j6851M638j4916j6319m109J9641N512k5068N547
3053A194950j9681L671k3890j4306L7851p370l9741j639K115l180L489m3362o14
3040A088293P666j7067q58L027k2651k2796O967o253M278p80P442j8585j7429
$$ plain form
3128 2022197 2002569 1977657 1978369 1959152 1922200 1880606 1868721 1884096 1858766 1841447 1819313 1775296
3116 1775296 1777323 1747879 1708514 1706463 1699526 1692602 1674614 1636545 1640005 1622847 1592462 1588831 1576730
3103 1576730 1564189 1533799 1528023 1518684 1490569 1489269 1465138 1470955 1464187 1444969 1431780 1410314
3091 1410314 1404848 1398413 1390531 1386427 1374279 1357182 1352590 1329361 1343311 1340941 1347247 1336468 1333010
3078 1333010 1315571 1294260 1281861 1300019 1288600 1283625 1265003 1262144 1279749 1287153 1285399 1263750
3066 1263750 1249665 1244551 1240652 1236875 1220024 1224662 1209746 1193427 1189318 1208959 1214471 1189403 1194950
3053 1194950 1175269 1178940 1155050 1140744 1178595 1171225 1131484 1129845 1131960 1128780 1132269 1088907 1088293
3040 1088293 1095959 1078892 1078034 1081061 1058410 1035614 1042581 1036328 1040606 1039826 1047268 1028683 1011254
3027A011254M825j5692o589k460J473J1595l0435N258Q518K120L930q299j5400
3014I70098o836n001l4473k0746P078k1369q993J4905k9428k2997m490K5047j2324
3001H50471k3036N71J5079K8908m19l1127L034l47J507j7677p636K657J3530K399
2987H37914J1674J7607k8014N236J495J0432j081N694k2737K0869j022j2639J4687
2974H60115P180J8258k361L001K434P911J9333J5228M115k214K1489J9698n37
2961I73650j4k158P68K5393R693q544J0909L4264N840K5520L0489N526J8693L6697
2947A166726K9850k762Q525j7864j3324j492k311K8394K2015P5R271K3613L3052
2934A283768j4501J2926J7754J7773K9876J2483m62M7246L2853Q522J7126J5253
$$ plain form
3027 1011254 1016079 1000387 993798 991338 992811 1004406 973971 979229 987747 989867 993797 985498 970098
3014 970098 963262 958261 923788 903042 910120 888751 879758 894663 865235 842238 837748 862795 850471
3001 850471 827435 828006 843085 871993 871574 840447 843481 843134 844641 826964 819328 821985 835515 837914
2987 837914 849588 867195 839181 844417 845912 856344 855263 860957 838220 859089 858067 845428 860115
2974 860115 867295 885553 883192 886193 888627 896538 915871 931099 935214 933000 954489 974187 973650
2961 973650 973636 971478 972246 997639 1007332 998788 1009697 1043961 1049801 1075321 1105810 1111336 1130029 1166726
2947 1166726 1196576 1193814 1202339 1184475 1171151 1169659 1167348 1195742 1217757 1217832 1227103 1250716 1283768
2934 1283768 1269267 1282193 1299947 1317720 1347596 1360079 1359617 1406863 1439716 1448238 1465364 1480617
2922A480617L6457K4622M0474K5931K9330N3876M7263L1979K8279K4333L2373
2911A855534N4196N5360L9917M9939O2682O2870M2426O6469P4213O4599N2016
2900B480221N1755n117J7056L4746K0912L1585J0955K3615L648K3521N5130M8648
2888B796675O2463O0934P3674P5286J03120J26503J34310J31257J47675J60310
2878C872207J24518J59076J82584J43371J37034Q3648J6497l3085j21573j41335
2868D422942j53365j65775j42601j06976p2720o5214l5301K6041J9148O3731O0632
2857C850542M4504J27778J13463J03670R2632J03006J34213J11821J27548R6803
2847D905980N7515K5990k6985r1701q7563j06337j80314j73648j68497j76216
$$ plain form
2922 1480617 1517074 1541696 1582170 1608101 1637431 1691307 1738570 1770549 1798828 1823161 1855534
2911 1855534 1909730 1965090 2005007 2054946 2117628 2180498 2222924 2289393 2363606 2428205 2480221
2900 2480221 2531976 2526859 2543915 2578661 2599573 2631158 2642113 2665728 2669376 2692897 2748027 2796675
2888 2796675 2859138 2920072 2993746 3069032 3172152 3298655 3432965 3564222 3711897 3872207
2878 3872207 3996725 4155801 4338385 4481756 4618790 4702438 4718935 4685850 4564277 4422942
2868 4422942 4269577 4103802 3961201 3854225 3781505 3716291 3680990 3707031 3726179 3789910 3850542
2857 3850542 3895046 4022824 4136287 4239957 4332589 4435595 4569808 4681629 4809177 4905980
2847 4905980 4963495 4989485 4962500 4870799 4783236 4676899 4496585 4322937 4154440 3978224
2837C978224j85558j42216j23171r4106n2272p5152l6453l369K08n043K2964L0649
2825C314705J2698L008J0316n5474l4648k6438o6982q7435j26540j17437j40633
2814B685140j53610j63693j07840r9666j00137o5911r8884p5122o5152n1695l5905
2803A667525p7623m0982l6637l9772j4784j9590l1729m4398q919j8829l9516n8985
2791A235761m0394m1086k6106j1903l9254l4690m3136k4102j9826j6280l9495
2780H99489l4595j5738j2691k1360k0813l6952k1777Q078o400k8347j8718J1102
2768G01278j1053l0075j5712K338j8428j7027r240J5840j2427k5435L296q306
2756E75049q270m820j3676k5482j5294O220l1798j7437J3765l093m753j2378j3582
$$ plain form
2837 3978224 3792666 3650450 3527279 3433173 3380901 3305749 3269296 3265927 3266135 3261092 3284056 3314705
2825 3314705 3327403 3330411 3340727 3285253 3250605 3224167 3157185 3069750 2943210 2825773 2685140
2814 2685140 2531530 2367837 2259997 2160331 2060194 1994283 1895399 1820277 1755125 1703430 1667525
2803 1667525 1589902 1548920 1512283 1472511 1457727 1438137 1406408 1362010 1353091 1334262 1294746 1235761
2791 1235761 1195367 1154281 1128175 1116272 1077018 1042328 999192 975090 955264 938984 899489
2780 899489 864894 849156 836465 815105 794292 757340 735563 743641 737241 708894 690176 701278
2768 701278 690225 660150 644438 646776 628348 611321 602081 617921 605494 580059 583355 575049
2756 575049 566779 561959 548283 522801 507507 513727 481929 464492 478257 475164 470411 458033 444451
2743D44451k0929o600p019j9168J2676p843O53L409j6883j5465M976Q264q34j1202
2729C68486l262J5311M589k1781o299o216l9765j7477m601Q892j5782M508j339
2716B85264l326l3342k5372K2547k077j251j0519j2850J067k957k755p625R130
2703B15934J0591O830k1615j8800j4827M556K9001j8955o841J1864k0493J1416
2691A88661l031j3399m684o177r059l999o331K7705j3091O454J7528j9407j6225
2678A44945k1532L2282J8316q927k019p304j811K936P109j2065n573Q520O297
2665A61174k948k5141l769J2277j254n691N841j0784K335K583J233j2722l1165
2652I1969p309J4158L31P403j0233L632J2112L765k1292o534L4696j0488M328
$$ plain form
2743 444451 423522 416922 409903 390735 403411 395568 396221 399630 382747 367282 372258 380522 379688 368486
2729 368486 365224 380535 385124 363343 357044 350828 311063 293586 288985 297877 282095 286603 285264
2716 285264 281938 248596 223224 245771 243694 242443 231924 219074 220141 217184 214429 206804 215934
2703 215934 226525 233355 211740 192940 178113 182669 211670 192715 185874 197738 177245 188661
2691 188661 185630 172231 167547 161370 152311 148312 141981 169686 156595 163049 180577 161170 144945
2678 144945 123413 155695 174011 165084 163065 155761 153950 156886 163995 151930 146357 154877 161174
2665 161174 158226 133085 129316 141593 140339 134648 140489 129705 132040 134623 135856 123134 91969
2652 91969 84660 98818 99149 106552 96319 99951 112063 115828 94536 88002 122698 112210 116538
2639A16538r344k0745J9752J2425R448j2133o893J0850M065l3501K0621K2885
2627A33968j1824j4745j9305N859J6346o906M369j5901j4478p073J2152L5362
2615A17824q638o691j5950Q184q736J0833m375R106J0612j06L470K993O603j6471
2601A08658q951N076K2613k6080J772M903P191p34j6458J8825Q460l371k0853
2588A01051N032K0425l1327J0559P926J988p577k388J2644L025r34m700l4442
2575H1282J6801K875j3907K7599L818O514j6684q026j2144K0246M868p89K4547
2562A37000j3333j1633J4714l7188P717K0805j3537p674j2086o703M531J6188
2550I8801J339r023N681j3063J2338j475j414n743j8024K366k803O17l860Q299
$$ plain form
2639 116538 107194 86449 106201 118626 128074 115941 109048 119898 123963 90462 111083 133968
2627 133968 122144 107399 88094 93953 110299 103393 107762 91861 77383 70310 82462 117824
2615 117824 109186 102495 86545 94729 85993 96826 92451 101557 112169 112063 115533 118526 125129 108658
2601 108658 99707 104783 127396 101316 103088 107991 115182 114448 97990 116815 125275 121904 101051
2588 101051 106083 126508 95181 105740 113666 115654 108077 105689 118333 121358 120424 115724 81282
2575 81282 98083 100958 87051 114650 118468 124982 108298 100272 88128 108374 113242 112453 137000
2562 137000 123667 112034 126748 89560 97277 118082 104545 96871 84785 78082 82613 98801
2550 98801 100140 91117 96798 83735 96073 94598 93184 87441 69417 71783 68980 69597 65737 74036
2536G4036m385O766j4688J6877n140O889o177j3403J0950j353r909j6655r042
2523C4766J7940J8794j721p36j1975j2914K0806J7386k4107k530j8077J2769J7823
2510F8224j6582j6715J3404q546J459j3065m099J2405J2515n095M181K242M035
2497E4363K927N044j0526j3559Q312J524p051O578K979k0372N319K091J4008l953
2483D7684K121K1571j3869m607j4538j062j8624J4456L595k0524K0573r37Q830
2470D4669J2588j7594j6022M679j8951K892J5200M208k6071J4399q085j1744K2850
2457B3018O861l2607J4331N2j4645O165J1307K2364J5083j2097j0280j3083k704
2444A3765J5409j381O422k6248J3486j4538o575j255L365J365q281J5723J7764
$$ plain form
2536 74036 69651 76417 61729 78606 73466 80355 74178 60775 71725 70372 60463 43808 34766
2523 34766 52706 71500 69779 69043 57068 44154 64960 82346 58239 55709 37632 50401 68224
2510 68224 51642 34927 48331 39785 41244 28179 24080 36485 49000 43905 48086 50328 54363
2497 54363 57290 62334 51808 38249 46561 48085 41034 47612 50591 30219 35538 37629 51637 47684
2483 47684 49805 71376 57507 52900 38362 37300 18676 33132 36727 16203 36776 35839 44669
2470 44669 57257 39663 23641 28320 9369 12261 27461 31669 5598 19997 11912 168 23018
2457 23018 29879 -2728 11603 11655 -2990 3175 14482 36846 51929 39832 29552 16469 13765
2444 13765 29174 27793 34215 7967 21453 6915 340 -915 2450 3815 -4466 11257 29021
2431B9021m408m0960J5504K7253L680j3598N114J246K92L40l794j4029j884m893
2417a116L41j870K7909L833q666j261j4577K6333m961k0791K3759K2751p615j3792
2403C0277n431j323j3688K1905J3860Q121j5678l9255K480J099r907J1535l887
2390A08Q854J0606R402L689l1940o164Q321J3346L4608p196k1600j3439L767j0512
2376A850q540m439m94J1789o89J8854J6583O432L86l1480o16J3428k2857M15K6110
2361B6732L53N357j4220J8124P40j7634J6245j2332k364q63j611O190m393j3895
2347F429K2816r708J9664L1515l614k220O24J2491j4897L070n024k1286j7690
2334B2170K330k2871j5684J6218q871K108K8662j5734j8811J6725J0006J2332
$$ plain form
2431 29021 24613 -16347 -843 26410 30090 16492 21606 22852 23144 23484 19690 5661 3777 -1116
2417 -1116 -775 -2645 25264 29097 20431 19170 4593 30926 25965 5174 28933 51684 44069 30277
2403 30277 24846 23523 9835 31740 45600 53721 38043 -1212 1268 2367 -7540 3995 108
2390 108 8962 19568 28970 32659 719 -5445 2876 16222 50830 43634 22034 8595 12362 1850
2376 1850 -6690 -11129 -11623 166 -523 18331 34914 41346 41732 10252 9636 23064 207 622 26732
2361 26732 27085 32442 18222 36346 37086 19452 35697 23365 21001 20138 18527 24717 20324 6429
2347 6429 29245 19537 39201 70716 67102 64882 65506 77997 63100 66170 61146 39860 22170
2334 22170 24500 1629 -14055 2163 -6708 -4600 24062 8328 -10483 6242 16248 28580
2322B8580m152j5698n804J7796r278k4675Q542K0749q754j745K5150m13k9442
2309H56L712K8040l285M515j5205p019K6253Q298q998k0183j134J6820p521j1606
2295A3543P819j3945J3411k775Q232l267j9275K306q6j7283J0113N998J2482J0506
2281B7779k9580K3287J2617k3672j752j9K2236K708j2091p158k4549J9984l526
2268F264J5171j4445k9854J9262K5104L566m856k5142Q689K4812k9009N82O242
2255F386R122Q344R758j9p416J4520r37L600m458k9018J6725P038K234k107k5629
2240H143J2833J125j6246J0948K9991J778K387j0691J0926L692l425J3569q903
2227E6127J232k1786M697r283K257O197J425J1898m215K957j6571o819k628J8692
$$ plain form
2322 28580 24428 8730 2926 20722 11444 -13231 -4689 16060 7306 5561 30711 30298 856
2309 856 4568 32608 29323 33838 18633 11614 37867 46165 37167 16984 15850 32670 25149 13543
2295 13543 21362 7417 20828 18053 26285 23018 3743 6049 5963 -11320 -1207 4791 17273 27779
2281 27779 -1801 21486 34103 10431 8679 8660 30896 33604 21513 14355 -10194 9790 6264
2268 6264 21435 6990 -22864 -3602 21502 25068 20212 -4930 3759 28571 -438 144 6386
2255 6386 15508 23852 33610 33591 26175 40695 39758 43358 38900 9882 26607 33645 35879 33772 8143
2240 8143 20976 22101 5855 16803 46794 48572 50959 40268 51194 54886 51461 65030 56127
2227 56127 57359 35573 40270 30987 33244 39441 40866 52764 48549 51506 34935 28116 25488 44180
2213D4180N048k5027j554j6951J0172N563K2233j0937m401j079L0348K0810k6441
2200E1964j2819J3040o027j1868K5594j8420J2126L48q98L754K460O885k0262
2187D5877K4022j166J048K3984n30n604j2588O056n801L117N403l609j3639J2036
2173G8606r515M558J8864Q616j8750M07J436J7772m539O799k3315j7495K5191
2160H8635J0754L207J6604K4179j2676q159P34J2617J5465P303K0823q664l120
2147A67702k078K0233J9697k948J3869l001j4005l569n339L446L0540K1687k7034
2134B19200j6328L8974L2670J6313O054m514j3579M002J8361M09K852K8272j424
2121C31262J4519J1319J6982J9787j368L6231J2862K5608K6549P042J5011J6125
$$ plain form
2213 44180 49228 24201 22647 5696 15868 21431 43664 32727 28326 27247 57595 78405 51964
2200 51964 39145 52185 46158 34290 59884 41464 53590 53938 53040 56794 59254 66139 45877
2187 45877 69899 68733 69781 93765 93235 87631 75043 81099 75298 78415 83818 80209 66570 78606
2173 78606 69091 73649 92513 101129 82379 82786 84222 101994 97455 104254 80939 63444 88635
2160 88635 99389 102596 119200 143379 130703 122544 123278 135895 151360 158663 179486 170822 167702
2147 167702 165624 185857 205554 202606 216475 213474 199469 195900 190561 194007 224547 246234 219200
2134 219200 202872 241846 274516 290829 296883 292369 278790 282792 301153 301562 304414 332686 331262
2121 331262 345781 357100 374082 393869 392501 428732 441594 467202 493751 500793 515804 531929
2109E31929K5035J8545K5004K0082M0757L9677K3043N2096N9694K0171K8113K7112
2097I11258M9464N5934L5675K3650Q3380J08319J17362J53361R9006J07305J19753
2086A864467J10876J44564J91270K45982L05321L79332N07114O64330R30620J337370
2076F681246J905351K178828M86066q56271j425674j839735j557782j279450q96234
2067C396345o33037m36703l23191k25034j61055j20140m9631l5874q0743r6098
2057A234839j01659r7604r8030p3678n2081l8676p0515n4543l9317l8791k8741
2046E41204k4950k1604J2583O29k0168l1296j1490l5798l7352J1775j8677l8928
2034C25928p336p033J8779l2926k8906p408K827j2319j8620j4178l032K5520k697
$$ plain form
2109 531929 556964 575509 600513 620595 661352 701029 724072 776168 835862 856033 884146 911258
2097 911258 960722 1016656 1052331 1075981 1159361 1267680 1385042 1538403 1637409 1744714 1864467
2086 1864467 1975343 2119907 2311177 2557159 2862480 3241812 3748926 4413256 5343876 6681246
2076 6681246 8586597 10765425 11251491 10395220 8969546 7129811 5572029 4292579 3396345
2067 3396345 2763308 2326605 2003414 1778380 1617325 1497185 1447554 1411680 1330937 1234839
2057 1234839 1133180 1035576 937546 863868 811787 773111 702596 648053 608736 569945 541204
2046 541204 516254 494650 507233 507862 487694 456398 444908 409110 371758 383533 364856 325928
2034 325928 318592 311559 330338 297412 268506 261098 263925 251606 232986 218808 215776 241296 238599
2021B38599j8457l101j5709l534J1772M913m027k2472j3043o569n400L426R107
2008A75505O277j3535l7270j6297P267J9225K480n91l0627J878L5109k3220m020
1995A22181N078o746o501k2910m512M207j2343Q382J3921j0266l2021J8365J2853
1982H9688o965j8462p754n535J8682M905j0600K624M547O63J1938l3462J6085
1969F6354j1676j2551N1O030N716P648R847l628j1570k9832R516j0181j0832J2337
1955B7229K2345l7511O915K168J5562k6481N391J8108J122k1571K6661L195m755
1942C8378M801l833m85j1569J2871q108p142l6239K0858J5373N919j5254m014
1929A1556K3570j5127J8581p388j1623r573k1226p613P586J2506Q454J1104L871
$$ plain form
2021 238599 220142 217041 201332 197798 209570 214483 210456 187984 174941 168372 162972 166398 175505
2008 175505 181782 168247 130977 114680 121947 141172 143652 143061 112434 114312 149421 126201 122181
1995 122181 127259 120513 114012 91102 86590 90797 78454 86836 100757 90491 58470 76835 89688
1982 89688 82723 64261 56507 50972 69654 74559 63959 66583 71130 71793 83731 50269 66354
1969 66354 54678 42127 42178 48208 53924 61572 71419 67791 56221 26389 35905 25724 14892 27229
1955 27229 49574 12063 18978 21146 36708 10227 15618 33726 34848 13277 39938 43133 38378
1942 38378 43179 39346 38861 27292 40163 32055 24913 -11326 9532 24905 30824 15570 11556
1929 11556 35126 19999 38580 31192 19569 9996 -11230 -18843 -11257 1249 9703 20807 24678
1916B4678p336o052J6803J9475j0682m692j3029l0171k188J4600J184L133J2301
1903A8024J2232m182k361p434j3885N657J7789l1718o90K0924J3743M140j4424
1890A7815O039j8123j5232P333J2765M709M441l486l3420o388R832L3503J5933
1877C5721j0014l4934n605J1954L365J2675m661j2920M29O590m680O730j1559
1864f909L0178N713j4226N453m0431J5896K3880Q047o590n794o458j9986p191
1851a8418K3479j0221K3113r051k5396K8723J6406j145j3341Q840m3143j3115
1839c3269L214L4223P121K1303j7968o787o921j4485j2398J1588J6819R802n286
1826F956N816n073J3359L800p615q122r439N714J0533j6091J4325r226N064R21
$$ plain form
1916 24678 17342 11290 28093 47568 36886 32194 19165 -11006 -13194 1406 2590 5723 18024
1903 18024 30256 26074 23713 16279 2394 8051 25840 -5878 -6568 14356 28099 32239 17815
1890 17815 23854 5731 -9501 -2168 10597 15306 19747 16261 -17159 -23547 -13715 19788 35721
1877 35721 25707 -9227 -14832 -2878 487 13162 8501 -4419 -3990 2600 -2080 4650 -6909
1864 -6909 23269 28982 14756 20209 -20222 -4326 19554 27601 21011 15217 8759 -11227 -18418
1851 -18418 5061 -5160 17953 8902 -16494 12229 28635 27490 14149 22989 -20154 -33269
1839 -33269 -30055 4168 11289 32592 14624 7837 916 -13569 -25967 -14379 2440 12242 6956
1826 6956 12772 7699 21058 24858 17243 9121 -318 5396 15929 -162 14163 4937 10001 10922
1812A0922J0276q908J8322K539k4488L4940o172J3138j2120K332k8873R64k745
1799A0127L370k0994j4916J7169M119R750l5958o4K0149j3916L849k698J1100
1786h913j0578J280L585K3001J8593k7952j020m973k2347O968J9061p135M851
1773e579J9989l559j6181P91K005J2602O995k3593R457L935M13j4045n7m955Q787
1758b995K553m757j4059J7123K743Q214P308j6495q258j6876P019M930o728L8
1744b0240L231L7335M823k1439r55j6875P605J070J4287j6862p747L633l085k3711
1730c8930K0440J6292J11J1033j5058k672J302j8476l742J9056k072J4566p305
1717e455K4915l685q999J554r848j112l0370J2543J0634r096K2125J351m327j1972
$$ plain form
1812 10922 21198 12290 30612 33151 8663 43603 37431 50569 38449 40781 11908 12872 10127
1799 10127 13497 -7497 -22413 -5244 -1125 8625 -27333 -27397 -7248 -21164 -17315 -20013 -8913
1786 -8913 -19491 -18211 -14626 8375 26968 -984 -2004 -6977 -29324 -22356 -3295 -10430 -5579
1773 -5579 14410 10851 -5330 -4539 -2534 10068 17063 -6530 2927 6862 7275 -6770 -6827 -11782 -2995
1758 -2995 -442 -5199 -19258 -2135 608 8822 16130 -365 -8623 -25499 -18480 -13550 -20278 -20240
1744 -20240 -17009 20326 25149 3710 2755 -14120 -6515 -5445 8842 -8020 -15767 -12134 -15219 -38930
1730 -38930 -18490 -2198 -2087 8946 -6112 -8784 -7482 -25958 -29700 -10644 -12716 1850 -5455
1717 -5455 19460 15775 6776 8330 -1518 -2630 -33000 -20457 -9823 -18919 3206 4557 230 -11742
1703a1742k2207l013p15o09J3439R978k1932Q833q78J4939J633k3J1867J1380
1689A0950j6508j343p171N478Q527j2297P218R514O299j4369Q794l1504k864J8637
1675a0639J54K2660J408k1186p881N314K7829m977j683k2859k02O312J7902p564
1661D588l521p952n356j4353J0911O818K510J702P80L269j5357J3618j2342Q02
1647a3883j8531n332J0113R360J4424J4210r377p502o721K4755n097O885j8123
1634d819J5434k38j1282J7947j2995j7524n346k5651L8082J9790k3255p942J064
1621a6735O175o627j1126J0062J1904J323J1986k2342k570J0100j00q521K422
1608a4049L4798k9813q976j3758O500K3621m786o896J1972p80J2184J1524r334
$$ plain form
1703 -11742 -33949 -36962 -37677 -38286 -24847 -14869 -36801 -27968 -28846 -13907 -12274 -12297 -430 10950
1689 10950 -5558 -6901 -14072 -8594 -67 -12364 -5146 4368 10667 -3702 5092 -26412 -29276 -10639
1675 -10639 -10485 12175 13583 -7603 -15484 -10170 17659 12682 10999 -11860 -12062 -5750 12152 4588
1661 4588 1067 -6885 -12241 -26594 -15683 -8865 -6355 -4653 -3873 -604 -15961 -2343 -14685 -13883
1647 -13883 -32414 -37746 -27633 -18273 -3849 10361 984 -6518 -13239 11516 6419 13304 -4819
1634 -4819 10615 10377 -905 17042 4047 -13477 -18823 -44474 -6392 13398 -9857 -17799 -16735
1621 -16735 -10560 -17187 -28313 -18251 -6347 -5024 6962 -15380 -17950 -7850 -7950 -16471 -14049
1608 -14049 20749 -9064 -18040 -31798 -25298 -1677 -6463 -13359 -1387 -2167 10017 21541 12207
1595A2207j9578k2803K5641j105O651j8577J0580J611j2406l264k175O443J1466
1582e309lk4603J4215K2100j283j4766J668L658O689R186k2464r012p107P055
1568a9976J2875j8952m33L3088Q382j2861l0727K751p526Q711P793K0745n189
1555a319j0303O973J9008j9283O563j9954J8325J074q193n327J1558L741r547
1542f684J3106m731L510J8941m030k6669r562p003J4669K91n090j1621K3593l294
1528d574J1781j8120j2974K5192k5604j456N301R856J3028j104k2121L712J4536
1515b547j5123k0754Q791K1739L174J2047k4690j0644O758K3951J0411m92j1669
1502I52n066p680J135N015J6121M675k2659k7530J5366R758j160j220J0047n743
$$ plain form
1595 12207 -7371 -30174 -4533 -5638 1013 -17564 -6984 -5373 -17779 -21043 -23218 -16775 -5309
1582 -5309 -5312 -29915 -15700 6400 5117 -9649 -7981 -4323 2366 11552 -10912 -19924 -27031 -19976
1568 -19976 -7101 -26053 -26486 6602 14984 2123 -28604 -25853 -33379 -24668 -16875 3870 -1319
1555 -1319 -11622 -4649 14359 -4924 1639 -18315 10 1084 -7109 -12436 -878 2863 -6684
1542 -6684 6422 1691 5201 24142 20112 -6557 -16119 -23122 -8453 -8162 -13252 -24873 -1280 -4574
1528 -4574 7207 -10913 -23887 1305 -24299 -25755 -20454 -10598 2430 1326 -20795 -17083 -2547
1515 -2547 -17670 -38424 -29633 -7894 -4720 7327 -17363 -28007 -21249 2702 13113 12621 952
1502 952 -4114 -11794 -10659 -5644 10477 15152 -7507 -35037 -19671 -9913 -11073 -12293 -2246 -7989
1488g989J3687J5969j6296q723O164j4962j0662J8563M831J1991j1408k5416K769
1475b1482l598p22J0829k791N95J200j7581R188l655J0957J2581p333j0264k1595
1461d3671Q088K6355m190m947J2921M019k8398O519J0565N382K2712J540j6845
1448E0l203J4666m286q209o348J2106J13q959N864p984M08R609l6647K409J7008
1433a3403J2158M652p957r256p336L282o876O05o020J6175J3270p129M003j492
1419e324O599j6255j5708J7597j0152p133o946K0998K9786o681j7611N400l17
1406e747j5616N770Q067J6097j5333J318K3280r28k7600j4054j2899L3017R263
1393D635L261j8306J0636L646o871J3047m017N287L102K056j7160n037J1031j3732
$$ plain form
1488 -7989 5698 21667 5371 -3352 2812 -12150 -22812 -4249 582 12573 1165 -24251 -21482
1475 -21482 -25080 -25802 -14973 -17764 -17169 -15969 -33550 -24362 -28017 -17060 -4479 -11812 -22076 -43671
1461 -43671 -35583 -9228 -13418 -18365 -5444 -1425 -29823 -23304 -12739 -7357 15355 16895 50
1448 50 -3153 11513 7227 -982 -7330 4776 4889 -4070 1794 -6190 -5782 3827 -32820 -30411 -13403
1433 -13403 -1245 3407 -4550 -13806 -21142 -17860 -24736 -24131 -30151 -13976 -706 -7835 -3832 -5324
1419 -5324 1275 -14980 -30688 -13091 -23243 -30376 -37322 -16324 13462 6781 -10830 -5430 -5747
1406 -5747 -21363 -15593 -7526 8571 -6762 -5444 17836 16908 -10692 -24746 -37645 -4628 4635
1393 4635 7896 -10410 226 3872 -2999 10048 6031 11318 14420 16476 -684 -5721 5310 -8422
1379h422j8642j5131P933J4479M465J0138j9558Q761J6889o104k3885j3435J2348
1366c0164P136R400J2747M999O545k2308o822J705J6684J543l193l479j0988j1146
$$ plain form
1379 -8422 -27064 -42195 -34262 -19783 -15318 -5180 -24738 -15977 912 -5192 -29077 -42512 -30164
1366 -30164 -23028 -13628 -881 4118 10663 -11645 -18467 -16762 -78 1465 -1728 -5207 -16195 -27341
$$ [...]
##END NTUPLES=NMR SPECTRUM
##END=
