##TITLE=1H_EC-3029(V-2)
 CDCl3
 8 sc, 
 29.06.2022
##JCAMPDX= 6.0         $$ Bruker NMR JCAMP-DX V2.0
##DATA TYPE= NMR SPECTRUM
##DATA CLASS= NTUPLES
##ORIGIN= UXNMR, Bruker Analytische Messtechnik GmbH
##OWNER= root
$$ XWIN-NMR		Version 3.5
$$ Wed Jun 29 13:58:37 2022 Russian Standard Time (UT+4h)  she@DPX200
##.OBSERVE FREQUENCY= 200.1313499994
##.OBSERVE NUCLEUS= ^1H
##.ACQUISITION MODE= SIMULTANEOUS
##.ACQUISITION SCHEME= undefined
##.AVERAGES= 8
##.DIGITISER RES= 18
##SPECTROMETER/DATA SYSTEM= spect
##.PULSE SEQUENCE= zg30
##.SOLVENT NAME= CDCl3
##.SHIFT REFERENCE= (INTERNAL, CDCl3, 0, 15.7326)
##AUDIT TRAIL= $$ (NUMBER, WHEN, WHO, WHERE, WHAT)
$$ ##TITLE= Audit trail, XWIN-NMR		Version 3.5
$$ ##JCAMPDX= 5.01
$$ ##ORIGIN= Bruker BioSpin GmbH
$$ ##OWNER= she
$$ F:/spectra/data/she/nmr/H-F/1/pdata/1/auditp.txt
$$ ##AUDIT TRAIL=  $$ (NUMBER, WHEN, WHO, WHERE, WHAT)
(   1,<2022-06-29 13:57:37.51 +0400>,<she>,<DPX200>,
      <created by zg, POWCHK disabled, PULCHK disabled
       configuration hash MD5:
       00 E9 B6 7A A2 85 ED C7 34 08 36 98 17 FE 4E 26
       data hash MD5: 16K
       3A A3 F0 F1 7C 5B D9 A2 6A 00 92 D6 57 FF 70 07>)
(   2,<2022-06-29 13:57:40.68 +0400>,<she>,<DPX200>,
      <Start of raw data processing
       efp BC_mod = 2 LB = 0.24 FT_mod = 6 PKNL = 1 PHC0 = -18047.87 PHC1 = 19.00069 SI = 16K 
       data hash MD5: 16K
       EA 1F E5 1E 90 1E 55 45 68 B3 57 9E 1C DF D7 07>)
(   3,<2022-06-29 13:57:52.90 +0400>,<she>,<DPX200>,
      <pk PHC0 = -3.113541 PHC1 = 4.4 
       data hash MD5: 16K
       EF BC DC 2A EA 26 A4 42 CE 0D 7A FC 7E 91 86 5A>)
(   4,<2022-06-29 13:57:55.98 +0400>,<she>,<DPX200>,
      <abs ABSG = 5 
       data hash MD5: 16K
       37 E2 4E 19 24 F2 57 FA 24 7E DB C8 D9 DF 4D 99>)
$$ ##END=
$$ 
$$ hash MD5
$$ 53 88 5D D6 6B C0 81 F8 AF 58 A3 03 8D 56 1C 36
##$RELAX= 
##$RELAX= 
##$RELAX= 
##$RELAX= 
##$RELAX= 
##$RELAX= 
$$ Bruker specific parameters
$$ --------------------------
##$DU= <F:/spectra>
##$EXPNO= 1
##$NAME= <H-F>
##$PROCNO= 1
##$TYPE= <nmr>
##$USER= <she>
##$AMP= (0..31)
100 100 100 100 100 100 100 100 100 100 100 100 100 100 100 100 100 100 
100 100 100 100 100 100 100 100 100 100 100 100 100 100 
##$AQSEQ= 0
##$AQ_mod= 1
##$AUNM= <au_zg>
##$AUTOPOS= <>
##$BF1= 200.13
##$BF2= 200.13
##$BF3= 200.13
##$BF4= 200.13
##$BF5= 200.13
##$BF6= 200.13
##$BF7= 200.13
##$BF8= 200.13
##$BYTORDA= 1
##$CFDGTYP= 0
##$CFRGTYP= 5
##$CHEMSTR= <none>
##$CNST= (0..31)
1 1 145 1 1 1 1 1 1 1 1 1 1 1 1 1 1 1 1 1 1 1 1 1 1 1 1 1 1 1 1 1 
##$CPDPRG= <>
##$CPDPRG1= <>
##$CPDPRG2= <>
##$CPDPRG3= <>
##$CPDPRG4= <mlev>
##$CPDPRG5= <mlev>
##$CPDPRG6= <mlev>
##$CPDPRG7= <mlev>
##$CPDPRG8= <mlev>
##$CPDPRGB= <>
##$CPDPRGT= <>
##$D= (0..31)
0 1.2 0 0 0 0 0 0 0 0.06 0 0.03 0 0 0 0 0.0002 0 0 0 0 0 0 0 0 0 0 0 0 
0 0 0 
##$DATE= 1656496657
##$DBL= (0..7)
120 120 120 120 120 120 120 120 
##$DBP= (0..7)
150 150 150 150 150 150 150 150 
##$DBP07= 0
##$DBPNAM0= <>
##$DBPNAM1= <>
##$DBPNAM2= <>
##$DBPNAM3= <>
##$DBPNAM4= <>
$$ [...]
##$SUBNAM2= <"">
##$SUBNAM3= <"">
##$SUBNAM4= <"">
##$SUBNAM5= <"">
##$SUBNAM6= <"">
##$SUBNAM7= <"">
##$SUBNAM8= <"">
##$SUBNAM9= <"">
##$SW= 18.0517283424941
##$SWIBOX= (0..15)
0 0 2 0 0 0 0 0 0 0 0 0 0 0 0 0 
##$SW_h= 3612.71676300578
##$TD= 16384
##$TD0= 1
##$TE= 0
##$TE2= 300
##$TE3= 300
##$TEG= 300
##$TL= (0..7)
0 120 120 120 120 120 120 120 
##$TP= (0..7)
150 150 150 150 150 150 150 150 
##$TP07= 0
##$TPNAME0= <>
##$TPNAME1= <>
##$TPNAME2= <>
##$TPNAME3= <>
##$TPNAME4= <>
##$TPNAME5= <>
##$TPNAME6= <>
##$TPNAME7= <>
##$TPOAL= (0..7)
0.5 0.5 0.5 0.5 0.5 0.5 0.5 0.5 
##$TPOFFS= (0..7)
0 0 0 0 0 0 0 0 
##$TUNHIN= 0
##$TUNHOUT= 0
##$TUNXOUT= 0
##$USERA1= <user>
##$USERA2= <user>
##$USERA3= <user>
##$USERA4= <user>
##$USERA5= <user>
##$V9= 5
##$VALIST= <valist>
##$VCLIST= <CCCCCCCCCCCCCCC>
##$VD= 0
##$VDLIST= <DDDDDDDDDDDDDDD>
##$VPLIST= <PPPPPPPPPPPPPPP>
##$VTLIST= <TTTTTTTTTTTTTTT>
##$WBST= 1024
##$WBSW= 4
##$XGAIN= (0..3)
0 0 0 0 
##$XL= 0
##$YL= 0
##$YMAX_a= 125881
##$YMIN_a= -204763
##$ZGOPTNS= <>
##$ZL1= 120
##$ZL2= 120
##$ZL3= 120
##$ZL4= 120
##$ABSF1= 15.73587
##$ABSF2= -2.315979
##$ABSG= 5
##$ABSL= 3
##$ALPHA= 0
##$AQORDER= 0
##$ASSFAC= 0
##$ASSFACI= 0
##$ASSFACX= 0
##$ASSWID= 0
##$AUNMP= <proc_1d>
##$AZFE= 0.1
##$AZFW= 0.1
##$BCFW= 0
##$BC_mod= 2
##$BYTORDP= 0
##$COROFFS= 0
##$CY= -3
##$DATMOD= 1
##$DC= 0
##$DFILT= <>
##$DTYPP= 0
##$F1P= 0
##$F2P= 0
##$FCOR= 1
##$FTSIZE= 16384
##$FT_mod= 6
##$GAMMA= 0
##$GB= 0
##$INTBC= 1
##$INTSCL= 0
##$ISEN= 128
##$LB= 0.24
##$LEV0= 0
##$LPBIN= 0
##$MAXI= 10000
##$MC2= 0
##$MEAN= 0
##$ME_mod= 0
##$MI= 1.114404
##$NCOEF= 0
##$NC_proc= -8
##$NLEV= 6
##$NOISF1= 3.799351
##$NOISF2= 2.8
##$NSP= 0
##$NTH_PI= 0
##$NZP= 0
##$OFFSET= 15.73257
##$PC= 1
##$PHC0= -18050.98
##$PHC1= 23.40069
##$PH_mod= 1
##$PKNL= yes
##$PPARMOD= 0
##$PSCAL= 0
##$PSIGN= 0
##$REVERSE= no
##$SF= 200.13000779904
##$SI= 16384
##$SIGF1= 3
##$SIGF2= 2
##$SINO= 5.538805
##$SIOLD= 16384
##$SREGLST= <1H.CDCl3>
##$SSB= 0
##$STSI= 16384
##$STSR= 0
##$SW_p= 3612.71676300578
##$SYMM= 0
##$S_DEV= 0
##$TDeff= 16384
##$TDoff= 0
##$TI= <>
##$TILT= no
##$TM1= 0
##$TM2= 0
##$TOPLEV= 0
##$USERP1= <user>
##$USERP2= <user>
##$USERP3= <user>
##$USERP4= <user>
##$USERP5= <user>
##$WDW= 1
##$XDIM= 16384
##$YMAX_p= 443556540
##$YMIN_p= -3601409
$$ End of Bruker specific parameters
$$ ---------------------------------
##NTUPLES= NMR SPECTRUM
##VAR_NAME=  FREQUENCY,     SPECTRUM/REAL,   SPECTRUM/IMAG
##SYMBOL=    X,             R,               I
##VAR_TYPE=  INDEPENDENT,   DEPENDENT,       DEPENDENT
##VAR_FORM=  AFFN,          ASDF,            ASDF
##VAR_DIM=   16384,         16384,           16384
##UNITS=     HZ,            ARBITRARY UNITS, ARBITRARY UNITS
##FACTOR=    0.220516191357247, 1,           1
##FIRST=     3148.55929566304, 0,            0
##LAST=      -464.157467342744, 0,           0
##MIN=       -464.157467342744, -3601409,    0
##MAX=       3148.55929566304, 443556540,    0
$$ Real data points
##PAGE= N=1
##DATA TABLE= (X++(R..R)), XYDATA
$$ [...]
$$ plain form
6952 712510 -28777 453177 1272776 902608 1422141 3907764 2924323 2033657 2984448 2983450
6942 2983450 511525 1758047 2018018 1308634 331320 1163576 1078863 -158231 1713472
6933 1713472 3542942 2885121 1390153 2408155 3095917 3277456 4217299 5204360 4041023
6924 4041023 2665180 3404901 3328863 2615619 2882144 3259474 3225351 3448997 4157005 4667771
6914 4667771 5138990 5632607 4951526 4326161 3978891 3660612 4775416 5998846 6238018
6905 6238018 5847566 5451407 6294186 6088949 4479190 5270588 5495137 5117360 6037124
6896 6037124 5519399 6864271 8058724 6857236 8289998 9346460 7987699 8597860 9928613
6887 9928613 9286827 9021002 9925712 11451476 9388559 9370703 11377814 10359476 9129105
$$ packed form
6952G12510p41287M81954Q19599l70168N19533K485623r83441q90666R50791r98
6942B983450k471925J246522K59971p09384r77314Q32256q4713j237094J871703
6933A713472J829470o57821j494968J018002O87762J81539R39843R87061j163337
6924D041023j375843P39721p6038p13244K66525L77330l4123K23646P08008N10766
6914D667771M71219M93617o81081o25365l47270l18279J114804J223430K39172
6905F238018l90452l96159Q42779k05237j609759P91398K24549l77777R19764
6896F037124n17725J344872J194453j201488J432762J056462j358761O10161J330753
6887I928613o41786k65825R04710J525764k062917j7856K007111j018338j230371
$$ plain form
6878 9129105 10640684 12106974 11387800 10906023 12708237 13220326 13871905 15830641 15325783
6869 15325783 15909510 17586920 16794905 18016513 18850128 18395396 20324118 20949477 20517917
6860 20517917 21624926 21876023 22583801 22926340 23243108 25430383 27654254 28308697 29674458
6851 29674458 32031980 33549876 33847860 34099120 35262426 34120853 34374596 35098451 34092385
6842 34092385 35177614 35748814 34378754 31948416 32576488 29998206 28324001 29858230
6834 29858230 28825482 25728353 26483769 25302178 23601851 23089587 21885102 19885459
6826 19885459 18692214 18303583 16294458 15520177 15885190 14971754 14303292 14992472 13148243
6817 13148243 13100461 13327263 12398714 12356473 10907433 9106027 9656008 9330848 9075912
$$ packed form
6878I129105J511579J466290p19174m81777J802214N12089O51579J958736n04858
6869A5325783N83727J677410p92015J221608Q33615m54732J928722O25359m31560
6860B0517917J107009K51097P07778L42539L16768K187275K223871O54443J365761
6851B9674458K357522J517896K97984K51260J163306j141573K53743P23855j006066
6842C4092385J085229N71200j370060k430338O28072k578282j674205J534229
6834B9858230j032748l097129P55416j181591j700327n12264j204485j999643
6826A9885459j193245l88631k009125p74281L65013r13436o68462O89180j844229
6817A3148243m7782K26802r28549m2241j449040j801406N49981l25160k54936
$$ plain form
6808 9075912 8997188 8823993 7778444 7157861 7061245 6979158 6584232 6841687 7160870 6636549
6798 6636549 5332542 4482765 5227885 5273248 4378845 3816134 5013182 4571530 5097919
6789 5097919 7751758 6182654 4072277 3581816 3139799 2394628 4937181 4068125 3213915
6780 3213915 3529599 3206406 3229949 3763079 1163665 1706463 3429401 2035316 1666981
6771 1666981 2236867 3372920 3271406 3044345 3050861 2446511 1554161 3291167 2782988 1006055
6761 1006055 2858621 2692647 3028679 3161539 2414041 3794693 4473315 4396553 3540489
6752 3540489 2123439 1545498 363156 2735 737046 204755 843960 772845 942121
6743 942121 1445843 1669015 2618280 2274764 921105 1265797 1417332 1218104 2017613 2203802
$$ packed form
6808I075912p8724j73195j045549o20583r6616q2087l94926K57455L19183n24321
6798F636549j304007q49777P45120M5363q94403n62711J197048m41652N26389
6789E097919K653839j569104k110377m90461m42017p45171K542553q69056q54210
6780C213915L15684l23193K3543N33130k599414N42798J722938j394085l68335
6771A666981N69886J136053j01514k27061O516o04350q92350J737006n08179j776933
6761A006055J852566j65974L36032J32860p47498J380652O78622p6762q56064
6752C540489j417050n77941j182342l60421P34311n32291O39205p1115J69276
6743I42121N03722K23172R49265l43516j353659L44692J51535j99228P99509J86189
$$ plain form
6733 2203802 1560517 682578 966614 1316952 527036 1395537 2628845 1745713 1093066
6724 1093066 1405338 1677519 2077373 766738 -915192 46228 -953228 -94722 1325491
6715 1325491 63417 477791 396253 367906 -473132 341923 -235780 862743 2631473
6706 2631473 2274237 2129140 2738827 1619861 -366535 969327 941270 316012 2377210
6697 2377210 1808523 800622 1874962 1242125 1268083 1535868 1119931 526335 -305432
6688 -305432 -277268 -270079 -694582 740272 348985 -662437 958568 1775282 1301802 1385122
6678 1385122 2151525 968119 460522 919039 -334703 -284938 1474214 564995 763937
6669 763937 1437183 681154 1205696 595315 -42657 1169726 634703 174736 -784600 -814700
$$ packed form
6733B203802o43285q77939K84036L50338p89916Q68501J233308q83132o52647
6724A093066L12272K72181L99854j310635j681930R61420r99456Q58506J420213
6715A325491j262074M14374q1538k8347q41038Q15055n77703J098523J768730
6706B631473l57236j45097O09687j118966j986396J335862k8057o25258K061198
6697B377210n68687j007901J074340o32837K5958K67785m15937n93596q31767
6688c05432K8164P189m24503J434854l91287j011422J621005Q16714m73480Q3320
6678A385122P66403j183406n07597M58517j253742M9765J759152r09219J98942
6669G63937O73246p56029N24542o10381o37972J212383n35023m59967r59336l0100
$$ plain form
6659 -814700 161235 -67959 -37515 832469 707050 118081 930738 970256 -175374 1365312
6649 1365312 1216817 -159587 488925 920848 233885 571123 -631376 219590 1003936
6640 1003936 -774341 -187086 -780912 -974260 -232499 594393 -282522 -407443 -666431
6631 -666431 -5207 987841 -268598 142944 1066524 628123 -35043 -206480 212462 841646
6621 841646 1300533 1144935 1808504 1260489 -281867 -249926 -561987 -1310429 -475917 -296662
6611 -296662 -111032 323315 1303286 1329053 574528 -544851 437269 76553 -1251421 -1234392
6601 -1234392 -458384 -1055708 -172730 218679 355061 390510 331592 737977 -951711 -655412
6591 -655412 115667 933810 487563 -790154 -820087 1516717 531847 326867 2108347
$$ packed form
6659h14700R75935k29194L0444Q69984j25419n88969Q12657L9518j145630J540686
6649A365312j48495j376404O48512M31923o86963L37238j202499Q50966P84346
6640A003936j778277N87255n93826j93348P41761Q26892q76915j24921k58988
6631f66431O61224R93048j256439M11542R23580m38401o63166j71437M18942O29184
6621H41646M58887j55598O63569n48015j542356L1941l12061p48442Q34512J79255
6611b96662J85630M34347R79971K5767p54525j119379R82120l60716j327974J7029
6601a234392P76008n97324Q82978L91409J36382L5449n8918M06385j689688K96299
6591f55412P71079Q18143m46247j277717k9933K336804r84870k04980J781480
$$ plain form
6582 2108347 742272 26106 344782 658142 303768 -262050 -372373 -647181 -2003924
6573 -2003924 -915454 856526 -87067 81162 467717 92683 -88033 534313 922650
6564 922650 149550 618278 1075590 -675852 -743897 2505119 2606834 1341055 -218707
6555 -218707 -516455 -820898 101422 -654726 -1361310 1190416 2018847 665231 6139
6546 6139 629479 -9184 1113169 218602 -1495824 -768078 -203837 -443916 -706488 260196
6536 260196 1510696 1379752 1651179 1523208 1648530 2049499 2341268 271622 -96843
6527 -96843 444432 -297016 -831289 465070 1140120 1915170 2691310 1735987 1701163 2144812
6517 2144812 1464155 1859933 1272379 683310 1648982 2403296 1256122 296644 658702
$$ packed form
6582B108347j366075p16166L18676L13360l54374n65818j10323k74808j356743
6573b003924J088470J771980r43593J68229L86555l75034j80716O22346L88337
6564I22650p73100M68728M57312j751442o8045L249016J01715j265779j559762
6555b18707k97748l04443R22320p56148p06584K551726Q28431j353616o59092
6546F139O23340o38663J122353q94567j714426P27746N64241k40079k62572R66684
6536B60196J250500j30944K71427j27971J25322M00969K91769k069646l68465
6527i6843N41275p41448n34273J296359O75050P75050P76140r55323l4824M43649
6517B144812o80657L95778n87554n89069R65672P54314j147174r59478L62058
$$ plain form
6508 658702 1859628 396671 -301446 404121 1063571 1096593 932954 1478828 1258120 1302929
6498 1302929 2148843 1584144 584600 918080 1281065 2017482 230631 1335209 2110508
6489 2110508 87543 -476091 1353492 572855 494660 308286 -184831 466935 697200
6480 697200 2237765 1603447 813781 2255255 1838410 492897 177700 431979 1403255
6471 1403255 1776108 709791 533523 -35486 -109505 222288 1451283 286802 659825
6462 659825 3428821 3539372 967399 814447 1941065 1758084 5557 -749374 -237621
6453 -237621 455353 767701 1146965 2129799 1180964 923041 2461748 2091552 -148545
6444 -148545 227937 1245550 300815 -573837 1299663 1121501 -14787 1137287 247046
$$ packed form
6508F58702J200926j462957o98117P05567O59450L3022j63639N45874k20708M4809
6498A302929Q45914n64699r99544L33480L62985P36417j786851J104578P75299
6489B110508k022965n63634J829583p80637p8195j86374m93117O51766K30265
6480F97200J540565o34318p89666J441474m16845j345513l15197K54279R71276
6471A403255L72853j066317j76268n69009p4019L31793J228995j164481L73023
6462F59825K768996J10551k571973j52952J126618j82981j752527p54931N11753
6453b37621O92974L12348L79264R82834r48835k57923J538707l70196k240097
6444a48545L76482J017613r44735q74652J873500j78162j136288J152074q90241
$$ plain form
6435 247046 1021216 1199794 442042 1564512 713829 810617 1585750 -322505 270326 2796559
6425 2796559 1632308 1595738 1700895 61178 832374 965875 420193 673611 425735
6416 425735 1570800 1159552 -178953 327309 1513605 662161 1177572 2065935 1641572
6407 1641572 1161196 1872159 1655884 1170535 92941 848310 614569 -296462 107319
6398 107319 1570564 2097944 1818701 2237862 2412285 689588 416899 1152941 1179398 581872
6388 581872 1395730 1772126 169585 320621 1742183 568304 440670 1980327 1061786
6379 1061786 443252 2373516 2011097 2008015 2181269 3103212 2941102 2266659 1782733 1435628
6369 1435628 2532854 3373544 2823476 3184727 3685646 2318816 4127707 2915338 1808444
$$ packed form
6435B47046P74170J78578p57752J122470q50683R6788P75133j908255N92831K526233
6425B796559j164251l6570J05157j639717P71196J33501n45682K53418k47876
6416D25735J145065m11248j338505N06262J186296q51444N15411Q88363m24363
6407A641572m80376P10963k16275m85349j077594P55369k33741r11031M03781
6398A07319J463245N27380k79243M19161J74423j722697k72689P36042K6457n97526
6388E81872Q13858L76396j602541J51036J421562j173879j27634J539657r18541
6379A061786o18534J930264l62419l082J73254R21943j62110o74443m83926l47105
6369A435628J097226Q40690n50068L61251N00919j366830J808891j212369j106894
$$ plain form
6360 1808444 2353518 3253178 1837625 1750548 2172260 2929445 1371351 1452213 1932734 1284667
6350 1284667 2372236 3554500 3291669 4136137 5085049 5459380 4779511 4237794 4606986
6341 4606986 5599336 6111278 8193642 9016146 10160186 11420358 11460729 10900616 11142672
6332 11142672 9866263 10095058 8036445 5019200 5737308 5558867 3795883 3336241 4854892
6323 4854892 3913786 3221257 3813636 5230114 4793562 4937526 4992604 3979688 2765163
6314 2765163 2971947 3748224 2717607 783359 1478532 3192991 4416789 2442637 3075649
6305 3075649 4689698 3002562 2973895 3389800 3057590 2618777 1462599 1653208 1373967
6296 1373967 963733 2761395 3364427 1336345 1523326 1913755 1606318 1427770 1444432
$$ packed form
6360A808444N45074Q99660j415553q7077M21712P57185j558094Q0862M80521o48067
6350A284667J087569J182264k62831Q44468R48912L74331o79869n41717L69192
6341D606986R92350N11942K082364Q22504J144040J260172M0371n60113K42056
6332A1142672j276409K28795k058613l017245P18108j78441j762984m59642J518651
6323D854892r41106o92529N92379J416478m36552J43964N5078j012916j214525
6314B765163K06784P76277j030617j934248O95173J714459J223798j974152O33012
6305C075649J614049j687136k8667M15905l32210m38813j156178J90609k79241
6296A373967m10234J797662O03032k028082J86981L90429l07437j78548J6662
$$ plain form
6287 1444432 1115007 2285522 2218781 1125468 1358321 2956468 2682681 2075042 2299860
6278 2299860 2991698 3471120 1669781 2355821 2549532 1820790 2298312 2046632 2280905
6269 2280905 1942123 2161333 2367571 1990899 944065 2767620 3038337 824373 1119167
6260 1119167 2306122 2145241 1189113 2014743 2388223 2497052 3337528 3445029 2553913
6251 2553913 3071023 2528747 3955059 2363006 1823132 2109233 2907498 4147698 3935858
6242 3935858 3780624 4654480 3584361 3453512 4813674 3855858 4673060 3965006 3831476
6233 3831476 4213193 3395374 3554114 4103412 3179875 3977690 4472288 4671745 4466381 4981397
6223 4981397 6309827 5167448 4009396 4544395 2867716 3940429 5432989 4577202 3789208
$$ packed form
6287A444432l29425J170515o6741j093313K32853J598147k73787o07639K24818
6278B299860O91838M79422j801339O86040J93711p28742M77522k51680K34273
6269B280905l38782K19210K06238l76672j046834J823555K70717k213964K94794
6260A119167J186955j60881r56128Q25630L73480J08829Q40476J07501q91116
6251B553913N17110n42276J426312j592053n39874K86101P98265J240200k11840
6242C935858j55234Q73856j070119j30849J360162r57816Q17202p08054j33530
6233C831476L81717q17819J58740N49298r23537P97815M94598J99457k05364N15016
6223D981397J328430j142379j158052N34999j676679J072713J492560q55787p87994
$$ plain form
6214 3789208 4388769 5857961 6058537 5063652 5699943 6725055 6314268 7459142 7339094
6205 7339094 6815297 5087346 6575124 6727506 5198779 6000394 7883719 6672110 6509325
6196 6509325 7916488 7626769 7713133 7123314 5799751 6631115 6963838 6557802 6202076
6187 6202076 7251595 6817080 6850683 8306058 8042709 8061085 10003860 10586534 8082059
6178 8082059 8617148 9242974 8859493 8908965 10509958 9305593 9887698 11960700 12233227
6169 12233227 12499635 13284486 13789606 13337103 12759189 12531105 13405240 14802749 15595750
6160 15595750 14131474 13741804 15936921 17080041 18258767 20354091 20838683 22304233
6152 22304233 24328266 25493286 26432328 26017919 25578335 26365168 26957569 27576210 29253075
$$ packed form
6214C789208N99561J469192K00576r94885O36291J025112m10787J144874j20048
6205G339094n23797j727951J487778J52382j528727Q01615J883325j211609j62785
6196F509325J407163k89719Q6364n89819j323563Q31364L32723m06036l55726
6187F202076J049519m34515L3603J455375k63349J8376J942775N82674k504475
6178H082059N35089O25826l83481M9472J600993j204365N82105K073002K72527
6169A2233227K66408P84851N05120m52503n77914k28084Q74135J397509P93001
6160A5595750j464276l89670K195117J143120J178726K095324M84592J465550
6152B2304233K024033J165020R39042m14409m39584P86833N92401O18641J676865
$$ plain form
6143 29253075 30823040 31970334 34365073 36691087 37046130 36747332 37182675 37129476 36994956
6134 36994956 39751645 40337901 40586121 40530833 40399486 39551074 40299111 40816237 43384956
6125 43384956 45492813 48118223 51525343 55484879 61834650 68296325 76511080 83637791
6117 83637791 90355970 92663487 89858597 81321970 72577431 65539693 60750920 57952444
6109 57952444 55504427 55172874 56634905 59257338 62655297 65758621 71673407 78755148
6101 78755148 86898230 95590180 99309355 100078930 101431622 100986490 97461267 93080338
6093 93080338 84453009 74086941 66745985 61695600 58025824 56359681 55363058 53569933
6085 53569933 51941237 53350013 56269491 56722940 58900175 64201618 68935574 74266926
$$ packed form
6143B9253075J569965J147294K394739K326014L55043k98798M35343n3199j34520
6134C6994956K756689N86256K48220n5288j31347q48412P48037N17126K568719
6125D3384956K107857K625410L407120L959536O349771O461675Q214755P126711
6117H3637791O718179K307517k804890q536627q744539p037738m788773k798476
6109E7952444k448017l31553J462031K622433L397959L103324N914786P081741
6101G8755148Q143082Q691950L719175P69575J352692m45132l525223m380929
6093I3080338q627329j0366068p340956n050385l669776j666143r96623j793125
6085E3569933j628696J408776K919478M53449K177235N301443M733956N331352
$$ plain form
6077 74266926 80635565 88087106 95425197 99375060 100155200 97739188 93674811 89009122
6069 89009122 82735040 74520769 67579587 60908007 58701763 56421588 53887926 54731227
6061 54731227 55556569 57510130 60042710 63125255 66235277 70832305 78256866 82877986
6053 82877986 83996161 81377804 74198417 65288420 59257902 52302862 47706817 44634030
6045 44634030 41411668 38917079 37423005 36812061 35542983 36474592 37816081 36900455 36134129
6036 36134129 35011759 32388447 32412899 32975811 33287469 33781399 33846405 31838471 31217939
6027 31217939 29299313 26785752 23777751 23374538 23284194 21490068 21540257 23107893 22279981
6018 22279981 21070199 20516792 19275957 17638020 16502908 15416153 15514327 14146812 13397261
$$ packed form
6077G4266926O368639P451541P338091L949863P80140k416012m064377m665689
6069H9009122o274082q214271o941182o671580k206244k280175k533662Q43301
6061E4731227Q25342J953561K532580L082545L110022M597028P424561M621120
6053H2877986J118175k618357p179387q909997o030518o955040m596045l072787
6045D4634030l222362k494589j494074o10944j269078R31609J341489r15626p66326
6036C6134129j122370k623312K4452N62912L11658M93930O5006k007934o20532
6027C1217939j918626k513561l008001m03213r0344j794126N0189J567636q27912
6018B2279981j209782n53407j240835j637937j135112j086755R8174j367515p49551
$$ plain form
6009 13397261 13430208 12366600 10355964 11448492 11874756 9931196 8873066 9933019 9006364
6000 9006364 8379294 9810441 8893183 7800111 7563157 8928681 8499199 7155974 7955155
5991 7955155 8261183 7010964 7868461 7833902 8961448 9004534 8217000 7651221 6744219 6646638
5981 6646638 7386451 7365878 7400056 8321182 8424491 7520107 8586036 9590572 9702681 7774734
5971 7774734 7309338 7369161 6967412 6602601 6859234 7368769 6894628 6744410 8154502 8436240
5961 8436240 7069518 8276803 8831975 7384438 6075553 6731739 8229665 6615420 7753263
5952 7753263 8257945 7541238 6965228 8641452 8373469 6422711 6731156 8536591 7731245
5943 7731245 6170528 6117352 6260873 6235827 6257835 7140361 6720712 6463456 6987843 7917997
$$ packed form
6009A3397261L2947j063608k010636J092528M26264j943560j058130J059953r26655
6000I006364o27070J431147r17258j093072k36954J365524m29482j343225P99181
5991G955155L06028j250219Q57497l4559J127546M3086p87534n65779r07002r7581
5981F646638P39813k0573L4178R21126J03309r04384J065929J004536J12109j927947
5971G774734m65396N9823m01749l64811K56633N09535m74141j50218J410092K81738
5961H436240j366722J207285N55172j447537j308885O56186J497926j614245J137843
5952G753263N04682p16707n76010J676224k67983j950758L08445J805435q05346
5943G731245j560717n3176J43521k5046K2008Q82526m19649k57256N24387R30154
$$ plain form
5933 7917997 7739146 7661303 7750562 8977127 7803128 6463821 7251361 6803980 6070487
5924 6070487 5330479 4152184 4712650 3939932 4478629 4759921 5650558 4497248 5061982
5915 5061982 4379602 3925527 3934749 3885648 3028035 2809149 3403973 2471955 2605976 2987292
5905 2987292 3049983 1817664 2432687 3347302 1840733 2332199 2554950 2103859 2741346
5896 2741346 2419419 1722094 2784008 1555614 2153770 4131194 4003577 3750640 4417871
5887 4417871 4257130 2037663 1845572 1167965 1028669 -153650 1625259 2222984 1564166
5878 1564166 1659778 2228912 2325158 3382895 3495473 2097296 1762752 1507176 1639664 1392868
5868 1392868 3116837 3152509 2525933 2263606 2419833 2474520 1519701 2171290 2963637 1884725
$$ packed form
5933G917997j78851p7843Q9259J226565j173999j339307P87540m47381p33493
5924F070487p40008j178295N60466p72718N38697K81292Q90637j153310N64734
5915E061982o82380m54075R222m9101q57613k18886N94824r32018J34021L81316
5905B987292O2691j232319O15023R14615j506569M91466K22751m51091O37487
5896B741346l21927o97325J061914j228394N98156J977424j27617k52937O67231
5887D417871j60741k219467j92091o77607j39296j182319J778909N97725o58818
5878A564166R5612N69134R6246J057737J12578j398177l34544k55576J32488k46796
5868A392868J723969L5672o26576k62327J56227N4687r54819O51589P92347j078912
$$ plain form
5858 1884725 2593451 3358456 2210508 3271606 2915050 2379892 1843652 973026 1719862
5849 1719862 1682451 2038601 3966335 3362809 4160152 4535977 2401468 3191652 2878154
5840 2878154 1383330 1748169 2133161 1683370 2983910 4081289 4338347 3095748 2751037
5831 2751037 3157198 604705 -28761 1718588 2406503 1647489 2713679 3537687 3333524
5822 3333524 3482980 4494097 4323643 4375665 3475345 3299332 4951933 3888992 3385310
5813 3385310 4587898 3433835 3396890 4846908 4985597 6128543 7576847 9496554 10630908
5804 10630908 11673720 11865036 8014110 7111433 6962318 3576378 3137953 5596909 4365237
5795 4365237 3074992 5299531 6808622 4630510 5054619 7214116 4633589 3857848 5719056
$$ packed form
5858A884725P08726P65005j147948J061098l56556n35158n36240q70626P46836
5849A719862l7411L56150J927734o03526P97343L75825k134509P90184l13498
5840B878154j494824L64839L84992m49791J300540J097379K57058j242599l44711
5831B751037M06161k552493o33466J747349O87915p59014J066190Q24008k04163
5822C333524J49456J011117j70454N2022r00320j76013J652601j062941n03682
5813C385310J202588j154063l6945J450018J38689J142946J448304J919707J134354
5804A0630908J042812J91316l850926r02677j49115l385940m38425K458956j231672
5795D365237j290245K224539J509091k178112M24109K159497k580527p75741J861208
$$ plain form
5786 5719056 5204071 4152903 6686617 6667004 4684620 4610275 5751151 5606140 4589723
5777 4589723 5411421 3721357 3897565 5143952 5487528 6039152 6029286 5704853 7166262
5768 7166262 7171704 5108324 4679627 5054586 6221668 5416016 5932092 5558051 6299781 7375763
5758 7375763 6720910 7576633 9771389 9377021 9736869 9961266 9107291 11073504 12534229
5749 12534229 12331899 10250476 8856896 9691672 8308193 7717399 8238843 7061200 6980094
5740 6980094 6876043 4584126 4917858 5772838 5683645 5254373 4575423 4876393 5416911 5465120
5730 5465120 6104484 5096897 4392724 4886106 5131356 5573583 5702648 5559363 5592400 4572282
5720 4572282 4655935 5612487 4384709 4464752 5095426 4896935 4022949 4082371 6020284 5991072
$$ packed form
5786E719056n14985j051168K533714j9613j982384p4345J140876j45011j016417
5777D589723Q21698j690064J76208J246387L43576N51624r866l24433J461409
5768G166262N442k063380m28697L74959J167082q05652N16076l74041P41730J075982
5758G375763o54853Q55723K194756l94368L59848K24397q53975J966213J460725
5749A2534229k02330k081423j393580Q34776j383479n90794N21444j177643q1106
5740F980094j04051k291917L33732Q54980q9193m29272o78950L00970N40518M8209
5730E465120O39364j007587p04173M93382K45250M42227J29065j43285L3037j020118
5720D572282Q3653R56552j227778Q0043O30674j98491q73986N9422J937913k9212
$$ plain form
5710 5991072 5124398 5148941 4217949 2649191 2987793 4754078 3754532 3880371 4106434
5701 4106434 4506461 4597841 5223901 4914248 5522851 4208758 4681519 5137802 3947561
5692 3947561 5046302 6128332 4942152 5104662 4562176 3662658 3660295 3861298 4404368
5683 4404368 4875007 5536182 4982205 4587450 6128299 6508552 4368858 3418607 3620227
5674 3620227 3622139 2364922 3462266 4311975 4397192 4867558 5485612 5551821 5457437 5417102
5664 5417102 5759833 5578039 4436870 3783353 4644968 4128343 3932117 3726770 4922594
5655 4922594 5209850 4299213 4862288 5304242 4449425 3493211 4026127 4312295 2801602
5646 2801602 3449355 4423847 4006159 4245591 4318341 4920977 4897082 3973884 4896017 5012995
$$ packed form
5710E991072q66674K4543r30992j568758L38602J766285r99546J25839K26063
5701D106434M00027R1380O26060l09653O08603j314093M72761M56283j190241
5692C947561J098741J082030j186180J62510n42486q99518k363K01003N43070
5683D404368M70639O61175n53977l94755J540849L80253k139694r50251K01620
5674C620227J912j257217J097344Q49709Q5217M70366O18054O6209r4384m0335
5664E417102L42731j81794j141169o53517Q61615n16625j96226k05347J195824
5655D922594K87256r10637N63075M41954q54817r56214N32916K86168j510693
5646B801602O47753R74492m17688K39432P2750O02636k3895r23198R22133J16978
$$ plain form
5636 5012995 4420785 4345414 3398536 4018627 4359577 3530926 4435333 4275212 4068144 4606571
5626 4606571 4545850 4257072 4490526 4454777 5052534 4439878 4395880 5757500 6461140 6181373
5616 6181373 5063898 5217659 5791527 4772502 4261733 4433719 4111182 4115231 5484486
5607 5484486 7468611 7444174 5631849 6059295 7170011 5748313 6272871 6941618 5902372
5598 5902372 5169998 6119884 6831042 5966941 6240278 7297135 6868182 6231888 6266213 5852703
5588 5852703 5267888 6293321 5829832 5990147 5720747 5835430 6446369 6435288 6767940 7667503
5578 7667503 6312777 5742950 5880019 6057684 5229012 6228807 7734464 6705797 7432971
5569 7432971 8525723 7985018 7270078 9455805 10506212 10339647 10916106 11933838 12199000
$$ packed form
5636E012995n92210p5371r46878O20091L40950q28651R04407j60121k07068N38427
5626D606571o0721k88778K33454l5749N97757o12656m3998J361620P03640k79767
5616F181373j117475J53761N73868j019025n10769J71986l22537M049J369255
5607E484486J984125k4437j812325M27446J110716j421698N24558O68747j039246
5598E902372p32374R49886P11158q64101K73337J056857m28953o36294L4325m13510
5588E852703n84815J025433m63489J60315k69400J14683O10939j1081L32652Q99563
5578G667503j354726n69827J37069J77665q28672R99795J505657j028667P27174
5569G432971J092752n40705p14940K185727J050407j66565N76459J017732K65162
$$ plain form
5560 12199000 14674528 17981241 18963767 18729705 16860571 14290638 13735377 13095475 10977270
5551 10977270 10192130 9463070 8155372 7767768 7848884 7437549 6538704 6923911 7561809
5542 7561809 5934882 6008112 6335108 4936109 3975765 5508517 6301794 6320488 6313065 6691463
5532 6691463 6504600 7718741 7401699 8855345 9184587 7897589 7176835 7516304 5881235
5523 5881235 5676220 6684272 5538899 5940326 6298514 6257174 6398104 6959772 6032543
5514 6032543 6178088 6864324 7373816 5985437 6282258 6495953 6093490 5874156 5057836
5505 5057836 5577893 6962619 6229376 4647512 5044732 5933784 6452191 6464666 6798891
5496 6798891 6680936 4860973 7032319 7931039 5639161 6679051 8742153 7760117 8180601
$$ packed form
5560A2199000K475528L306713R82526k34062j869134k569933n55261o39902k118205
5551A0977270p85140p29060j307698l87604Q1116m11335q98845L85207O37898
5542G561809j626927P3230L26996j398999r60344J532752P93277J8694p423L78398
5532F691463j86863J214141l17042J453646L29242j286998p20754L39469j635069
5523E881235k05015J008052j145373M01427L58188m1340J40930N61668r27229
5514F032543J45545O86236N09492j388379K96821K13695m02463k19334q16320
5505E057836N20057J384726p33243j581864L97220Q89052N18407J2475L34225
5496F798891j17955j819963K171346Q98720k291878J039890K063102r82036M20484
$$ plain form
5487 8180601 8991801 10158403 11049456 11019500 10866646 10000088 9159027 9570827 9701454 10035501
5477 10035501 9280964 9211169 8828433 7172387 6862525 8039789 9341916 10401416 10519190
5468 10519190 12246455 11402059 9240937 10130969 9799549 7983443 9130592 10710029 10860145
5459 10860145 11107958 11870063 14372906 14704186 14468435 15908526 16210120 15339656 14830240
5450 14830240 14993055 14445964 14058180 13786564 13964884 13278956 12045305 12651183 13882746
5441 13882746 12943216 12515837 14085595 14674761 14083114 13943753 14194094 13424621 13435970
5432 13435970 14027652 14638132 14664468 14499036 16433988 17317330 18069322 19058972 18229519
5423 18229519 18518988 19078575 18819612 19423170 20097124 19629801 22112269 22931558 23151257
$$ packed form
5487H180601Q11200J166602Q91053k9956j52854q66558q41061M11800J30627L34047
5477A0035501p54537o9795l82736j656046l09862J177264J302127J059500J17774
5468A0519190J727265q44396k161122Q90032l31420j816106J147149J579437J50116
5459A0860145K47813P62105K502843L31280k35751J440091L01594q70464n09416
5450A4830240J62815n47091l87784k71616J78320o85928j233651O05878J231563
5441A3882746r39530m27379J569758N89166n91647j39361K50341p69473J1349
5432A3435970N91682O10480K6336j65432J934952Q83342P51992R89650q29453
5423A8229519K89469N59587k58963O03558O73954m67323K482468Q19289K19699
$$ plain form
5414 23151257 22429005 23320719 24391738 22738487 23082690 25193184 25411951 26707028 29394838
5405 29394838 29216842 29749772 31531999 32251278 33295895 34490885 36796541 37687499 40315610
5396 40315610 42690607 45236849 47941989 51315514 52998083 55546702 60816912 65159608
5388 65159608 69545914 77203729 85460655 90032691 99328102 108052459 116729490 127872882
5380 127872882 139885063 149124443 157572874 164548942 170932695 174001218 172155957 170952483
5372 170952483 168616347 160621755 149858369 140443755 130833206 122321196 113584817 104868181
5364 104868181 93970743 83269927 77722121 69582788 60497387 56337963 52834068 49809497
5356 49809497 46288990 42533727 40364319 38699498 36058000 34496443 32690422 31220913
$$ packed form
5414B3151257p22252Q91714J071019j653251L44203K110494K18767J295077K687810
5405B9394838j77996N32930J782227P19279J044617J194990K305656Q90958K628111
5396D0315610K374997K546242K705140L373525J682569K548619N270210M342696
5388F5159608M386306P657815Q256926M572036R295411Q724357Q677031J1143392
5380A27872882J2012181R239380Q448431O976068O383753L068523j845261j203474
5372A70952483k336136p994592j0763386r414614r610549q512010q736379q716636
5364A04868181j0897438j0700816n547806q139333r085401m159424l503895l024571
5356D9809497l520507l755263k169408j664821k641498j561557j806021j469509
$$ plain form
5348 31220913 30301515 28310946 27312611 27247529 27795886 27508692 26667018 25693835 24902772
5339 24902772 26317469 25402952 21502482 21455718 21510971 19001118 19208995 19366048 18775156
5330 18775156 18712134 18640397 18844507 17031883 16775884 17804994 16505404 15284351 15692746
5321 15692746 15128221 13424548 12432907 11980935 12318346 12484010 13382532 11689454 11496754
5312 11496754 12731572 11921505 10445852 10913741 11500717 11657976 9872975 8930920 9351952
5303 9351952 9166457 10929563 10239427 8758360 8809897 7546517 8182260 9455676 9052364
5294 9052364 9188718 9583978 7607437 7560736 8895108 10320072 10495029 10060049 10079511
5285 10079511 9589270 8837756 9852429 9393132 8905232 9064882 8754344 7957873 7424454
$$ packed form
5348C1220913r19398j990569r98335o5082N48357k87194q41674r73183p91063
5339B4902772J414697r14517l900470m6764N5253k509853K07877J57053n90892
5330A8775156o3022p1737K04110j812624k55999J029110j299590j221053M08395
5321A5692746n64525j703673r91641m51972L37411J65664Q98522j693078j92700
5312A1496754J234818q10067j475653M67889N86976J57259j785001r42055M21032
5303I351952j85495J763106o90136j481067N1537j263380O35743J273416m03312
5294I052364J36354L95260j976541m6701J334372J424964J74957m34980J9462
5285A0079511m90241p51514J014673m59297m87900J59650l10538p96471n33419
$$ plain form
5276 7424454 8760327 9110566 8969712 7612178 7908374 6419268 6719707 7498500 7188280
5267 7188280 7914315 10046411 8757115 8152206 9319643 9855771 8885956 8994477 10219265
5258 10219265 10482828 9716362 11642475 12739352 14101743 16522140 17845569 20646017
5250 20646017 23405465 22144402 20487828 18157967 15122695 11457652 10421186 10704585
5242 10704585 8607687 8497424 10205364 9487827 9022577 9539472 8272585 8215790 9717015
5233 9717015 10200481 8841903 8045753 7616183 4954911 5515348 5602237 3648388 5774579
5224 5774579 6911062 4354771 4517001 5518208 5318444 5305330 5872465 6535823 4431315
5215 4431315 4468876 5567685 5696074 5691398 6377452 6794400 5678243 3761253 5103077
$$ packed form
5276G424454J335873L50239j40854j357534K96196j489106L00439P78793l10220
5267G188280P26035K132096j289296o04909J167437N36128r69815J08521J224788
5258A0219265K63563p66466J926113J096877J362391K420397J323429K800448
5250B0646017K759448j261063j656574k329861l035272l665043j036466K83399
5242A0704585k096898j10263J707940p17537m65250N16895j266887n6795J501225
5233I717015M83466j358578p96150m29570k661272N60437Q6889j953849K126191
5224E774579J136483k556291J62230J001207j99764j3114N67135O63358k104508
5215D431315L7561J098809J28389m676O86054M16948j116157j916990J341824
$$ plain form
5206 5103077 5959112 4442178 5368262 6310570 6417542 6060131 5392928 6799488 6519556
5197 6519556 5029866 6595945 6252903 5190861 5444934 5285702 5628158 5152998 5281642
5188 5281642 4763690 4786133 3595258 4204092 4917747 5668848 4166206 5132266 5212951 2773639
5178 2773639 3326987 3743631 2436114 1740336 3438696 3483203 3548018 4049359 5336550
5169 5336550 3824400 3551734 3647004 2713781 3722025 3378634 2371948 3693119 2772701
5160 2772701 1971619 4597069 4231478 4260732 4450969 4148429 4201511 4167441 4216180 3798494
5150 3798494 1622025 2664360 3070869 986643 2047187 3249460 2189592 3075082 3241700
5141 3241700 2913883 3374881 3485046 3466358 3187647 1667582 2044845 1828331 1850425 2234613
$$ packed form
5206E103077Q56035j516934R26084R42308J06972l57411o67203J406560k79932
5197F519556j489690J566079l43042j062042K54073j59232L42456m75160J28644
5188E281642n17952K2443j190875O08834P13655P51101j502642R66060Q0685k439312
5178B773639N53348M16644j307517o95778J698360M4507O4815N01341J287191
5169E336550j512150k72666R5270r33223J008244l43391j006686J321171r20418
5160B772701q01082K625450l65591K9254J90237l02540N3082l4070M8739m17686
5150C798494k176469J042335M06509k084226J060544J202273j059868Q85490J66618
5141C241700l27817M60998J10165j8688k78711j520065L77263k16514K2094L84188
$$ plain form
5131 2234613 1597752 2364019 3410809 2802306 3790325 4216345 3188609 2390853 2576271
5122 2576271 2031175 2535818 2758293 2618739 3144414 1800392 3014712 3479110 2030439
5113 2030439 487592 1218443 1548123 2403376 2493172 2828487 2486379 2666489 2582148 2645976
5103 2645976 2354233 2100523 2432991 3055071 2897440 2415396 2502718 3767386 2453349
5094 2453349 1116627 3534820 2347040 1473355 3540873 3428439 2832712 3551320 2986347
5085 2986347 2979039 2291232 2120866 2729282 2446709 3159873 3769749 3348323 3025178 3875199
5075 3875199 3731757 4269321 4025214 2880026 2691513 2525602 1765261 2371760 2395564 2464260
5065 2464260 3251955 4153689 5041970 4922771 5264163 6492103 6339661 4622471 4627042 4482463
$$ packed form
5131B234613o36861P66267J046790o08503R88019M26020j027736p97756J85418
5122B576271n45096N04643K22475j39554N25675j344022J214320M64398j448671
5113B030439j542847P30851L29680Q55253Q9796L35315l42108J80110q4341O3828
5103B645976k91743k53710L32468O22080j57631m82044Q7322J264668j314037
5094B453349j336722K418193j187780q73685K067518j12434n95727P18608n64973
5085B986347p308o87807j70366O08416k82573P13164O09876m21426l23145Q50021
5075C875199j43442N37564k44107j145188j88513j65911p60341O06499K3804O8696
5065B464260P87695R01734Q88281j19199L41392J227940j52442j717190M571j44579
$$ plain form
5055 4482463 3713748 3526353 3731638 3689600 3252718 3893450 4185670 3750122 4819172 6367069
5045 6367069 5157665 5115315 6635773 6842130 6429470 8447361 9254578 7291897 8108353
5036 8108353 6649041 6351219 7046763 5062437 4566906 5116659 4946913 4516461 5525963
5027 5525963 5964054 6694117 6620102 6756869 6209766 6283921 7349940 7260785 7751159 6857966
5017 6857966 7280981 7807381 6764723 6869429 7821606 7672245 8982296 8400835 7500046
5008 7500046 8839430 9260175 9094740 9204107 11277864 13516593 13799212 13841568 15824943
4999 15824943 16545904 19664106 22509096 20205147 20234783 20912578 21094946 19937631 20472257
4990 20472257 20637402 19991051 19694286 21723707 22093698 22087656 24679784 25709335 25575492
$$ packed form
5055D482463p68715j87395K05285m2038m36882O40732K92220m35548J069050J547897
5045F367069j209404m2350J520458K06357m12660K017891Q07217j962681Q16456
5036H108353j459312k97822O95544j984326m95531N49753j69746m30452J009502
5027E525963M38091P30063p4015J36767n47103P4155J066019q9155M90374q93193
5017F857966M23015N26400j042658J04706R52177j49361J310051n81461r00789
5008G500046J339384M20745j65435J09367K073757K238729K82619M2356J983375
4999A5824943P20961L118202K844990k303949K9636O77795J82368j157315N34626
4990B0472257J65145o46351k96765K029421L69991o042K592128J029551j33843
$$ plain form
4981 25575492 24415252 25017920 24133568 24197037 22521002 20787484 19349364 19177448 17130261
4972 17130261 16840003 17778927 17778106 18111990 18150648 18577389 19799228 19896423 20529892 21860501
4962 21860501 21399761 22138885 24178661 25544370 26279943 26401245 27942113 29021367 28882853
4953 28882853 29299293 29938493 31587867 32842707 34235866 36233579 38569044 40245191
4945 40245191 43441500 45286664 45754478 45344936 44526305 41503832 38898491 37895584 35149396
4936 35149396 32187728 28896106 27211897 26633405 24301828 23714559 24767526 24122633 23771104
4927 23771104 25968063 27900905 28858662 30225544 33645724 35321921 36147675 36990720 37287256
4918 37287256 37245386 38265247 38518268 37659139 35618877 35206903 35601743 35355070 34191057
$$ packed form
4981B5575492j160240O02668q84352O3469j676035j733518j438120j71916k047187
4972A7130261k90258R38924q21L33884L8658M26741J221839R7195O33469J330609
4962B1860501m60740P39124K039776J365709P35573J21302J540868J079254j38514
4953B8882853M16440O39200J649374J254840J393159J997713K335465J676147
4945D0245191L196309J845164M67814m09542q18631l022473k605341j002907k746188
4936C5149396k961668l291622j684209n78492k331577n87269J052967o44893l51529
4927B3771104K196959J932842R57757J366882L420180J676197Q25754Q43045K96536
4918C7287256m1870J019861K53021q59129k040262m11974L94840k46673j164013
$$ plain form
4909 34191057 30048356 27104197 25496576 22525988 23045217 24269399 21985348 22040058 23079250
4900 23079250 22305775 22973119 25126971 26703585 24130588 23633172 22649377 19846782 19701025
4891 19701025 20711850 19792586 20087893 20327317 19105794 18965898 20990633 21372497 19472386
4882 19472386 19943257 19613077 19775426 19589166 18838210 17529558 18371666 16674689 17428478
4873 17428478 17290655 16028699 16431119 16620360 15861627 14885298 16204452 14396858 13384607
4864 13384607 12809443 13731790 13405713 13076325 13307892 14554138 13733562 12947296 13688442
4855 13688442 13495422 13673136 14067024 13893123 12831531 13894210 14752558 15556457 15656284
4846 15656284 15736723 16535120 16730475 15404019 16232705 15485453 14159488 15245437 14716084
$$ packed form
4909C4191057m142701k944159j607621k970588N19229J224182k284051N4710J039192
4900B3079250p73475O67344K153852J576614k572997m97416r83795k802595j45757
4891A9701025J010825r19264K95307K39424j221523j39896K024735L81864j900111
4882A9472386M70871l30180J62349j86260p50956j308652Q42108j696977P53789
4873A7428478j37823j261956M02420J89241p58733r76329J319154j807594j012251
4864A3384607n75164R22347l26077l29388K31567J246246q20576p86266P41146
4855A3688442j93020J77714L93888j73901j061592J062679Q58348Q03899R9827
4846A5656284Q0439P98397J95355j326456Q28686p47252j325965J085949n29353
$$ plain form
4837 14716084 12750713 12845917 13334440 12801669 12569807 11800690 12881459 13289365 12993347
4828 12993347 12447067 12817078 13395464 13206328 13451859 14491900 14265098 12611685 14065434
4819 14065434 15362962 15982794 16046192 16812963 15560467 15238220 15597708 15513105 14635966
4810 14635966 14180307 15333911 15370546 13739830 15488349 16259511 16845292 18147522 17989966
4801 17989966 18312614 19220052 17752917 18751041 19102456 18344668 18653769 19134495 19928424
4792 19928424 20921038 22904686 25280440 25252511 27336466 31145798 32195537 34045087 33286159
4783 33286159 32309761 31151709 30115354 30314089 30536863 29776501 30233670 28908480 28687814
4774 28687814 30504674 29586884 30169238 29910308 29246515 29454510 29962875 29578458 30064126
$$ packed form
4837A4716084j965371R5204M88523n32771k31862p69117J080769M07906k96018
4828A2993347n46280L70011N78386j89136K45531J040041k26802j653413J453749
4819A4065434J297528O19832O3398P66771j252496l22247L59488q4603q77139
4810A4635966m55659J153604L6635j630716J748519P71162N85781J302230j57556
4801A7989966L22648R07438j467135R98124L51415p57788L09101M80726P93929
4792A9928424R92614J983648K375754k7929K083955L809332J049739J849550p58928
4783C3286159r76398j158052j036355J98735K22774p60362M57169j325190k20666
4774B8687814J816860r17790N82354k58930o63793K07995N08365l84417M85668
$$ plain form
4765 30064126 30693034 32084928 33144550 33600784 34213021 34748744 34750826 33913796 34135760
4756 34135760 34765068 35291998 35964542 37800337 36579469 37567508 40043942 40189892 39520917
4747 39520917 40536791 42151478 42501597 43537469 45529085 46498427 46270092 46872138 47434509
4738 47434509 47037862 49060012 51502806 52541154 52005393 53596022 56901573 58668951
4730 58668951 59947470 63020601 64206522 66511802 70177298 73707893 78849440 84622042
4722 84622042 88818874 91746924 95734197 100519731 103662787 107444668 109499352 110793543
4714 110793543 116104898 121756304 128451494 137110903 146817579 158194426 169487684 180196720
4706 180196720 191745166 203349171 216201621 231153341 243520320 256574323 267316551
$$ packed form
4765C0064126O28908J391894J059622M56234O12237N35723K082q37030K21964
4756C4135760O29308N26930O72544J835795j220868R88039K476434J45950o68975
4747C9520917J015874J614687L50119J035872J991616R69342k28335O02046N62371
4738D7434509l96647K022150K442794J038348n35761J590629L305551J767378
4730E8668951J278519L073131J185921K305280L665496L530595N141547N772602
4722H4622042M196832K928050L987273M785534L143056L781881K054684J294191
4714A10793543N311355N651406O695190Q659409R706676J1376847J1293258J0709036
4706A80196720J1548446J1604005J2852450J4951720J2366979J3054003J0742228
$$ plain form
4699 267316551 271433301 270965028 265910441 256376332 246074108 235123491 224086988 215248167
4691 215248167 207655187 200656927 194040287 184545884 174192801 162988775 152407377 145946174
4683 145946174 140304450 135222092 133137382 131139151 129075938 129073881 128827636 128066200 127652060
4674 127652060 125740926 123812302 120243322 115869234 110369487 104499456 97999969 91949363
4666 91949363 86742936 80989831 77078362 74132558 73275954 72068050 71132743 69310177
4658 69310177 69905674 69826280 69714116 67907571 64526385 62095009 59377676 56818512 56196209
4649 56196209 54576809 52828346 54491164 54634746 53124344 53348473 55404093 55744830 58105660
4640 58105660 61782189 65587768 69593443 75737657 80713732 82535448 84521865 86979617
$$ packed form
4699B67316551M116750m68273n054587r534109j0302224j0950617j1036503q838821
4691B15248167p592980o998260o616640r494403j0353083j1204026j0581398o461203
4683A45946174n641724n082358k084710j998231k063213k057k46245p61436m14140
4674A27652060j911134j928624l568980m374088n499747n870031o499487o050606
4666I1949363n206427n753105l911469k945804q56604j207904r35307j822566
4658F9310177N95497p9394j12164j806545l381186k431376k717333k559164o22303
4649E6196209j619400j748463J662818J43582j510402K24129K055620L40737K360830
4640E8105660L676529L805579M005675O144214M976075J821716J986417K457752
$$ plain form
4632 86979617 86229405 83625719 81481462 77160206 72491543 67922591 63855110 60307894
4624 60307894 55842727 51868094 48594396 45078334 43379455 42038633 39945184 37847959
4616 37847959 37270908 35327811 33681187 33305265 32568348 31370998 32982579 30778545 29990378
4607 29990378 30915249 29752237 28620698 29510104 28346708 26787469 27198998 28150252 27349157
4598 27349157 27459514 28998100 27211033 24905508 25517436 25213651 24797383 24451214 24013607
4589 24013607 25377526 25540109 25823508 27273829 26607243 27027369 27730111 27998502 26442883
4580 26442883 25778041 27367816 27390157 25828761 26634827 28624053 28066111 27824440 28918547
4571 28918547 28782823 28957094 30000237 30569501 29932420 30053570 30952682 30115309 28607948
$$ packed form
4632H6979617p50212k603686k144257m321256m668663m568952m067481l547216
4624F0307894m465167l974633l273698l516062j698879j340822k093449k097225
4616C7847959n77051j943097j646624l75922p36917j197350J611581k204034p88167
4607B9990378R24871j163012j131539Q89406j163396j559239M11529R51254q01095
4598B7349157J10357J538586j787067k305525O11928l03785m16268l46169m37607
4589B4013607J363919J62583K83399J450321o66586M20126P02742K68391j555619
4580B6442883o64842J589775K2341j561396Q06066J989226n57942k41671J094107
4571B8918547j35724J74271J043143N69264o37081J21150Q99112q37373j507361
$$ plain form
4562 28607948 29244364 29611205 28203741 28012442 27387112 25845691 26897343 28640089 28998183
4553 28998183 29390832 28906597 30424316 29517687 29133107 31450970 31976321 29465237 30592524
4544 30592524 31775674 32815977 33786598 35790397 35895820 35872912 35730819 35512927 34933128
4535 34933128 34645223 35379362 37054197 38284902 38308017 39434789 41679812 42359923 44001411
4526 44001411 45208396 46193843 47646170 49190797 49717214 51410781 54512472 55698828
4518 55698828 58852972 61168420 62879037 67858738 74602983 80718561 90416400 104832243
4510 104832243 115859695 132646459 155250375 179266152 202727176 239086100 289191885
4503 289191885 361102063 391529005 348494494 282668508 217836353 174972024 146548539
$$ packed form
4562B8607948O36416L66841j407464j91299o25330j541421J051652J742746L58094
4553B8998183L92649m84235J517719r06629l84580K317863N25351k511084J127287
4544C0592524J183150J040303R70621K003799J05423k2908j42093k17892n79799
4535C4933128k87905P34139J674835J230705K3115J126772K245023O80111J641488
4526D4001411J206985R85447J452327J544627N26417J693567L101691J186356
4518E5698828L154144K315448J710617M979701O744245O115578R697839J4415843
4510A04832243J1027452J6786764K2603916K4015777K3461024L6358924N0105785
4503B89191885P1910178L0426942m3034511o5825986o4832155m2864329k8423485
$$ plain form
4496 146548539 126548341 109991716 101645998 94633829 88892100 82916327 79248089 75032622
4488 75032622 71636287 68937387 66790850 63710319 62447556 61144409 57723090 58201645
4480 58201645 59592520 57958828 57298989 58362566 57396535 57012698 57326380 57373194 57618384
4471 57618384 59132368 59271582 60615858 62331159 62482384 63898545 66109867 67257007
4463 67257007 68579219 72088902 76260988 79259767 83408021 87696281 86536375 87513141
4455 87513141 90958751 92788131 96274515 102100330 108327516 116471726 125191377 132971955
4447 132971955 138116232 137960866 134012264 128723994 120866654 114680202 112910364 112481671
4439 112481671 112193598 114711769 120652742 125679402 131471512 140172629 151125112 163212346
$$ packed form
4496A46548539k0000198j6556625q345718p012169n741729n975773l668238m215467
4488G5032622l396335k698900k146537l080531j262763j303147l421319M78555
4480E8201645J390875j633692o59839J063577r66031l83837L13682M6814K45190
4471E7618384J513984J39214J344276J715301J51225J416161K211322J147140
4463F7257007J322212L509683M172086K998779M148254M288260j159906R76766
4455H7513141L445610J829380L486384N825815O227186Q144210Q719651P780578
4447A32971955N144277j55366l948602n288270p857340o186452j769838m28693
4439A12481671k88073K518171N940973N026660N792110Q701117J0952483J2087234
$$ plain form
4431 163212346 179816054 199978515 222650503 248927921 278399547 313920816 357716929
4424 357716929 401614856 424478923 412536232 370222362 317899501 271387195 232569921
4417 232569921 205149503 186245904 170939593 158369932 151564536 146234206 141524338
4410 141524338 139611403 140245325 140458717 140911332 140752881 139207158 134613245 128535829 122609432
4401 122609432 112011920 103810830 97931471 91133534 87346337 85927089 83470461 80873723
4393 80873723 78288546 77193270 77021137 75421535 76845413 75956043 73734676 72096851
4385 72096851 67925394 64791928 62488962 59547115 58755755 57141219 56065102 54394622
4377 54394622 53750324 53643211 53756144 51489432 50268347 51427130 50235214 49998220 51627950
$$ packed form
4431A63212346J6603708K0162461K2671988K6277418K9471626L5521269M3796113
4424C57716929M3897927K2864067j1942691m2313870n2322861m6512306l8817274
4417B32569921k7420418j8903599j5306311j2569661o805396n330330m709868
4410A41524338j912935O33922K13392M52615j58451j545723m593913o077416n926397
4401A22609432j0597512q201090n879359o797937l787197j419248k456628k596738
4393H0873723k585177j095276j72133j599602J423878q89370k221367j637825
4385G2096851m171457l133466k302966k941847p91360j614536j076117j670480
4377E4394622o44298j07113J12933k266712j221085J158783j191916k36994J629730
$$ plain form
4368 51627950 52335224 51189618 53961008 54786368 54785683 56095862 57093280 57073190 58269209
4359 58269209 58443153 58886139 60043991 60776677 60967928 62424515 63495411 64290032 65978951
4350 65978951 69644026 72331185 76197835 79179202 77031231 72870880 68500313 62008187
4342 62008187 58223545 56009056 53081602 50692004 49661402 49281672 49947024 50330021 50633063
4333 50633063 50358696 50655572 51815644 51151633 52165251 52481660 52552603 54152550 56687938
4324 56687938 56708299 60483851 62817116 63845736 67406921 72473227 74211342 78272569
4316 78272569 82221071 85771658 88620993 91060974 92105001 91771893 94825329 96164832
4308 96164832 97427829 99327321 103206173 103983962 106973011 110164862 112597549 117204984
$$ packed form
4368E1627950P07274j145606K771390Q25360o85J310179R97418k0090J196019
4359E8269209J73944M42986J157852P32686J91251J456587J070896P94621J688919
4350F5978951L665075K687159L866650K981367k147971m160351m370567o492126
4342F2008187l784642k214489k927454k389598j030602l79730O65352L82997L03042
4333E0633063k74367K96876J160072o64011J013618L16409P0943J599947K535388
4324E6687938K0361L775552K333265J028620L561185N066306J738115M061227
4316G8272569L948502L550587K849335K439981J044027l33108L053436J339503
4308I6164832J262997J899492L878852P77789K989049L191851K432687M607435
$$ plain form
4300 117204984 124048825 129013625 135070747 144706523 155639523 168356614 185889936 207520948
4292 207520948 231185970 256606580 279793327 301680964 328575298 365589285 413735663
4285 413735663 443556540 422717784 365322669 300174051 246097334 204981119 176050003
4278 176050003 155023014 138653630 125443644 116330681 109001345 101744680 93344457 87239925
4270 87239925 82142016 76712878 73710960 68982228 64533859 63100033 60521746 58042376
4262 58042376 57605768 55961122 55891952 55260329 54924695 55006995 54208510 55698276 57766029
4253 57766029 59047057 61466657 65795813 68563963 68176942 66855817 65114627 60744727
4245 60744727 55693682 54089485 50692748 47941827 47606817 47503679 47267230 48216569 50026830
$$ packed form
4300A17204984O843841M964800O057122R635776J0933000J2717091J7533322K1631012
4292B07520948K3665022K5420610K3186747K1887637K6894334L7013987M8146378
4285D13735663K9820877k0838756n7395115o5148618n4076717m1116215k8931116
4278A76050003k1026989j6369384j3209986r112963p329336p256665q400223o104532
4270H7239925n097909n429138l001918m728732m448369j433826k578287k479370
4262E8042376m36608j644646o9170o31623l35634Q2300p98485J489766K067753
4253E7766029J281028K419600M329156K768150l87021j321125j741190m369900
4245F0744727n051045j604197l396737k750921l35010j03138k36449R49339J810261
$$ plain form
4236 50026830 50111249 51390279 53103151 52956665 49808743 46410171 40446303 37444333 35757267
4227 35757267 33460454 32822365 32879935 32263507 32205298 31529668 31358071 30913438 29454293
4218 29454293 30806525 29975027 29578655 30080337 30717108 31324224 31686168 33311610 34285802
4209 34285802 33851625 34028102 34146098 31652001 31479147 30388473 28113974 27803431 28666702
4200 28666702 28147490 27753924 28674680 30132194 29612748 31368603 32366933 32341708 31656420
4191 31656420 30463416 28598143 25504659 24406852 24313304 23264255 22042617 22788552 22295761
4182 22295761 21112300 19188312 18957875 19119140 18345619 18168130 19150854 18686456 18270227
4173 18270227 18117328 18937485 18106303 17674648 17813136 18003946 16773004 17280647 17985286
$$ packed form
4236E0026830Q4419J279030J712872j46486l147922l398572n963868l001970j687066
4227C5757267k296813o38089N7570o16428n8209o75630j71597m44633j459145
4218B9454293J352232q31498l96372N01682O36771O07116L61944J625442R74192
4209C4285802m34177J76477J17996k494097j72854j090674k274499l10543Q63271
4200B8666702n19212l93566R20756J457514n19446J755855R98330k5225o85288
4191C1656420j193004j865273l093484j097807r3548j049049j221638P45935m92791
4182B2295761j183461j923988k30437J61265p73521j77489R82724m64398m16229
4173A8270227j52899Q20157q31182m31655J38488J90810j230942N07643P04639
$$ plain form
4164 17985286 18288209 18231407 17636941 19263966 19435621 18659369 19433477 18733829 18226067
4155 18226067 19459845 18145373 17652899 18124790 17071143 17770509 16889504 15697850 16328554
4146 16328554 16816327 17109724 16826750 16936800 16767142 17729704 18236897 17353616 15846546
4137 15846546 16340881 16918994 15268592 15069708 16952016 15684338 14749610 16331975 15800623
4128 15800623 15689394 16786408 16668009 14906161 16045776 17707727 17596046 15953807 17038645
4119 17038645 17748026 17222546 15394943 15392722 15056108 15501791 15566910 16874525 18501354
4110 18501354 17541672 17398640 16895713 16006776 16117491 16948396 16568193 15316015 15639077
4101 15639077 16238940 16177863 16104239 16526116 16568973 16404047 14711221 14381505 14441304 15010392
$$ packed form
4164A7985286L02923n6802n94466J627025J71655p76252P74108o99648n07762
4155A8226067J233778j314472m92474M71891j053647O99366q81005j191654O30704
4146A6328554M87773K93397k82974J10050j69658R62562N07193q83281j507070
4137A5846546M94335N78113j650402j98884J882308j267678r34728J582365n31352
4128A5800623j11229J097014j18399j761848J139615J661951j11681j642239J084838
4119A7038645P09381n25480j827603k221l36614M45683O5119J307615J626829
4110A8501354r59682j43032n02927q88937J10715Q30905l80203j252178L23062
4101A5639077N99863o1077p3624M21877M2857j64926j692826l29716N9799N69088
$$ plain form
4091 15010392 16357361 16391357 16836173 16978973 17764310 17512682 15809724 15494017 17008356
4082 17008356 16897258 16794511 15906601 16293909 16744244 17967430 16914328 17990320 18660887
4073 18660887 17308759 16373557 16752044 15689668 16625414 16785973 16216858 16474338 16535977
4064 16535977 15870459 15317722 16033432 15875756 15409352 15539193 14550645 13437113 15457207
4055 15457207 15888092 13908939 13390264 13130158 14153885 14139121 13832018 15061725 13402231
4046 13402231 13988254 15736837 14282369 13332357 13580171 13756255 14561182 13183244 13467492
4037 13467492 14717515 12682420 13003050 13426612 12809846 12632376 13463820 12850568 13034424
4028 13034424 12288555 12866240 14680344 13610608 12828350 12391169 13645965 14035341 13118575
$$ packed form
4091A5010392J346969L3996M44816J42800P85337k51628j702958l15707J514339
4082A7008356j11098j02747q87910L87308M50335J223186j053102J075992O70567
4073A8660887j352128r35202L78487j062376R35746J60559n69115K57480O1639
4064A6535977o65518n52737P15710j57676m66404J29841r88548j113532K020094
4055A5457207M30885j979153n18675k60106J023727j4764l07103J229707j659494
4046A3402231N86023J748583j454468r50012K47814J76084Q04927j377938K84248
4037A3467492J250023k035095L20630M23562o16766j77470Q31444o13252J83856
4028A3034424p45869N77685J814104j069736p82258m37181J254796L89376r16766
$$ plain form
4019 13118575 12144748 12413001 10598712 9434552 10359550 10978290 11148502 12610673 14476607
4010 14476607 14569941 15351445 17357076 16947536 16204369 16619484 17363126 17442215 17444803 18350217
4000 18350217 18399043 18333170 18891460 17167824 15232475 16573969 16574282 14136897 13405520 13884391
3990 13884391 14066582 13639807 13592583 13971708 12318970 14195298 14699145 13074073 13878822
3981 13878822 15422297 14559552 14225998 14472503 13733037 12481619 12998839 14437159 14252460
3972 14252460 14681579 16638054 15473708 15986576 17960030 18742070 19920384 21087601 20940787
3963 20940787 21235951 22338232 21119622 19676272 19890408 20581098 20276002 18976976 18919432
3954 18919432 19913026 19048979 20804573 22551076 22123679 22991153 26012856 26857624 27708555
$$ packed form
4019A3118575r73827K68253j814289j164160R24998O18740J70212J462171J865934
4010A4476607R3334P81504K005631m09540p43167M15115P43642P9089K588R05414
4000A8350217M8826o5873N58290j723636j935349J341494L13k437385p31377M78871
3990A3884391J82191m26775m7224L79125j652738J876328N03847j625072Q04749
3981A3878822J543475q62745l33554K46505p39466j251418N17220J438320j84699
3972A4252460M29119J956475j164346N12868J973454P82040J178314J167217j46814
3963B0940787K95164J102281j218610j443350K14136O90690l05096j299026n7544
3954A8919432R93594q64047J755594J746503m27397Q67474L021703Q44768Q50931
$$ plain form
3945 27708555 31257775 33204714 33343545 34599119 36385324 35617327 33337241 33348970 30784217
3936 30784217 28903115 26429948 24945222 22692147 20982670 19308922 19257819 18598770 19014249
3927 19014249 20196178 21497319 20318116 20496918 22050548 22601853 22385401 23721023 24129318
3918 24129318 24197008 24181907 24817173 24431130 22746815 22840730 21993076 22481124 24629685 25566603
3908 25566603 27102808 27997202 26726900 27135036 27517671 25861637 24390107 23639809 21819060
3899 21819060 20443750 19628942 19474432 18016203 17848028 16381193 14699510 15136585 14610687
3890 14610687 14450396 15692468 15828796 16418813 16902135 19046042 19332603 19492971 19477868
3881 19477868 18939364 17551355 18565298 16572604 14984748 14795297 13449661 11909956
$$ packed form
3945B7708555L549220J946939J38831J255574J786205p67997k280086J1729k564753
3936C0784217j881102k473167j484726k253075j709477j673748n1103o59049M15479
3927A9014249J181929J301141j179203J78802J553630N51305k16452J335622M08295
3918B4129318O7690j5101O35266l86043j684315R3915q47654M88048K148561R36918
3908B5566603J536205Q94394j270302M08136L82635j656034j471530p50298j820749
3899B1819060j375310q14808j54510j458229j68175j466835j681683M37075n25898
3890A4610687j60291J242072J36328N90017M83322K143907K86561J60368j5103
3881A9477868n38504j388009J013943j992694j587856j89451j345636j539705
$$ plain form
3873 11909956 12397541 12180829 11187482 12279090 11529311 10681507 10097864 10932979 11770256
3864 11770256 12041799 11027198 10214620 11517492 11214954 10413357 10820939 12406805 11603588
3855 11603588 11708649 13209940 12888956 13408643 15216886 14771593 13442179 13576555 14501545
3846 14501545 14315531 12294012 11515838 10633332 9363814 8748220 8033734 7800478 8476122
3837 8476122 7186504 6285801 6892949 7040869 6962216 6644510 5804141 4612178 5592032
3828 5592032 5198916 4101446 4332438 4678142 4128822 3301339 3578317 4044424 4708448
3819 4708448 5234344 5558194 5503519 5765560 4718479 4010477 3363874 3150483 4256998
3810 4256998 3158134 2771655 3255986 2933500 3130729 4329024 4154890 3853360 3523180
$$ packed form
3873A1909956M87585k16712r93347J091608p49779q47804n83643Q35115Q37277
3864A1770256K71543j014601q12578J302872l02538q01597M07582J585866q03217
3855A1603588J05061J501291l20984N19687J808243m45293j329414J34376R24990
3846A4501545j86014k021519p78174q82506j269518o15594p14486k33256O75644
3837H476122j289618r00703O07148J47920p8653l17706q40369j191963R79854
3828E592032l93116j097470K30992L45704n49320q27483K76978M66107O64024
3819D708448N25896L23850n4675K62041j047081p08002o46603k13391J106515
3810D256998j098864l86479M84331l22486J97229J198295j74134l01530l30180
$$ plain form
3801 3523180 2713018 2399412 3071400 4086949 3530958 3065508 2634723 3033900 3585488
3792 3585488 4012443 3278283 3088256 3710269 3975576 2692734 2932817 4614034 3210909
3783 3210909 2234589 3430425 1769898 1675148 3614350 3884038 2495155 1822871 2851442
3774 2851442 3584260 2394634 3008105 3681035 2816695 2490911 2660923 2221382 1543440
3765 1543440 1941956 3631590 2761007 2436093 3569359 3492591 2753817 1974729 1387459
3756 1387459 2345550 1536546 1024926 1054234 166010 1259400 2817246 3394154 3174282
3747 3174282 2588190 2274329 2796293 640529 2165359 2556414 1178009 442476 2153192
3738 2153192 2372046 2074242 2605147 3311484 2905766 2377316 3303280 3149840 2359458 2290907
$$ packed form
3801C523180q10162l13606O71988J015549n55991m65450m30785L99177N51588
3792C585488M26955p34160j90027O22013K65307j282842K40083J681217j403125
3783C210909r76320J195836j660527r4750J939202K69688j388883o72284J028571
3774B851442P32818j189626O13471O72930q64340l25784J70012m39541o77942
3765A543440L98516J689634q70583l24914J133266p6768p38774p79088n87270
3756A387459R58091q09004n11620K9308q88224J093390J557846N76908k19872
3747C174282n86092l13861N21964k155764J524830L91055j378405p35533J710716
3738B153192K18854k97804N30905P06337m05718n28450R25964j53440p90382o8551
$$ plain form
3728 2290907 2092426 868195 1500214 1706978 908363 1338081 1727395 2252625 2298891 2149630
3718 2149630 2050593 3198987 2340144 2830870 2710020 2795889 3441526 3148626 2574593 2074508
3708 2074508 2132439 3321387 4199811 3900735 4853958 3827587 2974277 2870396 3781814
3699 3781814 2563396 2999015 1900331 1248589 2771283 3212902 4460055 3811980 2167607
3690 2167607 1511593 1214002 1329062 2060782 2145670 2657135 2694356 1479269 2798010 2825859
3680 2825859 3313649 4697973 3203839 1506077 2043628 1574764 1841464 2282321 4442614
3671 4442614 2917165 2804660 4623213 2476646 2162414 3706853 1683521 1205126 2143850
3662 2143850 1028110 2286980 2789460 3030760 2967442 2222057 2582495 2101897 2443431
$$ packed form
3728B290907j98481j224231O32019K06764p98615M29718L89314N25230M6266j49261
3718B149630r9037J148394q58843M90726j20850Q5869O45637k92900n74033n00085
3708B074508N7931J188948Q78424k99076R53223j026371q53310j03881R11418
3699C781814j218418M35619j098684o51742J522694M41619J247153o48075j644373
3690B167607o56014k97591J15060P31720Q4888N11465L7221j215087J318741K7849
3680B825859M87790J384324j494134j697762N37551m68864K66700M40857K160293
3671D442614j525449j12505J818553k146567l14232J544439k023332m78395R38724
3662B143850j115740J258870N02480K41300o3318p45385L60438m80598L41534
$$ plain form
3653 2443431 2588667 1517146 3341785 4366576 1556804 1589538 2520551 2746533 1815117
3644 1815117 2166026 2058077 1023193 1554362 1833827 1239617 2186908 1694242 1040758
3635 1040758 2688456 1965670 2206473 3443290 2347206 2880091 3144870 2270817 2919123
3626 2919123 2406388 1090448 1716223 2080684 947673 1358534 1502635 2005205 1282462
3617 1282462 1707085 2238148 2329323 3976098 3718383 2816975 2080785 1552682 1664684 993779
3607 993779 37842 783932 1203619 874796 1409615 1428257 2515894 2143060 3026808 2010392
3597 2010392 2608855 2978923 3455851 2399270 2667791 2000059 1167586 1457757 1344735
3588 1344735 357934 1465998 2387290 1739974 259248 166342 2082828 2204662 1079230
$$ packed form
3653B443431J45236j071521J824639J024791k809772L2734R31013K25982r31416
3644A815117L50909j07949j034884N31169K79465n94210R47291m92666o53484
3635A040758J647698p22786K40803J236817j096084N32885K64779q74053O48306
3626B919123n12735j315940O25775L64461j133011M10861J44101N02570p22743
3617A282462M24623N31063R1175J646775k57715r01408p36190n28103J12002o70905
3607I93779r55937P46090M19687l28823N34819J8642J087637l72834Q83748j016416
3597B010392N98463L70068M76928j056581K68521o67732q32473K90171j13022
3588A344735r86801J108064R21292o47316j480726r2906J916486J21834j125432
$$ plain form
3579 1079230 2965564 1663122 -195113 798331 2044412 412760 1322165 2949511 1724986
3570 1724986 1028978 2486385 3428775 1928071 1646903 2167888 814638 -658327 1114055
3561 1114055 1154149 1222148 1786833 2815219 1470106 2387190 3062629 2091693 1815076 1860322
3551 1860322 1425207 2472270 1681830 1451167 1353538 1228072 2011572 1411559 1189823 2791799
3541 2791799 906336 447797 938043 1713209 2560730 3173932 1676353 680826 2017897
3532 2017897 2564438 2112166 2749139 1414379 542935 1043015 9859 1177408 1445639
3523 1445639 1560584 2618517 1723086 -423462 1456239 1803876 1261740 124523 1041542
3514 1041542 1579760 -250965 62222 1132140 1433709 2467784 2161857 3102056 3780142
$$ packed form
3579A079230J886334j302442j858235R93444J246081j631652R09405J627346j224525
3570A724986o96008J457407R42390j500704k81168N20985j353250j472965J772382
3561A114055M0094O7999N64685J028386j345113R17084O75439r70936k76617M5246
3551A860322m35115J047063p90440k30663r7629j25466P83500o00013k21736J601976
3541B791799j885463m58539M90246P75166Q47521O13202j497579r95527J337071
3532B017897N46541m52272O36973j334760q71444N00080j033156J167549K68231
3523A445639J14945J057933q95431k146548J879701L47637n42136j137217R17019
3514A041542N38218j830725L13187J069918L01569J034075l05927R40199O78086
$$ plain form
3505 3780142 1486039 1048899 824808 823391 623434 1060414 1965390 975230 1287694 3303716
3495 3303716 1672618 1539091 1048154 1358465 2034206 809440 1784608 2227552 1356460
3486 1356460 1507665 1483239 740950 -19360 815064 2707224 2397978 113801 979694
3477 979694 232631 -20315 442337 10137 388675 1806381 916838 1365344 622866 823902
3467 823902 1566042 547017 195737 311518 -114045 743996 2205029 900763 2081262
3458 2081262 2496758 2395602 634500 28794 1318854 1731177 415251 646730 942708
3449 942708 -703710 -657892 -455749 -787278 -300641 1092517 751024 -130003 -27284 1244464
3439 1244464 1782050 944311 626812 1412037 2442278 2568019 1349424 506257 2229118
$$ packed form
3505C780142k294103m37140k24091j417j99957M36980R04976r90160L12464K016022
3495C303716j631098j33527m90937L10311O75741j224766R75168M42944q71092
3486A356460J51205k4426p42289p60310Q34424J892160l09246k284177Q65893
3477I79694p47063k52946M62652m32200L78538J417706q89543M48506p42478K01036
3467H23902P42140j019025l51280J15781m25563Q58041J461033j304266J180499
3458B081262M15496j01156j761102o05706J290060M12323j315926K31479K95978
3449I42708j646418M5818K02143l31529M86637J393158l41493q81027J02719J271748
3439A244464N37586q37739l17499P85225J030241J25741j218595q43167J722861
$$ plain form
3430 2229118 1719819 1163277 -243472 -2144160 -1215625 975321 78848 -1071588 67461
3421 67461 585187 1259776 1314295 1284086 1919923 2492623 852238 541861 1780037 1588134
3411 1588134 549055 -658812 1136945 1218367 996904 784566 500631 -572779 330270
3402 330270 867799 358016 474770 766253 1811533 731751 -998627 1382168 1990878
3393 1990878 534179 312394 -1094189 -1084712 57489 -759857 407650 1033273 335157
3384 335157 1233737 1048075 1266881 2074278 1112203 806789 325763 -881384 457939
3375 457939 1572277 -279113 161196 1584227 1501741 371330 554239 1286551 1245935
3366 1245935 -646149 -457522 -567312 -1043372 201400 -346673 -1093918 -645965 432429
$$ packed form
3430B229118n09299n56542j406749j900688R28535K190946q96473j150436J139049
3421F7461N17726O74589N4519l0209O35837N72700j640385l10377J238176j91903
3411A588134j039079j207867J795757Q1422k21463k12338k83935j073410R03049
3402C30270N37529n09783J16754K91483J045280j079782j730378K380795O08710
3393A990878j456699k21785j406583R477J142201q17346J167507O25623o98116
3384C35157Q98580j85662K18806Q07397r62075l05414m81026j207147J339323
3375D57939J114338j851390M40309J423031q2486j130411J82909P32312m0616
3366A245935j892084J88627j09790m76060J244772n48073p47245M47953J078394
$$ plain form
3357 432429 992637 1465730 1208637 2180170 828854 382742 1224924 1017376 599117 399453
3347 399453 664061 848506 613604 1785465 2566879 1828856 1519880 2099697 916623
3338 916623 -904640 -105053 -107997 -796734 -608773 -659908 848890 1125853 542237 1804455
3328 1804455 3132635 994471 1169503 1715009 407348 412597 1111249 1323809 142528
3319 142528 651662 1927105 2835494 1947857 1856391 1892023 1556293 1078978 999920 1100301
3309 1100301 2226093 1595913 -189019 1261774 1806331 480066 1450350 2315371 1156429
3300 1156429 1618249 2233010 1217578 278654 1655822 3898006 3459194 2517122 3690583
3291 3690583 3046322 2712020 3481436 2545563 1065730 2843761 3008012 1392150 692374
$$ packed form
3357D32429N60208M73093k57093R71533j351316m46112Q42182k07548m18259j99664
3347C99453K64608J84445k34902J171861P81414p38023l08976N79817j183074
3338I16623j821263P99587k944o88737J87961n1135J508798K76963n83616J262218
3328A804455J328180k138164J75032N45506j307661N249O98652K12560j181281
3319A42528N09134J275443R08389q87637r1466L5632l35730m77315p9058J00381
3309A100301J125792o30180j784932J450793N44557j326265R70284Q65021j158942
3300A156429M61820O14761j015432r38924J377168K242184m38812r42072J173461
3291C690583o44261l34302P69416r35873j479833J778031J64251j615862o99776
$$ plain form
3282 692374 3335365 3872887 1749494 862412 2444943 1908965 2526355 4718707 4117678
3273 4117678 3062285 4300627 5129853 2853438 1697891 3152367 3482698 1431672 1737002
3264 1737002 5720237 5868681 5773224 7240636 7801944 7005539 9169857 10908820 9600054
3255 9600054 7976267 8356494 7089879 5631479 5994283 7119049 7395892 7621747 8451121
3246 8451121 8001058 9996907 9388903 7627246 7306433 8240146 7557974 7562212 7535990 7115913
3236 7115913 7472951 6768242 5411588 5457742 5953266 6059761 6905952 7808279 6602798
3227 6602798 8707015 11066556 11561260 11987759 12232621 9980034 8437858 8055091 7961987
3218 7961987 7004122 7326097 6878669 4416796 3104764 3637642 3740067 3061034 3980507
$$ packed form
3282F92374K642991N37522k123393q87082J582531n35978O17390K192352o01029
3273D117678j055393J238342Q29226k276415j155547J454476L30331k051026L05330
3264A737002L983235J48444r5457J467412N61308p96405K164318J738963j308766
3255I600054j623787L80227j266615j458400L62804J124766K76843K25855Q29374
3246H451121m50063J995849o08004j761657l20813R33713o82172M238k6222m20077
3236G115913L57038p04709j356654M6154M95524J06495Q46191R02327j205481
3227F602798K104217K359541M94704M26499K44862k252587j542176l82767r3104
3218G961987r57865L21975m47428k461873j312032N32878J02425o79033R19473
$$ plain form
3209 3980507 4794445 4905428 5648685 5238167 4134091 3732918 5730671 4861366 4482358
3200 4482358 3225567 4051152 3980273 2866264 4458020 4547808 5593938 6488308 6410526
3191 6410526 5236230 4458345 3965130 4821477 3264209 2578375 2737492 2509013 4513996
3182 4513996 4468899 3314824 3556696 3409865 1196913 1530617 2008366 1782153 2374163
3173 2374163 2522262 1881592 941601 1897991 1240252 -89774 -221720 349504 -73950
3164 -73950 86540 977964 1029582 2224666 3402128 1630731 1150831 2395313 1784983
3155 1784983 1186291 844500 1315943 2145660 1193251 2147517 -345050 -1308021 552229
3146 552229 530146 1314553 1606919 212594 592501 -23958 182096 1533311 39545
$$ packed form
3209C980507Q13938J10983P43257m10518j104076m01173J997753q69305l79008
3200D482358j256791Q25585p0879j114009J591756Q9788J046130Q94370p7782
3191F410526j174296p77885m93215Q56347j557268o85834J59117k28479K004983
3182D513996m5097j154075K41872j46831k212952L33704M77749k26213N92010
3173B374163J48099o40670r39991R56390o57739j330026j31946N71224m23454
3164g3950J60490Q91424N1618J195084J177462j771397m79900J244482o10330
3155A784983n98692l41791M71443Q29717r52409R54266k492567r62971J860250
3146E52229k2083P84407K92366j394325L79907o16459K06054J351215j493766
$$ plain form
3137 39545 -231849 156972 -83663 1108978 1884850 2479130 2188167 603054 1967449
3128 1967449 1924317 739192 918890 755302 333279 -396167 -49363 692881 -867788
3119 -867788 357509 1056143 -1432487 -1152529 685522 954249 224373 277817 385159
3110 385159 166833 520877 1355358 847052 -361068 332754 1143606 951213 327773 1237654
3100 1237654 1328336 254575 1288820 1145700 28091 766724 -758717 -1403065 -305656
3091 -305656 -669702 -2060 568594 -215289 722752 1171046 728942 1007869 730184 412250
3081 412250 -277806 -954346 -950240 247479 118518 414696 817389 1467817 360385 1172404
3071 1172404 408262 503290 519363 -357115 959969 282851 -1777654 -1436001 -1504004 -2593696
$$ packed form
3137C9545k71394L88821k40635J192641P75872N94280k90963j585113J364395
3128A967449m3132j185125J79698j63588m22023p29446L46804P42244j560669
3119h67788J225297O98634k488630K79958J838051K68727p29876N3444J07342
3110C85159k18326L54044Q34481n08306j208120O93822Q10852j92393o23440R09881
3100A237654R0682j073761J034245j43120j117609P38633j525441o44348J097409
3091c05656l64046O67642N70654p83883R38041M48294m42104K78927k77685l17934
3081D12250o90056o76540M106J197719j28961K96178M02693O50428j107432Q12019
3071A172404p64142R5028J6073q76478J317084o77118k060505L41653o8003j089692
$$ plain form
3061 -2593696 -1696141 -263059 -158136 -10764 -344774 509643 1979577 521793 -691013
3052 -691013 -719129 -222179 -606143 770657 1957360 2081762 2038467 2050908 1608220 -71922
3042 -71922 -733157 389629 -264762 -1818885 -170327 1021776 17712 -459563 363480
3033 363480 312493 -595828 -76843 649349 -562669 256100 1679082 638607 172286
3024 172286 -715555 -703354 -1205301 -1025369 -979420 -640163 -439098 -862515 -222022 604049
3014 604049 144968 -604234 -321424 157470 233015 373428 1175858 251148 4936 662936
3004 662936 -848954 -1144085 -2112137 -1384719 -382438 -787640 29703 118936 -324540 1019401
2994 1019401 1668752 1205541 685718 -222510 1372597 1152701 232483 9589 -269577
$$ packed form
3061b593696Q97555J433082J04923J47372l34010Q54417J469934j457784j212806
3052f91013k8116M96950l83964J376800J186703J24402m3295J2441m42688j680142
3042g1922o61235J122786o54391j554123J648558J192103j004064m77275Q23043
3033C63480n0987r08321N18985P26192j212018Q18769J422982j040475m66321
3024A72286q87841J2201n01947J79932M5949L39257K01065m23417O40493Q26071
3014F04049m59081p49202K82810M78894P5545J40413Q02430r24710k46212O58000
3004F62936j511890k95131r68052P27418J002281m05202Q17343Q9233m43476J343941
2994A019401O49351m63211n19823r08228J595107k19896r20218k22894k79166
$$ plain form
2985 -269577 -1482738 -708981 -146945 -189534 513797 -110744 322851 -198984 -665141 759648
2975 759648 1421383 -184394 355398 1056597 709443 169483 440833 703477 134473 -1177206
2965 -1177206 -921755 -306978 -721905 -403542 1623325 1165151 -303311 -73263 -14640
2956 -14640 267422 -657638 -342127 1148014 -233783 63290 1117518 -1368486 -1144572
2947 -1144572 1556119 904482 220979 473604 129378 301862 -20936 370646 -81299
2938 -81299 -991508 -572576 -843694 -773604 795479 957297 1424035 1625101 412189 1081359
2928 1081359 1771480 523564 -464416 -406125 -436792 619431 1027550 842091 575998 311013
2918 311013 348491 -360576 -873917 698182 1662369 28507 1329155 1281285 212545
$$ packed form
2985b69577j213161P73757N62036m2589P03331o24541M33595n21835m66157J424789
2975G59648O61735j605777N39792P01199l47154n39960K71350K62644n69004j311679
2965a177206K55451O14777m14927L18363K026867m58174j468462K30048N8623
2956a4640K82062r25060L15511J490141j381797K97073J054228k486004K23914
2947a144572K700691o51637o83503K52625l44226J72484l22798L91582m51945
2938h1299r10209M18932k71118P0090J569083J61818M66738K01066j212912O69170
2928A081359O90121j247916r87980N8291l0667J056223M08119j85459k66093k64985
2918C11013L7478p09067n13341J572099R64187j633862J300648m7870j068740
$$ plain form
2909 212545 1354096 1582012 145113 1185529 778283 420185 1445832 2008111 1397672
2900 1397672 892831 974595 1752342 1322915 1142034 902183 247719 827663 1787636 315071
2890 315071 -204967 344803 217443 1501149 1120675 634263 733548 -132280 265995 3480
2880 3480 -635968 -145809 442693 1700810 1871915 624975 850609 2259924 972907
2871 972907 1187554 948441 1080505 610910 644878 37391 -488574 968727 1081659 -196942
2861 -196942 1250774 938350 1634 539966 1376453 211560 -166639 475938 -62037
2852 -62037 -116725 842576 542561 87388 3361 -343800 1532239 1038084 -85809 384235
2842 384235 744528 -958984 -776565 -1464877 -988912 -1211173 561604 1252960 -1465004
$$ packed form
2909B12545J141551K27916j436899J040416m07246l58098J025647N62279o10439
2900A397672n04841Q1764P77747m29427j80881k39851o54464N79944R59973j472565
2890C15071n20038N49770j27360J283706l80474m86412R9285q65828L98275k62515
2880C480o39448M90159N88502J258117J71105j246940K25634J409315j287017
2871I72907K14647k39113J32064m69595L3968o07487n25965J457301J12932j278601
2861a96942J447716l12424r36716N38332Q36487j164893l78199O42577n37975
2852f2037n4688R59301l00015m55173q4027l47161J876039m94155j123893M70044
2842C84235L60293j703512J82419o88312M75965k22261J772777O91356k717964
$$ plain form
2833 -1465004 895658 1474897 -789362 -946894 154492 -282000 -221020 -1421252 -1370465
2824 -1370465 -755260 1186246 1470238 188712 797628 482160 -179419 -107283 -350417
2815 -350417 -883656 280518 -21125 -1887098 -2425581 583001 1183897 452383 581695
2806 581695 -19250 -755713 -1003078 -372339 -446704 -794380 -549321 -42381 -838342 -2885571
2796 -2885571 -958437 299618 -89586 -381898 -48775 -1175533 -664086 153076 -15985
2787 -15985 -1058124 -822663 251632 -1162438 -1325395 -379557 -135400 140030 -57181
2778 -57181 307225 -1341844 -2225357 -646023 -674204 -1035843 27308 -240865 -1646716
2769 -1646716 -218956 228460 -212615 232373 1227069 299699 -358050 -525395 263017
$$ packed form
2833a465004K360662N79239k264259j57532J101386m36492O0980j200232N0787
2824a370465O15205J941506K83992j281526O08916l15468o61579P2136k43134
2815c50417n33239J164174l01643j865973n38483L008582O00896p31514J29312
2806E81695o00945p36463k47365O30739p4365l47676K45059N06940p95961k047229
2796b885571J927134J258055l89204k92312L33123j126758N11447Q17162j69061
2787a5985j042139K35461J074295j414070j62957R45838K44157K75430j97211
2778e7181L64406j649069q83513J579334k8181l61639J063151k68173j405851
2769a646716J427760M47416m41075M44988R94696r27370o57749j67345P88412
$$ plain form
2760 263017 -563557 238737 -338896 -1115957 -970869 -1614029 -1644745 -1695956 -926284 -873552
2750 -873552 -2145593 -2467657 -2156688 -1748317 -548062 -1144618 -1180955 -664381 -1097673 -949577
2740 -949577 -412598 -541170 -1345 47893 -533991 107283 268295 1566471 1513335 -199297
2730 -199297 -434257 -482862 -1411627 -2441123 -3042047 -1986854 -947091 -1905006 -1472168
2721 -1472168 -2138965 -1213780 458768 28955 -691724 -668332 -578731 -770279 -642135 -1503048
2711 -1503048 -1166228 -155654 -561262 -1040317 70440 1531945 1282186 -5438 901146
2702 901146 -178311 -1854511 -827305 -721772 -1756539 -1456271 -1472409 -1176244 -2727475
2693 -2727475 -2388263 -344478 -759047 -1260477 -2278394 -1452641 -245028 -1284684 -32347
$$ packed form
2760B63017q26574Q02294n77633p77061J45088o43160l0716n1211P69672N2732
2750h73552j272041l22064L10969M08371J200255n96556l6337N16574m33292J48096
2740i49577N36979j28572N39825M9238n81884O41274J61012J298176n3136j712632
2730a99297k34960m8605r28765j029496o00924J055193J039763r57915M32838
2721a472168o66797R25185J672548m29813p20679K3392Q9601j91548J28144q60913
2711a503048L36820J010574m05608m79055J110757J461505k49759j287624R06584
2702I01146j079457j676200J027206J05533j034767L00268j6138K96165j551231
2693b727475L39212K043785m14569n01430j017917Q25753J207613j039656J252337
$$ plain form
2684 -32347 864649 -491266 409850 688259 -1170118 -466549 39373 -233010 -1591257
2675 -1591257 -212885 231231 -1403314 -253727 568000 -837059 75553 -13045 -1107768
2666 -1107768 -1223373 -1339824 -184815 -51379 -1259850 -1577973 -1187714 -1711944 -1556024
2657 -1556024 -1181356 516 -555407 -855260 -355315 -624696 -695025 761245 -673874
2648 -673874 -1375055 26825 505113 -1113259 -499219 628102 201538 -1071284 -1579946
2639 -1579946 -2572701 -2731044 -2063591 -987714 -1242913 -2351960 -512926 604538 -884320
2630 -884320 -830083 18235 -1122364 -986940 37218 -992689 -1131597 -290823 67948
2621 67948 -281039 -1453524 -259141 -327852 -1763391 -741758 587409 -1329851 -1787729
$$ packed form
2684c2347Q96996j355915R01116K78409j858377P03569N05922k72383j358247
2675a591257J378372M44116j634545J149587Q21727j405059R12612q8598j094723
2666a107768j15605j16451J155009J33436j208471l18123L90259n24230J55920
2657a556024L74668J181872n55923k99853M99945k69381p0329J456270j435119
2648f73874p01181J401880M78288j618372O14040J127321m26564j272822n08662
2639a579946r92755j58343O67453J075877k55199j109047J839034J117464j488858
2630h84320N4237Q48318j140599J35424J024158j029907j38908Q40774L58771
2621F7948l48987j172485J194383o8711j435539J021633J329167j917260m57878
$$ plain form
2612 -1787729 -1597312 -1476250 -1221179 -1114109 -817121 -1000706 160973 -219596 -1144045
2603 -1144045 -1864566 -1028167 -1856749 -2182558 -1087031 -1516157 -1370131 -323815 257345
2594 257345 542124 1071398 -231811 175456 -273799 -1389664 106710 427720 -1573127
2585 -1573127 -1770940 -979603 -2107972 -3076691 -1845928 -254256 -1625127 83867 -93667
2576 -93667 -577263 883659 628784 -1681545 -1527769 -1365096 -741387 -1352662 -1439455 94710
2566 94710 -1232750 -1615899 -320803 -880082 -573488 -310208 -100942 -403570 -1547585
2557 -1547585 -1359920 -1845321 -1234538 -1649627 -1256685 701795 409070 -1263986 663796
2548 663796 693449 -617101 -471056 -801037 -1955212 -1295088 -1425300 -1822076 -1937672 -760599
$$ packed form
2612a787729J90417J21062K55071J07070K96988j83585J161679l80569r24449
2603a144045p20521Q36399q28582l25809J095527m29126J46026J046316N81160
2594B57345K84779N29274j303209M07267m49255j115865J496374L21010k000847
2585a573127j97813P91337j128369r68719J230763J591672j370871J708994j77534
2576i3667m83596J460922k54875k310329J53776J62673O23709o11275q6793J534165
2566I4710j327460l83149J295096n59279L06594K63280K09266l02628j144015
2557a547585J87665m85401O10783m15089L92942J958480k92725j673056J927782
2548F63796K9653j310550J46045l29981j154175O60124j30212l96776j15596J177073
$$ plain form
2538 -760599 -969466 -2613194 -2092755 -1433866 -136397 563154 -273159 -459463 880494
2529 880494 737153 -796840 -951560 -1220071 -538248 -2208931 -1951677 -2102779 -1551216
2520 -1551216 -1239092 -219019 -19831 -864239 239871 1028758 146869 -145165 468423
2511 468423 -26061 -1100077 -2632373 -2118020 -644429 -1132831 -178701 639759 -1168531
2502 -1168531 -1332521 -515590 -779663 -928154 -907258 -152293 -1445893 -2444719 -951681
2493 -951681 -1080669 -1988420 -833884 -1521925 -1699597 -994249 43390 -220088 -645392
2484 -645392 1184842 47200 -1526624 -393828 502389 742294 820847 159123 -862866
2475 -862866 -2422550 -2290260 -1108961 -1972469 -2339850 -483996 -903892 -1347849 -722350
$$ packed form
2538g60599k08867j643728N20439O58889J297469O99551q36313j86304J339957
2529H80494j43341j533993j54720k68511O81823j670683K57254j51102N51563
2520a551216L12124J020073J99188q44408J104110P88887q81889k92034O13588
2511D68423m94484j074016j532296N14353J473591m88402R54130Q18460j808290
2502a168531j63990Q16931k64073j48491K0896P54965j293600r98826J493038
2493i51681j28988r07751J154536o88041j77672P05348J037639k63478m25304
2484f45392J830234j137642j573824J132796Q96217K39905P8553o61724j021989
2475h62866j559684J32290J181299q63508l67381J855854m19896m43957O25499
$$ plain form
2466 -722350 933224 -1668315 -2824517 -1302849 -1076618 -1339927 -251490 244956 -16688
2457 -16688 -425546 165158 899080 -175737 -627033 -225354 -903389 -1233655 -1110711 -1735
2447 -1735 -308723 -1370154 -214806 -163331 -407570 -1256106 -1642198 -524519 -499834 -2301443
2437 -2301443 -1985258 -1903130 -2568467 -2583820 -1363687 -965271 -2229656 -521450 877487
2428 877487 -648742 -1739390 187779 1201729 396412 -708113 -165108 -696643 -2322786
2419 -2322786 -1876517 -861637 -1496937 -832732 328896 -502829 -833902 -866719 12666
2410 12666 -424899 -1576652 -855146 -797796 -496590 -1022953 -1560559 -1720129 -436773 -1585526
2400 -1585526 -934525 -652985 -717699 -370876 76588 660392 166092 -444771 -779154 -1000303
$$ packed form
2466g22350J655574k601539j156202J521668K26231k63309J088437M96446k61644
2457a6688m08858N90704P33922j074817m51296M01679o78035l30266J22944J108976
2447a735l06988j061431J155348N1475k44239q48536l86092J117679K4685j801609
2437b301443L16185Q2128o65337j5353J220133L98416j264385J708206J398937
2428H77487j526229j090648J927169J013950q05317j104525N43005n31535j626143
2419b322786M46269J014880o35300O64205J161628q31725l31073l2817Q79385
2410A2666m37565j151753P21506N7350L01206n26363n37606j59570J283356j148753
2400a585526O51001K81540o4714L46823M47464N83804m94300o10863l34383k21149
$$ plain form
2390 -1000303 -782757 -1207271 -641827 -654579 -1446232 -967233 -518470 -905452 -867838 -1027662
2380 -1027662 236195 1499063 -724618 -703832 -551990 -1521862 -69370 396112 -59498
2371 -59498 785236 -392059 876297 -247364 -321136 811831 -813480 -1191162 -759484
2362 -759484 -1036611 -135614 1368703 585240 1174284 1570092 1089956 442421 -456632 658608
2352 658608 587755 -983286 -826631 -786284 -1937504 -1492361 -1797601 -1196904 -594802 -713903
2342 -713903 -429357 328113 -1124588 -34755 684896 -468029 -123440 650148 -335273
2333 -335273 884647 730339 -476296 -543415 -65196 -1540842 -2107472 -1069072 -727954
2324 -727954 -633126 -646448 289440 1357666 -1397766 -1184178 251750 -60808 25144 404858
$$ packed form
2390a000303K17546m24514N65444j2752p91653M78999M48763l86982L7614j59824
2380a027662J263857J262868k223681K0786J51842r69872J452492M65482m55610
2371e9498Q44734j177295J268356j123661p3772J132967j625311l77682M31678
2362g59484k77127R00997J504317p83463N89044L95808m80136o47535q99053J115240
2352F58608p0853j571041J56655M0347j151220M45143l05240O00697O02102j19101
2342g13903K84546P57470j452701J089833P19651j152925L44589P73588r85421
2333c35273J219920j54308j206635o7119M78219j475646n66630J038400L41118
2324g27954R4828j3322R35888J068226k755432K13588J435928l12558Q5952L79714
$$ plain form
2314 404858 -884785 -1682921 -938502 -849908 40440 -1135393 -1354805 -672394 -310299 -228682
2304 -228682 -451075 -772681 193878 -970214 -812798 509101 782140 678390 777086 -677272
2294 -677272 -1685219 -1445947 -344410 -416867 -374989 -766876 168370 -676218 -462490 -493101
2284 -493101 -834538 -291987 229394 -168267 -314572 786112 738706 -1035292 -1318939 -467869
2274 -467869 -1688414 -1692390 -179243 -1462716 -549368 1330426 -328825 89521 634098
2265 634098 -852530 -881595 -993982 -1447924 -65452 38326 219831 177364 -293560 145615
2255 145615 1410438 532678 873164 -667915 -931849 -510408 -1499236 -1252934 -457295
2246 -457295 -1722078 -1011928 224520 98894 660703 987036 250320 -8854 -153557
$$ packed form
2314D04858j289643p98136P44419Q8594Q90348j175833k19412O82411L62095Q1617
2304b28682k22393l21606R66559j164092J57416J321899K73039j03750R8696j454358
2294f77272j007947K39272J101537p2457M1878l91887R35246q44588K13728l0611
2284d93101l41437N42551N21381l97661j46305J100684m7406j773998k83647Q51070
2274d67869j220545l976J513147j283473R13348J879794j659251M18346N44577
2265F34098j486628k9065j12387m53942J382472J03778J81505m2467m70924M39175
2255A45615J264823q77760L40486j541079k63934M21441r88828K46302P95639
2246d57295j264783P10150J236448j25626N61809L26333p36716k59174j44703
$$ plain form
2237 -153557 343147 1089158 -77334 -1046997 -614232 -1476315 -2067248 -350468 39092
2228 39092 -987232 -1238856 -166901 1093893 433246 -426443 1250741 -282440 -1412993
2219 -1412993 366824 223604 -895338 -579706 962877 875777 445139 1647187 1970304
2210 1970304 869771 901042 1428810 691350 250772 500667 1030395 -57672 551717
2201 551717 550927 1394955 2372467 1794133 1677490 1885742 2234198 3386848 2208166 1469176
2191 1469176 2443088 1794152 2864717 3827324 1406841 2636475 4418903 3073641 2261707
2182 2261707 3044444 4965418 3828369 4043223 5045797 4257827 2517983 5118523 5952972
2173 5952972 4872048 4061688 3951877 3481574 3191699 3337812 4892531 4345337 3744656
$$ packed form
2237a53557M96704P46011j166492r69663M32765q62083n90933J716780L89560
2228C9092j026324k51624J071955J260794o60647q59689J677184j533181j130553
2219a412993J779817j43220j118942L15632J542583q7100m30638J202048L23117
2210A970304j100533L1271N27768p37460m40578K49895N29728j088067O09389
2201E51717p90Q44028R77512n78334j16643K08252L48456J152650j178682p38990
2191A469176R73912o48936J070565R62607k420483J229634J782428j345262q11934
2182B261707P82737J920974j137049K14854J002574p87970j739844K600540Q34449
2173E952972j080924q10360j09811m70303k89875J46113J554719n47194o00681
$$ plain form
2164 3744656 4561394 4645158 5204740 5120233 4849303 5561434 7179070 6421385 6484632 5410792
2154 5410792 6495437 7526042 9707506 8524956 7519586 8833997 9526570 7822033
2146 7822033 8452930 9825964 9576930 9485883 10169346 11232062 11495454 12689892 14892115
2137 14892115 13521466 14652362 16494114 17262210 17408501 18639040 19482621 20439115 20733472
2128 20733472 21982493 23087084 24127234 26230500 28727426 30655028 34334615 36769337
2120 36769337 40343084 43143098 45135520 48122444 53630068 58994628 68815150 79492460
2112 79492460 93937567 113211332 135016978 152658250 179180989 217152009 287815304
2105 287815304 356379246 331816434 268948148 200016595 154448939 124950080 103999498
$$ packed form
2164C744656Q16738Q3764N59582q4507k70930P12131J617636p57685O3247j073840
2154E410792J084645J030605K181464j182550j005370J314411O92573j704537
2146G822033O30897J373034k49034r1047O83463J062716K63392J194438K202223
2137A4892115j370649J130896J841752P68096J46291J230539Q43581R56494K94357
2128B0733472J249021J104591J040150K103266K496926J927602L679587K434722
2120C6769337L573747K800014J992422K986924N507624N364560R820522J0677310
2112G9492460J4445107J9273765K1805646J7641272K6522739L7971020P0663295
2105B87815304O8563942k4562812o2868286o8931553m5567656k9498859k0950582
$$ plain form
2098 103999498 90153851 79762623 69889118 63290431 58137554 53738636 51360395 49362331
2090 49362331 48870587 44599412 39860168 36085572 33033709 31296384 28622802 27589853
2082 27589853 26864850 24098981 22598457 21402422 19318779 18266610 17645909 17555851 17035655
2073 17035655 16072239 15298733 15439600 16076667 16358714 15266089 14147028 13996150 12689636
2064 12689636 12877918 13193564 13017001 12390452 11532574 10502000 10538064 9995892 10388997
2055 10388997 10731095 9700267 8533840 8002594 7900633 8398432 7715731 8001453 8238186
2046 8238186 6529629 5855499 7185021 6557511 5826056 5173833 4965733 5365113 5973619
2037 5973619 5528691 5803825 7010203 7854746 6768956 6104289 5525777 6215178 6103244
$$ packed form
2098A03999498j3845647j0391228r873505o598687n152877m398918k378241j998064
2090D9362331m91744m271175m739244l774596l051863j737325k673582j032949
2082B7589853p25003k765869j500524j196035k083643j052169o20701r0058n20196
2073A7035655r63416p73506J40867O37067K82047j092625j119061j50878j306514
2064A2689636J88282L15646j76563o26549q57878j030574L6064n42172L93105
2055A0388997L42098j030828j166427n31246j01961M97799o82701K85722K36733
2046H238186j708557o74130J329522o27510p31455o52223k08100L99380O08506
2037E973619m44928K75134J206378Q44543j085790o64667n78512O89401j11934
$$ plain form
2028 6103244 5587173 4588232 2566181 3895129 3745312 1993971 2717075 3640512 3891638
2019 3891638 4147125 4024864 3937623 4372118 2863059 2667442 3056779 2750396 3154258 4073992
2009 4073992 3250837 2860615 2993244 4562392 4597937 4054556 4322837 4267145 3015026 2432480
1999 2432480 3648818 2602847 2914280 1686720 1304483 1291669 1571396 1574212 2950355
1990 2950355 2566689 1868209 1707521 1450844 1604103 2698695 3538338 2583156 3318516
1981 3318516 2981895 3038195 2873483 1599157 1253327 1360262 239026 1430836 1566004
1972 1566004 2006877 2229639 1137219 1086346 1928185 1550678 2414220 723761 720193 1555945
1962 1555945 956870 182770 1753549 1353349 778417 219885 601095 349431 909302
$$ packed form
2028F103244n16071r98941k022051J328948j49817j751341P23104R23437K51126
2019C891638K55487j22261q7241M34495j509059j95617L89337l06383M03862R19734
2009D073992q23155l90222J32629J569148L5545n43381K68281n5692j252119n82546
1999B432480J216338j045971L11433j227560l82237j2814K79727K816J376143
1990B950355l83666o98480j60688k56677J53259J094592Q39643r55182P35360
1981C318516l36621N6300j64712j274326l45830J06935j121236J191810J35168
1972A566004M40873K22762j092420n0873Q41839l77507Q63542j690459l568Q35752
1962A555945n99075p74100J570779m00200n74932n58532L81210k51664N59871
$$ plain form
1953 909302 729306 25310 550988 1869063 1966579 2313597 2534408 2855577 2119789 1627558
1943 1627558 1711978 47617 -140376 415253 851055 1361357 1656765 899197 883069 -307652
1933 -307652 -8018 190931 496259 1007422 1575415 277615 308046 1160224 873007 -443935
1923 -443935 141921 784634 1073146 1854862 1803304 996681 1061733 173709 390175 -640397
1913 -640397 -700844 1104545 609936 449179 1366701 1040816 1807254 1156822 -1129017 -1175478
1903 -1175478 279933 -252905 330844 810119 568333 -219733 -223228 788452 411051 374990
1893 374990 1755849 1424881 466012 1861416 1682679 1060317 1092495 215129 415437 745382
1883 745382 -633347 -129355 489323 -480944 363043 -99797 -476650 462566 291175 527723
$$ packed form
1953I09302j79996p03996N25678J318075R7516L47018K20811L21169p35788m92231
1943A627558Q4420j664361j87993N55629M35802N10302K95408p57568j6128j190721
1933c07652K99634J98949L05328N11163N67993j297800L0431Q52178k87217j316942
1923d43935N85856O42713K88512P81716n1558q06623O5052q88024K16466j030572
1913f40397o0447J805389m94609j60757R17522l25885P66438o50432k285839m6461
1903a175478J455411n32838N83749M79275k41786p88066l495J011680l77401l6061
1893C74990J380859l30968r58869J395404j78737o22362L2178q77366K00308L29945
1883G45382j378729N03992O18678r70267Q43987m62840l76853R39216j71391K36548
$$ plain form
1873 527723 236058 -802202 -594816 -575801 -262044 -149695 353060 20347 873491 481855
1863 481855 1328492 378580 486068 1185271 676839 -225476 575973 529667 248757 -193598
1853 -193598 -479952 -408918 -405326 -614041 823010 1579805 1951009 2522290 2071151 422878
1843 422878 904343 130042 -1386946 -1109478 -128954 362594 1085999 1487635 2433669 2599103
1833 2599103 1938712 2109702 633149 1479957 1253478 424579 2032746 2147321 478991
1824 478991 969246 -357478 -987327 -623187 -89460 160343 70131 -353582 430542 -45394
1814 -45394 -221303 -115985 1385357 5181 -61591 34091 -379306 -71032 1517776 125390
1804 125390 186780 1130280 467947 -268928 811773 299816 -840824 440016 1258532
$$ packed form
1873E27723k91665j038260K07386J9015L13757J12349N02755l32713Q53144l91636
1863D81855Q46637r49912J07488O99203n08432r02315Q01449m6306k80910m42355
1853a93598k86354P1034L592k08715J437051P56795L71204N71281m51139j648273
1843D22878M81465p74301j516988K77468R80524M91548P23405M01636R46034J65434
1833B599103o60391J70990j476553Q46808k26479q28899J608167J14575j668330
1824D78991M90255j326724o29849L64140N33727K49803r0212m23713P84124m75936
1814d5394j75909J05318J501342j380176o6772R5682m13397L08274J588808j392386
1804A25390O1390R43500o62333p36875J080701n11957j140640J280840Q18516
$$ plain form
1795 1258532 -913418 -869559 252504 1375649 331049 140493 1147492 457394 215720
1786 215720 818670 532550 435699 839482 104385 -9570 -676805 -1648760 -1472417 -786
1776 -786 573341 50309 158762 182609 444334 244756 909542 -60722 -67297 -347342 122437
1765 122437 -598107 278674 1636146 199234 -1676999 -565436 -147598 -350665 809057
1756 809057 340162 185004 1668715 1162996 -794790 -456634 -549920 82875 -447951 -984534
1746 -984534 -114747 -54397 -1090289 -567813 -369156 -1927526 -834685 -583733 -2021959
1737 -2021959 -998787 710527 1075355 18325 621590 498112 826388 -4370 153690
1728 153690 -408640 -390829 177682 -449967 -1313831 -316384 -1162692 -954983 -437260 150582
$$ packed form
1795A258532k171950M3859J122063J123145j044600j90556J006999o90098k41674
1786B15720O02950k86120r6851M03783p35097j13955o67235r71955J76343J471631
1776g86N74127n23032J08453K3847K61725j99578O64786r70264o575k80045M69779
1765A22437p20544Q76781J357472j436912j876233J111563M17838k03067J159722
1756H09057m68895j55158J483711n05719j957786L38156r3286O32795n30826n36583
1746i84534Q69787O0350j035892N22476J98657j558370J092841K50952j438226
1737b021959J023172J709314L64828j057030O03265j23478L28276q30758J58060
1728A53690n62330J7811N68511o27649q63864R97447q46308K07709N17723N87842
$$ plain form
1718 150582 -442046 -1226380 -859178 117009 -949928 -66885 224581 -1379821 -848069
1709 -848069 -67473 66576 -132961 -217151 4398 -194699 -358549 -89318 1220394 948808
1699 948808 611024 -130783 -961774 -1217639 -602860 -252604 -270477 -1092276 -1224481 -1560789
1689 -1560789 -1771103 310027 1046429 -520533 -58217 417281 -755564 -719774 603218
1680 603218 763116 -739393 405382 69410 -2350473 -528716 1542981 -208662 85311
1671 85311 501701 42778 135700 -1013320 -253420 1215855 -581043 -977847 85062
1662 85062 -908577 -1216766 248749 830524 -320403 -139420 1277304 -16804 -1490127
1653 -1490127 225774 1941992 272939 -505176 254045 -53730 -170674 476766 1082956
$$ packed form
1718A50582n92628p84334L67202R76187j066937Q83043K91466j604402N31752
1709h48069P80596J34049j99537q4190K21549j99097j63850K69231J309712k71586
1699I48808l37784p41807q30991k55865O14779L50256j7873q21799j32205l36308
1689a560789k10314K081130P36402j566962M62316M75498j172845L5790J322992
1680F03218J59898j502509J144775l35972k419883J821757K071697j751643K93973
1671H5311M16390m58923R2922j149020P59900J469275j796898l96804J062909
1662H5062r93639l08189J465515N81775j150927J80983J416724j294108j473323
1653a490127J715901J716218j669053p78115P59221l07775j16944O47440O06190
$$ plain form
1644 1082956 177437 -673514 54529 504293 -990238 -1194830 1355020 -557275 -2054831
1635 -2054831 -55828 -1176703 -698352 1112591 -610713 1195430 2576453 669564
1627 669564 583535 -659680 -1234248 -1049061 -1896962 -1281982 -941773 -1011130 427383 -136501
1617 -136501 -627929 983199 -28667 -179279 411255 26945 626519 575191 -508964
1608 -508964 -351921 -492871 -1006154 -1368653 -1329211 -1287205 -470982 671393 115608 -245830
1598 -245830 47360 1476674 362478 -1961183 -207775 219982 -1606892 -781703 1599675
1589 1599675 95631 -187283 482235 -225724 -491448 -50571 -333997 81008 -260977
1580 -260977 -735389 699404 -83893 -1733866 102671 405678 -1266760 -960735 -943166
$$ packed form
1644A082956r05519q50951P28043M49764j494531k04592K549850j912295j497556
1635b054831J999003j120875M78351J810943j723304J806143J381023j906889
1627F69564q6029j243215n74568J85187q47901O14980L40209o9357J438513n63884
1617a36501m91428J611128j011866j50612N90534l84310N99574n1328j084155
1608e08964J57043j40950n13283l62499L9442M2006Q16223J142375n55785l61438
1598b45830K93190J429314j114196k323661J753408M27757j826874Q25189K381378
1589A599675j504044k82914O69518p07959k65724M40877k83426M15005l41985
1580b60977m74412J434793p83297j649973J836537L03007j672438L06025J7569
$$ plain form
1571 -943166 -199872 533177 719029 1372192 -287042 -1435963 -151695 -909549 -182304
1562 -182304 823489 -1270941 -1766236 -1409774 -1031425 76303 -222003 528184 488987
1553 488987 -599447 1153601 1267106 -251520 249600 665399 -1369369 -2559377 -2529241
1544 -2529241 -840661 -299987 -911315 -311764 -143096 -552128 673155 1335033 -128707
1535 -128707 -526121 -87368 264500 -22488 38565 -323785 -788138 -1640484 -877507 291562
$$ packed form
1571i43166P43294P33049J85852O53163j659234j148921J284268p57854P27245
1562a82304J005793k094430m95295L56462L78349J107728k98306P50187l9197
1553D88987j088434J753048J13505j518626N01120M15799k034768j190008L0136
1544b529241J688580N40674o11328N99551J68668m09032J225283O61878j463740
1535a28707l97414M38753L51868k86988O1053l62350m64353q52346P62977J169069
$$ [...]
##END NTUPLES=NMR SPECTRUM
##END=
