##TITLE=1H_EC-3029(III-2)
 CDCl3
 40 sc, 
 17.11.2021
##JCAMPDX= 6.0         $$ Bruker NMR JCAMP-DX V2.0
##DATA TYPE= NMR SPECTRUM
##DATA CLASS= NTUPLES
##ORIGIN= UXNMR, Bruker Analytische Messtechnik GmbH
##OWNER= root
$$ XWIN-NMR		Version 3.5
$$ Wed Nov 17 12:07:48 2021 Russian Standard Time (UT+4h)  she@DPX200
##.OBSERVE FREQUENCY= 200.131346
##.OBSERVE NUCLEUS= ^1H
##.ACQUISITION MODE= SIMULTANEOUS
##.ACQUISITION SCHEME= undefined
##.AVERAGES= 8
##.DIGITISER RES= 18
##SPECTROMETER/DATA SYSTEM= spect
##.PULSE SEQUENCE= zg30
##.SOLVENT NAME= Acetone
##.SHIFT REFERENCE= (INTERNAL, Acetone, 0, 15.7248)
##AUDIT TRAIL= $$ (NUMBER, WHEN, WHO, WHERE, WHAT)
$$ ##TITLE= Audit trail, XWIN-NMR		Version 3.5
$$ ##JCAMPDX= 5.01
$$ ##ORIGIN= Bruker BioSpin GmbH
$$ ##OWNER= she
$$ F:/spectra/data/she/nmr/H-F/1/pdata/1/auditp.txt
$$ ##AUDIT TRAIL=  $$ (NUMBER, WHEN, WHO, WHERE, WHAT)
(   1,<2021-11-17 12:03:51.85 +0400>,<she>,<DPX200>,
      <created by zg, POWCHK disabled, PULCHK disabled
       configuration hash MD5:
       00 E9 B6 7A A2 85 ED C7 34 08 36 98 17 FE 4E 26
       data hash MD5: 16K
       13 D2 0E 3A 46 59 B6 14 25 29 E7 CD 39 F4 28 60>)
(   2,<2021-11-17 12:04:05.06 +0400>,<she>,<DPX200>,
      <Start of raw data processing
       efp BC_mod = 2 LB = 0.24 FT_mod = 6 PKNL = 1 PHC0 = -15514.54 PHC1 = 16.20081 SI = 16K 
       data hash MD5: 16K
       BB 90 9B AD 3B CF 4B FE 00 A4 47 4B 08 DC 83 8D>)
(   3,<2021-11-17 12:04:22.42 +0400>,<she>,<DPX200>,
      <pk PHC0 = 1.456312 PHC1 = -3.2 
       data hash MD5: 16K
       83 11 F9 6B 0D F2 A3 52 72 B3 C2 D3 1B 61 BD A5>)
(   4,<2021-11-17 12:04:25.50 +0400>,<she>,<DPX200>,
      <abs ABSG = 5 
       data hash MD5: 16K
       3D 2B 56 5D 56 59 69 64 7C 24 90 BD AB 8E 2A 61>)
$$ ##END=
$$ 
$$ hash MD5
$$ 8F 69 70 E9 46 A7 E0 AE 2B 44 BB 8F 7D 48 24 5F
##$RELAX= 
##$RELAX= 
##$RELAX= 
##$RELAX= 
##$RELAX= 
##$RELAX= 
$$ Bruker specific parameters
$$ --------------------------
##$DU= <F:/spectra>
##$EXPNO= 1
##$NAME= <H-F>
##$PROCNO= 1
##$TYPE= <nmr>
##$USER= <she>
##$AMP= (0..31)
100 100 100 100 100 100 100 100 100 100 100 100 100 100 100 100 100 100 
100 100 100 100 100 100 100 100 100 100 100 100 100 100 
##$AQSEQ= 0
##$AQ_mod= 1
##$AUNM= <au_zg>
##$AUTOPOS= <>
##$BF1= 200.13
##$BF2= 200.13
##$BF3= 200.13
##$BF4= 200.13
##$BF5= 200.13
##$BF6= 200.13
##$BF7= 200.13
##$BF8= 200.13
##$BYTORDA= 1
##$CFDGTYP= 0
##$CFRGTYP= 5
##$CHEMSTR= <none>
##$CNST= (0..31)
1 1 145 1 1 1 1 1 1 1 1 1 1 1 1 1 1 1 1 1 1 1 1 1 1 1 1 1 1 1 1 1 
##$CPDPRG= <>
##$CPDPRG1= <>
##$CPDPRG2= <>
##$CPDPRG3= <>
##$CPDPRG4= <mlev>
##$CPDPRG5= <mlev>
##$CPDPRG6= <mlev>
##$CPDPRG7= <mlev>
##$CPDPRG8= <mlev>
##$CPDPRGB= <>
##$CPDPRGT= <>
##$D= (0..31)
0 1.2 0 0 0 0 0 0 0 0.06 0 0.03 0 0 0 0 0.0002 0 0 0 0 0 0 0 0 0 0 0 0 
0 0 0 
##$DATE= 1637136231
##$DBL= (0..7)
120 120 120 120 120 120 120 120 
##$DBP= (0..7)
150 150 150 150 150 150 150 150 
##$DBP07= 0
##$DBPNAM0= <>
##$DBPNAM1= <>
##$DBPNAM2= <>
##$DBPNAM3= <>
##$DBPNAM4= <>
$$ [...]
##$SUBNAM2= <"">
##$SUBNAM3= <"">
##$SUBNAM4= <"">
##$SUBNAM5= <"">
##$SUBNAM6= <"">
##$SUBNAM7= <"">
##$SUBNAM8= <"">
##$SUBNAM9= <"">
##$SW= 18.0517287032376
##$SWIBOX= (0..15)
0 0 2 0 0 0 0 0 0 0 0 0 0 0 0 0 
##$SW_h= 3612.71676300578
##$TD= 16384
##$TD0= 1
##$TE= 0
##$TE2= 300
##$TE3= 300
##$TEG= 300
##$TL= (0..7)
0 120 120 120 120 120 120 120 
##$TP= (0..7)
150 150 150 150 150 150 150 150 
##$TP07= 0
##$TPNAME0= <>
##$TPNAME1= <>
##$TPNAME2= <>
##$TPNAME3= <>
##$TPNAME4= <>
##$TPNAME5= <>
##$TPNAME6= <>
##$TPNAME7= <>
##$TPOAL= (0..7)
0.5 0.5 0.5 0.5 0.5 0.5 0.5 0.5 
##$TPOFFS= (0..7)
0 0 0 0 0 0 0 0 
##$TUNHIN= 0
##$TUNHOUT= 0
##$TUNXOUT= 0
##$USERA1= <user>
##$USERA2= <user>
##$USERA3= <user>
##$USERA4= <user>
##$USERA5= <user>
##$V9= 5
##$VALIST= <valist>
##$VCLIST= <CCCCCCCCCCCCCCC>
##$VD= 0
##$VDLIST= <DDDDDDDDDDDDDDD>
##$VPLIST= <PPPPPPPPPPPPPPP>
##$VTLIST= <TTTTTTTTTTTTTTT>
##$WBST= 1024
##$WBSW= 4
##$XGAIN= (0..3)
0 0 0 0 
##$XL= 0
##$YL= 0
##$YMAX_a= 230280
##$YMIN_a= -402756
##$ZGOPTNS= <>
##$ZL1= 120
##$ZL2= 120
##$ZL3= 120
##$ZL4= 120
##$ABSF1= 15.72926
##$ABSF2= -2.322589
##$ABSG= 5
##$ABSL= 3
##$ALPHA= 0
##$AQORDER= 0
##$ASSFAC= 0
##$ASSFACI= 0
##$ASSFACX= 0
##$ASSWID= 0
##$AUNMP= <proc_1d>
##$AZFE= 0.1
##$AZFW= 0.1
##$BCFW= 0
##$BC_mod= 2
##$BYTORDP= 0
##$COROFFS= 0
##$CY= -3
##$DATMOD= 1
##$DC= 0
##$DFILT= <>
##$DTYPP= 0
##$F1P= 0
##$F2P= 0
##$FCOR= 1
##$FTSIZE= 16384
##$FT_mod= 6
##$GAMMA= 0
##$GB= 0
##$INTBC= 1
##$INTSCL= 0
##$ISEN= 128
##$LB= 0.24
##$LEV0= 0
##$LPBIN= 0
##$MAXI= 10000
##$MC2= 0
##$MEAN= 0
##$ME_mod= 0
##$MI= 1.114404
##$NCOEF= 0
##$NC_proc= -7
##$NLEV= 6
##$NOISF1= 3.799351
##$NOISF2= 2.8
##$NSP= 0
##$NTH_PI= 0
##$NZP= 0
##$OFFSET= 15.72485
##$PC= 1
##$PHC0= -15513.08
##$PHC1= 13.00081
##$PH_mod= 1
##$PKNL= yes
##$PPARMOD= 0
##$PSCAL= 0
##$PSIGN= 0
##$REVERSE= no
##$SF= 200.130005343656
##$SI= 16384
##$SIGF1= 3
##$SIGF2= 2
##$SINO= 5.538805
##$SIOLD= 16384
##$SREGLST= <1H.CDCl3>
##$SSB= 0
##$STSI= 16384
##$STSR= 0
##$SW_p= 3612.71676300578
##$SYMM= 0
##$S_DEV= 0
##$TDeff= 16384
##$TDoff= 0
##$TI= <>
##$TILT= no
##$TM1= 0
##$TM2= 0
##$TOPLEV= 0
##$USERP1= <user>
##$USERP2= <user>
##$USERP3= <user>
##$USERP4= <user>
##$USERP5= <user>
##$WDW= 1
##$XDIM= 16384
##$YMAX_p= 390406187
##$YMIN_p= -543636
$$ End of Bruker specific parameters
$$ ---------------------------------
##NTUPLES= NMR SPECTRUM
##VAR_NAME=  FREQUENCY,     SPECTRUM/REAL,   SPECTRUM/IMAG
##SYMBOL=    X,             R,               I
##VAR_TYPE=  INDEPENDENT,   DEPENDENT,       DEPENDENT
##VAR_FORM=  AFFN,          ASDF,            ASDF
##VAR_DIM=   16384,         16384,           16384
##UNITS=     HZ,            ARBITRARY UNITS, ARBITRARY UNITS
##FACTOR=    0.220516191357247, 1,           1
##FIRST=     3147.01425467485, 0,            0
##LAST=      -465.702508330925, 0,           0
##MIN=       -465.702508330925, -543636,     0
##MAX=       3147.01425467485, 390406187,    0
$$ Real data points
##PAGE= N=1
##DATA TABLE= (X++(R..R)), XYDATA
$$ [...]
9429 451921 349509 402972 261539 373605 460374 621662 515672 356339 270626 534038
9419 534038 632620 437783 215351 159308 335409 362212 342251 312120 383852 431343 257453
9408 257453 302957 365401 195936 78044 120455 269613 196102 379535 445208 335426 483123
9397 483123 542610 457485 428291 486298 462557 432538 308491 404132 474149 451663 377306
9386 377306 318470 431419 438919 576705 592921 613305 693319 714997 599698 527853 354063
9375 354063 545091 542595 585484 679610 541078 550980 682141 505489 221889 417864 348433
9364 348433 396289 237908 342804 297138 244108 549682 711828 629603 458188 479432 506877
9353 506877 487186 405638 470162 424119 473545 403138 459402 320176 349242 474037 421424
9342 421424 410430 471472 402510 264497 429094 549179 600424 519736 390635 300833 375959
9331 375959 366773 386044 319721 445686 618136 693181 474569 429648 433371 594013 431417
9320 431417 395050 267379 182774 331358 489997 510391 534584 554025 207772 408537 522115
9309 522115 461212 497364 687409 644171 578483 664284 570446 530517 557745 721330 677179
9298 677179 644381 506811 467611 665155 547986 569482 614140 421736 427147 525782 424145
9287 424145 681574 702667 731279 869946 836181 611788 542827 556125 422622 464016 512516
9276 512516 699313 846142 712237 845245 740306 573964 892975 936824 901086 756004
9266 756004 633785 781966 709598 575519 658637 668838 646765 852555 894922 779506 841623
9255 841623 751937 698018 746831 590754 768287 784779 918062 805196 769848 1054942 1138937
9244 1138937 965029 921519 1139108 1028431 1053063 872793 983985 1091244 1031226 973978
9234 973978 1118869 1144064 1038386 1079558 1205596 1284548 1155551 1192787 1401328 1618363
9224 1618363 1683029 1629845 1838813 1820920 1797770 2034872 2189427 2374119 2376131 2595732 2557704
9213 2557704 2498435 2343859 2239253 2089536 1981218 2091414 1948716 2029045 2155603 2078497
9203 2078497 2186435 2375115 2389452 2476301 2740091 2791943 2893050 3105204 3327861 3695290
9193 3695290 3939146 4094642 4147036 4190466 4316581 4464233 4374302 4204797 4071187 3971737
9183 3971737 3497835 3404920 3342688 3204131 3111873 3227314 3257480 3383836 3291466 3171218
9173 3171218 3069550 2919817 2588827 2367174 2414854 2398327 2384830 2287789 2446067 2392029
9163 2392029 2425134 2349164 2561617 2600840 2605360 2716186 2790313 2957746 2943406 2839895 2679027
9152 2679027 2891703 3098570 3057284 2749860 2389242 2325622 2293181 2109209 1942067 1898662
9142 1898662 1807760 2063313 1864767 1670149 1724082 1690849 1650332 1656312 1833642 1661927 1645313
9131 1645313 1805487 1715642 1892125 2033249 1992388 2101301 1973784 1721682 1752679 1821706
9121 1821706 1959788 1907812 1907508 1764985 1898971 1835674 1928006 1921667 1787469 1466033 1254573
9110 1254573 1559965 1644189 1322526 1319745 1235662 1315041 1770664 1440872 1175684 1388340
9100 1388340 1480395 1251119 1233625 1307360 1351586 1287999 1491838 1445984 1301296 1203190 1159629
9089 1159629 1237331 1333516 1256204 1238378 1365857 1529102 1503637 1369505 1599330 1615939 1459554
9078 1459554 1394033 1185566 1470135 1564281 1224703 1153965 987907 955494 1061011 1108855
9068 1108855 1089373 1293882 1095382 790272 1119005 1244311 1119210 923866 919168 1064193
9058 1064193 1168937 1179172 1065494 1167689 1225220 1160253 1320439 1331426 1092152 1108556
9048 1108556 1179130 1259311 1142511 1088226 1210443 1138524 1112975 1243650 1100178 1165713 1214196
9037 1214196 1215355 1340447 1062145 1014341 961047 928320 1123413 1195688 1085460 1265404 1150576
9026 1150576 864626 853124 888433 1179678 1251960 1284471 1207114 1137366 985515 950016 1170542
9015 1170542 1167913 1198626 1322672 1417676 1420244 1462945 1408625 1454892 1426069 1537717 1398093
9004 1398093 1321128 1550420 1697804 1548909 1498925 1613151 1440778 1324623 1603145 1533606
8994 1533606 1468734 1480219 1676787 1534341 1530522 1784668 1851729 1556863 1530051 1752555 1678632
8983 1678632 1729329 1552092 1437383 1630353 1705193 1732678 1565679 1608524 1610107 1557620 1661891
8972 1661891 1626711 1760871 1761386 1583787 1548153 1670937 1732348 1553500 1591252 1645383 1783299
8961 1783299 1652247 1610078 1588047 1732571 1699368 1493745 1802567 1715953 1467450 1314589
8951 1314589 1399051 1381663 1491287 1456874 1279334 1384793 1504345 1487588 1518512 1367501
8941 1367501 1487245 1778702 1820877 1800222 1809229 1519002 1563202 1642373 1749027 1670500 1683907
8930 1683907 1723508 1702504 1677746 1512295 1508193 1505693 1476135 1730751 1757037 1812785 1818751 1681204
8918 1681204 1861343 1928242 1944236 2012307 1999800 1884815 1885787 1886979 1945219 2056904 2197517
8907 2197517 2263620 2130916 2045978 1913468 2072885 1982754 2100693 2211612 2298139 2314903
8897 2314903 2252423 2194420 2412669 2373488 2178412 2189385 2355539 2286078 2418957 2466897 2396180
8886 2396180 2369696 2458882 2346728 2360904 2386966 2418365 2492651 2777927 2676343 2558291 2701641
8875 2701641 2671784 2712244 2760050 2775143 2868822 2993240 3179069 3077501 3185717 3216687 2965417
8864 2965417 3213129 3289178 3360267 3364437 3416854 3537316 3656487 3640575 3626108 3567531 3574704
8853 3574704 3587348 3516980 3402542 3576059 3614135 3827489 3883945 3990535 4025393 4016154 4043015
8842 4043015 4225439 4180012 4084702 4077283 4111394 4215194 4105795 4168483 4143480 4297806 4263416
8831 4263416 4459591 4454785 4485677 4770456 4568888 4572635 4545457 4703331 4750749 4966968 5173471
8820 5173471 5111372 5062696 5253754 5354126 5354689 5200302 5200250 5163492 5387696 5382471 5553142 5604067
8808 5604067 5780946 5924256 6052158 6192389 6413726 6469909 6520979 6667604 6878911 6869950
8798 6869950 6998434 7134623 7254922 7609346 7842322 7930796 8195825 8303107 8544817 8728992
8788 8728992 8926415 9070198 9243362 9424483 9661873 9912295 9952107 9953329 10233201 10576991
8778 10576991 10833515 11147427 11464563 11671729 12070064 12233709 12824476 13128043 13387787
8769 13387787 13897889 14142263 14140712 14312872 14872664 15340526 15467081 15888763 16042059 16751652
8759 16751652 17247458 17586377 18182000 18984566 19475183 19954569 20432854 21090312 21690731
8750 21690731 22542651 23232725 23862150 24675407 25276350 25917905 26704948 27677683 28279327
8741 28279327 28854220 30149881 31565139 32814890 34313688 35815386 37773144 40105606
8733 40105606 43000256 46176814 49665656 53586721 58468859 64658278 72335385 80306172
8725 80306172 89173082 98991980 111084095 125649811 141460315 158658359 181044962
8718 181044962 205994431 231963165 251801410 278908510 289136758 260128700 204960124
8711 204960124 159024823 132305740 114272699 102937337 94095615 87971363 82891388
8704 82891388 78593907 74329446 71225910 68270902 66382899 64935150 64288747 63607658
8696 63607658 63623926 62823273 62444228 61715030 60618534 58552617 56850530 55062748 53678208
8687 53678208 52678781 52372414 52000617 51597161 51559952 52356745 53339192 54190711 53590587 52825592
8677 52825592 52067319 52033489 52484307 53389901 54599372 56024168 57096527 58319436 59502421
8668 59502421 61077168 62389348 63719320 65072305 66764232 68737428 70745539 72311209
8660 72311209 72889330 72220602 70106052 66538486 62803037 59486322 57211161 55728630
8652 55728630 55175074 55465642 56874365 58588456 61008850 63876304 67076657 69204683
8644 69204683 70606537 72682384 75761169 77531751 76046599 72379219 67318304 62519194
8636 62519194 58925081 56632315 55280216 54565369 54245862 54687474 55731331 57481017 58341596
8627 58341596 58482376 58675076 59229115 60098216 61238017 62538337 63771034 64185385 63288376
8618 63288376 61324198 58355608 55057217 52206106 50372320 49309663 49044287 49346037
8610 49346037 50734290 52227656 54177938 56551406 58682261 60289985 61958065 64029242
8602 64029242 66029057 66433517 64673942 61309419 56555388 51772191 47368121 44197461
8594 44197461 41609112 39419893 38020622 36886187 36320208 36001813 35088402 33069897 31180166
8585 31180166 29884983 29070452 28525863 27963534 27411704 26836151 26476325 26288273 26181620
8576 26181620 25796395 25606669 25500426 25363350 25113621 25420822 25585080 26016552 26545900
8567 26545900 27002403 27122114 27165383 27043328 27162348 27051724 27033246 27324196 27580859 27923901
8557 27923901 28272242 28261244 28560279 28841545 28931020 28917307 29054055 29272484 29723953 30291742
8547 30291742 31439648 32556760 33516078 34823867 36312088 37905895 39928701 42010240
8539 42010240 44262521 46861871 49303198 51704264 54284802 56367594 57578074 57809678
8531 57809678 57214294 56077021 55067045 54673575 55571776 56701518 57760395 59186919 60254379
8522 60254379 60404257 59459350 57477960 54418490 50873488 47705344 45209748 43229606
8514 43229606 41720321 40627561 39670616 38911548 38297951 38212859 38251271 38705286 39157546
8505 39157546 39715184 40647396 41885981 43228482 44732053 46732825 48884804 51100217
8497 51100217 53362706 56143914 58457214 60177147 62063404 63704589 64515435 64476424 63812020
8488 63812020 62077319 60283710 59052674 58284557 58447836 58850010 59189564 59309334 59039776
8479 59039776 57538888 55030068 51306538 47099446 42752147 39231748 36312155 34186724
8471 34186724 32454780 31227046 30078644 29091804 28541573 27884982 27429682 27510526 27512067
8462 27512067 27531986 27511634 27599414 27603733 27609524 27798150 27938328 28218711 28672269 29171007 29681602
8451 29681602 29845224 29969451 29896284 29951010 29704589 29343776 28956838 28894094 28957470 29013207
8441 29013207 29181597 29334355 29232164 29227970 29269186 28937633 28966841 29056945 29093151 29612796
8431 29612796 30518917 31477321 32129506 33046397 34215371 35406932 36298683 37434409 38978024
8422 38978024 39321600 38410775 36644319 35048871 34269487 33779493 33759667 34024558 33977992
8413 33977992 34293062 34596591 34615031 33712755 32094955 29977128 28213037 27014655 26209099
8404 26209099 25829629 25620213 25280737 25325449 25456354 25417782 25451328 25662083 26079569 26665978
8394 26665978 27492396 28530974 29751986 31114380 32833672 34733505 36740718 38836772
8386 38836772 41055068 43150080 45360451 47319053 49052764 49981764 49311837 47387624
8378 47387624 44900465 43254797 42532933 42251629 42121007 42319764 42569510 42520405 42075630
8369 42075630 40598259 37925648 34680052 31329636 28920996 26967461 25359982 24025361
8361 24025361 23233551 22659104 22302947 21911516 21338082 21134982 20978464 21100213 21280837
8352 21280837 21799683 22102567 22523417 23082793 23855982 24570654 25595821 26679195 27259804
8343 27259804 27983031 28584763 29529787 29958345 29295991 28188738 26986254 26168313 25646301
8334 25646301 25608636 25605033 25623235 25823826 26004531 25914872 25159489 23886666 22243584 20730106
8324 20730106 19646822 19015738 18475070 18282386 18143380 17925541 17772484 18005634 17914595
8315 17914595 17834746 17861612 18168136 18450297 18778317 19036912 19085233 19135448 19009248 18943225
8305 18943225 18700024 18735935 18532607 18334935 18386983 18405840 18562593 18625950 18355325 18168379
8295 18168379 17876988 17571236 17186058 16805360 16782481 16718676 16716333 16826975 16961086 17118518
8285 17118518 17439128 17899525 18666396 19724517 20828531 22049942 23301497 24926814 26709052
8276 26709052 28087016 29534870 31246724 33062291 34443177 35145489 35529534 35604370 35299132
8267 35299132 34488557 33130308 31645793 30530929 30121482 30007582 30142681 30677574 31396810
8258 31396810 31975545 32729650 33209564 33409535 33223899 32233293 31273491 29647905 27697482
8249 27697482 25529503 23616411 22029281 20746597 20022998 19730176 19711155 19788506 20193009
8240 20193009 20958091 21838707 22741676 23725602 24281435 24831252 25565954 26233152 26622155
8231 26622155 26267721 25817291 25343623 24629058 23393632 22095754 21042162 20608853 20175994
8222 20175994 19975305 20193214 20679170 21116300 21327670 22076286 22454510 22623539 22516748
8213 22516748 21747663 20678374 19050068 17136118 15049072 13246421 11764092 10877086
8205 10877086 10101577 9288352 8854554 8346047 7915803 7307061 6855936 6642560 6677722 6345807
8195 6345807 6247645 6013965 5646860 4205918 4099735 4535333 4419130 4547444 4164679 4536429
8185 4536429 4336587 4156218 3891254 3963292 4061749 4130081 4101160 3831368 3733955 3655677 3462608
8174 3462608 3366861 3220625 3118528 3126936 3068451 3235114 3279685 3342704 3390612 3163144 2942538
8163 2942538 2826533 2944710 2818052 2766687 2676488 2573589 2529073 2706571 2772803 2446417
8153 2446417 2334262 2306453 2389558 2269470 2302081 2178200 2210749 2513870 2435912 2303457
8143 2303457 2292971 2204385 2316041 2243321 2249150 2314963 2210069 2040459 2011209 1843327 1965327
8132 1965327 2108855 1994466 2009660 2025841 2041112 1964338 1949634 1942446 2132043 2179208 2076549
8121 2076549 2128172 2168592 2087746 1974075 1881851 1785857 1778303 1743013 1750593 1612489 1682634
8110 1682634 1765062 1687046 1469523 1429337 1613678 1587095 1724731 1519954 1337078 1432442
8100 1432442 1561883 1492367 1655272 1578881 1506235 1584746 1449957 1292661 1292293 1399772 1367428
8089 1367428 1481574 1459937 1173539 1122108 1243809 1287523 1454712 1452591 1358690 1266908 1201744
8078 1201744 1308283 1373319 1493896 1481393 1362405 1451040 1446253 1520165 1554065 1431240 1321133
8067 1321133 1341845 1283824 1172147 1216280 1317682 1419413 1446631 1557149 1602826 1532853 1533032
8056 1533032 1637799 1581827 1699230 1681180 1620273 1767457 1744279 1944009 1852470 2016568
8046 2016568 1992621 1957051 1730693 1412488 1433751 1367331 1523171 1353630 1415013 1573003
8036 1573003 1480091 1493238 1346024 1246891 1321455 1264743 1197834 1174096 1316495 1280476 1332168
8025 1332168 1585153 1579373 1608188 1644949 1734147 1818602 1617587 1592595 1794823 1869026 1755740
8014 1755740 1661173 1430976 1341447 1332154 1329900 1260079 1102130 1210691 1235804 901522 826835
8003 826835 1092531 922177 1008053 905987 876106 792767 724147 560238 648589 593919 477590
7992 477590 398681 367488 396207 408428 693650 766187 854802 786334 654112 558749 445587
7981 445587 290458 406014 688060 692335 566558 469561 336002 295676 481208 295905
7971 295905 180086 258226 451603 683121 660030 524091 496490 520016 360917 368713 467573
7960 467573 453235 343776 530897 567693 709929 588978 576387 729949 475505 586072
7950 586072 554254 360560 646218 456699 579309 620674 762617 741448 761514 675991 646610
7939 646610 502865 467347 451507 452178 440047 537071 687065 388020 328525 489494 555786
7928 555786 432731 478963 463496 569916 644507 618204 377665 524375 563442 491134 471691
7917 471691 462271 534108 300200 185599 186527 174061 212720 230697 201073 341038 308577 424801
7905 424801 554034 598806 451261 265012 107170 235525 278232 93861 289986 457377
7895 457377 255885 178867 296940 283760 398693 298035 332592 353149 360050 373536 269007
7884 269007 149570 326988 415047 344176 408543 378423 475604 517406 376457 364737 182298
7873 182298 180930 172318 73803 268195 417063 158465 131196 307278 315659 528352 416263
7862 416263 203112 229156 180658 316422 239646 96330 197292 484965 254943 464065
7852 464065 454231 332058 291845 170384 355037 375023 287994 285952 333518 404005 210950
7841 210950 146197 294764 464942 389405 389079 302361 240023 336139 300543 59433 61572 -34989
7829 -34989 -10944 51281 92283 359538 216272 368608 139622 49096 79145 -20440 33473
7818 33473 214987 132369 -9801 119936 170273 146127 145175 -39558 -22985 -74522 -162070
7807 -162070 -1052 -115387 -31512 8322 35000 33426 -12693 105501 41351 -197372 192399
7796 192399 1073877 672422 420573 269970 137628 226048 326572 394528 380647 350709
7786 350709 238040 490337 331446 -138449 -79383 234175 228334 167578 267385 162830 128964
7775 128964 232114 387721 224337 244093 164129 129473 181330 179546 136700 80721 -12818
7764 -12818 -92549 -165732 -122953 213561 306281 157549 103000 112127 -80291 47389 351317
7753 351317 277329 61975 -63087 -70770 19296 -10804 -120952 -128688 118567 100305 -19061
7742 -19061 124147 25152 -95894 103277 258669 348307 253377 269758 152584 180378 232893
7731 232893 155550 318418 282027 220803 397894 333951 421135 334224 378291 470416 258499
7720 258499 228439 160875 145936 80074 70232 59211 217443 363389 300924 82779 103627
7709 103627 119653 10782 136901 16651 -56022 80540 -37476 -6172 -56596 -122152 -14105
7698 -14105 -85382 -61639 51373 13726 -20227 113510 192522 207316 352089 223332 31689
7687 31689 25333 13603 -14705 40310 294 -71655 57494 219139 91012 46211 177409
7676 177409 220315 469953 212416 10236 -28325 66431 24572 -4618 86034 142730 99789
7665 99789 185126 117067 167476 75735 215582 224679 -10336 159413 56840 111566 240408
7654 240408 292465 258258 226380 182452 14258 79235 117916 148377 143231 -13849 -48634
7643 -48634 58782 173824 128903 130743 72744 137370 25970 -36002 38010 104012 30784
7632 30784 79743 155320 141952 51002 269661 211680 171100 306145 340923 172120 311183
7621 311183 411901 268123 337241 365672 436889 437004 141610 79142 71389 54082 432083
7610 432083 396746 295566 179086 202880 273715 203652 287708 341715 499866 429534 287794
7599 287794 30444 -84864 -54410 -55272 -190065 -129171 171485 265620 300720 321875 422849
7588 422849 338249 321937 396749 573259 372675 234718 346078 339147 433541 379311 610583
7577 610583 558617 303239 438872 345670 408331 466168 263514 285629 249677 189255 213420
7566 213420 286158 419353 399374 532236 562007 684289 642933 658911 555729 692255 689931
7555 689931 438897 372776 613069 758018 726191 767421 493185 300976 307602 417734 480637
7544 480637 461625 523099 407617 492321 389437 444766 428527 452458 499858 551539 755625
7533 755625 818315 891564 791413 646865 521654 540796 510819 620486 711183 745343 793637
7522 793637 782149 582005 498031 594148 473481 434905 435481 453534 446383 516302 743424 724461
7510 724461 741272 703508 632354 484981 546141 543198 631817 569778 575412 551906 461821 536112
7498 536112 588105 412176 579636 515379 431454 635743 603097 262773 235066 211846 217345
7487 217345 223043 290276 255068 125186 203668 369839 334501 86028 117622 148986 236239
7476 236239 244287 247282 151388 196200 -11535 -1091 200566 351527 303686 126297 121029
7465 121029 131057 176654 104035 137729 -23299 -26303 215185 380402 389130 209024 304897
7454 304897 263880 216229 45884 99526 159190 62683 42319 40035 162693 93549 -29142
7443 -29142 -59141 -5287 -21986 -68747 49671 30667 43884 -76181 35080 -17526 -54278
7432 -54278 45860 103786 173359 298408 268413 178873 134996 -50802 -153311 -162821 -144604
7421 -144604 -80176 73516 -184365 -285663 -341694 -148245 -160821 -67107 -118028 -284494 -199730
7410 -199730 -89163 -23767 -124343 36952 255840 312929 216795 90524 116915 211306 157502
7399 157502 193112 141600 192335 251670 241552 146697 186725 340362 223120 193186 188185
7388 188185 386782 335897 129257 114722 132454 178881 188317 247523 302646 205888 51880
7377 51880 42757 43643 203606 313707 109338 107478 300928 396061 436635 334952 336661 423539
7365 423539 364319 387545 412675 297601 291168 579653 677107 533775 573653 406162 333899
7354 333899 517013 487257 586211 709959 482498 340190 393757 501712 529493 303930
7344 303930 314917 435366 379204 334796 277176 510882 406461 460016 388545 345851 479617
7333 479617 490912 365662 383241 386935 394697 511809 358843 320932 167056 121396 150883
7322 150883 280844 387108 335779 368746 368433 314640 175238 143126 221046 194345 250218
7311 250218 551788 414015 305814 334275 264306 315890 208608 137554 138522 163700 255240
7300 255240 142229 412 -29362 -48199 73589 238585 301551 48911 44597 112826 109657
7289 109657 -215263 -101461 255119 381249 285886 308811 290341 268774 329892 334522 396605
7278 396605 267460 69628 123657 126432 77419 74157 194613 199329 367217 502866 319629
7267 319629 61774 -10485 -60510 -72467 163511 -15388 89777 258420 184601 140681 124440
7256 124440 345767 276761 148472 214659 257057 471631 395117 207177 327127 350767 351014
7245 351014 366754 141226 75838 93678 134614 -27746 -93313 31413 141666 178864 240923
7234 240923 154904 57862 21802 85409 382818 237178 153107 271386 182715 102375 -26119
7223 -26119 86329 213740 261326 184725 87923 127532 331054 238323 272562 290831 116163
7212 116163 237853 400188 221404 202405 205994 238360 285685 244176 198060 441438 489178
7201 489178 238791 287788 176503 174456 236936 244048 339447 462826 327147 320713 567290
7190 567290 493423 561610 566559 401803 373082 417812 604198 560803 497762 431956 590376
7179 590376 601742 630989 671322 580311 607991 663671 614713 491999 507520 576710 607804
7168 607804 847063 724097 590736 611008 699316 529325 408059 463876 401724 344867 321706
7157 321706 300474 345013 404441 506199 434353 493162 290759 319601 559766 375098 447513
7146 447513 343013 315820 514871 500744 471196 610349 521951 462017 645637 696768 447382
7135 447382 460644 522084 517488 484271 522300 605882 279393 160030 286435 440374 494752
7124 494752 649489 839586 797177 759092 659915 584135 495258 659309 703633 708856 673850
7113 673850 623715 863325 1174223 944795 645210 552124 656704 899313 965966 1124533
7103 1124533 1080700 1195199 1141922 1177972 1265946 1337610 1224806 1087273 1053536 1083524 1084796
7092 1084796 1162442 1098530 935327 1029056 1088618 1276700 1134440 1174124 1153461 1261757 1367679
7081 1367679 1446271 1312887 1343510 1482860 1430283 1376616 1408734 1428140 1360396 1210467 1430007
7070 1430007 1561385 1629118 1691436 1811752 1722039 1726595 1906654 1841172 1898689 1850823 1884631
7059 1884631 2142085 2185866 1989053 2096035 2188938 2353299 2338875 2403795 2429694 2503850 2563155
7048 2563155 2566814 2745731 2704582 2814123 2874779 3007311 2891944 3015252 3298813 3273762
7038 3273762 3352285 3331436 3311445 3383588 3431916 3548467 3756368 4057268 4060702 4079475 4274451
7027 4274451 4350761 4305436 4335486 4378325 4655768 5102255 5164521 5166164 5325962 5677497 5802209
7016 5802209 5904723 6241650 6489195 6494508 6739444 7020086 7421501 7839175 8302414 8635427
7006 8635427 9051847 9337324 9573910 10008343 10439008 10952096 11391906 12004950 12747506 13273631
6996 13273631 13983103 14660531 15425820 16184456 16908067 18062487 18883957 19507276 20422763
6987 20422763 21449620 22256357 22777700 23305771 23967211 24543091 24691857 24979077 25191488
6978 25191488 25396747 25332804 25133231 24629147 24307465 23688984 22958283 22344511 21610288 20876807
6968 20876807 20089273 19108820 18513186 17769594 16875221 16254793 15617614 14719407 13976565
6959 13976565 13512513 12845031 12168756 11347309 10925635 10734966 10345145 9839960 9433706
6950 9433706 9039632 8585316 8335820 8053247 7480756 7090366 6843161 6812573 6564732 6325489
6940 6325489 6145527 5994618 5785284 5477757 5050660 5118375 4812439 4858908 4651856 4567795
6930 4567795 4726906 4492410 4375526 4167716 4085994 4008176 3800656 3842197 3745742 3643211
6920 3643211 3422144 3362370 3476194 3429522 3309293 3272987 3273562 3027772 3143835 3100256 2987415
6909 2987415 2982075 3030312 2819675 2896855 2896069 2873027 2835624 2702880 2761316 2652934 2686813
6898 2686813 2564935 2597041 2673963 2759822 2800613 2850333 2746684 2789142 2772819 2754936 2791466
6887 2791466 2569660 2748916 2902758 3081847 3304333 3174318 3094613 3178374 3083779 2896461
6877 2896461 3071287 3137406 2891145 2655177 2505722 2545985 2506203 2476832 2391560 2576007
6867 2576007 2480218 2235900 2145984 2147962 2104292 2030407 1891757 1909926 1925722 1971465 1953743
6856 1953743 1789898 1802602 1789831 1728802 1884485 2220367 2127226 1982959 2017970 1999480 1951470
6845 1951470 1913951 1897439 1931567 2091605 1914040 1995832 2176051 2135255 2303941 2105166
6835 2105166 2153320 2192485 2161628 2194347 2169482 2022089 1864749 1870116 1718005 1939241 1916665
6824 1916665 1787246 1821306 1653409 1817154 1850067 1874167 1973359 1991625 1952491 1913961 1889172
6813 1889172 1935294 1960822 1918564 1727870 1861177 1924898 1695055 1713341 1819262 1871866 1662605
6802 1662605 1464136 1496271 1738713 1777534 1557547 1534006 1634283 1768745 1854613 1808866
6792 1808866 2048741 2032003 1977370 1920471 1940031 2094319 2197012 2281551 2423577 2439291 2540712
6781 2540712 2574243 2699747 2651739 2414169 2435428 2549508 2606674 2591967 2786597 2844949 2735748
6770 2735748 2722380 2814170 2709352 2808338 2788184 2787899 2789657 2594737 2469300 2453335 2657440
6759 2657440 2661199 2499727 2527501 2420579 2600746 2583903 2463284 2348011 2225677 2277713
6749 2277713 2221952 1872593 1898451 1823137 1774829 1755574 1632491 1823912 1540704 1628131 1611086
6738 1611086 1605069 1616778 1531917 1521202 1585600 1424403 1454197 1521741 1629920 1702933 1581554
6727 1581554 1578751 1566314 1501056 1573213 1390679 1425831 1521341 1496160 1505261 1507314 1512441 1656212
6715 1656212 1453052 1480079 1716593 1582081 1782593 1595638 1502695 1529569 1732637 1644482
6705 1644482 1469149 1503578 1386719 1290800 1494399 1600583 1625877 1643059 1648223 1767772 1788861
6694 1788861 1918185 1991045 1954009 1960665 1751870 1726088 1823621 2015666 2211616 2235384 2381100
6683 2381100 2274268 2337673 2356951 2382187 2547363 2418603 2380789 2422712 2694287 2637453 2507757
6672 2507757 2422524 2199758 2287617 2072539 1971594 2036814 2043983 2059592 2031362 2006016 1829368
6661 1829368 1798988 1851066 1830650 1655734 1461220 1357668 1560823 1585157 1488072 1471670 1452659
6650 1452659 1444064 1510791 1447710 1424327 1284431 1231376 1263250 1391315 1326671 1233959 1254271
6639 1254271 1152143 1152936 1157428 1152540 1100271 1227548 1207111 1284804 1287155 1504291 1636110 1556833
6627 1556833 1290452 1184897 1364173 1302120 1360086 1300680 1338550 1357876 1266077 1158421 993283
6616 993283 993765 1190635 1165315 1198184 1307984 1207475 1247213 1206987 997953 1106393 1349992
6605 1349992 1267945 1390485 1434329 1309718 1155075 1333770 1285006 1424011 1504493 1381183
6595 1381183 1336382 1527621 1506349 1425877 1510225 1388042 1465469 1414774 1287855 1207419 1443054
6584 1443054 1613123 1547876 1441541 1380645 1271271 1341887 1343221 1231959 1148501 1393671 1467553
6573 1467553 1454210 1593207 1662686 1666433 1659491 1518496 1433211 1540070 1701119 1674278 1504054
6562 1504054 1528797 1552168 1528553 1706306 1699305 1740406 1904384 2023274 2078510 2176602 2194007
6551 2194007 2170626 2289031 2285584 2237275 2301031 2292426 2220316 2351065 2285345 2283588 2323602 2245325
6539 2245325 2146541 2104843 1859743 1988573 2108884 2109558 2090026 2064325 2095825 2250163 2251401
6528 2251401 2028152 2074756 2097510 2029465 2117293 2286258 2157281 1945625 2087477 2231798
6518 2231798 2298712 2387012 2355431 2219159 2299121 2270970 2348527 2638722 2623250 2721053 2808898
6507 2808898 3143956 3065370 2996177 3209766 3139048 2857961 2837995 2777635 2943461 2915669 2729306
6496 2729306 2719170 2718364 2763185 2685134 2762998 2762983 2688379 2530213 2490353 2583965 2707536 2646763
6484 2646763 2682281 2701563 2605587 2624454 2533943 2495309 2661643 2468777 2652278 2687905 2637966
6473 2637966 2495838 2728296 2542255 2386508 2376181 2403680 2331851 2228243 2173813 1996922
6463 1996922 2077659 2127406 2099198 2098357 1983121 2100987 2200639 2116268 2101249 1866307 1970995
6452 1970995 2038122 2053263 2030697 2171233 2197610 2345720 2376352 2293970 2151182 2102494 2045314
6441 2045314 2050582 2175264 2276938 2329313 2143132 1940542 2167041 2385444 2472600 2112000
6431 2112000 2194125 2541459 2622709 2573368 2551621 2597163 2601568 2376714 2464823 2726942 2530043
6420 2530043 2557103 2554686 2351283 2253977 2300922 2253836 2096270 2203520 1960684 1740543 1921980
6409 1921980 1840872 1990423 2059340 2115366 2068426 1970164 2121624 2052552 2140201 2177866 2004371
6398 2004371 1996430 1997092 2176849 2304102 2164737 2041665 2019316 2040704 2007412 2140158 2232358
6387 2232358 2155284 2050382 2162667 2270690 2390088 2342011 2216275 2253038 2403349 2401717
6377 2401717 2393160 2376410 2447021 2649432 2697943 2649690 2833163 2872707 2748245 2738871 2855525
6366 2855525 3044550 3065658 2995519 3104322 3305599 3508673 3461368 3419810 3547929 3582256
6356 3582256 3442913 3535694 3600606 3639669 3753717 3770282 3767177 3727213 4100615 4197043 4407693
6345 4407693 4607627 4867278 5364842 5523858 5739227 6236138 6444652 6791192 7385451 7926005
6335 7926005 8377652 8851185 9224284 9451244 9517023 9365229 8992296 8709716 8050367 7476477
6325 7476477 6942581 6466537 5941005 5497803 5437599 5244982 5250944 5150148 5137698 5201886
6315 5201886 4882440 4843638 4909046 4859539 4621558 4572990 4613024 4502162 4250407 4028480
6305 4028480 3927900 3878235 3878647 3843225 3450142 3615017 3722395 3605507 3532568 3499282 3451223
6294 3451223 3449736 3439940 3262947 3184615 3266553 3237613 3258994 3345382 3224922 3300168 3238389
6283 3238389 3222719 3348311 3323826 3465971 3460001 3300388 3427434 3392756 3439765 3450891 3574051
6272 3574051 3506369 3672077 3678961 3594284 3754912 3766675 3790678 3936175 3855302 4002812 4010044
6261 4010044 4083079 4135187 4160016 4169453 4278806 4059576 4241181 4301796 4297536 4276961 4048676
6250 4048676 4028791 3981059 3921325 3957644 4065609 3992180 4032623 4345581 4225974 4166238 4277709
6239 4277709 4017017 4132195 4220095 4343901 4328458 4355732 4174927 4408546 4673074 4658235
6229 4658235 4598907 4725556 4656487 4714353 4855857 5030319 5057915 5102270 5035175 5255895 5407862
6218 5407862 5663508 5717622 5835124 5790392 5728683 5881833 5895396 6043238 6073672 6194026
6208 6194026 6035310 6251253 6284160 6455630 6636098 6582731 6541539 6937938 7233869 7370654
6198 7370654 7491365 7643858 7612178 7931333 8054831 8057913 8314027 8456469 8613721 8699612
6188 8699612 8953517 9173269 9341391 9513060 9782154 9757298 9953630 10127658 10126309 10328371
6178 10328371 10698623 11073658 11280737 11619182 11900024 12241638 12568380 12891740 13196660
6169 13196660 13700644 14100714 14617775 15196798 15923700 16501188 17250919 18227150 19091501
6160 19091501 20140688 21427869 22577523 24037712 25862926 27596909 28664149 29454022
6152 29454022 30619052 31941984 34336609 35993495 36133401 35906236 35394714 35375233 35578103
6143 35578103 35913596 36916605 38245241 39385425 40447281 41362710 41936242 42638157 43505961
6134 43505961 44687068 45908950 47057345 48313188 49848148 51214213 52324896 53143670
6126 53143670 53750540 54411195 55114948 56270825 57575449 59411167 61164012 62719956 64513582
6117 64513582 66441504 68974974 72283783 76364961 80989431 85677618 89889417 93726968
6109 93726968 96972726 100193302 102691403 103550760 102054242 97827959 92309500 87047665
6101 87047665 83255018 81247246 80901097 81813783 83658981 86734221 90367565 94511022
6093 94511022 98656042 102664403 106827000 111060098 114134187 114952072 113679752 111415214
6085 111415214 108320966 103843505 97529926 90597717 83792450 78072822 73816685 70756880
6077 70756880 68591794 67527041 67117785 67687733 69323339 71367964 74019381 77065387
6069 77065387 81030997 85428362 89924383 94157817 98327265 102576176 106794270 110193448
6061 110193448 111854539 111390783 109109130 106109337 102352018 97479918 92191474 87079888
6053 87079888 82860744 79888164 78119653 77506027 77971686 79536276 81728099 84088805
6045 84088805 86290100 88229483 90078704 91724788 92971431 93223451 91607807 87598848
6037 87598848 82027174 76006266 70487834 65467921 61376842 58263852 56043214 54331770
6029 54331770 52937861 51863141 51197013 50638555 50039249 49207238 47882162 46437676 45332629
6020 45332629 44399433 43624337 42972676 42257353 41146236 39632274 38410737 37261492 36041122
6011 36041122 35004940 33960601 32821632 31943086 31157643 30374638 29090856 27569231 26177362
6002 26177362 24614829 23535227 22337152 21595892 20901228 20210298 19551538 19053687 18598198
5993 18598198 18082323 17678405 17343637 17126349 16901836 16695789 16395265 16187814 15765823
5984 15765823 15827861 15623646 15308929 15140009 14880838 14606124 14405485 14192949 14415739 14073338
5974 14073338 13510123 13258965 13070271 12716398 12734137 12671124 12577712 12398011 12203479 12042532
5964 12042532 11612501 11532871 11447872 11368529 11307288 11261191 11136978 10916020 10434736 10400614
5954 10400614 10422531 10312108 10162446 10159662 9964511 10000703 9792461 9641483 9504455 9367730
5944 9367730 9423554 9251318 9075298 8887937 8784932 8796526 8557001 8350219 8365654 8417171
5934 8417171 8448716 8118694 7971319 7691018 7535333 7384620 7245180 7130522 6922586 6761639
5924 6761639 6633124 6524965 6400229 6198481 6107658 5825586 5784926 5708380 5522743 5560694
5914 5560694 5416425 5325594 5239647 5247714 5146861 5085703 5236900 5103102 5316009 5318103 4765961
5903 4765961 5068252 5197277 5138114 5038540 4939239 4590449 4716454 4902208 4821296 4713368
5893 4713368 4709000 4861420 4640281 4742991 4756394 4811720 4646398 4544170 4468209 4510916 4491927
5882 4491927 4374018 4454609 4290956 4163093 4311276 4403737 4487287 4351508 4302256 4268456
5872 4268456 4176393 4142669 4110320 4027537 4058430 4094642 3961828 4194693 4350538 4274024 4137655
5861 4137655 4099311 4065176 3973522 3896075 4087828 4274814 4428458 4254665 4142000 4244429
5851 4244429 4302480 4270103 4265234 4119048 4155906 4132958 4082628 4215489 4386257 4512023 4386159
5840 4386159 4344013 4347589 4388354 4682661 4597322 4375575 4459142 4376560 4508956 4556701 4670806
5829 4670806 4766130 4961609 4939466 4935240 5148745 5348994 5519089 5688515 5882618 6350880
5819 6350880 6725946 7201116 7598075 8121142 8709793 9505565 10226149 10685897 11004869 11623749
5809 11623749 12135158 11821812 10968078 9656235 8453526 7826559 7439623 7183049 7094089
5800 7094089 6847961 6735840 6491400 6585379 6891474 6814557 6947937 7016808 7000203 7039474
5790 7039474 7209435 7259675 7346501 7580086 7597853 7459719 7372901 7067056 6725341 6405829
5780 6405829 6137357 6168924 6042486 5863186 5962805 6213406 6249690 6366722 6220430 6128836
5770 6128836 6098165 5944453 6312720 6645253 6612327 6603993 7049330 7520095 7709378 7873745
5760 7873745 8160923 8497094 8581573 9016757 9524871 9924612 10042667 10581263 10806471 11054924
5750 11054924 11253204 11316234 11089990 10672691 10219964 9817148 9176810 8744420 8386696 8135604
5740 8135604 7858471 7699289 7644861 7248028 7235806 7076947 7065400 7125804 6931891 6870242
5730 6870242 6971846 6777967 6794211 7055332 7029988 6959941 6927175 7046255 6994265 6878231
5720 6878231 6985100 6954518 6854897 6862621 6799673 6663420 6690910 6689705 6766896 6690243 6793722
5709 6793722 6894201 6919091 6946861 6998613 7020063 6928030 7014680 6944223 6836666 6793519 6894988
5698 6894988 6775927 6529408 6560816 6624856 6558626 6563311 6492005 6496349 6645934 6437213 6513778
5687 6513778 6307156 6200723 6268595 6219358 6229880 6352541 6313473 6331540 6103297 6088726 6232323
5676 6232323 6311271 6269441 6144685 6196737 6244090 6238959 6210940 6111236 6010452 5956064 6032851
5665 6032851 5951496 5905243 5874921 5824942 5770699 5654215 5907750 5702011 5739071 5726265 5553361
5654 5553361 5402553 5349744 5285184 5188156 5085078 5075151 4985488 4883337 5050771 5135553 5238460
5643 5238460 5163466 5035400 5026335 4988720 4986496 4987634 4955434 4982863 5063445 4928764 4737755
5632 4737755 4585199 4693233 4633621 4701243 4908911 4901949 4922018 4797194 4873141 4954007 4951245
5621 4951245 4930865 4995115 4944365 4873260 5006915 5161383 5237381 5476738 5536488 5506501 5311058
5610 5311058 5369673 5590306 5866758 5922927 5934939 5989213 5923137 5997523 6009722 6299984 6474692
5599 6474692 6869520 7004866 7038022 7239855 7471141 7517451 7459862 7586606 7678207 7949753
5589 7949753 8029992 8077606 7875974 7728594 7573285 7400751 7423701 7412652 7321538 7425632
5579 7425632 7353688 7494994 7606812 7579381 7557155 7496434 8139134 8326165 8515665 8885027
5569 8885027 9407159 9944614 10523791 11236260 11747775 12379074 13336412 14458153 15546548
5560 15546548 16613328 17003715 17678959 18676266 19280296 18998768 17652884 15928414 14487209
5551 14487209 13452040 12934107 12472230 12468942 12483656 12513837 12726524 13187817 13487148 13838250
5541 13838250 14686599 15302269 16189091 16993374 17896002 18811526 19588854 20165297 20608470
5532 20608470 21042734 21456894 21110524 20232360 18869616 17258113 15708769 14248144 13016950
5523 13016950 12355435 11886495 11417675 10995892 10685637 10326202 10026823 9712817 9657324 9533894
5513 9533894 9476966 9412260 9274886 9065565 9112698 9442766 9645045 9570216 9312898 9245462
5503 9245462 9306493 9240146 9150062 9082218 8999569 8787413 8730995 8733591 8675150 8675133 8620153 8610707
5491 8610707 8564812 8480835 8576694 8764689 8894295 8760149 8559026 8522372 8685492 8938358
5481 8938358 8737064 8871456 8935179 9125085 9210669 9119283 9156651 9295933 9435006 9448964
5471 9448964 9559233 9794566 9739842 9915709 10000440 10127866 10295100 10315233 10580891 10975804
5461 10975804 10944693 10951121 11270078 11376450 11397063 11500139 11881614 12117971 12071868 11872611
5451 11872611 11994220 12277183 12513804 12614912 12598681 13007718 13118748 13336814 13610457 13760345
5441 13760345 14156966 14715407 15103109 15584452 15961179 16392757 16904391 17201990 17625293
5432 17625293 18197396 18609826 18972033 19357320 20046723 20655215 20730037 21235952 21800229 22244370
5422 22244370 22671478 23016132 23506602 24033784 24428359 25015094 25932580 26731648 27318291
5413 27318291 28232075 29039375 30097285 31110200 31856097 32837831 34103557 35354802 36606982
5404 36606982 38073703 39655996 41358583 43066294 44837687 47141122 49780999 52820980
5396 52820980 56015952 59588961 63789399 68594614 73963153 79997294 86971560 94586592
5388 94586592 103339806 112582413 122649226 133129812 144302881 155861794 167084394
5381 167084394 177830785 187687144 196029872 202422156 206757012 208533243 207066344 202123297
5373 202123297 194436693 184665549 173632841 161866998 150037615 138650731 127623042
5366 127623042 116921590 106894365 97382012 89050265 81689501 75274621 70017703 65449524
5358 65449524 61347668 57714298 54510541 51539119 49205628 46853786 44544493 42585607
5350 42585607 40805787 39127465 37551881 36153255 34740883 33451300 32306676 31409269
5342 31409269 30507149 29596465 28745146 28044339 27160692 26218473 25495055 25102527 24538100
5333 24538100 24085610 23471047 23110066 22774207 22404743 22053812 21765045 21527215 21334541
5324 21334541 21148644 21241982 21129467 20867513 20845334 20638798 20405299 20279665 20436270 20441983
5314 20441983 20179017 19795732 19677420 19443746 19161364 18641057 18107633 17583712 16991198
5305 16991198 16360818 15736843 15282439 14875828 14439950 14022735 13604018 13281930 12961726
5296 12961726 12941275 12707841 12620095 12610886 12324468 12060449 11947657 12027947 11740729 11608326
5286 11608326 11589948 11508891 11208396 10960578 10843100 10518150 10525054 10437951 10035718 9640556
5276 9640556 9468099 9336898 9133351 8998166 9074264 8948843 8609631 8422001 8548450 8472965
5266 8472965 8250953 8204311 8147719 8324800 8386347 8384122 8459130 8384559 8497205 8513433 8632740
5255 8632740 8801386 9067160 9137968 9296045 9486458 9663861 9493841 9431055 9830317 10188512
5245 10188512 10296812 10542136 10471397 10495260 10992229 10948138 10440217 9554012 8888414 8466582
5235 8466582 8409034 8058260 7640593 7508273 7224041 7165741 7208281 7203271 7228570 7340222 7321757
5224 7321757 7030369 7041814 7260776 7406457 7546701 7544780 7483492 7726475 7824482 7856990 7735961
5213 7735961 7489507 7615610 7975655 8093137 8070585 8081393 8012825 7654663 7376207 7399138
5203 7399138 7132923 7035776 7093943 7119357 6995165 6763398 6819350 6696329 6733149 6745349 6717528
5192 6717528 6796449 6883003 6879752 6857224 6648755 6674515 6851485 7258641 7342720 7053901 7104242
5181 7104242 7193945 7197172 6958869 6810527 6613409 6369499 6605480 6502731 6507149 6445317 6523461
5170 6523461 6517844 6509584 6576243 6568545 6364013 6314890 6058752 6080472 5929306 5662128 5677385
5159 5677385 5370835 5535350 5569829 5665014 5643522 5629910 5362775 5286709 5394221 5390135 5360448
5148 5360448 5379426 5418616 5475627 5608618 5804251 5614050 5641756 5611897 5289628 5335275 5373644
5137 5373644 5470652 5348509 5338374 5492704 5362989 5373673 5509933 5511701 5160452 4968472
5127 4968472 5081446 5322050 5199498 5211948 5271112 5141641 5076623 5146552 5087720 5073204 5183544
5116 5183544 5062276 4838567 4837877 4820184 4743489 4841844 4811208 4900723 4980235 5150717 5234235
5105 5234235 5217211 5129607 5170023 5059200 5119550 5232222 5031847 4987661 4949566 4995809 4958380
5094 4958380 4987123 4862845 4785292 5043477 5207103 4977611 4901304 5028596 5073164 5017467
5084 5017467 4991808 5174209 5158623 5040623 5380119 5529584 5485210 5397879 5631466 5691663
5074 5691663 5622878 5955335 5992696 5833620 6003921 5919522 5695344 5738821 5775767 5800818 5710598
5063 5710598 5679126 5969076 6208225 5930031 5816781 5997407 5892028 5848821 5874933 5995574
5053 5995574 6017351 5914608 5844390 6176149 6096399 5999970 6052812 6125552 6093898 6103728 6236895
5042 6236895 6452007 6360681 6510292 6663543 6728889 7016645 7191364 7426102 7521357 7498063
5032 7498063 7626741 7725928 7747732 7840692 7707674 7962094 8019929 8155699 8229772 7941211
5022 7941211 7858652 8204787 8078891 8083286 8196236 8207393 8336938 8484964 8518472 8625860
5012 8625860 8669093 9011672 9070598 9040197 9168628 9408245 9608756 10000988 10509255 10829137
5002 10829137 11436073 11812661 12020558 12533753 12937963 13714086 14184163 14723906 15319850
4993 15319850 15885757 16423380 16909141 17306529 17560113 17729365 17944359 17888362 17732584 17719946
4983 17719946 18045150 18377649 18595843 18841866 19222237 19661039 19860615 19973448 20048842 19970815
4973 19970815 19841901 19798076 19512950 18961479 18292319 17755475 17331404 17226865 17304960 17099370
4963 17099370 17340091 17907258 18195679 18719514 19170164 19698352 20458988 21160788 21934039
4954 21934039 22807657 23836480 24819766 25655844 26491806 27352426 28142588 28728185 29368023
4945 29368023 29893635 30431785 30798090 31349023 31819309 32131219 32501644 32521273 32271713 31600551
4935 31600551 31085557 30449677 29625128 28387121 27299645 26393508 25437802 24854868 24221014
4926 24221014 24235510 24250422 24403242 24851814 25321774 25975922 26999005 27877233 28987346
4917 28987346 30125449 31520488 33128015 34627497 35993689 37283524 38648853 39953934
4909 39953934 40954506 41912155 42564372 42755823 41784515 41299900 41286603 42203150 42206483 39760091
4899 39760091 36015558 32283587 29432077 27325448 26079575 25042758 24017212 23120644
4891 23120644 22428196 21824621 21380213 21072400 20678602 20222031 20068137 20100504 19645458 19223379
4881 19223379 19115421 18963124 18832527 18615193 18766916 18709294 18595447 18628684 18534724 18588470
4871 18588470 18719231 18601380 18353782 17982002 17759381 17413854 16865346 16468166 16123292
4862 16123292 16184117 16003993 15810753 15617240 15511585 15554550 15466828 15280810 15318927 15267108
4852 15267108 14723912 14346825 14343129 14235255 14070642 13951052 13780815 13839500 13798291 13774310
4842 13774310 13713187 13761501 13827522 13809287 13575031 13702027 13596532 13752901 13987651 13956517
4832 13956517 14061689 14234118 14288862 14364448 14386382 14419402 14329404 14289379 14154090 14017154
4822 14017154 14304944 14500670 14570859 14696144 14783316 15037841 15286972 15630310 15883839 16115853
4812 16115853 16304029 16392480 16601703 16669678 16757877 16823903 16786687 16657275 16628569 16559031 16385798
4801 16385798 16376479 16320698 16553471 16823542 17014347 17222589 17568065 17956034 18311843 18519589
4791 18519589 18946892 19430732 19970245 20380453 21013612 21550633 22068936 22643597 23177014
4782 23177014 24019545 24791068 25304872 26140383 27217086 28047988 29108585 29733438 30338059
4773 30338059 31459238 32343362 32877365 32758599 32090038 31584125 31332353 31276866 31589657
4764 31589657 32080029 32375969 32751495 33603660 34162304 34594672 35142480 36057398 36867789
4755 36867789 37671621 38378293 39259196 40227022 41096434 41913545 42626773 43514773 44221179
4746 44221179 44871114 45691603 46695831 47753971 48914350 50005105 50976738 52118663 53606271
4737 53606271 54852362 56393923 57771886 59421847 61196068 63160432 65161510 67309761
4729 67309761 69632177 71927921 74425415 77201181 79949048 83179379 86608377 90553632
4721 90553632 95385697 100601736 106288602 112653277 119782643 127403901 135698040 145169416
4713 145169416 155575313 166792295 178986600 192268332 206718269 221695723 237388561
4706 237388561 253463832 269008781 283497296 296222718 307057779 315541644 321696436
4699 321696436 324133393 321899053 314846571 304261260 291404979 276611134 260994756
4692 260994756 245466515 229776430 213917589 198060209 183395619 171064817 160956588
4685 160956588 151997557 144081319 137414292 131790518 127296380 123382742 119972645 117094617
4677 117094617 114271464 111466935 108898646 105973781 103178749 100270614 97563655 94907597
4669 94907597 92343512 90061020 88161954 86565483 85394193 84748541 84677619 85109135 85948824
4660 85948824 87193855 88669583 90591496 93027599 95739113 98600664 101966185 105046444
4652 105046444 107916799 110405177 112687106 114827323 116994147 118320378 119215561 119537671
4644 119537671 118874911 117603980 115634361 113264636 110869859 108507305 106362729 103708385
4636 103708385 100554012 96803257 92797687 89052284 85190815 81313872 77466227 73559954
4628 73559954 69614644 65756196 62042574 58583990 55195848 52349076 49820094 47521384
4620 47521384 45415692 43763400 42208245 40826834 39613857 38556526 37554745 36487418
4612 36487418 35472758 34524894 33819248 33134184 32569896 32028504 31482381 30863003 30710165
4603 30710165 30480464 30098673 29672081 29375088 28870403 28457328 28082098 27529939 27208391
4594 27208391 26759208 26685936 26379820 26202247 25964761 26006127 25955394 25685773 25639128 25907657
4584 25907657 25906105 26043627 26081960 25949609 25916552 26073077 26101206 26424692 26589719 26990879
4574 26990879 27251032 27426361 27233131 27376699 27408955 27566373 27597784 27623726 27737948 27771656
4564 27771656 27652629 27473942 27566942 27848387 28021587 28421585 28776015 28992516 29207499 29462168
4554 29462168 29729523 30230695 30505927 30873384 31220700 31592473 31725295 32115200 32639649
4545 32639649 32753999 32821527 32971661 33275710 33547523 33814649 34246698 34583616 35208075 35698654
4535 35698654 36345590 36915202 37576602 38271517 38959400 39783484 40080078 40791739 41697270
4526 41697270 42311328 43043194 43939155 44795113 45826045 47021117 48388290 49781462 51758048
4517 51758048 53694146 56019291 58464852 61641006 65060299 69358815 74333079 79995047
4509 79995047 86610012 94879183 104580317 116212404 129520782 144912739 161901666 181990527
4501 181990527 203529843 229057361 259310914 288988053 303235010 313229675 332654545
4494 332654545 363807302 372913146 339611903 286179904 233755958 195410960 167978708
4487 167978708 149295405 135275481 124424629 115539791 108605564 102631389 98003438 94037194
4479 94037194 90936567 88350582 86564991 84743014 83357127 82425640 81839282 81084923 80662108
4470 80662108 80212945 80178135 80203640 81131199 81885071 83004814 84424414 86034680 87353827
4461 87353827 89035753 91352708 94078656 96915953 99821801 102703733 105839809 109315357
4453 109315357 112974031 116642107 119811369 121657672 122189658 121291197 120131338 119628074
4445 119628074 120841908 123573199 128138694 134480218 142277101 151489496 162481923 175178573
4437 175178573 189645063 206159608 224785380 245850567 269154198 294538689 319650778
4430 319650778 341230667 359532572 377170540 390406187 388026994 366884309 336212200
4423 336212200 306543480 282419939 263678164 250536742 241473527 233476448 222727071
4416 222727071 208694939 194099339 181127354 170753225 162588675 155806092 150208290
4409 150208290 145174738 139998546 133652970 126213968 118289724 110027929 102615321 96465025
4401 96465025 91429289 87266702 83974453 81190181 78559871 76233844 74221980 72739497
4393 72739497 71165180 69378623 67170145 64811017 62408230 60320849 58299007 56365281
4385 56365281 54646850 53211538 51891421 50403918 49253939 48352206 47503819 46614191 45894299
4376 45894299 45310047 44895083 44514569 43971060 43759084 43697023 43589072 43663977 43980892 44406398
4366 44406398 45049181 45539080 46387981 47496651 48260823 49109848 50124535 51094769 51933716
4357 51933716 52406338 52597712 52847141 53067331 53382487 53200403 52426556 51081668 49709348
4348 49709348 47961470 46425658 45350695 44206225 43786784 43474528 42972924 42202129 41214815
4339 41214815 40303588 39656851 39352147 39350308 39346071 39778536 40079959 40595120 41196382 41754392
4329 41754392 42856946 43853067 45096145 46720548 48380314 50437826 52175858 54322978
4321 54322978 56499524 58677486 60843298 62575996 63994831 65066217 65763458 66468155
4313 66468155 67271220 68413891 69633663 70981833 72322356 73762089 75493129 77379082
4305 77379082 79300799 81812503 84546606 86773251 88848896 91059921 94139244 98786361
4297 98786361 105094400 112836749 122108909 132383336 143834425 156278305 169768109 183843402
4289 183843402 198901270 212423072 221166556 225893303 231579392 238483740 236838918 219293030
4281 219293030 190892067 161449148 137161585 118730207 105258503 94737487 86288184
4274 86288184 79390176 73527151 68645339 64373915 60559748 56997863 53992753 51473006
4266 51473006 49408381 47502383 45712392 44190368 42986924 41891884 40655022 39869998
4258 39869998 39252110 38624246 38211855 38091837 37900324 38048596 38422170 38806703 39091074
4249 39091074 39501629 39997959 40376259 40444059 40490697 40355307 39666881 38821897 37290713 35557136
4239 35557136 34212077 33064891 32335624 32018433 32073895 32171845 32130395 32242656 32162092 32560505
4229 32560505 32776866 32713945 32061417 30695833 29060455 27591459 26305428 25322369 24540220
4220 24540220 23889128 23421688 23127482 22941547 22869493 22474346 22261317 22400777 22300149 22178424
4210 22178424 22354855 22671135 22929862 23157018 23253769 23313449 23561392 23820911 24004093 23344956
4200 23344956 22678129 22150672 21822184 21520314 21130136 21090335 21666270 21907208 21745639 21821594
4190 21821594 21913059 22069702 21643470 21051627 20574261 19872300 19018492 18176273 17425590 16939311
4180 16939311 16685546 16321112 15983580 15820667 15502124 15242404 14922310 14558492 14160196
4171 14160196 13950752 13764792 13699981 13573184 13476925 13148734 13099919 13158100 12907068 12712497
4161 12712497 12701879 12590041 12322755 12250216 12046601 11872519 11867996 11944602 11765180 11712939
4151 11712939 11783284 11629868 11634265 11655951 11566054 11773121 11948294 11994841 12086429 12145421 12321740
4140 12321740 12050528 12094696 12064045 12083264 12237828 12325748 12314255 12085162 11928759 11897288
4130 11897288 11586939 11289244 11017065 10708711 10809892 10812834 10602302 10336920 10005236 9878021
4120 9878021 9706230 9240379 9032133 8872748 8575642 8510482 8532726 8418611 8058655 7695347
4110 7695347 7537601 7514726 7351089 7178200 7046725 6900439 6869578 6720712 6765053 6763289
4100 6763289 6742294 6541271 6196406 6095327 6098215 5955765 6002917 5983249 5902584 5986189 6142286
4089 6142286 6178269 6072869 5661410 5710817 5847219 5900839 5922445 5774097 5647579 5636652
4079 5636652 5670100 5652213 5737660 5580985 5592950 5351028 5545294 5553313 5347879 5457087 5446465
4068 5446465 5365464 5419229 5230191 5249684 5237193 5392765 5368639 5325063 5530214 5590586 5439098
4057 5439098 5347811 5405392 5461974 5619142 5410671 5276962 5403898 5641825 5658569 5682742
4047 5682742 5637703 5766403 5724208 5595194 5720727 5767128 5660694 5558265 5838827 5895376
4037 5895376 6034561 6137629 6044045 6085981 5874355 5674722 5707611 5830545 5664112 5659185
4027 5659185 5654565 5529160 5488543 5669220 5953872 6043573 5918409 6123153 6061193 6330806
4017 6330806 6515861 6575880 6830320 7001033 7082776 7511104 7696762 7926953 8226930 8469528
4007 8469528 8845990 8938822 9006093 8857620 8653245 8552338 8266104 8016474 7844296 7686677
3997 7686677 7440308 7205130 7383009 7279898 7266791 7334112 7359648 7382003 7626532 7702813
3987 7702813 7999055 7957874 8028181 8108200 8511123 8890442 8776282 9090758 9419557 9824941
3977 9824941 9951981 10286729 10632843 11017110 11562420 12108324 12517785 13032334 13632255 13913847
3967 13913847 13818072 13743489 13596472 13504292 13057934 12731986 12225394 11713188 11695019 11885119
3957 11885119 11776473 11916979 12382390 12694255 13217588 13850872 14627420 15683079 16774448
3948 16774448 17525015 18763823 20014074 20717005 21334922 21626882 21969642 21910142 21284879
3939 21284879 20451286 19504968 18483743 17418201 16431715 15314305 14490787 13675564 13221243
3930 13221243 13035420 13111620 13289250 13457186 13561743 13979482 14309082 14621217 15170674 15604287
3920 15604287 15752265 15781686 15721267 15657887 15605463 15779996 15883939 15760455 15771718 15727880
3910 15727880 15958247 16421424 16631305 16557639 16310075 16077699 15741485 15488300 15146481 14746928
3900 14746928 14305759 14035358 13798328 13656480 13347787 13260988 13023195 13002251 12674076 12443833
3890 12443833 12367456 12398974 12166090 12033500 12165576 12117044 12386026 12468553 12280331 11878623
3880 11878623 11449229 11050712 10718336 10196329 9482070 8894624 8574054 8211778 7731795
3871 7731795 7569786 7316568 7209764 7217242 7261571 7481612 7442724 7582177 7505114 7572272 7624296
3860 7624296 7734440 7994015 8335413 8392710 8645267 8770288 9002788 9204186 9130635 9479841
3850 9479841 9750117 9645966 9252587 8803764 8717103 8355025 7922874 7317334 6817592 6499616
3840 6499616 6025113 5558330 5425036 5262028 5064887 5025867 4868515 4793338 4629744 4498862
3830 4498862 4399465 4304023 4287050 4120010 4076415 4139167 4145850 3901926 3778273 3893225 4069815
3819 4069815 4022128 3792767 3670109 3675339 3545277 3608984 3612837 3541283 3351728 3394462 3479374
3808 3479374 3356780 3185466 3223136 3154011 3191769 3181618 3200829 3277224 3265375 3064671 3023140
3797 3023140 3119652 2950070 3242340 3265948 3090309 3132168 3156595 3168220 3160911 3151165 3261138
3786 3261138 3257702 2804535 2671383 2685865 2769245 2826402 3049488 3043223 2925068 2947792 2847719
3775 2847719 3014896 2995755 2961953 2856261 2802471 2774138 2940117 2756499 2706119 2746510 2670645
3764 2670645 2707147 2820465 2631478 2608170 2689206 2728280 2798555 2820471 2581920 2663494 2699571
3753 2699571 2613609 2392998 2593190 2763358 2597685 2583811 2574617 2550653 2561209 2609970 2622986
3742 2622986 2739399 2936410 3013632 2880071 2731332 2648632 2614837 2608155 2557768 2563721 2618868
3731 2618868 2485466 2421676 2564312 2513219 2666031 2620872 2463997 2595431 2644740 2857850
3721 2857850 2831668 2946387 2914962 2938775 2921115 2759265 2957177 2952752 2843524 3012542 2829799
3710 2829799 2759758 2939215 2819489 2923361 3115113 3048127 3332698 3434865 3445912 3533958
3700 3533958 3385452 3324290 3464079 3787366 3766242 3842039 4333350 4428045 4364509 4710711
3690 4710711 4665427 4693306 4846671 4992594 5089097 5308545 5595251 5607599 5619111 5562404 5496931
3679 5496931 5367026 5295222 5101629 4653848 4524213 4498740 4654068 4517497 4466252 4457779
3669 4457779 4422759 4316226 4432947 4747584 4668521 4725321 4676549 4754269 4963887 5015626 5041705
3658 5041705 5047495 4883849 4992611 5244818 5355439 5207602 5281202 5589717 5746671 5685493
3648 5685493 5575227 5219341 5115936 4831349 4592065 4475125 4215370 3936788 3814927 3842110
3638 3842110 3800104 3860469 3787201 3806741 3745398 3728006 3630850 3439526 3599964 3585295 3416500
3627 3416500 3485542 3431769 3409732 3506439 3341230 3317006 3323402 3397898 3451529 3326174 3354116
3616 3354116 3551542 3326421 2986951 3026204 3232656 3266356 3346102 3376260 3341383 3348673 3403541
3605 3403541 3393097 3454756 3491517 3448634 3448935 3328206 3000063 3055779 3274789 3443481 3266662
3594 3266662 3201249 3252342 3342596 3408272 3246708 3342919 3321043 3306792 3434328 3357405 3217807
3583 3217807 3423871 3452154 3654079 3380128 3335864 3575772 3613152 3490979 3465794 3648944
3573 3648944 3702181 3566097 3462514 3614840 3709120 3741419 3763718 3984327 4089559 4116988
3563 4116988 4073019 4083040 4045096 4183462 4335965 4254219 4262664 4335505 4347691 4312653 4329329
3552 4329329 4450682 4707411 4725316 4791346 4633609 4516529 4540073 4674988 4531958 4377393
3542 4377393 4376863 4419683 4453479 4471462 4448329 4425285 4439495 4514456 4519071 4509938 4481731 4308494
3530 4308494 4405927 4480332 4350901 4300256 4506089 4648467 4544542 4396848 4283999 4483939
3520 4483939 4552323 4456256 4361144 4258856 4301451 4001997 4019418 4093842 4001011 4189083 4281852
3509 4281852 4289512 4197011 4197444 4085266 4203088 4422595 4360539 4381676 4310584 4375959 4344322
3498 4344322 4411046 4558521 4471860 4413477 4315821 4354509 4366788 4328270 4482287 4462233 4368358
3487 4368358 4502966 4295833 4434840 4439722 4178259 4152866 4125447 4157751 4168070 4125022 4008676
3476 4008676 4096444 4125152 4127437 3945065 3975174 4016256 4039082 3915692 3910765 3923362 3870619
3465 3870619 3812387 3686167 3795384 3675175 3559341 3641729 3643676 3365513 3196058 3267796
3455 3267796 3381322 3480754 3415642 3196241 3204565 3158999 3099976 3038737 2954350 2892814 3107600
3444 3107600 3246148 3083413 3127359 3092160 3018433 2875095 3146756 3224856 3283362 3090324
3434 3090324 3078076 3103782 3070250 3112733 3123423 3037562 3018689 3058340 3003926 3157605 3123144
3423 3123144 2911440 2882872 2830192 2852029 2988607 2866816 2927770 2859166 2873859 2994077 3057693
3412 3057693 3031594 3005212 2787009 2795341 3022259 3111251 3266703 3234785 3176850 3229234 3289970
3401 3289970 3247360 3150449 3281428 3290119 3171923 3237113 3283416 3350273 3388335 3591498 3758397
3390 3758397 3694728 3654074 3560783 3609548 3622974 3618951 3629200 3689092 3824378 3898777 3980133
3379 3980133 3684704 3732481 4103912 4077288 3815363 3885601 4094263 4217527 4160311 4269049
3369 4269049 4276602 4197674 4414185 4423288 4564633 4907308 4848217 4670314 4594048 4818873 5049056
3358 5049056 4991105 5051461 5061394 5266633 5195535 5103995 5247261 5519881 5291319 5566128 5704660
3347 5704660 5663846 5723092 5671770 5743063 5833725 5901850 6159990 6438648 6504994 6623427 6789081
3336 6789081 7039640 7038791 7033869 7265276 7443861 7589741 7438283 7593537 8012577 8168116
3326 8168116 8291056 8330010 8401782 8693341 8799537 9035816 9324269 9292275 9562329 9684465
3316 9684465 9632154 9783927 10059553 10374358 10767803 11028045 11338713 11738841 11962984 12346761
3306 12346761 12571489 12597055 12829793 13045137 13363938 13648945 13927042 14222791 14567885 14836678
3296 14836678 15135045 15385759 15638678 15894617 16191216 16706210 16952513 17249966 17848067
3287 17848067 18132073 18579030 18981898 19480320 19859926 20458471 21013198 21642751 22200610
3278 22200610 22909186 23690223 24532218 25643022 26633398 27710585 28966337 30235596 31775617
3269 31775617 33434373 35031521 37159683 39085971 41406878 43833846 46429141 48978071
3261 48978071 51427760 53804200 56378520 58749377 60403695 61852610 62516254 62467619 61566183
3252 61566183 59733937 57170063 54036079 50819706 48060098 45369281 42988376 40988527
3244 40988527 39423161 37995076 36443879 35241727 34187843 33226570 32081625 31094770
3236 31094770 30312745 29509561 28685514 28098732 27647551 27257246 26846944 26368567 25796631
3227 25796631 25531695 25317078 24836372 24600444 23965814 23240254 22755586 22466815 21946875
3218 21946875 21620347 21163357 20743352 20317403 19887357 19419267 18909096 18427082 18268826
3209 18268826 17867332 17596711 17527186 17021690 16708651 16250614 15741410 15495956 15188195 14933110
3199 14933110 14496584 14286939 14192988 14011374 13716900 13316368 13214005 12919693 12806057 12677945
3189 12677945 12430492 12156580 12029863 11763328 11725859 11741680 11516944 11287648 11256846 10933248
3179 10933248 10697027 10499807 10682148 10469840 10191309 9983312 9864492 9655474 9477341
3170 9477341 9502003 9440607 9167615 8990567 8983844 9130801 9042287 8711251 8609639 8464577
3160 8464577 8339666 8379567 8299705 8185218 8166539 8190256 8149449 7859399 7601857 7620131 7534381
3149 7534381 7206911 7084286 7015364 7096516 7046947 6900228 7119237 7211006 7090595 6939496
3139 6939496 6903081 6769543 6692167 6833838 6779133 6747497 6847272 7099291 7047544 6812141 6591951
3128 6591951 6670209 6354986 6401868 6348115 6278677 6090923 5977484 6118828 5994631 6048754
3118 6048754 5962117 5899160 5923770 5794866 5909446 5906423 5857677 5887554 5919329 5919091 5859951 5871026
3106 5871026 5761055 5713210 5714591 5661435 5631393 5727909 5670899 5729968 5848342 5984051 5842072
3095 5842072 5712564 5662143 5656347 5595327 5327574 5152940 5239508 5346400 5341821 5376301 5344770
3084 5344770 5327425 4978991 5016695 5220378 5039076 5201125 5003909 4745059 4827751 4877118
3074 4877118 4885690 4906412 4779723 4726552 4739346 4755678 4610279 4298213 4161380 4071342 4101783
3063 4101783 4109664 4215710 4311419 4167668 4014883 4012775 4058909 4138731 4083573 4187531 4134287
3052 4134287 4090221 3974127 3928127 3952374 4089621 3994955 3916005 3845657 3854344 3786385 3616625
3041 3616625 3557188 3653621 3605480 3448167 3561511 3474085 3456120 3285829 3181841 3256996 3347017
3030 3347017 3324341 3309628 3266746 3357902 3373842 3292623 3485836 3539781 3689413 3832672 3821244
3019 3821244 3934175 4018857 4028386 3972239 3933823 3933670 3989735 4099138 3837017 3693119 3808138
3008 3808138 3883853 3866200 3914809 3908187 3851451 3765633 3598380 3640622 3746276 3845587 3898511
2997 3898511 3886435 3896493 4075190 4171475 4145822 4115001 4223672 4400279 4646909 4719831 4776678
2986 4776678 4694170 4849010 5020953 5167899 5425110 5659479 5833676 6005812 5899462 5836925
2976 5836925 5904508 5624966 5501487 5460000 5366711 5463742 5326082 5503207 5573611 5566211 5643162
2965 5643162 5450424 5538804 5503913 5651693 5836279 5803439 5723449 5811785 6160709 6215337 6392903
2954 6392903 6495682 6688313 7045016 7173353 7525814 7738688 7718722 7852313 8301130 8548613
2944 8548613 8813805 9100376 9197083 9235171 9211367 9359493 9207181 9247813 9312649 9403689 9374032
2933 9374032 9464433 9689438 9632149 9667335 10057221 10281191 10222987 10510423 10799200 11160064
2923 11160064 11690631 12038338 12214146 12715415 13229130 13863045 14253697 14614462 14970954
2914 14970954 15266682 15499341 15583457 15520707 15362899 15211207 14545007 14188638 13698693 13337298
2904 13337298 13491609 13460920 13363325 13575958 13762221 13915930 14192270 14496928 14749327 14994289
2894 14994289 15508901 15885040 16064689 16314786 16567135 17037407 17215289 17176864 17140823 17035811
2884 17035811 16976815 16464145 15975825 15438800 15192332 14709617 14306128 13789686 13464977 13214062
2874 13214062 12755304 12685048 12693025 12389553 12399135 12512144 12537702 12386721 12209996 12283028 12418143
2863 12418143 12252447 12091281 12124851 11731200 11336748 10938923 10639032 10320028 9674864 9209555
2853 9209555 8903822 8579112 8059916 7648941 7307393 7067316 7166457 6819247 6480250 6327177
2843 6327177 6085325 5819983 5626137 5604544 5632371 5453477 5219537 5072587 4963948 4928447
2833 4928447 4703454 4453420 4142965 4128282 4070239 3784376 3701148 3633665 3407139 3223292
2823 3223292 3501920 3437421 3349740 3208146 3060221 3076431 2996473 2812152 2798871 2610126
2813 2610126 2554641 2661382 2653221 2614933 2514568 2394488 2377564 2394177 2251430 2281447 2314815
2802 2314815 2370260 2276096 2186157 2156419 2039881 2170653 2191837 2122199 1975078 2093983 2116493
2791 2116493 1992164 1788793 1716037 1636106 1517432 1746315 1867492 1926406 1907743 1672342
2781 1672342 1633178 1623214 1308045 1220665 1120723 1316603 1502748 1683253 1360317 1281584 1352603
2770 1352603 1333214 1555086 1490530 1429894 1312332 1165296 1285251 1345241 1189675 1042463
2760 1042463 1030068 1130883 1084769 1068779 1097674 1123718 988530 1107559 1101792 1005445 1166690
2749 1166690 1072665 1005893 1200156 1207482 1068657 1006570 855535 708801 647689 688879 857999
2738 857999 850456 652308 453309 606791 464849 603742 606129 599509 676909 604499 478812
2727 478812 619248 730685 592808 701908 708981 586544 580348 619663 710101 579656 599591
2716 599591 647653 619082 768628 682341 717871 796448 697298 511036 520677 499842 748876
2705 748876 691818 642101 556962 429005 489230 565900 672202 731234 606197 460552 428433
2694 428433 470020 483505 664521 444252 211598 269397 413178 511434 668456 619839 540666
2683 540666 494194 516266 489250 473364 527012 654995 731768 642326 633627 677744 636304 576882
2671 576882 676785 544581 517467 610588 699018 729716 604940 578414 529275 555217 754736
2660 754736 779707 698715 762587 675376 448730 627882 564443 596546 593721 601697 527446 545014
2648 545014 588905 685690 813507 887255 829606 879003 950029 935220 945286 1004424 1049893
2637 1049893 926891 720624 791916 1015456 983669 1075764 987166 1004883 909914 785965 840902
2626 840902 836347 847854 913284 1088830 1093190 1009401 1016309 989509 1020809 1060925 996931 996281
2614 996281 1093522 1280558 1110783 1022211 1115491 1111898 962451 1176733 1149041 1069857 1227212
2603 1227212 1376169 1411532 1250001 1176460 1161658 1176168 1133538 991511 897190 892695 924547
2592 924547 1136139 1203798 1114703 1132699 1169519 1099382 1064451 1018423 1080213 1087949 990375 1068919
2580 1068919 1048436 1100348 1274092 1238897 1111531 1081409 1103563 859376 1005388 1052647 1174049
2569 1174049 1045574 1065884 823792 787347 984950 980812 920061 829652 664889 636186 758951
2558 758951 628115 671948 626712 575526 684040 568995 662716 552930 490831 561279 462001
2547 462001 425478 385409 388660 349900 548240 479177 240915 195622 291883 419936 610712
2536 610712 639008 386878 529393 662441 482395 338080 355109 234609 145807 103693
2526 103693 -33770 275262 289483 279238 316396 164263 72679 181279 253090 329141 59624
2515 59624 258430 457399 353357 233694 -43302 59461 61816 181749 329229 193615
2505 193615 146046 218523 360189 514242 428074 418538 417594 269533 173251 208773 115867 206189
2493 206189 253300 307581 280560 47663 151888 130720 35536 59648 131107 147989 141348
2482 141348 -24239 127623 173432 167050 224809 148043 223642 158973 83848 119202 67281
2471 67281 214762 329873 207853 148974 283911 185669 135892 212593 98047 -82184 3203
2460 3203 83377 48854 104025 150912 163567 36219 51297 52812 -90094 -91009 3480 147528
2448 147528 178364 138343 63553 -12044 86165 154251 176630 188640 160289 111421 -40823
2437 -40823 -119578 -63724 44666 34053 -15048 -160091 33134 -19841 -44112 -140537 -7693
2426 -7693 -82614 -148238 5819 -15721 -16898 -60527 132692 133205 121707 108193 216481 156737
2414 156737 170458 193757 113068 -229347 -320234 -313004 -331298 -79373 -23331 39065 191294
2403 191294 285834 243602 117937 213819 196056 135880 60798 66262 150744 292253 160800
2392 160800 339946 183754 289119 473688 479900 371254 320112 346186 354594 578374 568911
2381 568911 654318 617653 461056 463209 389123 49169 -23465 139916 294783 321133 279727
2370 279727 246768 212136 292662 70097 121744 243959 148406 78239 159938 64995 -46916
2359 -46916 138135 6374 -84539 -17923 78781 -6146 -162440 -30927 -47458 -255062 -143138
2348 -143138 -37084 -11478 52933 75570 100202 43783 -124821 -13510 184083 -26934 55215
2337 55215 7292 -56846 33883 169299 73231 188430 139927 50293 63550 -97487 175002
2326 175002 248462 196663 115941 168345 -11794 35771 139727 150881 -109605 -77167 -19368
2315 -19368 14597 -7971 -75423 76434 -7414 77948 118842 286726 194729 203161 139569 111731
2303 111731 155078 115063 200573 69413 35223 26251 98544 -31733 -5765 -30492 186494
2292 186494 233944 72403 82879 134913 -91004 -119982 21336 85405 336237 432341 286122
2281 286122 174501 41865 97678 97472 99443 15559 -31946 116303 130766 -4629 -17263
2270 -17263 71388 59288 126538 58355 193038 406257 349904 -15894 -227171 -149026 196664
2259 196664 223577 211945 175566 332838 406973 303109 285438 279158 353567 367434 570712
2248 570712 500868 348445 333543 415117 415333 355130 255712 339137 382555 199454 234183 516782
2236 516782 456482 293105 258990 220842 209963 310287 248143 227550 185705 117187 241491
2225 241491 156202 222536 429353 614389 602667 539816 505603 671483 686542 643262 627675
2214 627675 503888 416110 393043 598480 747517 835883 747727 632569 672949 623558 450921
2203 450921 684561 814861 769554 803375 772494 854344 892996 897718 1003189 1032325 1262433
2192 1262433 1408149 1266253 1249188 1369968 1298846 1388656 1624714 1537478 1635870 1651290 1761336
2181 1761336 1740711 1775425 1704327 1776951 1907529 1980267 2302788 2276016 2144685 2296711 2508805
2170 2508805 2774868 2726039 2614008 2726185 2772249 2838437 2858757 2979719 2955904 2935147 3139633
2159 3139633 3445806 3502915 3535260 3775256 3975785 4257479 4317676 4255536 4398674 4700661
2149 4700661 4919568 4946063 5124713 5387286 5631178 5869952 6149643 6344832 6588174 6883549
2139 6883549 7251320 7534854 7882815 8539593 9293571 10061189 10753732 11804061 12852619
2130 12852619 13876064 15256932 16896527 18461598 20325192 22584976 25180538 28118001
2122 28118001 31828237 36349132 41134729 46499473 53680530 61699488 68732880 71763732
2114 71763732 78428321 86080698 82053351 66897869 50781209 40319659 33557415 29014303
2106 29014303 25636926 22692200 20399318 18796261 17059720 15860572 15095341 14229422
2098 14229422 13467457 12814817 11793944 10830077 9944836 9309692 8839418 8407175 7931003
2089 7931003 7491648 6956312 6542608 6198136 6144565 6026297 5851235 5480516 5218008 4888298
2079 4888298 4799844 4668993 4357328 4343031 4211826 4011006 3676887 3747337 3752222 3397026
2069 3397026 3332447 3089698 3058228 3025571 2886702 2706525 2614112 2723091 2696659 2548240
2059 2548240 2759844 2540321 2276350 2067253 1989654 2040884 2067759 1934809 1828539 1710547
2049 1710547 1836085 1711923 1714510 1694866 1605105 1828666 1447006 1417121 1649860 1663562 1712634
2038 1712634 1638643 1416509 1542003 1452446 1228347 1063415 1166005 1133530 1087141 1025162
2028 1025162 1058297 1149168 1120192 1170287 944560 988401 944436 858668 846378 869743 901352
2017 901352 1001280 976065 855596 796299 812153 866415 741890 921344 795942 620129 631535
2006 631535 779534 817686 870888 839951 622386 635325 548503 628627 600014 671226 738774
1995 738774 688281 715238 387997 346993 349368 356251 352447 442243 377417 362902 527626 516054
1983 516054 535774 553544 598043 613119 701590 653871 504679 493364 468730 536642 235257
1972 235257 305773 370953 276624 302861 245873 244275 294380 425978 495226 385005 359127
1961 359127 573448 512279 467376 499425 365859 409377 559181 479369 445785 596894 656935
1950 656935 525769 325301 234440 438690 274121 207905 118369 75335 298213 289378 284467
1939 284467 308860 412975 382398 196401 82325 211545 172434 134638 79083 163145 -67840
1928 -67840 -109927 40674 234559 161231 227763 341635 181809 131192 156145 211105 268364
1917 268364 30613 165488 469510 238201 22777 -112192 160774 233549 -58276 -101449
1907 -101449 108827 201860 353081 183830 230339 219767 42728 214556 293835 305681 282464
1896 282464 144815 -34784 3764 64114 215977 192984 178762 165181 63210 42379 123996
1885 123996 135092 128720 226436 332538 317937 138072 100187 125139 57513 258605 329348
1874 329348 293149 198102 42439 8683 278147 239035 -80171 146898 278082 172804
1864 172804 -122972 -65404 125049 164459 223006 211131 44766 76082 81779 246555 352981
1853 352981 469653 312178 552533 458897 349929 416282 275897 180918 168697 380230
1843 380230 559480 448099 310033 218181 206635 167335 84105 16101 -52106 4572 177425
1832 177425 159316 197546 233018 -35042 71545 144605 13880 -68113 2529 68555 -76691
1821 -76691 -22977 -53667 86000 143486 50527 -41682 -3623 -8964 84960 89391 206764 182585
1809 182585 -43358 63989 123111 -38750 -24552 34727 -209537 61529 104309 174355 47424
1798 47424 65628 11062 80085 214190 111213 -31954 -37220 218596 258223 306893 208155
1787 208155 251041 319995 352134 117711 85863 -5302 -117274 5011 132578 33400 -127165
1776 -127165 3651 -159063 -107310 -86803 -138158 -157949 -220611 29320 171668 75318 208901
1765 208901 115089 -4508 -225956 -280417 -110869 -4173 -107803 -110750 -116309 97762 -84996
1754 -84996 -186388 1214 -25542 19809 69534 21205 199522 211597 235156 55941 -282310
1743 -282310 -224637 -84949 185281 110397 -23681 29555 -45467 21927 -39501 -80730 152407
1732 152407 -10678 -76623 169835 144299 222014 67495 101054 138248 200229 60314 188084
1721 188084 346872 223194 95020 87023 280460 249659 11630 -64285 89452 -59749
1711 -59749 -80790 -36384 26360 -86175 -8427 112193 73784 -88285 -35381 -35267 10302 -3111
1699 -3111 -158170 -100424 112950 -128141 -89835 -17024 -88868 -65717 -175957 -219621 -65695
1688 -65695 -42188 -122769 54597 -24476 -181810 -36209 10110 97154 68329 -101342 -140591
1677 -140591 153552 74195 -58291 20621 -243005 -216239 -293854 -94735 19840 -91556
1667 -91556 -15385 -53965 -126352 -161142 -215662 -196825 24280 -16763 -65375 -246988 -215929
1656 -215929 -36418 108523 -11419 38312 -3249 -106257 4250 30490 128548 26478
1646 26478 31594 204261 111930 -99795 -106895 -118446 -28774 -65739 -271830 -389437 -169518
1635 -169518 -140420 -170414 -182765 -246421 -98810 123040 162217 43516 170264 266808 262660
1624 262660 38081 54221 85542 -112473 -82470 -40612 69785 71430 123020 174012 30583
1613 30583 31696 19364 -7427 -320305 -259487 -179791 -219734 -172685 -121626 147566 9999
1602 9999 102756 258901 206497 114365 -55267 -32791 16746 81865 251819 201943 250258
1591 250258 87561 112920 162557 146258 58965 -120343 -13618 113695 209229 17089 -152704
1580 -152704 -57130 -232362 -188403 -13039 -173996 -186257 -201694 -134969 -64110 -14159 -152810
1569 -152810 -130066 -75492 162791 262277 70509 32668 -31682 28457 166534 21270 -59448
1558 -59448 -144612 -20806 -68309 -4313 169802 34790 207108 54597 -5277 -78861 -118160
1547 -118160 -26715 77402 -41575 73447 -6916 -93517 -61883 28717 127067 99897 -123993
1536 -123993 -285649 -242154 -165431 -136906 -311808 -265465 -101508 -15593 -83882 -105684 -26355
1525 -26355 -350065 -249009 -106147 -250473 -127545 -232664 -288089 -65786 -37073 39430
1515 39430 -130277 -409618 -162149 -101528 -26468 72626 -47902 -112040 -97751 -277870 -207938
1504 -207938 -283133 -147868 -98143 -186305 -277935 -234235 -290158 -201639 -133274 -31152 133563
1493 133563 -57750 35907 93519 -98719 -70101 112573 14974 -123540 -69893 30575 -20788
1482 -20788 -144377 -324223 -53406 -7382 -69557 65065 38830 111149 87423 81703 28772
1471 28772 -45344 -61887 -223330 -49492 157404 263784 123747 33439 -231610 -118958
1461 -118958 140313 99667 -115171 -60552 -107900 -304558 -191821 -8939 -23612 48793 237545
1450 237545 155203 187139 25070 151675 -33845 -329593 -294786 -81783 64229 -93663
1440 -93663 -125293 -43206 29116 380 57549 125692 32658 202616 43298 -25950 -128798
1429 -128798 -158959 -147688 130636 193361 46551 189451 124094 135016 81543 -92717 6509
1418 6509 9550 138219 19915 -318904 -87952 -30850 150526 169542 14796 -32671 2396
1407 2396 8285 -89642 -13892 9449 -12061 -85810 81484 -19180 -96828 -164689 -55102 -23392
1395 -23392 88016 -67199 -184626 -149247 -216205 -175028 -12975 -92641 -213740 -47064 -132876
1384 -132876 27458 40570 -45808 -13482 15329 -112960 -30835 83188 230542 125956 200354
1373 200354 100768 177493 286392 82422 27512 41893 129354 93162 -76028 107659 3729
1362 3729 66229 -27739 33497 75523 106849 152602 72516 20355 -70120 -69296 6428 188679
1350 188679 141348 166256 173637 84687 281295 226010 -80765 -62818 28690 53898 14033
1339 14033 -87688 -99345 76434 117601 -18504 -85526 -301541 -154115 51673 37765 73959
1328 73959 -172010 -318554 -265017 -110484 -2733 254604 161456 400596 335084 193433
1318 193433 58092 -55791 -62160 -53170 -43699 4151 105145 -9978 -22005 38418 41711 -5341
1306 -5341 -178507 69993 176339 106623 172442 26033 41580 -105540 -41918 29515 -27143
1295 -27143 -32011 -107182 16260 -38579 127701 155190 -88397 -146900 -171582 -43435 49670
1284 49670 117237 211447 163787 153966 -20580 -2821 51384 -177385 -28277 216422 68960
1273 68960 -2454 -29353 11645 -11743 -380202 -297454 -39120 27668 -97335 -163987 -120085
1262 -120085 26901 130667 -71442 -46671 214693 121735 -23055 227660 345774 162030
1252 162030 135983 38219 -41037 108273 74619 -19397 -53593 -38451 -188002 -92722 96038
1241 96038 66899 -144298 -169211 -137457 -253239 -416488 -274401 -135110 -256227 -262555 -268181
1230 -268181 -214461 -287444 -155299 -47542 -110835 -261103 -84684 -131104 -44133 -39497 -156168
1219 -156168 -255020 -180325 -175013 -252856 -171931 -66970 -199325 13463 5794 16906 27313
1208 27313 84293 99635 -91849 49365 37458 69544 -133545 -278745 -336243 -156027 -23844
1197 -23844 -166022 -87226 -37129 -148704 -223475 -156388 -239690 -259310 -163573 -7487 268707
1186 268707 131347 200421 169395 106666 167339 131805 76558 232888 216915 -74661 -229110
1175 -229110 -177606 5993 -31032 -89196 -42389 89187 39799 -133620 -139646 -62786 5884
1164 5884 31 -87897 -91448 -95289 187279 213508 142766 201463 199203 97089 -90472 -40137
1152 -40137 -28294 -98026 -51215 15734 7054 139433 208103 72927 23384 2726 54323 70902
1140 70902 186619 152836 464 -101177 -182063 -124391 -49582 -217501 -260238 145417 17409
1129 17409 64680 -78476 -137279 -273978 -120029 115785 101361 -26877 -37082 119252 42666
1118 42666 -141576 -72006 -231744 -500971 -375528 -52224 -73006 215253 53643 -158782
1108 -158782 178026 120070 -109662 -122992 -89157 -137605 -186611 966 31969 -115237 -74071
1097 -74071 -110620 -125432 -62587 103281 88334 113358 175266 226906 86701 -103450 -234756
1086 -234756 -179877 38513 -6787 -181340 105993 175119 34896 -137153 88293 -24305
1076 -24305 -94975 -18753 71714 -41122 70651 346525 206915 -54855 -33942 84277 -53472
1065 -53472 66657 124517 101933 -180386 69489 53657 22531 -108679 -221509 -74048 -19126
1054 -19126 109260 49846 27200 86218 114967 -66364 13115 -98264 -164601 -129928 -45203
1043 -45203 62901 2472 -143801 40016 11640 184409 152565 -52724 -67461 -47962 -17537
1032 -17537 40120 -82772 -37445 101494 79966 -167028 -161012 -11118 6946 39627 -140282
1021 -140282 36307 13379 -34213 197916 25285 -88801 -20744 41459 47469 -77207 -139149
1010 -139149 -224737 92487 162701 -137789 -85356 43084 -39062 -1578 69652 -47127 10343
999 10343 26524 67489 -33775 -104234 -142984 -76254 27007 -114764 126561 236869 105894
988 105894 20715 27790 -235095 -243850 -67456 -183720 -159703 -13561 48125 -24922 -55300
977 -55300 13241 -12609 -24522 32968 67069 -57472 62898 -53478 -217742 -11579 -53184
966 -53184 34766 87621 -25323 12711 -58834 -91268 111781 230451 120970 218837 93103
955 93103 72056 4827 -432201 -163332 -42668 -59750 -39572 -60251 -82329 -281581 -242093
944 -242093 -154993 -54417 58365 5440 -30903 76653 -98620 -83764 -172925 -70451 -176050
933 -176050 -270899 -315613 -199278 -145448 21131 16749 -144209 -208604 -167520 -51456 -152373
922 -152373 48230 66949 231080 134907 13764 -61929 -97559 -91493 -83382 67207 248752
911 248752 -10895 -224367 59673 244294 161600 41203 97113 -56570 -243923 -220613
901 -220613 -168323 -248223 -289675 -186556 -168690 -249222 -253119 -318054 1155 283112 301722
890 301722 87851 -171134 -151376 -78000 13320 111727 148510 3793 -164023 -131039 -102543
879 -102543 -202375 -89007 -177126 -156551 186692 70894 29585 66687 -123706 -197799 21656
868 21656 19777 2868 115088 153810 125581 -65135 -125614 -104240 -86271 -10836 44352 -94191
856 -94191 -85416 88358 -11721 -308884 -108830 -60377 -173485 -165233 -30385 91304 142388
845 142388 -179161 -91960 -69730 129745 132939 104024 90040 -15386 59505 70303 7795
834 7795 -93979 5417 79484 88593 5429 -12402 -108525 -176263 3929 172339 108357 -177829
822 -177829 -29582 -8713 79172 143931 -46402 -17798 -70730 26952 105873 -35804 -127353
811 -127353 -146857 -196653 -67329 -24840 10093 93220 128040 268674 187969 82291 183693
800 183693 23081 28347 118108 73393 -109996 -116827 -241402 -211820 -89458 58209 50207
789 50207 -93340 -125343 -220590 4543 -2224 -23826 -52084 -95735 -35142 -20264 -73658 -45193
777 -45193 74118 -78273 19011 40107 -107085 -96359 -1765 -52814 185994 171586 94144
766 94144 49961 -141730 -227558 -102384 -192600 -35693 72450 -28575 -72398 -54075 -140510
755 -140510 -164554 81803 34687 -166534 -230628 -143369 53259 186123 142270 146270 110489
744 110489 73469 8224 45067 142100 221296 8385 -102410 -25489 -138314 -166595 28489
733 28489 85127 -186178 -230891 -179123 2499 -101986 -255185 -173743 -282635 -230488 -44549
722 -44549 75454 -52077 -184008 -35471 9590 -76858 -104665 26443 99353 58297 83371
711 83371 127717 85886 66857 88522 150454 105628 58843 -179158 -129551 11186 -10443 -68268
699 -68268 -168194 -33055 -225695 -56211 -117129 -74133 3886 945 136765 40115 -39122
688 -39122 11351 31759 -4305 67769 118073 176007 89125 -44064 3883 -88343 -22387 -41485
676 -41485 -64472 -47704 -76035 -70492 -32677 30554 -100767 -116942 185045 -89066 -89602 16358
664 16358 81983 62456 42190 -28487 -93119 -141166 190835 -2401 -178223 -13547 -54058
653 -54058 -220016 -365560 -50607 22176 210582 401870 331553 99916 103400 198340 -61697
642 -61697 -231528 -106781 -312895 -221549 -184995 -22457 114236 54214 -123290 -52600 -306316
631 -306316 -389964 -156880 80429 106154 -39020 19175 67299 84727 37172 14602 -94377
620 -94377 124507 85393 -21701 170192 27036 5906 32320 -134440 -140603 8618 74452
609 74452 81602 -162652 -288264 -56554 30610 5209 186129 -23138 -16733 32938 138593
598 138593 175243 46137 -47561 -138046 -82321 -59292 -7154 239714 -134243 -144593 -206514
587 -206514 -98117 167819 143619 284147 39789 2415 -38930 -13216 -208813 -39390 -87945
576 -87945 -21634 17809 -44759 -196706 -298753 -65978 169034 3030 -59205 69136 -11943
565 -11943 -44155 -73046 -212122 -233639 -105801 -27878 5925 -68509 -134491 85871 146197
554 146197 -18952 -4930 -186778 -356 95234 44366 92808 -121027 -134518 -50679 -34772
543 -34772 91943 239367 209697 156607 -1552 196258 93465 117030 136053 165410 91203
532 91203 320 -57205 -221297 153939 152910 162617 101097 42630 6646 63027 -14077 132381
520 132381 59567 27360 207547 126643 197688 -120548 -108751 -41925 -99603 8215 36241
509 36241 -1533 -269121 -188033 1683 -39999 30271 128779 62321 -216728 -114934 -227764
498 -227764 -313712 -192872 -84536 -105077 31038 99558 -2800 250107 204078 64646 34899
487 34899 -79192 -232764 -203798 -68692 14212 116432 13223 43191 98692 -78660 -104499
476 -104499 57314 283859 303282 172788 107996 62103 28335 185077 2247 168602 -146796
465 -146796 -148664 26969 -17935 68995 11235 6399 -16902 -58132 10589 74387 120810 96522
453 96522 97905 65959 38997 40455 44324 98168 -13946 169044 66781 60802 138429 190026
441 190026 171620 166271 2000 57705 -17634 52479 131050 155170 75476 -4525 -56003 28669
429 28669 153323 -23730 -99090 -231288 -350454 -160897 12204 112613 115761 151940 -9290
418 -9290 -102674 18982 -439 -30381 -9318 -70568 -131686 53912 -143763 -192802 106237
407 106237 72666 31415 -92289 -193872 -159194 -211783 -120243 -129013 43308 -82652 -162868
396 -162868 -115478 -74418 -111593 -205605 -133844 18127 34673 -60584 -196345 -73446 -41324
385 -41324 13751 -195490 -305553 -193858 -123746 -233992 -179709 -114735 3997 -3228 -112947
374 -112947 -201038 -127877 -197965 -141437 3523 -241277 -177563 -162145 87199 -97875 -111349
363 -111349 -55785 -73413 -47124 -204096 -81711 32419 -37896 -179633 -145678 -137681 -178079
352 -178079 -23016 -40689 -100469 -145761 -88507 -71908 -174475 -163535 -61053 23002 2339
341 2339 -140386 3148 32717 -56214 -35815 7534 -23385 -82513 70572 159408 -460
330 -460 -37920 -48235 56443 155780 6437 -70534 -92006 -152740 25754 -87508 -137154 -281056
318 -281056 -321564 -115152 -156082 -52433 40731 -209147 -271192 -147374 -148232 -110316 -177241
307 -177241 -125358 -210627 -178979 -55505 -186755 -305650 -220563 -207824 -98227 30827 -183406
296 -183406 -427317 -193455 55883 -123574 -59162 98716 -75199 14028 43934 -186111
286 -186111 -268895 -228297 -103444 -44606 -313744 -305657 -23456 230723 99692 35510 125052
275 125052 124778 184051 -3049 -35045 -81983 -155709 -39545 -13574 -117781 -204559 -199749 -150272
263 -150272 -81308 -76403 14459 -1910 -134614 22934 -1423 -38573 -152345 -17523 -240957
252 -240957 -184222 43554 177463 71321 5466 3760 -92345 -8007 -112450 -82514 126298
241 126298 197380 -56515 21448 -112446 -54877 -62326 -120674 -49320 -69601 -236027 38718
230 38718 77290 -200323 -430917 -343247 -491369 -363549 -252974 -173673 -123789 -349983 -191164
219 -191164 -321761 -133816 -111469 28392 68006 85017 69369 11187 -63430 -87315 -39933
208 -39933 -173611 -23130 -142829 -135758 -20523 -159626 -146900 -130053 -119124 16718 2693
197 2693 1527 -108183 -218905 -328047 -304440 -358872 -187335 -46338 83784 80735 -95541
186 -95541 -217292 -120911 84711 58855 95285 141058 65709 -160784 48360 32875 -40331
175 -40331 -87221 -160449 -222505 -113022 -141576 -203844 -131266 -21521 -44366 99403 -3273
164 -3273 -44801 -36143 58894 94993 131149 -29369 -73660 -62239 -103922 -215139 -265128 -56865
152 -56865 -159814 -147295 -151072 112179 133297 62863 208800 208028 91185 13049 67446 32699
140 32699 -76353 113216 110266 52915 -4842 181860 43154 -191801 -94044 -134589 -157224
129 -157224 -1919 -105350 -82502 -108064 -323765 -191433 -133004 -109590 -140575 -116035 -257420
118 -257420 -297446 -243941 -158539 -13517 48166 22988 -25389 -16077 -49241 -192991 -247099 -64326
106 -64326 159111 60091 -136833 -40845 -92773 -176601 -234320 -135432 -83584 55432 -165323
95 -165323 -279347 -205713 -17637 62528 -92326 -195192 -222382 42236 36375 -50403 29588
84 29588 52661 -79075 -260512 -239573 -188940 -82019 -72292 -134899 49834 -64413 -108962
73 -108962 -138332 -151338 -63992 45036 -6311 -57311 -106555 -95662 -119082 -187001 -61319 -98645
61 -98645 -127515 -110036 -85491 125821 170950 159861 -9559 -25337 -125296 -220275 -228833 -149658
49 -149658 39389 73860 102919 126258 72478 22974 36034 42405 84192 -52173 -218766 -147284
37 -147284 -24093 7709 57729 -39050 -109001 -110040 -107438 -39790 -26860 -18647 -110219 12455
25 12455 88135 7289 60984 88611 55716 94909 75805 -40418 -81698 -240107 -167926 73692
13 73692 13760 -130708 -50942 -161837 -126801 -189934 -93456 27569 -138484 -129591 -108592 -61892
1 -61892 -111961
0 -111961
$$ Imaginary data points
##PAGE= N=2
##DATA TABLE= (X++(I..I)), XYDATA
16383 -1654696 -1713991 -1838359 -1847942 -1582513 -1586391 -1754642 -1727686 -1599782 -1531555 -1651397 -1470106
16372 -1470106 -1265169 -1228762 -1397911 -1374016 -1318535 -1340479 -1406730 -1286154 -1311168 -1255068 -1124787
16361 -1124787 -1031659 -966742 -943760 -993614 -929075 -845926 -810975 -861835 -855786 -852513 -773383 -586016
16349 -586016 -578136 -498989 -490845 -525980 -420000 -247251 -222548 -327892 -296180 -324379 -315048
16338 -315048 -262553 -125005 -87595 -182916 -147320 18247 88878 86309 45155 91959 222134
16327 222134 210980 315518 350999 234467 243923 337219 400291 491253 542528 535628 440936
16316 440936 572141 672075 702769 629564 605257 564854 561135 603841 692465 721153 807137
16305 807137 882426 845752 917065 903502 864173 891162 1049548 1250548 1272750 1125897 1265559
16294 1265559 1241042 1371315 1385142 1281229 1116912 1198783 1349108 1299776 1424762 1503834
16284 1503834 1564365 1566138 1680954 1726535 1809423 1696731 1752176 1707087 1887248 1911759 1807400
16273 1807400 1756714 1760301 1886618 1971718 1920961 1854805 2056658 2000402 2049686 2239494 2236243
16262 2236243 2342079 2029785 1945638 2090837 2274329 2314092 2124165 2004717 2011539 2108765
16252 2108765 2202339 2270129 2376645 2409857 2413804 2494988 2422589 2470987 2585320 2580042 2439139
16241 2439139 2381662 2610750 2687583 2492395 2548689 2622560 2612519 2703745 2563753 2599621 2717878
16230 2717878 2727310 2660108 2820598 2939847 2692681 2829712 2981269 3087885 3001262 3025241
16220 3025241 2806142 2870285 2940728 2972856 3022115 3111999 2934163 3008033 3118436 3077128 2942877
16209 2942877 2959367 3014871 3211406 3306666 3298575 3185015 3057022 3401704 3314842 3010619
16199 3010619 2997371 3044832 3131346 3140076 3276742 3485836 3493606 3300557 3144916 3373568 3437401
16188 3437401 3485436 3472535 3660076 3640643 3676463 3424552 3425072 3437996 3389875 3526656 3512876
16177 3512876 3455406 3519411 3566366 3343991 3389954 3404625 3352020 3385653 3500433 3570496 3566791
16166 3566791 3764834 3828418 3664812 3625113 3672759 3720751 3779788 3588502 3576208 3546616 3540765
16155 3540765 3527325 3645622 3898681 3750497 3720629 3826994 3971852 3946082 4004266 4052959
16145 4052959 3929517 3723640 3736919 3806077 3793267 3809607 4032424 4008050 3879527 3841440
16135 3841440 3865806 3898378 3949060 3981066 3822930 3870722 4020866 4163587 4052202 3964713
16125 3964713 3898366 3707513 3670252 3811052 3757826 3792826 3829835 3718663 3821903 3923535
16115 3923535 3959203 4065906 4066834 3976043 4066167 4143573 4131676 4038013 4041987 3927160 4094000
16104 4094000 4184553 4258689 4138824 3984328 3883636 3876145 3875850 3735879 3917334 3957554 4106972
16093 4106972 4050086 3843464 3634983 3916090 3929012 3899235 3907233 3671688 3876283 4009297
16083 4009297 4039214 4133502 4154631 4261359 4078918 4132628 3878329 3884516 4049914 4126594 4275500
16072 4275500 4194845 4059613 3997044 3917045 3809193 3943767 4026690 3916510 4011810 3877136
16062 3877136 3961578 3940250 3924633 4048997 3917177 3999311 4140317 4297743 3984051 3966487
16052 3966487 4079728 3956871 3936126 3989688 4070626 4103109 4142875 4099051 4303644 4218725 3894261
16041 3894261 4100605 3984771 3830664 4093513 4228539 4103015 4096528 4019848 4116535 4081866
16031 4081866 4188895 4162357 4065971 3912915 4194345 4153814 4019161 4089089 4112243 4007535
16021 4007535 3877380 4068911 4179159 4248262 4234160 4270310 4288237 4244219 4216228 4175419 4054008
16010 4054008 4145514 4144563 4133158 4266961 4182563 4070681 4075946 4176248 4082554 3935248 3961416
15999 3961416 4027808 4211364 4048037 4092025 4187194 4137347 4251116 4135550 4213611 4280330
15989 4280330 3906685 3958219 3882036 3757148 3747215 3751674 3896718 3892413 4011654 4109636 4167975
15978 4167975 4258267 4300336 4296100 4373367 4443508 4328027 4139675 4110320 4268136 4278612 4124443
15967 4124443 4018785 3873360 3949510 4106254 4061797 4077426 4034907 4067786 4372860 4072645
15957 4072645 3756574 3872771 3912396 3835433 4072450 4164819 4247578 4264968 4074122 4127909
15947 4127909 4019086 4017875 4213089 4110778 4174292 4264008 4257854 4178038 3995515 4065515 4138138
15936 4138138 4181271 4159693 4153554 4124246 4426376 4505565 4311257 4269666 4262269 4101650 4116271
15925 4116271 4177595 4028921 4030315 3964232 4051590 4062953 4054308 4226899 4027639 4150093 4450292
15914 4450292 4371654 4414699 4255281 4162337 4128473 4078637 4158582 4183151 4295529 4293235 4247374
15903 4247374 4351053 4106351 3936844 4274263 4215739 4089126 4197392 4146545 4297445 4423802
15893 4423802 4336509 4375509 4081404 4042509 4165636 4169860 4025297 4056953 4190214 4068908
15883 4068908 3929480 4092842 4155258 4153029 4134030 4105704 4299194 4323769 4284137 4122983 3907226
15872 3907226 4127555 4188679 3975801 4194694 4311418 4130124 4106190 4174647 4265137 4169097
15862 4169097 4113021 4316288 4272285 4239016 4230039 4251865 4352819 4458247 4132362 3867863
15852 3867863 3985115 3940695 4167862 4196507 4191705 4134431 4018144 3944759 4159194 4179562 4174298
15841 4174298 4331152 4205004 4130581 4329441 4217175 4072649 4177226 4111331 4232479 4458494
15831 4458494 4374085 4283967 4303726 4314820 4075570 3989322 4010260 4017261 4099138 4208927 4380161
15820 4380161 4393629 4397530 4231838 4210022 4192578 4216900 4152804 4440774 4386567 4198961 4206543
15809 4206543 4320376 4308307 4225595 4379307 4422898 4337602 4205430 4309828 4402812 4442109
15799 4442109 4314359 4081714 3994714 3925945 4102704 4163876 4124643 4148989 4125165 4158333 4108497
15788 4108497 4308366 4437036 4292835 4047961 4135307 4420595 4457688 4318747 4202675 4287819
15778 4287819 4270468 4336291 4098431 4342062 4511700 4381297 4400297 4352230 4437772 4493457
15768 4493457 4471026 4224036 3997850 4105969 4343032 4411180 4188481 4338036 4305909 4343963
15758 4343963 4247116 4141189 4257973 4187998 4067567 4034483 4168351 4208328 4197807 4249445
15748 4249445 4149546 4369888 4093532 4213977 4409423 4181862 4111333 4258696 4276671 4291752
15738 4291752 4277096 4136435 4143448 4182232 4322752 4408296 4549801 4444494 4438168 4464414 4362049
15727 4362049 4296360 4262470 4200229 4138916 4066081 4308050 4377927 4419637 4311880 4318625 4342732
15716 4342732 4321617 4353890 4378003 4312478 4321260 4403877 4339449 4274424 4309706 4324154 4534322
15705 4534322 4286186 4361410 4363956 4269142 4317161 4283599 4285363 4428659 4393895 4319991 4415656
15694 4415656 4441019 4396218 4269194 4276960 4395583 4284304 4173628 4190873 4385784 4332858
15684 4332858 4073281 4277240 4432033 4386133 4444578 4254905 4193539 4277453 4333532 4310587
15674 4310587 4474009 4107910 4383786 4561898 4370208 4378253 4307012 4223444 4267437 4382917
15664 4382917 4310340 4359666 4292714 4291788 4375958 4359655 4151120 4089299 4394134 4374106 4253505
15653 4253505 4330142 4214445 4228363 4305270 4269190 4216212 4181478 4226454 4320004 4232966 4243540
15642 4243540 4300034 4384778 4326312 4422955 4520391 4564735 4524372 4339443 4161314 4123489 4281023
15631 4281023 4438831 4432556 4439636 4335104 4472084 4208164 4308938 4411700 4072296 4056031
15621 4056031 4051350 4105886 4127759 4253574 4442432 4201398 4225377 4434381 4409507 4202534
15611 4202534 4336366 4561540 4527003 4607457 4502133 4348368 4388716 4254892 4380338 4477921
15601 4477921 4339800 4233275 4255071 4307706 4218594 4258846 4364938 4238309 4225922 4251936
15591 4251936 4352385 4254041 4211161 4278279 4301628 4207079 4318933 4089945 4178460 4231431 4259159
15580 4259159 4289942 4262174 4419266 4304174 4251821 4257785 4268726 4129037 4221088 4339148 4338076
15569 4338076 4602471 4522609 4228986 4366523 4499535 4420775 4415642 4569835 4505385 4281055
15559 4281055 4232107 4519116 4556835 4446796 4538247 4618842 4421088 4302323 4185284 4292729
15549 4292729 4433876 4388767 4328648 4167799 4190133 4280932 4475339 4325705 4279038 4501437
15539 4501437 4429051 4510414 4444047 4313705 4128191 4385269 4371644 4381868 4399864 4408380 4471000
$$ [...]
##END NTUPLES=NMR SPECTRUM
##END=
