##TITLE=1H_EC-3029(II-2)
 CDCl3, 8 sc, 
 28.04.2021
##JCAMPDX= 6.0         $$ Bruker NMR JCAMP-DX V2.0
##DATA TYPE= NMR SPECTRUM
##DATA CLASS= NTUPLES
##ORIGIN= UXNMR, Bruker Analytische Messtechnik GmbH
##OWNER= root
$$ XWIN-NMR		Version 3.5
$$ Wed Apr 28 11:31:01 2021 Russian Standard Time (UT+4h)  she@DPX200
##.OBSERVE FREQUENCY= 200.131506
##.OBSERVE NUCLEUS= ^1H
##.ACQUISITION MODE= SIMULTANEOUS
##.ACQUISITION SCHEME= undefined
##.AVERAGES= 8
##.DIGITISER RES= 18
##SPECTROMETER/DATA SYSTEM= spect
##.PULSE SEQUENCE= zg30
##.SOLVENT NAME= CDCl3
##.SHIFT REFERENCE= (INTERNAL, CDCl3, 0, 15.9771)
##AUDIT TRAIL= $$ (NUMBER, WHEN, WHO, WHERE, WHAT)
$$ ##TITLE= Audit trail, XWIN-NMR		Version 3.5
$$ ##JCAMPDX= 5.01
$$ ##ORIGIN= Bruker BioSpin GmbH
$$ ##OWNER= she
$$ F:/spectra/data/she/nmr/H-F/1/pdata/1/auditp.txt
$$ ##AUDIT TRAIL=  $$ (NUMBER, WHEN, WHO, WHERE, WHAT)
(   1,<2021-04-28 11:29:34.10 +0400>,<she>,<DPX200>,
      <created by zg, POWCHK disabled, PULCHK disabled
       configuration hash MD5:
       00 E9 B6 7A A2 85 ED C7 34 08 36 98 17 FE 4E 26
       data hash MD5: 16K
       C6 CE F0 13 7D 86 A9 F7 AE 63 76 C9 C2 BF C1 8D>)
(   2,<2021-04-28 11:29:36.79 +0400>,<she>,<DPX200>,
      <Start of raw data processing
       efp BC_mod = 2 LB = 0.24 FT_mod = 6 PKNL = 1 PHC0 = -11117.13 PHC1 = 6.401015 SI = 16K 
       data hash MD5: 16K
       3C FD 2C 72 AA 34 4E FF AA 2A C9 A1 D6 EE DD 75>)
(   3,<2021-04-28 11:29:56.03 +0400>,<she>,<DPX200>,
      <pk PHC0 = 3.237621 PHC1 = -2.4 
       data hash MD5: 16K
       B2 C1 83 CD 4C B2 5A A1 73 F3 54 B3 AE 6E 6F 12>)
(   4,<2021-04-28 11:29:59.59 +0400>,<she>,<DPX200>,
      <abs ABSG = 5 
       data hash MD5: 16K
       48 51 D0 12 DF 8B 67 6B F5 2E 6A 35 E6 5B 06 F8>)
$$ ##END=
$$ 
$$ hash MD5
$$ 3E 31 70 E4 F1 0D 2A B0 FB 4B D7 D3 24 CD 3E 80
##$RELAX= 
##$RELAX= 
##$RELAX= 
##$RELAX= 
##$RELAX= 
##$RELAX= 
$$ Bruker specific parameters
$$ --------------------------
##$DU= <F:/spectra>
##$EXPNO= 1
##$NAME= <H-F>
##$PROCNO= 1
##$TYPE= <nmr>
##$USER= <she>
##$AMP= (0..31)
100 100 100 100 100 100 100 100 100 100 100 100 100 100 100 100 100 100 
100 100 100 100 100 100 100 100 100 100 100 100 100 100 
##$AQSEQ= 0
##$AQ_mod= 1
##$AUNM= <au_zg>
##$AUTOPOS= <>
##$BF1= 200.13
##$BF2= 200.13
##$BF3= 200.13
##$BF4= 200.13
##$BF5= 200.13
##$BF6= 200.13
##$BF7= 200.13
##$BF8= 200.13
##$BYTORDA= 1
##$CFDGTYP= 0
##$CFRGTYP= 5
##$CHEMSTR= <none>
##$CNST= (0..31)
1 1 145 1 1 1 1 1 1 1 1 1 1 1 1 1 1 1 1 1 1 1 1 1 1 1 1 1 1 1 1 1 
##$CPDPRG= <>
##$CPDPRG1= <>
##$CPDPRG2= <>
##$CPDPRG3= <>
##$CPDPRG4= <mlev>
##$CPDPRG5= <mlev>
##$CPDPRG6= <mlev>
##$CPDPRG7= <mlev>
##$CPDPRG8= <mlev>
##$CPDPRGB= <>
##$CPDPRGT= <>
##$D= (0..31)
0 1.2 0 0 0 0 0 0 0 0.06 0 0.03 0 0 0 0 0.0002 0 0 0 0 0 0 0 0 0 0 0 0 
0 0 0 
##$DATE= 1619594973
##$DBL= (0..7)
120 120 120 120 120 120 120 120 
##$DBP= (0..7)
150 150 150 150 150 150 150 150 
##$DBP07= 0
##$DBPNAM0= <>
##$DBPNAM1= <>
##$DBPNAM2= <>
##$DBPNAM3= <>
##$DBPNAM4= <>
$$ [...]
##$SUBNAM3= <"">
##$SUBNAM4= <"">
##$SUBNAM5= <"">
##$SUBNAM6= <"">
##$SUBNAM7= <"">
##$SUBNAM8= <"">
##$SUBNAM9= <"">
##$SW= 16.9725357007746
##$SWIBOX= (0..15)
0 0 2 0 0 0 0 0 0 0 0 0 0 0 0 0 
##$SW_h= 3396.73913043478
##$TD= 16384
##$TD0= 1
##$TE= 0
##$TE2= 300
##$TE3= 300
##$TEG= 300
##$TL= (0..7)
0 120 120 120 120 120 120 120 
##$TP= (0..7)
150 150 150 150 150 150 150 150 
##$TP07= 0
##$TPNAME0= <>
##$TPNAME1= <>
##$TPNAME2= <>
##$TPNAME3= <>
##$TPNAME4= <>
##$TPNAME5= <>
##$TPNAME6= <>
##$TPNAME7= <>
##$TPOAL= (0..7)
0.5 0.5 0.5 0.5 0.5 0.5 0.5 0.5 
##$TPOFFS= (0..7)
0 0 0 0 0 0 0 0 
##$TUNHIN= 0
##$TUNHOUT= 0
##$TUNXOUT= 0
##$USERA1= <user>
##$USERA2= <user>
##$USERA3= <user>
##$USERA4= <user>
##$USERA5= <user>
##$V9= 5
##$VALIST= <valist>
##$VCLIST= <CCCCCCCCCCCCCCC>
##$VD= 0
##$VDLIST= <DDDDDDDDDDDDDDD>
##$VPLIST= <PPPPPPPPPPPPPPP>
##$VTLIST= <TTTTTTTTTTTTTTT>
##$WBST= 1024
##$WBSW= 4
##$XGAIN= (0..3)
0 0 0 0 
##$XL= 0
##$YL= 0
##$YMAX_a= 451930
##$YMIN_a= -295624
##$ZGOPTNS= <>
##$ZL1= 120
##$ZL2= 120
##$ZL3= 120
##$ZL4= 120
##$ABSF1= 15.97195
##$ABSF2= -1.000712
##$ABSG= 5
##$ABSL= 3
##$ALPHA= 0
##$AQORDER= 0
##$ASSFAC= 0
##$ASSFACI= 0
##$ASSFACX= 0
##$ASSWID= 0
##$AUNMP= <proc_1d>
##$AZFE= 0.1
##$AZFW= 0.1
##$BCFW= 0
##$BC_mod= 2
##$BYTORDP= 0
##$COROFFS= 0
##$CY= -3
##$DATMOD= 1
##$DC= 0
##$DFILT= <>
##$DTYPP= 0
##$F1P= 0
##$F2P= 0
##$FCOR= 1
##$FTSIZE= 16384
##$FT_mod= 6
##$GAMMA= 0
##$GB= 0
##$INTBC= 1
##$INTSCL= 1.334414e-10
##$ISEN= 128
##$LB= 0.24
##$LEV0= 0
##$LPBIN= 0
##$MAXI= 10000
##$MC2= 0
##$MEAN= 0
##$ME_mod= 0
##$MI= 1.114404
##$NCOEF= 0
##$NC_proc= -6
##$NLEV= 6
##$NOISF1= 3.799351
##$NOISF2= 2.8
##$NSP= 0
##$NTH_PI= 0
##$NZP= 0
##$OFFSET= 15.97713
##$PC= 1
##$PHC0= -11113.89
##$PHC1= 4.001015
##$PH_mod= 1
##$PKNL= yes
##$PPARMOD= 0
##$PSCAL= 0
##$PSIGN= 0
##$REVERSE= no
##$SF= 200.130006865047
##$SI= 16384
##$SIGF1= 3
##$SIGF2= 2
##$SINO= 5.538805
##$SIOLD= 16384
##$SREGLST= <1H.CDCl3>
##$SSB= 0
##$STSI= 16384
##$STSR= 0
##$SW_p= 3396.73913043479
##$SYMM= 0
##$S_DEV= 0
##$TDeff= 16384
##$TDoff= 0
##$TI= <>
##$TILT= no
##$TM1= 0
##$TM2= 0
##$TOPLEV= 0
##$USERP1= <user>
##$USERP2= <user>
##$USERP3= <user>
##$USERP4= <user>
##$USERP5= <user>
##$WDW= 1
##$XDIM= 16384
##$YMAX_p= 429775503
##$YMIN_p= -924056
$$ End of Bruker specific parameters
$$ ---------------------------------
##NTUPLES= NMR SPECTRUM
##VAR_NAME=  FREQUENCY,     SPECTRUM/REAL,   SPECTRUM/IMAG
##SYMBOL=    X,             R,               I
##VAR_TYPE=  INDEPENDENT,   DEPENDENT,       DEPENDENT
##VAR_FORM=  AFFN,          ASDF,            ASDF
##VAR_DIM=   16384,         16384,           16384
##UNITS=     HZ,            ARBITRARY UNITS, ARBITRARY UNITS
##FACTOR=    0.207333158178282, 1,           1
##FIRST=     3197.50312381911, 0,            0
##LAST=      -199.236006615681, 0,           0
##MIN=       -199.236006615681, -924056,     0
##MAX=       3197.50312381911, 429775503,    0
$$ Real data points
##PAGE= N=1
##DATA TABLE= (X++(R..R)), XYDATA
$$ [...]
$$ plain form
6483 115351 53046 13734 -3604 -48794 -441 -3620 -15788 64156 133010 47614 25659 61210
6471 61210 100730 -104112 -51448 -26804 28282 -49428 6788 62096 90402 75382 -50289
6460 -50289 -47933 -1636 22668 71685 122680 110315 56411 -4492 50581 8847 26204 79183
6448 79183 90209 100649 64724 -53706 12972 -11977 -46555 20520 94471 32364 -12944 46692
6436 46692 -18624 -66595 -145174 -67233 -52856 -40402 -129589 -121946 -85567 -95514 -101035 -82268
6424 -82268 -118762 -72553 -106426 -124924 -118563 -114761 24554 78641 24812 79524 5247 -38321
6412 -38321 36091 44915 -18436 -19571 65715 111544 63555 -27291 -21302 -43778 22681 11175
6400 11175 74122 44368 -100086 535 111785 153378 192769 139880 99598 87284 59310
$$ packed form
6483A15351o2305l9312j7338m5190M8353l179j2168P9944O8854q5396k1955L5551
6471F1210L9520k04842N2664K4644N5086p7710N6216N5308K8306j5020j25671
6460e0289K356M6297K4304M9017N0995j2365n3904o0903N5073m1734J7357N2979
6448G9183J1026J0440l5925j18430O6678k4949l4578O7075P3951o2107m5308N9636
6436D6692o5316m7971p8579P7941J4377J2454q9187P643L6379r947n521J8767
6424h2268l6494M6209l3873j8498O361L802J39315N4087n3829N4712p4277m3568
6412c8321P4412Q824o3351j135Q5286M5829m7989r0846N989k2476O6459j1506
6400A1175O2947k9754j44454J00621J11250M1593L9391n2889m0282j2314k7974
$$ plain form
6389 59310 72911 48502 11318 -24824 -24124 22325 -22572 -18949 22662 -20233 -67054 -5664
6377 -5664 -65440 -89061 39702 91660 40606 35550 91961 45185 12970 -8428 18513 33815
6365 33815 -25776 46758 29407 31293 112797 96573 71099 147239 65746 18284 -45560 -123457
6353 -123457 -21154 32766 35335 -36272 -63769 -26893 15606 84515 143363 12244 57438
6342 57438 -15480 5984 40410 21235 42770 43398 145305 117222 116377 126690 110021 142720
6330 142720 212315 171411 224506 285872 233267 119599 141756 178199 196588 156184 178518
6319 178518 150539 187323 151666 105869 139311 125469 145446 78736 63835 50135 61269 104645
6307 104645 8435 -32037 -6848 71675 71704 32125 11567 -7598 42942 -18730 11369 55721
$$ packed form
6389E9310J3601k4409l7184l6142P00M6449m4897L623M1611m2895m6821O1390
6377e664n9776k3621J28763N1958n1054n056N6411m6776l2215k1398K6941J5302
6365C3815n9591P2534j7351J886Q1504j6224k5474P6140q1493m7462o3844p7897
6353a23457J02303N3920K569p1607k7497L6876M2499O8909N8848j31119M5194
6342E7438p2918K1464L4426j9175K1535O28J01907k8083q45J0313j6669L2699
6330A42720O9595m0904N3095O1366n2605j13668K2157L6443J8389m0404K2334
6319A78518k7979L6784l5657m5797L3442j3842J9977o6710j4901j3700J1134M3376
6307A04645r6210m0472K5189P8523K9l9579k0558j9165N0540o1672L0099M4352
$$ plain form
6295 55721 36575 -13832 3724 149111 142922 256 -11542 22770 92120 82257 43831 130977
6283 130977 114597 109036 140801 78307 78572 85632 197691 119517 -10094 60883 88385 53530
6271 53530 24565 3591 -21276 41790 196671 193419 158027 213265 148636 -14359 41736 213356
6259 213356 164117 101603 208460 271818 190818 103918 165276 192213 247566 191047 218880
6248 218880 280374 380491 446892 314950 157315 137431 143830 182511 212510 215376 261880
6237 261880 221627 312378 264463 264364 234974 301682 232379 126633 58219 93985 97800 63550
6225 63550 80793 85858 133069 169879 212043 198783 165968 232622 164969 206656 207597 153771
6213 153771 205669 223692 190059 355901 442620 312109 283756 279279 306751 297719 388262 328733
$$ packed form
6295E5721j9146n0407J7556J45387o189j42666j1798L4312O9350r863l8426Q7146
6283A30977j6380n561L1765o2494K65P060J12059p8174j29611P0977K7502l4855
6271E3530k8965k0974k4867O3066J54881l252l5392N5238o4629j62995N6095J71620
6259B13356m9239o2514J06857O3358q1000q6900O1358K6937N5353n6519K7833
6248B18880O1494J00117O6401j31942j57635j9884O399L8681K9999K866M6504
6237B61880m0253R0751m7915r9k9390O6708o9303j05746o8414L5766L815l4250
6225F3550J7243N065M7211L6810M2164j3260l2815O6654o7653M1687R41n3826
6213A53771N1898J8023l3633J65842Q6719j30511k8353m477K7472r032R0543n9529
$$ plain form
6201 328733 346565 397584 349840 443598 418490 401225 370806 412072 372816 350212 363021 322589
6189 322589 244840 224916 378289 378569 341628 274575 338718 413394 474355 408825 428037 488366
6177 488366 528554 519547 549218 505412 505046 509297 519876 484597 572317 667314 690223 705589
6165 705589 719397 697385 685567 739650 717435 799864 894565 895195 923745 909955 847831 954837
6153 954837 990242 1051133 1079529 1040785 1088756 1169511 1139632 1181215 1253709 1383665 1434041
6142 1434041 1453987 1526594 1576728 1683458 1719771 1726188 1830453 1916613 1952924 2087198 2127846
6131 2127846 2280276 2472284 2646320 2759501 2849003 2909902 3142348 3323126 3499883 3725305
6121 3725305 3868703 3964385 4044079 4156939 4254241 4319229 4281630 4326218 4357904 4327836 4196657
$$ packed form
6201C28733J7832N1019m7744R3758k5108j7265l0419M1266l9256k2604J2809m0432
6189C22589p7749j9924J53373K80l6941o7053O4143P4676O0961o5530J9212O0329
6177D88366M0188r007K9671m3806l66M251J0579l5279Q7720R4997K2909J5366
6165G05589J3808k2012j1818N4083k2215Q2429R4701O30K8550j3790o2124J07006
6153I54837L5405O0891K8396l8744M7971Q0755k9879M1583P2494J29956N0376
6142A434041J9946P2607N0134J06730L6313O417J04265Q6160L6311J34274M0648
6131B127846J52430J92008J74036J13181Q9502O0899K32446J80778J76757K25422
6121C725305J43398R5682P9694J12860R7302O4988l7599M4588L1686l0068j31179
$$ plain form
6110 4196657 4080982 3984742 3905839 3753179 3621778 3442561 3333098 3256048 2986576 2925949
6100 2925949 2833927 2549518 2458380 2341903 2274147 2180038 2000566 1942692 1932774 1915514 1776382
6089 1776382 1614996 1522887 1474796 1401187 1348717 1233874 1263269 1189891 1062881 1051671 1006069
6078 1006069 1011119 1024286 1003690 963552 996965 870835 847827 872606 840939 847994 739809
6067 739809 694770 683706 642662 646008 672976 659487 709263 676198 522152 630753 531078
6056 531078 529298 587967 571314 606553 612441 659934 653747 602273 524944 450519 451539 490696
6044 490696 622967 715021 686013 630160 658577 780723 813085 796542 810184 863896 1041565
6033 1041565 1135565 1244626 1175431 1079559 1079832 1063101 1042527 946122 798241 732193 743605
$$ packed form
6110D196657j15675r6240p8903j52660j31401j79217j09463p7050k69472o0627
6100B925949r2022k84409r1138j16477o7756r4109j79472n7874r918j7260j39132
6089A776382j61386r2109m8091p3609n2470j14843K9395p3378j27010j1210m5602
6078A006069N050J3167k0596m0138L3413j26130k3008K4779l1667P055j08185
6067G39809m5039j1064m1044L346K6968j3489M9776l3065j54046J08601r9675
6056E31078j780N8669j6653L5239N888M7493o187n1474p7329p4425J020L9157
6044D90696J32271R2054k9008n5853K8417J22146L2362j6543J3642N3712J77669
6033A041565R4000J09061o9195r5872K73j6731k0574r6405j47881o6048J1412
$$ plain form
6022 743605 738946 714033 787808 767091 652540 730464 742760 646937 605540 554454 529439 491924
6010 491924 543918 560788 354987 377841 342483 391532 340470 280804 395242 427703 365174
5999 365174 323663 339122 353352 337830 357972 311920 314202 280526 277941 380891 405159 360548
5987 360548 338862 290684 264948 251005 283007 307428 304645 267316 277832 342824 293683 249966
5975 249966 349517 349154 299894 228384 266150 340477 294632 239745 356944 358488 343917 400299
5963 400299 390082 470965 456708 444066 507205 494225 580602 594489 634220 768400 698096
5952 698096 705710 664942 558914 508281 388905 412018 432951 353025 323052 222368 217795
5941 217795 228593 181302 144185 135807 149216 275844 237217 223814 192687 200487 181180 284531
$$ packed form
6022G43605m659k4913P3775k0717j14551P7924J2296r5823m1397n1086k5015l7515
6010D91924N1994J6870k05801K2854l5358M9049n1062n9666J14438L2461o2529
5999C65174m1511J5459J4230j5522K0142m6052K282l3676k585J02950K4268m4611
5987C60548k1686m8178k5736j3943L2002K4421k783l7329J0516O4992m9141m3717
5975B49966R9551l63m9260p1510L7766P4327m5845n4887J17199J544j4571N6382
5963D00299j0217Q0883j4257j2642O3139j2980Q6377J3887L9731J34180p0304
5952F98096P614m0768j06028n0633j19376K3113K0933p9926k9973j00684m573
5941B17795J0798m7291l7117q378J3409J26628l8627j3403l1127P800j9307J03351
$$ plain form
5929 284531 340121 312859 231083 310732 248521 105692 104634 85102 90219 150889 285776 285066
5917 285066 183324 121791 195979 115971 55201 144849 87967 31609 48474 115676 68797
5906 68797 -33061 103078 191997 68153 23536 122785 130611 74107 204383 195767 183608
5895 183608 239301 226009 140368 113968 288174 184877 51843 83218 155243 101954 125284
5884 125284 142420 189467 117178 47861 156880 154927 158537 191125 97483 79535 70514 76974
5872 76974 -3544 2906 32445 -35701 -65091 72915 68508 30958 7316 92276 91971 23258
5860 23258 85623 26555 10184 55970 50220 -16429 11074 104016 67439 89679 94668 9394
5848 9394 7479 87616 150468 113906 156309 237737 200005 112863 98877 134291 151766 139025
$$ packed form
5929B84531N5590k7262q1776P9649o2211j42829j058j9532N117O0670J34887p10
5917B85066j01742o1533P4188q0008o0770Q9648n6882n6358J6865O7202m6879
5906F8797j01858J36139Q8919j23844m4617R9249P826n6504J30276q616j2159
5895A83608N5693j3292q5641k6400J74206j03297j33034L1375P2025n3289K3330
5884A25284J7136M7047p2289o9317J09019j953L610L2588r3642j7948r021O460
5872G6974q0518O450K9539o8146k9390J38006m407l7550k3642Q4960l05o8713
5860B3258O2365n9068j6371M5786n750o6649K7503R2942l6577K2240M989q5274
5848I394j915Q0137O2852l6562M2403Q1428l7732q7142j3986L5414J7475j2741
$$ plain form
5836 139025 146077 81408 83019 141875 142342 37005 -375 82683 162261 79448 38727 106503
5824 106503 106282 135901 242022 72531 28080 85646 144396 213576 140157 188577 233019 171680
5812 171680 149814 247368 225916 125026 254983 274637 184948 224814 222630 153169 110532
5801 110532 166538 161106 127336 158649 151123 74131 47658 82024 141808 149681 151743 175020
5789 175020 141826 128879 130132 148316 88173 84119 121754 59250 69481 234741 235924 230165
5777 230165 238794 197346 68458 81540 186546 191094 176147 245979 196369 120543 190519 214821
5765 214821 210059 216994 246959 204264 147350 159041 188964 231087 232329 330161 274179 229680
5753 229680 178102 121386 190879 263957 231766 165440 235476 265582 216174 187700 171235 145557
$$ packed form
5836A39025P052o4669J611N8856M67j05337l7380Q3058P9578q2813m0721O7776
5824A06503k21K9619J06121j69491m4451N7566N8750O9180p3419M8420M4442o1339
5812A71680k1866R7554k1452j00890J29957J9654q9689L9866k184o9461m2637
5801A10532N6006n432l3770L1313p526p6992k6473L4366N9784P873K062K3277
5789A75020l3194j2947J253J8184o0143m054L7635o2504J0231J65260J183n759
5777B30165Q629m1448j28888J3082J05006M548j4947O9832m9610p5826O9976K4302
5765B14821m762O935K9965m2695n6914J1691K9923M2123J242R7832n5982m4499
5753B29680n1578n6716O9493P3078l2191o6326P0036L0106m9408k8474j6465k5678
$$ plain form
5741 145557 99762 155450 230072 64306 10647 48132 185879 156013 234440 298744 295334
5730 295334 217995 157234 171703 79841 100201 282039 353316 327444 310030 270062 208447
5719 208447 188456 240375 272182 251175 272819 268650 312726 406673 405698 332928 330124 424319
5707 424319 520486 596749 625026 703134 671381 703203 777876 758421 761810 671945 676180 768334
5695 768334 698035 590488 498973 415963 482638 451873 358531 288961 328884 273753 261078
5684 261078 367260 386923 337850 351942 321966 410186 336815 233028 250690 284904 259290
5673 259290 241549 260572 231540 261755 313224 247088 242638 267525 337126 345024 371383 492242
5661 492242 467260 563197 590782 584717 640005 665755 678509 656136 715352 700068 693852 662416
$$ packed form
5741A45557m5795N5688P4622j65766n3659L7485J37747k9866P8427O4304l410
5730B95334p7339o0761J4469r1862K0360J81838P1277k5872j7414l9968o1615
5719B08447j9991N1919L1807k1007K1644m169M4076R3947r75p2770k804R4195
5707D24319R6167P6263K8277P8108l1753L1822P4673j9455L389q9865M235R2154
5695G68334p0299j07547r1515q3010O6675l0765r3342o9570L9923n5131j2675
5684B61078J06182J9663m9073J4092k9976Q8220p3371j03787J7662L4214k5614
5673B59290j7741J9023k9032L0215N1469o6136m450K4887O9601P898K6359J20859
5661D92242k4982R5937K7585o065N5288K5750J2754k2373N9216j5284o216l1436
$$ plain form
5649 662416 593310 548327 363806 287917 343079 382852 266263 286747 256012 357891 334912
5638 334912 359525 401557 339629 295000 242542 311835 267704 177931 124124 128110 214832 248405
5626 248405 251371 265348 245164 263828 335839 401278 410600 322234 368960 309659 282310 349491
5614 349491 448384 308265 323127 323304 292395 318893 342445 394294 399292 346013 370819 356469
5602 356469 349134 446141 469952 342368 450390 519030 475214 478058 488462 500764 503086 510821
5590 510821 550143 516324 534335 535256 572738 471444 313492 474826 481163 457614 497202 493334
5578 493334 443320 417996 484670 500586 496591 686178 723724 688486 718944 703497 795353 978258
5566 978258 945633 1063902 981189 1005999 986675 860756 774156 794495 711014 636708 551275
$$ packed form
5649F62416o9106m4983j84521p5889N5162L9773j16589K0484l0735J01879k2979
5638C34912K4613M2032o1928m4629n2458O9293m4131q9773n3807L986Q6722L3573
5626B48405K966J3977k0184J8664P2011O5439R322q8366M6726n9301k7349O7181
5614C49491R8893j40119J4862J77l0909K6498K3552N1849M998n3279K4806j4350
5602C56469p335R7007K3811j27584J08022O8640m3816K844J0404J2302K322P735
5590E10821L9322l3819J8011R21L7482j01294j57952J61334O337k3549L9588l868
5578D93334n0014k5324O6674J5916l995J89587L7546l5238L0458j5447R1856J82905
5566I78258l2625J18269q2713K4810j9324j25919q6600K0339q3481p4306q5433
$$ plain form
5555 551275 487627 461298 531332 618260 697216 660893 577652 567864 567781 645446 633052 662445
5543 662445 640588 606505 705845 732966 707265 725559 737036 744545 748998 778761 726092 570707
5531 570707 641956 669430 627489 640966 711893 704160 621457 607528 612544 620626 646065 700980
5519 700980 698354 640518 661777 662032 651571 643466 594580 571438 690638 698185 651541 660987 731584
5506 731584 767476 723050 685541 752417 857288 917179 853856 810983 830301 890299 868331
5495 868331 896585 986869 1015348 1096531 1103391 1089977 1139298 1170352 1142685 1163236 1192605 1248519
5483 1248519 1195729 1327970 1333881 1258430 1281513 1381079 1338496 1474490 1521766 1544772 1544842 1576837
5471 1576837 1701295 1703883 1737918 1842824 1896281 1881881 1941074 1981407 2039280 2092222 2107814
$$ packed form
5555E51275o3648k6329P0034Q6928P8956l6323q3241r788q3P7665j2394K9393
5543F62445k1857l4083R9340K7121k5701J8294J1477P509M453K9763n2669j55385
5531E70707P1249K7474m1941J3477P0927p733q2703j3929N016Q082K5439N4915
5519G00980k626n7836K1259K55j0461q105m8886k3142J19200P547m6644R446P0597
5506G31584L5892m4426l7509O6876J04871N9891o3323m2873J9318N9998k1968
5495H68331K8254R0284K8479Q1183O860j3414M9321L1054k7667K0551K9369N5914
5483A248519n2790J32241N911p5451K3083R9566m2583J35994M7276K3006P0L1995
5471A576837J24458K588L4035J04906N3457j4400N9193M0333N7873N2942J5592
$$ plain form
5460 2107814 2247198 2281883 2449773 2487079 2505094 2648548 2813496 2818048 2990652 3318381
5450 3318381 3515404 3823267 4098312 4408661 4741100 5203046 5747691 6244472 6704278 7029717
5440 7029717 7268945 7246986 6985545 6549788 5910389 5214353 4778235 4427825 4035361 3679754
5430 3679754 3441481 3266078 3043579 2910916 2803638 2634251 2535099 2536756 2403061 2292259
5420 2292259 2257392 2227571 2118975 2053941 2148468 2143187 2067200 2001821 1963718 1898878 1880935
5409 1880935 1835711 1769164 1832233 1793903 1757830 1732597 1717491 1791180 1671683 1604038 1560272
5398 1560272 1590295 1648837 1636844 1694997 1598712 1615423 1670521 1715178 1680737 1746491 1741481 1745209
5386 1745209 1745875 1738999 1685798 1688185 1746642 1896880 1877988 1872684 1831960 1786659 1768807 1932396
$$ packed form
5460B107814J39384L4685J67890L7306J8015J43454J64948M552J72604L27729
5450C318381J97023L07863K75045L10349L32439M61946N44645M96781M59806L25439
5440G029717K39228k1959k61441m35757o39399o96036m36118l50410l92464l55607
5430C679754k38273j75403k22499j32663j07278j69387r9152J657j33695j10802
5420B292259l4867k9821j08596o5034R4527n281p5987o5379l8103o4840j7943
5409A880935m5224o6547O3069l8330l6073k5233j5106P3689j19497o7645m3766
5398A560272L0023N8542j1993N8153r6285J6711N5098M4657l4441O5754n010L728
5386A745209O66o876n3201K387N8457J50238j8892n304m0724m5301j7852J63589
$$ plain form
5374 1932396 2127460 2114161 1995915 1998185 2066935 2013756 2172999 2225148 2124764 2152426 2136624
5363 2136624 2161128 2239140 2337014 2322307 2278217 2345813 2406505 2492537 2455292 2520880 2483030
5352 2483030 2431904 2453725 2497737 2598059 2560356 2599050 2569335 2591425 2637120 2722655 2767295
5341 2767295 2764314 2766293 2883178 2920897 2948628 3009103 3104465 3188367 3277994 3331359 3265846 3287080
5329 3287080 3403983 3482304 3497656 3617485 3615274 3713565 3663744 3772504 3873009 3946395 4036721
5318 4036721 4080381 4065532 4142833 4205369 4170039 4205265 4213126 4267390 4362969 4498368 4515543
5307 4515543 4518979 4586135 4652153 4781878 5015742 5123484 5262787 5447576 5533505 5634286
5297 5634286 5682196 5735767 5837505 6085041 6121783 6219562 6384150 6446083 6523276 6586506 6759042
$$ packed form
5374A932396J95064j3299j18246K270O8750n3179J59243N2149j00384K7662j5802
5363B136624K4504P8012R7874j4707m4090O7596O0692Q6032l7245O5588l7850
5352B483030n1126K1821M4012J00322l7703L8694k9715K2090M5695Q5535M4640
5341B767295k981J979J16885L7719K7731O0475R5362Q3902Q9627N3365o5513K1234
5329C287080J16903P8321J5352J19829k211R8291m9821J08760J00505P3386R0326
5318D036721M3660j4849P7301O2536l5330L5226P861N4264R5579J35399J7175
5307D515543L436O7156O6018J29725K33864J07742J39303J84789Q5929J00781
5297E634286M7910N3571J01738K47536L6742R7779J64588O1933P7193O3230J72536
$$ plain form
5286 6759042 6828588 6847963 6899857 6876232 7065623 7123447 7307110 7489735 7666463 7890255
5276 7890255 7979931 8221175 8532037 8704113 8832368 9003378 9258585 9494770 9750335 10063399
5266 10063399 10325349 10544183 10752448 11117245 11443404 11690460 12043192 12517005 12805933
5257 12805933 13235791 13750569 14202706 14672043 15204547 15854565 16567150 17281469 18007731
5248 18007731 18836156 19738197 20768715 21997699 23362686 24868412 26506521 28224802
5240 28224802 29980514 31778168 33442843 34738558 35483554 35729775 35944899 36634594 37687608
5231 37687608 39020201 40640866 42299166 43949671 45357023 46218293 46493087 46567319 46796899
5222 46796899 47544718 48732721 50308293 52234613 54188981 55960910 57185216 57999538
$$ packed form
5286F759042O9546J9375N1894k3625J89391N7824J83663J82625J76728K23792
5276G890255Q9676K41244L10862J72076J28255J71010K55207K36185K55565L13064
5266A0063399K61950K18834K08265L64797L26159K47056L52732M73813K88928
5257A2805933M29858N14778M52137M69337N32504O50018P12585P14319P26262
5248A8007731Q28425R02041J030518J228984J364987J505726J638109J718281
5240B8224802J755712J797654J664675J295715P44996K46221K15124O89695J053014
5231C7687608J332593J620665J658300J650505J407352Q61270K74794P4232K29580
5222D6796899P47819J188003J575572J926320J954368J771929J224306Q14322
$$ plain form
5214 57999538 58764186 60025965 61933516 64818089 68605902 73283044 78970232 85217752
5206 85217752 91845813 98398538 103929038 107546136 107849627 104018934 96981460 88442488
5198 88442488 81030666 75733022 72441985 70743540 70106299 70461721 71745433 74093133
5190 74093133 77312475 81652308 86690814 92553230 98997333 105442201 111255004 115118030
5182 115118030 115938085 114320388 111671220 107766755 101467470 92957409 84136686 76509982
5174 76509982 70519463 65918788 62420654 59860961 58091594 56846825 56177447 56062267
5166 56062267 56429650 57304448 58553486 60262025 62514903 65424356 68892039 72960668
5158 72960668 77861917 83387177 89450906 95972300 102434037 108305931 112652640 114237239
$$ packed form
5214E7999538P64648J261779J907551K884573L787813M677142N687188O247520
5206H5217752O628061O552725N530500L617098L03491l830693p037474q538972
5198H8442488p411822n297644l291037j698445o37241L55422J283712K347700
5190G4093133L219342M339833N038506N862416O444103O444868N812803L863026
5182A15118030Q20055j617697k649168l904465o299285q510061q820723p626704
5174G6509982n990519m600675l498134k559693j769367j244769o69378j15180
5166E6062267L67383Q74798J249038J708539K252878K909453L467683M068629
5158G2960668M901249N525260O063729O521394O461737N871894M346709J584599
$$ plain form
5150 114237239 113040958 110029938 106035449 100893488 94455727 87385187 80866639 75716133
5142 75716133 72171923 69666403 68275202 68072772 68721562 70143247 72636683 76118989
5134 76118989 80262562 85054047 90181028 94949934 98572971 99709635 97449941 92180008
5126 92180008 84722569 76843000 69682124 63809714 59223869 55816523 53376156 51588415
5118 51588415 50302901 49448456 48852412 48246667 47371851 46096357 44438784 42937812 41720188
5109 41720188 40832377 40344505 39979309 39802000 39298987 38355860 37108173 35463873 33759153
5100 33759153 32264850 31251940 30498918 29859014 29352464 28951379 28285307 27150766 25529980
5091 25529980 23673787 21840254 20294704 18969920 17862078 16975088 16174181 15453844 14865376
$$ packed form
5150A14237239j196281l011020l994489n141961o437761p070540o518548n150506
5142G5716133l544210k505520j391201k02430O48790J421685K493436L482306
5134G6118989M143573M791485N126981M768906L623037J136664k259694n269933
5126I2180008p457439p879569p160876n872410m585845l407346k440367j787741
5118E1588415j285514q54445n96044o05745q74816j275494j657573j500972j217624
5109D1720188q87811m87872l65196j77309n03013r43127j247687j644300j704720
5100C3759153j494303j012910p53022o39904n06550m01085o66072j134541j620786
5091B5529980j856193j833533j545550j324784j107842q86990q00907p20337n88468
$$ plain form
5082 14865376 14415314 13814811 13272737 12861381 12621125 12340700 12234763 12058474 11752467
5073 11752467 11494318 11324973 11089614 10895289 10742027 10491542 10332073 10202200 10064414
5064 10064414 10004086 9879571 9671614 9478523 9338404 9206348 8839162 8502997 8461526 8368402
5054 8368402 8153311 8004939 7845501 7647770 7555224 7365621 7241343 7123776 7026845 6866492
5044 6866492 6707284 6608105 6623866 6454033 6297740 6179458 6136759 6126631 5980429 5973366 5854280
5033 5854280 5828045 5775887 5716342 5757512 5820648 5688767 5586545 5489236 5329826 5306249 5318129
5022 5318129 5266891 5236839 5207765 5118503 5062549 4960546 4646705 4446355 4295872 4227760 4111584
5011 4111584 4008967 3835938 3652633 3531192 3424838 3371406 3274824 3143343 3021639 3051982
$$ packed form
5082A4865376m50062o00503n42074m11356k40256k80425j05937j76289l06007
5073A1752467k58149j69345k35359j94325j53262k50485j59469j29873j37786
5064A0064414o0328j24515k07957j93091j40119j32056l67186l36165m1471r3124
5054H368402k15091j48372j59438j97731r2546j89603j24278j17567r6931j60353
5044F866492j59208r9179J5761j69833j56293j18282m2699j0128j46202p063j19086
5033E854280k6235n2158n9545M1170O3136j31881j02222r7309j59410k3577J1880
5022E318129n1238l0052k9074q9262n5954j02003l13841k00350j50483o8112j16176
5011D111584j02617j73029j83305j21441j06354n3432r6582j31481j21704L0343
$$ plain form
5001 3051982 3097986 2971299 2904845 2912202 2763052 2625185 2485581 2468718 2462731 2376423 2325413
4990 2325413 2272415 2416209 2360150 2263707 2237512 2160744 2161173 2215636 2212323 2121201 2127136 2065646
4978 2065646 2056717 1998039 2067805 2006262 2036795 1973289 1894741 1927404 1931513 1813337 1705605
4967 1705605 1765581 1699477 1709877 1719515 1691563 1623594 1603609 1604034 1683541 1683883 1614833 1630593
4955 1630593 1534029 1451131 1505086 1576682 1575497 1561231 1553324 1614753 1613267 1620196 1663500 1602869
4943 1602869 1553994 1531302 1474923 1451404 1492194 1482525 1426260 1405340 1508158 1502630 1483388 1385860
4931 1385860 1399857 1331459 1279418 1320382 1336973 1272376 1323752 1302951 1361570 1337904 1392806
4920 1392806 1453791 1355224 1352363 1370425 1333883 1294464 1379604 1387890 1354169 1459126 1516101 1463862
$$ packed form
5001C051982M6004j26687o6454P357j49150j37867j39604j6863n987q6308n1010
4990B325413n2998J43794n6059r6443k6195p6768M29N4463l313r1122N935o1490
4978B065646q929n8678O9766o1543L0533o3506p8548L2663M109j18176j07732
4967A705605N9976o6104J0400R638k7952o7969j9985M25P9507L42o9050J5760
4955A630593r6564q2898N3955P1596j185j4266p907O1429j486O929M3304o0631
4943A602869m8875k2692n6379k3519M0790r669n6265k0920J02818n528j9242r7528
4931A385860J3997o8398n2041M0964J6591o4597N1376k0801N8619k3666N4902
4920A392806O0985r8567k861J8062l6542l9419Q5140Q286l3721J04957N6975n2239
$$ plain form
4908 1463862 1472586 1456863 1416423 1373133 1382431 1457062 1438992 1329774 1280143 1310804 1291961 1339366
4896 1339366 1426581 1314626 1253682 1249034 1285113 1337569 1449751 1301835 1245408 1336958 1392379
4885 1392379 1367368 1351225 1436027 1419997 1402816 1496386 1510394 1517352 1479820 1537852 1661078
4874 1661078 1591512 1546440 1654498 1630690 1662763 1717764 1814383 1826388 1787101 1785199 1880452
4863 1880452 1850013 1903621 1960457 1913571 1931874 2095285 2140415 1991585 1952227 2026132 2037434
4852 2037434 2100984 2075238 2036738 2095807 2139231 2220900 2296625 2443266 2417963 2481934 2696265
4841 2696265 2829275 3022876 3134124 3232294 3409368 3516538 3758726 3964337 4118181 4279401
4831 4279401 4537554 4778082 5082122 5419389 5802882 6235716 6468077 6569941 6601654 6382709
$$ packed form
4908A463862Q724j5723m0440m3290R298P4631j8070j09218m9631L0661j8843M7405
4896A339366Q7215j11955o0944m648L6079N2456J12182j47916n6427R1550N5421
4885A392379k5011j6143Q4802j6030j7181R3570J4008O958l7532N8032J23226
4874A661078o9566m5072J08058k3808L2073N5001R6619J2005l9287j902R5253
4863A880452l0439N3608N6836m6886J8303J63411M5130j48830l9358P3905J1302
4852B037434O3550k5746l8500N9069M3424Q1669P5725J46641k5303O3971K14331
4841B696265J33010J93601J11248R8170J77074J07170K42188K05611J53844J61220
4831D279401K58153K40528L04040L37267L83493M32834K32361J01864L1713k18945
$$ plain form
4821 6382709 6121210 5739435 5181661 4741658 4420930 3992174 3738813 3600648 3463758 3243051
4811 3243051 3115766 3047883 2943861 2768601 2633527 2635737 2588297 2644927 2667110 2567903 2507141
4800 2507141 2556597 2522503 2447721 2428082 2408340 2440801 2464420 2494250 2405625 2285315 2221947
4789 2221947 2156765 2049206 2076766 2065677 2045771 1875795 1831647 1926914 1947111 1886377 1931181
4778 1931181 1881490 1738021 1789510 1863386 1845909 1822126 1859374 1917257 1833923 1832215 1952217
4767 1952217 2000816 2030202 1948113 1988324 2059032 2212975 2125306 2064538 2056186 2134831 2129681 2103947
4755 2103947 2197765 2204189 2179103 2281579 2317647 2219285 2296779 2322293 2327033 2395406 2364085 2313795
4743 2313795 2253608 2189857 2111414 1988565 1951916 1956491 1859667 1811037 1792025 1727840 1668388
$$ packed form
4821F382709k61499l81775n57774m40003l20728m28756k53361j38165j36890k20707
4811C243051j27285o7883j04022j75260j35074K210m7440N6630K2183r9207o0762
4800B507141M9456l4094p4782j9639j9742L2461K3619K9830q8625j20310o3368
4789B221947o5182j07559K7560j1089j9906j69976m4148R5267K0197o0734M4804
4778A931181m9691j43469N1489P3876j7477k3783L7248N7883q3334j708J20002
4767A952217M8599K9386q2089M0211P0708J53943q7669o0768q352P8645n150k5734
4755B103947R3818O424k5086J02476L6068r8362P7494K5514M740O8373l1321n0290
4743B313795o0187o3751p8443j22849l6649M575r6824m8630j9012o4185n9452
$$ plain form
4732 1668388 1732420 1678145 1700192 1628462 1640525 1670506 1555312 1565548 1573254 1490895 1610536
4721 1610536 1625663 1553307 1493903 1387299 1505903 1644912 1617940 1687284 1774653 1680070 1663145
4710 1663145 1631572 1512623 1460560 1568080 1431690 1302424 1345361 1424736 1476415 1514076 1487057
4699 1487057 1488202 1525787 1557853 1487494 1455315 1410245 1468621 1464313 1346417 1370953 1382911 1438076
4687 1438076 1410391 1378437 1502876 1557850 1509000 1467784 1475195 1570379 1628661 1613714 1632798
4676 1632798 1652983 1796439 1812141 1762715 1797307 1853186 1866069 1828169 1849090 1883000 1856776
4665 1856776 1904351 1983166 1925307 1871360 1904379 1880708 1932105 1959919 1875042 1852523 1799407
4654 1799407 1804007 1826361 1807604 1776068 1765208 1644523 1707411 1775289 1767752 1768856 1790717 1848202
$$ packed form
4732A668388O4032n4275K2047p1730J2063K9981j15194J0236P706q2359J19641
4721A610536J5127p2356n9404j06604J18604J39009k6972O9344Q7369r4583j6925
4710A663145l1573j18949n2063J07520j36390j29266M2937P9375N1679L7661k7019
4699A487057J145L7585L2066p0359l2179m5070N8376m308j17896K4536J1958N5165
4687A438076k7685l1954J24439N4974m8850m1216P411R5184N8282j4947J9084
4676A632798K0185J43456J5702m9426L4592N5879J2883l7900K0921L3910k6224
4665A856776M7575P8815n7859n3947L3019k3671N1397K7814q4877k2519n3116
4654A799407M600K2354j8757l1536j0860j20685O2888O7878p537J104K1861N7485
$$ plain form
4642 1848202 1763785 1787809 1779408 1798378 1810642 1817186 1752491 1743299 1767166 1816361 1783757 1794490
4630 1794490 1809485 1790067 1789937 1719174 1785092 1855611 1948256 1973965 1995384 1906059 1932962 1985543
4618 1985543 1975897 1988165 1973465 1900639 1803524 1922467 1980994 1971722 1964558 1957601 1995142 2042179
4606 2042179 2060682 2089319 2162354 2093829 2219532 2285081 2308883 2321604 2217365 2273834 2333608
4595 2333608 2312509 2422698 2487618 2500992 2421191 2400943 2499147 2525616 2470547 2467971 2441368
4584 2441368 2519336 2522376 2468566 2459225 2523448 2579091 2547136 2670535 2779593 2860234 2896386
4573 2896386 2892326 2916599 2964881 3005431 3050605 3066849 3087460 3150133 3083277 3098345 3112907 3120536
4561 3120536 3229828 3255754 3330294 3330562 3238698 3370819 3464317 3383913 3410021 3504008 3523527
$$ packed form
4642A848202q4417K4024q401J8970J2264O544o4695r192K3867M9195l2604J0733
4630A794490J4995j9418j30p0763O5918P0519R2645K5709K1419q9325K6903N2581
4618A985543r646J2268j4700p2826r7115J18943N8527r272p164o957L7541M7037
4606B042179J8503K8637P3035o8525J25703O5549K3802J2721j04239N6469N9774
4595B333608k1099J10189O4920J3374p9801k0248R8204K6469n5069k576k6603
4584B441368P7968L040n3810r341O4223N5643l1955J23399J09058Q0641L6152
4573B896386m060K4273M8282M0550M5174J6244K0611O2673o6856J5068J4562P629
4561C120536J09292K5926P4540K68r1864J32121R3498q0404K6108R3987J9519
$$ plain form
4550 3523527 3517102 3502100 3451709 3534259 3652569 3680367 3649326 3758910 3878841 4077945 4109162
4539 4109162 4247452 4319897 4346948 4420041 4401250 4472570 4674572 4681254 4814592 4967918 5086605
4528 5086605 5262600 5528563 5671190 5827555 6024794 6083858 6112716 6053737 6086451 6095910 6125166
4517 6125166 6174865 6305636 6416050 6485286 6590314 6698126 6786575 6861639 6954189 7161004
4507 7161004 7291966 7396367 7530946 7722315 7879739 8153253 8259422 8446899 8769878 9126923
4497 9126923 9416135 9804271 10179013 10556794 10976126 11530734 11994223 12334457 12493487 12256404
4487 12256404 12110739 11975010 12009588 12032357 12073597 12330341 12619040 12785922 13070997 13348887
4477 13348887 13682365 13959075 14299590 14647485 14941437 15433337 15846352 16268367 16787136
$$ packed form
4550C523527o425j5002n0391Q2550J18310K7798l1041J09584J19931J99104L1217
4539D109162J38290P2445K7051P3093j8791P1320K02002O682J33338J53326J18687
4528E086605J75995K65963J42627J56365J97239N9064K8858n8979L2714R459K9256
4517F125166M9699J30771J10414O9236J05028J07812Q8449P5064R2550K06815
4507G161004J30962J04401J34579J91369J57424K73514J06169J87477L22979L57045
4497I126923K89212L88136L74742L77781M19332N54608M63489L40234J59030k37083
4487A2256404j45665j35729L4578K2769M1240K56744K88699J66882K85075K77890
4477A3348887L33478K76710L40515L47895K93952M91900M13015M22015N18769
$$ plain form
4468 16787136 17511398 18181637 18683236 19436664 20284098 21133984 22030879 22995445 24124458
4459 24124458 25304392 26483119 27634584 28858024 29811920 30532719 31578043 32716567
4451 32716567 34086037 35661751 37361043 39345313 41620459 44159289 46872471 49945893
4443 49945893 53380133 57192724 61598111 66495322 72043188 78132915 84924291 92415092
4435 92415092 100441745 108988708 117962954 127203356 136472947 145361733 153402964 160121703
4427 160121703 165169965 168060112 168207335 165160916 158929004 150428201 140639629 130723151
4419 130723151 121424114 112360118 103192738 94072599 85116902 76587185 68885029 62125392
4411 62125392 56262476 51280533 46953550 43304598 40186657 37523317 35270654 33131709
$$ packed form
4468A6787136P24262O70239N01599P53428Q47434Q49886Q96895R64566J129013
4459B4124458J179934J178727J151465J223440R53896P20799J045324J138524
4451C2716567J369470J575714J699292J984270K275146K538830K713182L073422
4443D9945893L434240L812591M405387M897211N547866O089727O791376P490801
4435I2415092Q026653Q546963Q974246R240402R269591Q888786Q041231O718739
4427A60121703N048262K890147J47223l046419o231912q500803r788572r916478
4419A30723151r299037r063996r167380r120139q955697q529717p702156o759637
4411F2125392n862916m981943m326983l648952l117941k663340k252663k138945
$$ plain form
4403 33131709 31159497 29434578 27933858 26575831 25358254 24369304 23391030 22542401 21710816
4394 21710816 20833742 20098626 19479983 18819166 18250514 17675360 17177394 16761412 16276625
4385 16276625 15871656 15534056 15141701 14910256 14678890 14480405 14258913 14077450 13908454
4376 13908454 13608511 13309942 13112650 12984185 12910771 12796371 12859243 12840163 12710992 12541726
4366 12541726 12263877 11785754 11290112 10852245 10568525 10234381 9937817 9867622 9702565 9452839
4356 9452839 9102232 8663279 8236844 7888537 7569297 7355047 7161611 6943968 6741027 6557206
4346 6557206 6374414 6171267 6038244 5954552 5830933 5752580 5652624 5504107 5357594 5249102
4336 5249102 5219963 5205445 5023627 4897464 4805625 4678423 4595358 4573146 4496083 4303844 4225372
$$ packed form
4403C3131709j972212j724919j500720j358027j217577r88950r78274q48629q31585
4394B1710816q77074p35116o18643o60817n68652n75154m97966m15982m84787
4385A6276625m04969l37600l92355k31445k31366j98485k21492j81463j68996
4376A3908454k99943k98569j97292j28465p3414j14400O2872j9080j29171j69266
4366A2541726k77849m78123m95642m37867k83720l34144k96564p0195j65057k49726
4356I452839l50607m38953m26435l48307l19240k14250j93436k17643k02941j83821
4346F557206j82792k03147j33023q3692j23619p8353r9956j48517j46513j08492
4336E249102k9139j4518j81818j26163r1839j27202q3065k2212p7063j92239p8472
$$ plain form
4325 4225372 4223200 4037362 3914606 3867524 3875517 3653468 3619627 3570158 3468903 3480945 3368105
4314 3368105 3296696 3271344 3264931 3292548 3146477 3042407 2975988 3037201 2997847 2870142 2899962
4303 2899962 2991439 2889321 2841544 2768476 2896295 2911920 2806261 2727368 2729314 2690791 2698522
4292 2698522 2671765 2552334 2580105 2546013 2441097 2459706 2407727 2285510 2387299 2342722 2271445
4281 2271445 2347108 2370380 2254427 2221559 2237772 2267281 2155319 2123500 2227471 2267214 2170351
4270 2170351 2090025 2067535 1988167 2105257 2182807 2180564 2140176 2093383 2210406 2154571 2170128
4259 2170128 2268020 2242094 2209035 2312310 2326407 2305984 2240754 2293893 2293205 2241329 2272245 2353863
4247 2353863 2264447 2376550 2430743 2452157 2437607 2509318 2524634 2565871 2630966 2618176 2642153
$$ packed form
4325D225372k172j85838j22756m7082P993k22049l3841m9469j01255J2042j12840
4314C368105p1409k5352o413K7617j46071j04070o6419O1213l9354j27705K9820
4303B899962R1477j02118m7777p3068J27819J5625j05659p8893J946l8523P731
4292B698522k6757j19431K7771l4092j04916J8609n1979j22217J01789m4577p1277
4281B271445P5663K3272j15953l2868J6213K9509j11962l1819J03971L9743r6863
4270B170351q0326k2490p9368J17090P7550k243m0388m6793J17023n5835J5557
4259B170128R7892k5926l3059J03275J4097k0423o5230N3139o88n1876L0916Q1618
4247B353863q9416J12103N4193K1414j4550P1711J5316M1237O5095j2790K3977
$$ plain form
4236 2642153 2682847 2908896 2991417 3062960 3139125 3277503 3317048 3593949 3917366 4157864
4226 4157864 4719204 5307643 5824316 6412405 7093382 7570805 7899390 7221296 5822073
4217 5822073 4790874 4097654 3623797 3327416 3128016 2851768 2652725 2543437 2394936
4208 2394936 2329263 2299634 2242054 2060768 1971573 2004846 1916620 1939347 1959064 1877652 1787997
4197 1787997 1661246 1610118 1511351 1509071 1633101 1600185 1615259 1690047 1675417 1510761 1482108
4186 1482108 1448696 1377268 1377869 1393498 1379374 1326454 1385960 1428845 1402724 1386584 1458587 1428220
4174 1428220 1452511 1465256 1440360 1532627 1535308 1527304 1489234 1412083 1357008 1332351 1275210 1355027
4162 1355027 1278783 1282210 1323541 1328333 1229881 1199215 1279124 1169396 1171905 1242826 1248958 1247048
$$ packed form
4236B642153M0694K26049Q2521P1543P6165J38378L9545K76901L23417K40498
4226D157864N61340N88439N16673N88089O80977M77423L28585o78094j399223
4217E822073j031199o93220m73857k96381j99400k76248j99043j09288j48501
4208B394936o5673k9629n7580j81286q9195L3273q8226K2727J9717q1412q9655
4197A787997j26751n1128r8767k280J24030l2916J5074P4788j4630j64656k8653
4186A482108l3412p1428O01J5629j4124n2920N9506M2885k6121j6140P2003l0367
4174A428220K4291J2745k4896R2267K681q004l8070p7151n5075k4657n7141P9817
4162A355027p6244L427M1331M792r8452l0666P9909j09728K509P0921O132j910
$$ plain form
4150 1247048 1273179 1286686 1281582 1290819 1281554 1311233 1311009 1323389 1323919 1337087 1304329 1300130 1275021
4137 1275021 1238371 1261109 1389217 1455865 1366653 1302054 1348906 1376848 1292399 1287063 1311538
4126 1311538 1452820 1387130 1276595 1274122 1388465 1370850 1489480 1497452 1447365 1575261 1567925
4115 1567925 1568280 1564497 1613208 1697988 1764922 1774252 1799861 1823711 1847337 1903597 2023264 2000099
4103 2000099 1956532 2001064 2026283 2014538 2015515 2083989 2116069 2080847 2067960 2034525 2038389 2091367
4091 2091367 1992970 1971290 1946144 1911423 1854220 1774734 1788569 1825446 1883448 1916079 1923342 1912355
4079 1912355 1876897 1871166 1932879 1932895 1961783 1819698 1864027 1860800 1814363 1855249 1955934 2055238
4067 2055238 2048693 1976369 1932486 2054711 2151907 2123268 2202671 2353178 2355074 2492780 2597419
$$ packed form
4150A247048K6131J3507n104R237r265K9679k24J2380N30J3168l2758m199k5109
4137A275021l6650K2738J28108O6648q9212o4599M6852K7942q4449n336K4475
4126A311538J41282o5690j10535k473J14343j7615J18630P972n0087J27896p336
4115A567925L55l783M8711Q4780O6934R330K5609K3850K3626N6260J19667k3165
4103B000099m3567M4532K5219j1745R77O8474L2080l5222j2887l3435L864N2978
4091B091367r8397k1680k5146l4721n7203p9486J3835L6877N8002L2631P263j0987
4079A912355l5458n731O1713J6K8888j42085M4329l227m6437M0886J00685R9304
4067B055238o545p2324m3883J22225R7196k8639P9403J50507J896J37706J04639
$$ plain form
4056 2597419 2707574 2879784 2837270 2906422 3001328 3069000 3157799 3187156 3409823 3570521 3667145
4045 3667145 3791846 3741900 3632183 3583187 3413117 3322245 3319814 3331155 3351172 3341044 3355522
4034 3355522 3354928 3482922 3546707 3669394 3744355 3767280 3894515 4073596 4256423 4376581 4400912
4023 4400912 4579554 4653452 4775582 4881722 4868386 4874110 4795332 4696476 4621201 4594760 4505361
4012 4505361 4473331 4479741 4422674 4456592 4581926 4597981 4613333 4730029 4879347 4921983 4933848
4001 4933848 4799603 4790527 4871224 4883646 4757389 4723596 4659927 4696547 4786382 4767304 4699845
3990 4699845 4756663 4886837 4834092 4868033 4911284 4944283 5129282 5236411 5399278 5548851
3980 5548851 5690596 5810381 5972626 6229024 6424909 6585132 6664082 6764618 6840041 6905709
$$ packed form
4056B597419J10155J72210m2514O9152R4906O7672Q8799K9357K22667J60698R6624
4045C667145J24701m9946j09717m8996j70070r0872k431J1341K0017j0128J4478
4034C355522n94J27994O3785J22687P4961K2925J27235J79081J82827J20158K4331
4023D400912J78642P3898J22130J06140j3336N724p8778r8856p5275k6441q9399
4012D505361l2030O410n7067L3918J25334J6055J5352J16696J49318M2636J1865
4001D933848j34245r076Q0697J2422j26257l3793o3669L6620Q9835j9078o7459
3990D699845N6818J30174n2745L3941M3251L2999J84999J07129J62867J49573
3980E548851J41745J19785J62245K56398J95885J60223P8950J00536P5423O5668
$$ plain form
3970 6905709 7043814 7073831 7232169 7383364 7562775 7607312 7607753 7659540 7678616 7643477 7603199
3959 7603199 7451708 7298812 7179935 7052378 6901057 6869303 6746879 6632341 6573986 6496699
3949 6496699 6623237 6814525 6926361 7043514 7247165 7498688 7705382 7905125 8235229 8591491
3939 8591491 8841028 9106567 9312505 9572582 9808609 10033047 10279536 10542469 10788046 11164589
3929 11164589 11562369 11755282 12011406 12064514 11755188 10872429 10122381 9535673 9066657 8746196
3919 8746196 8561030 8358888 8300131 8217416 8107808 7936756 7834211 7819416 7777619 7779710 7765654
3908 7765654 7860608 7828088 7791906 7840277 7838688 7856887 7897764 7983339 7981268 7957407 7898968 7886210
3896 7886210 7916176 7787896 7690314 7713077 7684486 7758179 7696725 7699945 7643200 7663985 7606028
$$ packed form
3970F905709J38105L0017J58338J51195J79411M4537M41N1787J9076l5139m0278
3959G603199j51491j52896j18877j27557j51321l1754j22424j14538n8355p7287
3949F496699J26538J91288J11836J17153K03651K51523K06694J99743L30104L56262
3939H591491K49537K65539K05938K60077K36027K24438K46489K62933K45577L76543
3929A1164589L97780J92913K56124N3108l09326q82759p50048n86708m69016l20461
3919H746196j85166k02142n8757q2715j09608j71052j02545j4795m1797K091j4056
3908G765654R4954l2520l6182M8371j589J8199M0877Q5575k071k3861n8439j2758
3896G886210K9966j28280r7582K2763k8591P3693o1454L220n6745K0785n7957
$$ plain form
3885 7606028 7485810 7533566 7592605 7535968 7571166 7692928 7658849 7720824 7750770 7677984 7747063
3874 7747063 7706633 7656919 7519991 7350525 7358874 7315735 7229120 7269413 7289716 7304620 7376583
3863 7376583 7350816 7408129 7409566 7366463 7324719 7278850 7277023 7263546 7364542 7444094 7521519 7576357
3851 7576357 7643550 7767667 7857924 7937479 8036228 8030485 8091461 8274463 8285718 8410112 8631611
3840 8631611 8730519 8715529 8807292 8881411 8933023 9029582 9232249 9440251 9618549 9852525 10042256
3829 10042256 10231027 10507084 10800390 11143966 11477239 11816025 12237490 12746365 13195069
3820 13195069 13596223 13888179 13810558 13770464 13856199 13995169 14296280 14516647 14872730 15246286
3810 15246286 15738134 16361781 17013621 17847821 18733898 19753267 21055129 22339377 23625551
$$ packed form
3885G606028j20218M7756N9039n6637L5198J21762l4079O1975K9946p2786O9079
3874G747063m0430m9714j36928j69466Q349m3139q6615M0293K0303J4904P1963
3863G376583k5767N7313J437m3103m1744m5869j827j3477J00996P9552P7425N4838
3851G576357O7193J24117R0257P9555R8749n743O0976J83002J1255J24394K21499
3840H631611R8908j4990R1763P4119N1612R6559K02667K08002J78298K33976J89731
3829A0042256J88771K76057K93306L43576L33273L38786M21465N08875M48704
3820A3195069M01154K91956p7621m0094Q5735J38970L01111K20367L56083L73556
3810A5246286M91848O23647O51840Q34200Q86077J019369J301862J284248J286174
$$ plain form
3801 23625551 24803864 25533973 25006816 23200204 21677196 20712743 20100645 19675914 19453477
3792 19453477 19365906 19377257 19472435 19404923 19582138 19783658 20030439 20340105 20588795 20888455
3782 20888455 21333626 21671922 22004047 22432971 22878202 23287763 23557936 23906479 24339711
3773 24339711 24776200 25310908 25807325 26187432 26641253 27314435 27883305 28363615 28902017
3764 28902017 29530478 30042575 30616857 31306689 31902123 32555139 33261764 34046610 34856035
3755 34856035 35668097 36414815 37318726 38334662 39343635 40286333 41281512 42490379 43672810
3746 43672810 45002920 46445516 48006900 49757681 51582625 53398528 55291870 57348864
3738 57348864 59531460 61719132 64039267 66432146 69122278 71946993 75198943 78677410
$$ packed form
3801B3625551J178313P30109n27157j806612j523008r64453o12098m24731k22437
3792A9453477q7571J1351R5178o7512J77215K01520K46781L09666K48690K99660
3782B0888455M45171L38296L32125M28924M45231M09561K70173L48543M33232
3773B4339711M36489N34708M96417L80107M53821O73182N68870M80310N38402
3764B8902017O28461N12097N74282O89832N95434O53016P06625P84846Q09425
3755C4856035Q12062P46718R03911J015936J008973R42698R95179J208867J182431
3746D3672810J330110J442596J561384J750781J824944J815903J893342K056994
3738E7348864K182596K187672K320135K392879K690132K824715L251950L478467
$$ plain form
3730 78677410 82490605 86840184 91512521 96596931 102094478 108092649 114331974 120984609
3722 120984609 128167192 135896751 144391687 153709097 163998735 175251992 187532434 200513012
3714 200513012 213953294 227488240 240844527 253864356 266605970 278582598 288906039
3707 288906039 296662058 300212988 298622317 292053227 281420607 268362700 254321575 239671001
3699 239671001 224647827 209982225 195652482 181052220 165624950 149689278 134821306
3692 134821306 121830603 110997411 101949666 94326899 87955953 82649103 77974711 74070681
3684 74070681 70731426 67604183 64845598 62420274 60149003 57989646 55950126 54048160
3676 54048160 52271166 50611609 48789908 47109002 45407947 43714496 41993111 40298059
$$ packed form
3730G8677410L813195M349579M672337N084410N497547N998171O239325O652635
3722A20984609P182583P729559Q494936R317410J0289638J1253257J2280442J2980578
3714B00513012J3440282J3534946J3356287J3019829J2741614J1976628J0323441
3707B88906039P756019L550930j590671o569090j0632620j3057907j4041125j4650574
3699B39671001j5023174j4665602j4329743j4600262j5427270j5935672j4867972
3692A34821306j2990703j0833192r047745p622767o370946n306850m674392l904030
3684G4070681l339255l127243k758585k425324k271271k159357k039520j901966
3676E4048160j776994j659557j821701j680906j701055j693451j721385j695052
$$ plain form
3668 40298059 38597435 37109790 35916691 34805263 33874587 33170369 32338985 31595320 31101686
3659 31101686 30562021 30215936 29896853 29541758 29354515 29240593 29108626 28703044 28222502
3650 28222502 27635515 27118815 26588696 26135689 25698109 25435644 25195657 25056247 24903875
3641 24903875 24723170 24571615 24498341 24279178 24057899 23855491 23532721 23020516 22506307 22046803
3631 22046803 21429784 20876756 20373238 19801615 19362754 18978159 18447908 17893538 17525681
3622 17525681 17178887 16744865 16313852 15965951 15609020 15236640 14940435 14819037 14543865
3613 14543865 14328885 14147473 13956752 13863099 13725389 13598699 13449805 13333795 13244354 13182691
3603 13182691 13183307 13096727 12935279 12826589 12823615 12913601 12928833 12943228 13033653 13104499 13210463
$$ packed form
3668D0298059j700624j487645j193099j111428r30676p04218q31384p43665m93634
3659C1101686n39665l46085l19083l55095j87243j13922j31967m05582m80542
3650B8222502n86987n16700n30119m53007m37580k62465k39987j39410j52372
3641B4903875j80705j51555p3274k19163k21279k02408l22770n12205n14209m59504
3631B2046803o17019n53028n03518n71623m38861l84595n30251n54370l67857
3622A7525681l46794m34022m31013l47901l56931l72380k96205j21398k75172
3613A4543865k14980j81412j90721r3653j37710j26690j48894j16010q9441o1663
3603A3182691O16q6580j61448j08690k974Q9986J5232J4395R0425P0846J05964
$$ plain form
3592 13210463 13314765 13258067 13258760 13320333 13401396 13411225 13526685 13667049 13854250 14018894 14150303
3581 14150303 14317981 14419862 14523148 14708502 14881674 15045865 15184561 15337031 15449412
3572 15449412 15527644 15686176 15970352 16050044 16139496 16207247 16423225 16536431 16744727 16811591
3562 16811591 16943631 17045570 17289634 17547556 17802807 17998455 18389240 18655475 19013639
3553 19013639 19210604 19480199 19631870 19856620 20082695 20242329 20398972 20710743 20846674
3544 20846674 21090358 21407562 21756190 22083047 22474777 22797657 23149236 23424467 23893121
3535 23893121 24385879 24946407 25490517 26116586 26611927 27199384 27933210 28860278 29771521
3526 29771521 30825727 31798917 32852208 33751092 34949451 36003156 37024058 38338780
$$ packed form
3592A3210463J04302n6698O93O1573Q1063R829J15460J40364J87201J64644J31409
3581A4150303J67678J01881J03286J85354J73172J64191J38696J52470J12381
3572A5449412P8232J58532K84176P9692Q9452O7751K15978J13206K08296O6864
3562A6811591J32040J01939K44064K57922K55251J95648L90785K66235L58164
3553A9013639J96965K69595J51671K24750K26075J59634J56643L11771J35931
3544B0846674K43684L17204L48628L26857L91730L22880L51579K75231M68654
3535B3893121M92758N60528N44110O26069M95341N87457P33826R27068R11243
3526B9771521J054206R73190J053291Q98884J198359J053705J020902J314722
$$ plain form
3518 38338780 39870631 41173926 42758366 44284525 45956743 47521794 49331140 51426288
3510 51426288 53675302 55976309 58456766 61090637 64198219 67765972 71885479 76848343
3502 76848343 82894104 89523251 96391726 103643313 112005620 121662829 132680207 145959072
3494 145959072 162707688 183505201 209642843 241991798 277209406 314087202 352206659
3487 352206659 390954644 425941910 429775503 362831577 280106107 222937121 183955377
3480 183955377 157547673 137540547 122546411 110336284 100920059 93089975 86847471
3473 86847471 81540149 77268522 73307424 70329513 67785463 65980481 64275029 63025368
3465 63025368 61911776 61254575 60642250 60374093 60237527 60218096 60151132 60329240 60474173 60814043
$$ packed form
3518C8338780J531851J303295J584440J526159J672218J565051J809346K095148
3510E1426288K249014K301007K480457K633871L107582L567753M119507M962864
3502G6848343O045761O629147O868475P251587Q362307R657209J1017378J3278865
3494A45959072J6748616K0797513K6137642L2348955L5217608L6877796L8119457
3487C52206659L8747985L4987266L833593o6943926q2725470n7168986l8981744
3480A83955377k6407704k0007126j4994136j2210127r416225p830084o242504
3473H6847471n307322m271627l961098k977911k544050j804982j705452j249661
3465F3025368j113592o57201o12325k68157j36566j9431o6964J78108J44933L39870
$$ plain form
3455 60814043 60835922 60902369 60996100 61557240 62068104 63031730 64260948 65753127 67364924
3446 67364924 69185577 70623790 71804080 72970444 74521390 76093364 78062139 80681280
3438 80681280 84124467 87936881 92662246 98170326 104556684 111351523 118844739 127134955
3430 127134955 136509591 147212703 160066368 175432100 193875883 215943254 241545628
3423 241545628 269518538 298567834 326931076 352190616 369509533 369248559 341894286
3416 341894286 295867050 249760233 211849842 182466481 159831935 142005089 127815830
3409 127815830 116386816 107121221 99515977 93292653 88192696 83976653 80319737 77268374
3401 77268374 74615557 72202394 69702617 66978276 63755302 60065510 56280553 52902313
$$ packed form
3455F0814043K1879O6447R3731N61140N10864R63626J229218J492179J611797
3446F7364924J820653J438213J180290J166364J550946J571974J968775K619141
3438H0681280L443187L812414M725365N508080O386358O794839P493216Q290216
3430A27134955R374636J0703112J2853665J5365732J8443783K2067371K5602374
3423B41545628K7972910K9049296K8363242K5259540J7318917k60974k7354273
3416C41894286m6027236m6106817l7910391k9383361k2634546j7826846j4189259
3409A27815830j1429014r265595p605244o223324n099957m216043l656916l051363
3401G7268374k652817k413163k499777k724341l222974l689792l784957l378240
$$ plain form
3393 52902313 50153289 47685026 45428212 43534405 41810341 40216941 38685129 37179126
3385 37179126 35749288 34288757 32948586 31774522 30611423 29531677 28643420 27655642
3377 27655642 26796007 26046282 25296577 24528955 23974933 23506082 22922591 22376073 21994251
3368 21994251 21572208 21191208 20791677 20418998 19992704 19704624 19550280 19340076 19163295
3359 19163295 19013341 18898318 18911818 18905407 18784770 18715749 18574447 18401238 18268691 18044367
3349 18044367 17748967 17690949 17482518 17227535 17142273 16927471 16773889 16523872 16155418 15727649
3339 15727649 15287095 15147228 15053431 14815782 14880751 14991196 14970720 15028645 14968007 14448358
3329 14448358 14049288 13728805 13531465 13247134 13000851 12827393 12658125 12467869 12380285 12382882
$$ packed form
3393E2902313k749024k468263k256814j893807j724064j593400j531812j506003
3385C7179126j429838j460531j340171j174064j163099j079746q88257r87778
3377B7655642q59635p49725p49705p67622n54022m68851n83491n46518l81822
3368B1994251m22043l81000l99531l72679m26294k88080j54344k10204j76781
3359A9163295j49954j15023J3500o411j20637o9021j41302j73209j32547k24324
3349A8044367k95400n8018k08431k54983q5262k14802j53582k50017l68454m27769
3339A5727649m40554j39867r3797k37649O4969J10445k0476N7925o0638n19649
3329A4448358l99070l20483j97340k84331k46283j73458j69268j90256q7584K597
$$ plain form
3319 12382882 12379341 12390266 12595962 12691692 12724229 12920981 13148140 13373717 13755649 14180734
3309 14180734 14735824 15084187 15404055 15626539 15714553 15931470 16269670 16405322 16565504 16720415
3299 16720415 16877000 17034847 17419304 17889156 18411767 19212496 20110563 21015719 21894732
3290 21894732 22661659 23273381 23680245 23658775 23443959 23232776 23296293 23604256 24341663 25437724
3280 25437724 26883790 28932675 31450838 34323870 37409644 40421204 43315110 45710157
3272 45710157 46813258 44854330 39451679 33187528 28054429 24116363 21072997 18650710
3264 18650710 16826363 15297582 13989492 12988189 12252922 11602480 10898716 10293921 9735727
3255 9735727 9223279 8865301 8544506 8255163 8055896 7752214 7619607 7429408 7116116 6964823
$$ packed form
3319A2382882l541J0925K05696R5730L2537J96752K27159K25577L81932M25085
3309A4180734N55090L48363L19868K22484Q8014K16917L38200J35652J60182J54911
3299A6720415J56585J57847L84457M69852N22611Q00729Q98067R05156Q79013
3290B1894732P66927O11722M06864k1470k14816k11183O3517L07963P37407J096061
3280B5437724J446066K048885K518163K873032L085774L011560K893906K395047
3272D5710157J103101j958928n402651o264151n133099l938066l043366k422287
3264A8650710j824347j528781j308090j001303p35267o50442p03764o04795n58194
3255I735727n12448l57978l20795k89343j99267l03682j32607j90199l13292j51293
$$ plain form
3245 6964823 6849038 6583138 6583211 6558019 6382968 6314135 6180127 6122922 6165840 6207972 6056037
3234 6056037 5994652 5993347 5888387 5963675 6025715 6096920 6273941 6475881 6737643 6831621 6775431
3223 6775431 6806127 6696975 6404237 6022299 5733992 5478045 5272557 5127630 5074775 5096927
3213 5096927 5085979 5277496 5356064 5370413 5529765 5690796 5721107 5667183 5494738 5190542
3203 5190542 4861657 4586818 4489409 4356687 4141259 4067290 4054834 4110700 4075629 4037364 3964641
3192 3964641 3918908 4014150 3926249 3940050 3948644 3897785 3966189 3940477 4028265 4179379 4273436
3181 4273436 4213140 4296712 4293645 4213471 4139511 4155720 3953061 3784621 3732721 3727464 3673008
3170 3673008 3681611 3756790 3776039 3770778 3858415 3913893 3918193 3847053 3778585 3717722 3570594 3483792
$$ packed form
3245F964823j15785k65900P3k5192j75051o8833j34008n7205M2918M2132j51935
3234F056037o1385j305j04960P5288O2040P1205J77021K01940K61762R3978n6190
3223F775431L0696j09152k92738l81938k88307k55947k05488j44927n2855K2152
3213E096927j0948J91517P8568J4349J59352J61031L0311n3924j72445l04196
3203E190542l28885k74839r7409j32722k15428p3969j2456N5866l5071l8265p2723
3192C964641m5733R5242q7901J3801Q594n0859O8404k5712Q7788J51114R4057
3181D273436o0296Q3572l067q0174p3960J6209k02659j68440n1900n257n4456
3170C673008Q603P5179J9249n261Q7637N5478M300p1140o8468o0863j47128q6802
$$ plain form
3158 3483792 3420162 3283013 3313604 3330833 3407188 3557287 3710932 3836416 3875856 3974119 4087153
3147 4087153 3852215 3476792 3137151 2836795 2751164 2586333 2436010 2367782 2361140 2330967
3137 2330967 2303275 2235661 2149923 2146777 2063147 2088867 2157575 2118667 2085234 2151188 2115682 1969644
3125 1969644 2015670 1987694 2039881 2110965 2150686 2057775 2052906 2113589 2098108 2059395 1975557 1935644
3113 1935644 1948086 1921872 1868791 1846644 1918873 2026175 1945022 1888874 1959518 2038670 2203159
3102 2203159 2251446 2384691 2605035 2636686 2724435 2844738 2892174 2926690 2997624 2816488 2531856
3091 2531856 2286267 2104092 1943334 1890902 1876371 1773289 1737101 1621490 1534398 1489327
3081 1489327 1470164 1330878 1250967 1262331 1195767 1134406 1027335 972337 1063934 994544 1017499
$$ packed form
3158C483792o3630j37149L0591J7229P6355J50099J53645J25484L9440R8263J13034
3147D087153k34938l75423l39641l00356q5631j64831j50323o8228o642l0173
3137B330967k7692o7614q5738l146q3630K5720O8708l8908l3433O5954l5506j46038
3125A969644M6026k7976N2187P1084L9721r2911m869O0683j5481l8713q3838l9913
3113A935644J2442k6214n3081k2147P2229J07302q1153n6148P0644P9152J64489
3102B203159M8287J33245K20344L1651Q7749J20303M7436L4516P0934j81136k84632
3091B531856k45589j82175j60758n2432j4531j03082l6188j15611q7092m5071
3081A489327j9163j39286p9911J1364o6564o1361j07071n4998R1597o9390K2955
$$ plain form
3070 1017499 1056406 1030006 1016800 915959 916327 884496 919155 1004920 1064067 1020317 1032630 1033306
3058 1033306 934315 896508 920003 1038095 1133932 1088496 1076642 1201837 1143435 1124033 1117418
3047 1117418 1174255 1206533 1288414 1265914 1252322 1190755 1202938 1124624 1038008 1000622 1106004
3036 1106004 961674 828531 779808 794265 756226 792397 815033 870459 947741 942470 874187
3025 874187 843962 863932 884584 784835 733497 741506 594277 586965 612583 666551 669000 703319
3013 703319 732635 713244 703550 675383 692031 648739 654982 678542 709642 778268 713548 695106
3001 695106 683595 618567 566360 663999 608784 632321 597453 607090 678485 700248 557381 703986
2989 703986 811678 807008 726810 819353 946499 859490 882043 898519 874350 966510 1042950
$$ packed form
3070A017499L8907k6400j3206j00841L68l1831L4659Q5765N9147m3750J2313O76
3058A033306r8991l7807K3495J18092R5837m5436j1854J25195n8402j9402o615
3047A117418N6837L2278Q1881k2500j3592o1567J2183p8314q6616l7386J05382
3036A106004j44330j33143m8723J4457l8039L6171K2636N5426P7282n271o8283
3025H74187l0225J9970K0652r9749n1338Q009j47229p312K5618N3968K449L4319
3013G03319K9316j9391r694k8167J6648m3292O243K3560L1100O8626o4720j8442
3001F95106j1511o5028n2207R7639n5215K3537l4868R637P1395K1763j42867J46605
2989G03986J07692m670q0198R2543J27146q7009K2553J6476k4169R2160P6440
$$ plain form
2978 1042950 1037083 1075237 1128622 1129651 1244364 1346162 1341028 1256371 1143944 1175292 1219880
2967 1219880 1152244 1028130 991455 1023884 1055242 940916 909516 943121 977926 915346 844925
2956 844925 953012 956062 943437 1034476 1150714 1164462 1148978 1186324 1233460 1298666 1348089
2945 1348089 1337148 1337188 1435731 1524304 1460407 1491256 1570651 1722742 1801739 1837910 1976013 2004697
2933 2004697 1989167 2137445 2179513 2160544 2092151 2025139 1945083 1893743 1872633 1841445 1574341
2922 1574341 1545461 1608967 1498177 1575122 1733633 1710766 1699398 1739730 1965866 1933719 1914337
2911 1914337 2047760 2262400 2512952 2685670 2971239 3125128 3191179 3499486 3588815 3605952
2901 3605952 3697525 3664701 3476114 3222980 3001627 2828196 2622830 2506045 2412868 2203765
$$ packed form
2978A042950n867L8154N3385J029J14713J01798n134q4657j12427L1348M4588
2967A219880o7636j24114l6675L2429L1358j14326l1400L3605L4805o2580p0421
2956H44925J08087L050j2625R1039J16238J3748j5484L7346M7136O5206M9423
2945A348089j0941M0R8543Q8573o3897L0849P9395J52091P8997L6171J38103K8684
2933B004697j5530J48278M2068j8969o8393o7012q0056n1340k1110l1188k67104
2922A574341k8880O3506j10790P6945J58511k2867j1368M0332K26136l2147j9382
2911A914337J33423K14640K50552J72718K85569J53889O6051L08307Q9329J7137
2901C605952R1573l2824j88587k53134k21353j73431k05366j16785r3177k09103
$$ plain form
2891 2203765 2180091 2120546 1946132 1843179 1942534 2082230 2188609 2012398 2080508 2164342
2881 2164342 2270386 2267174 2415762 2428623 2366761 2489909 2558238 2443963 2533609 2523934 2467986
2870 2467986 2451926 2482431 2627759 2770411 2693694 2711709 2657482 2468242 2466389 2452467 2368693
2859 2368693 2243347 2222042 2175077 2083499 2090934 2121869 2128576 2092457 2089577 2052477 1997012 1938905
2847 1938905 1965981 2002118 1920164 1954234 2003705 2030873 2065801 2002835 2001279 2061760 2000082 1872858
2835 1872858 1836254 1790296 1652622 1452003 1395619 1256009 1228185 1232791 1121723 1161097 1133298
2824 1133298 1074478 945560 954412 983572 981907 983878 991561 934938 960323 1044779 1103721 1165178
2812 1165178 1120270 1177622 1292654 1335313 1298583 1283541 1424772 1496837 1482296 1516158 1404252
$$ packed form
2891B203765k3674n9545j74414j02953R9355J39696J06379j76211O8110Q3834
2881B164342J06044l212J48588J2861o1862J23148O8329j14275Q9646r675n5948
2870B467986j6060L0505J45328J42652p6717J8015n4227j89240j853j3922q3774
2859B368693j25346k1305m6965r1578P435L0935O707l6119k880l7100n5465n8107
2847A938905K7076L6137q1954L4070M9471K7168L4928o2966j556O0481o1678j27224
2835A872858l6604m5958j37674k00619n6384j39610k7824M606j11068L9374k7799
2824A133298n8820j28918Q852K9160j665J971P683n6623K5385Q4456N8942O1457
2812A165178m4908N7352J15032M2659l6730j5042J41231P2065j4541L3862j11906
$$ plain form
2801 1404252 1383222 1326799 1325336 1268886 1230169 1096939 945535 944709 885045 834764 799748 822215
2789 822215 829098 882115 832601 796422 733193 747433 813876 902215 939583 820454 762028 745177
2777 745177 781077 804123 804651 878623 804001 726686 737986 743189 734389 720182 753511 799269
2765 799269 787868 758890 823016 869364 824961 853666 953985 1025474 1016233 966044 886433 891458
2753 891458 895359 894340 960835 917002 875864 915397 995795 993083 975215 1080492 1135303 1111002
2741 1111002 1158951 1100304 1041676 991643 826616 816821 849079 885313 797820 837065 867836
2730 867836 927958 802151 834116 855924 775875 778402 882852 891725 783994 748657 838761
2719 838761 793247 755897 727964 653793 724493 758005 745891 793709 821511 833450 873143 866046
$$ packed form
2801A404252k1030n6423j463n6450l8717j33230j51404q26n9664n0281l5016K2467
2789H22215O883N3017m9514l6179o3229J4240O6443Q8339L7368j19129n8426j6851
2777G45177L5900K3046N28P3972p4622p7315J1300N203q800j4207L3329M5758
2765G99269j1401k8978O4126M6348m4403K8705J00319P1489r241n0189p9611N025
2753H91458L901j019O6495m3833m1138L9533Q0398k712j7868J05277N4811k4301
2741A111002M7949n8647n8628n0033j65027r795L2258L6234q7493L9245L0771
2730H67836O0122j25807L1965K1808q0049K527J04450Q873j07731l5337R0104
2719H38761m5514l7350k7933p4171P0700L3512j2114M7818K7802J1939L9693p097
$$ plain form
2707 866046 819836 810945 775639 718515 622213 651134 620292 527086 514200 549215 535025 653708
2695 653708 719320 616806 603398 545651 556145 412845 480003 578387 540600 592599 625854
2684 625854 672454 671934 580902 670091 670495 693293 674528 713803 716206 577228 607384 622392
2672 622392 557112 510165 516676 620405 630431 723839 720207 759716 679910 699455 712433 615263
2660 615263 634055 658668 762085 833600 767417 746087 788720 805910 703228 647303 638045
2649 638045 650912 643850 656494 750403 822310 846063 914607 925932 875176 984088 1026338 1090909
2637 1090909 1110261 1046981 1009925 1053424 971945 1010114 1039515 1018815 1075741 1175893 1173120
2626 1173120 1137149 1159728 1212881 1170118 1120046 1041665 1050566 1076437 999110 1014365 1038993 1002426
$$ packed form
2707H66046m6210q891l5306n7124r6302K8921l0842r3206j2886L5015j4190J18683
2695F53708O5612j02514j3408n7747J0494j43300O7158R8384l7787N1999L3255
2684F25854M6600n20r1032Q9189M04K2798j8765L9275K403j38978L0156J5008
2672F22392o5280m6947O511J03729J0026R3408l632L9509p9806J9545J2978r7170
2660F15263J8792K4613J03417P1515o6183k1330M2633J7190j02682n5925r258
2649F38045J2867p062J2644R3909P1907K3753O8544J1325n0756J08912M2250O4571
2637A090909J9352o3280l7056M3499q1479L8169K9401k0700N6926J00152k773
2626A173120l5971K2579N3153m2763n0072p8381Q901K5871p7327J5255K4628l6567
$$ plain form
2614 1002426 1050650 1109239 1158539 1153164 1106584 1185077 1214409 1169924 1219951 1236897 1167105 1181638
2602 1181638 1226001 1215276 1255371 1280578 1208251 1227019 1267328 1245782 1244637 1259038 1183576 1156033
2590 1156033 1179708 1213173 1220901 1150235 1122197 1089405 1110521 1182641 1136877 1075104 1098500 1106966
2578 1106966 1053591 1026375 1005100 1063452 1081447 1060359 1081582 1180831 1131853 1119308 987995
2567 987995 1032246 1057861 1107091 1130406 1102491 1056830 1083829 997563 1046857 1055303 1004139 962479
2555 962479 984893 1023716 999681 1094924 1079069 1097063 1194846 1135985 1013061 1078408 1109186
2544 1109186 1076276 1080438 1124267 1104457 1096396 1090329 1043809 1054040 1120936 1112600 1134891 1172404
2532 1172404 1253705 1239511 1256612 1260076 1279687 1178445 1047353 1030480 1061547 1056784 1074011
$$ packed form
2614A002426M8224N8589M9300n375m6580P8493K9332m4485N0027J6946o9792J4533
2602A181638M4363j0725M0095K5207p2327J8768M0309k1546j145J4401p5462k7543
2590A156033K3675L3465P728p0666k8038l2792K1116P2120m5764o1773K3396Q466
2578A106966n3375k7216k1275N8352J7995k1088K1223R9249m8978j2545j31313
2567I87995M4251K5615M9230K3315k7915m5661K6999q6266M9294Q446n1164m1660
2555I62479K2414L8823k4035R5243j5855J7994R7783n8861j22924O5347L0778
2544A109186l2910M162M3829j9810q061o067m6520J0231O6896q336K2291L7513
2532A172404Q1301j4194J7101L464J9611j01242j31092j6873L1067m763J7227
$$ plain form
2521 1074011 1030071 1070576 1108600 1120954 1184479 1210925 1203250 1147751 1137646 1191281 1200934 1283213
2509 1283213 1142198 1138388 1198615 1221868 1248629 1285135 1217737 1287313 1328176 1336780 1462058
2498 1462058 1469410 1510681 1519670 1470351 1440087 1437659 1528473 1501453 1524407 1540496 1468762 1317559
2486 1317559 1394616 1553562 1456876 1428408 1463620 1497316 1457718 1501733 1455547 1380331 1287569
2475 1287569 1306753 1332865 1335923 1230739 1239072 1244478 1196631 1222916 1212388 1247146 1353415 1381657
2463 1381657 1377042 1362963 1395666 1466892 1455768 1410350 1456708 1404540 1367175 1355256 1300922 1381252
2451 1381252 1467401 1552064 1448110 1426629 1368306 1272904 1186025 1256116 1271401 1240003 1272004
2440 1272004 1303464 1228920 1268604 1336636 1391035 1405648 1324754 1327037 1347308 1385864 1401002 1435816
$$ packed form
2521A074011m3940M0505L8024J2354O3525K6446p675n5499j0105N3635R653Q2279
2509A283213j41015l810O0227K3253K6761L6506o7398O9576M0863Q604J25278
2498A462058P352M1271Q989m9319l0264k428R0814k7020K2954J6089p1734j51203
2486A317559P7057J58946r6686k8468L5212L3696l9598M4015m6186p5216r2762
2475A287569J9184K6112L058j05184Q333N406m7847K6285j0528L4758J06269K8242
2463A381657m615j4079L2703P1226j1124m5418M6358n2168l7365j1919n4334Q0330
2451A381252Q6149Q4663j03954k1481n8323r5402q6879P0091J5285l1398L2001
2440A272004L1460p4544L9684O8032N4399J4613q0894K283K0271L8556J5138L4814
$$ plain form
2428 1435816 1335102 1241391 1275104 1268217 1255142 1226021 1205002 1157091 1106642 1160328 1203413
2417 1203413 1151827 1101783 1201525 1244681 1298604 1297868 1278174 1353756 1376692 1231206 1165647 1129694
2405 1129694 1159331 1139500 1115028 1211819 1264042 1293057 1349259 1323406 1270035 1203440 1260228
2394 1260228 1323601 1300960 1320045 1373182 1300918 1308187 1414151 1326460 1367023 1329116 1229572
2383 1229572 1217072 1257779 1266904 1207451 1222602 1334593 1382498 1310016 1304814 1326865 1302544 1254578
2371 1254578 1357131 1333722 1330872 1367881 1420033 1472749 1447762 1426307 1491209 1462965 1431311
2360 1431311 1581368 1518606 1455450 1514489 1487594 1464780 1521899 1564907 1483913 1462532 1574343
2349 1574343 1571337 1557680 1520235 1563125 1619412 1632645 1583645 1552006 1630339 1563225 1646784 1580738
$$ packed form
2428A435816j00714r3711L3713o887j3075k9121k1019m7911n0449N3686M3085
2417A203413n1586n0044R9742M3156N3923p36j9694P5582K2936j45486o5559l5953
2405A129694K9637j9831k4472R6791N2223K9015N6202k5853n3371o6595N6788
2394A260228O3373k2641J9085N3137p2264P269J05964q7691M0563l7907r9544
2383A229572j2500M0707R125n9453J5151J11991M7905p2482n202K2051k4321m7966
2371A254578J02553k3409k850L7009N2152N2716k4987k1455O4902k8244l1654
2360A431311J50057o2762o3156N9039k6895k2814N7119M3008q0994k1381J11811
2349A574343l006j3657l7445M2890N6287J3233m9000l1639P8333o7114Q3559o6046
$$ plain form
2337 1580738 1650088 1740956 1794361 1764426 1755477 1745489 1728899 1822983 1847882 1813571 1876561 1800471
2325 1800471 1788142 1886803 1991301 2005758 1983867 1865847 1870160 1798221 1818415 1923764 2039441
2314 2039441 1987848 1918329 2030125 2020806 2068789 2054507 2119252 2056909 2098426 2089370 2120982 2058632
2302 2058632 2044192 2137014 2183066 2203199 2260160 2195569 2235989 2302112 2312615 2271390 2323119
2291 2323119 2395292 2422198 2476766 2558119 2513534 2526428 2574164 2616266 2650959 2705850 2789957
2280 2789957 2757814 2820013 2840828 2899905 2927638 2930398 3091228 3191814 3186788 3183690 3219149 3280186
2268 3280186 3297630 3302377 3474812 3473184 3527854 3490554 3476265 3617966 3788983 3853463 3770657
2257 3770657 3768485 3837472 3864138 4016749 4138265 4302658 4335233 4401587 4386379 4486289 4629361
$$ packed form
2337A580738O9350R0868N3405k9935q949r988j6590R4084K4899l4311O2990p6090
2325A800471j2329R8661J04498J4457k1891j18020M313p1939K0194J05349J15677
2314B039441n1593o9519J11796r319M7983j4282O4745o2343M1517r056L1612o2350
2302B058632j4440R2822M6052K0133N6961o4591M0420O6123J0503m1225N1729
2291B323119P2173K6906N4568Q1353m4585J2894M7736M2102L4693N4891Q4107
2280B789957l2143O2199K0815N9077K7733K760J60830J00586n026l098L5459O1037
2268C280186J7444M747J72435j628N4670l7300j4289J41701J71017O4480q2806
2257C770657k172O8987K6666J52611J21516J64393L2575O6354j5208R9910J43072
$$ plain form
2246 4629361 4679693 4662877 4728796 4969002 5068756 5127524 5231697 5303983 5373764 5400175 5487980
2235 5487980 5571941 5614680 5774187 5902404 5966956 6100902 6188269 6317516 6509869 6571295
2225 6571295 6590071 6740416 6907434 7063220 7203594 7344594 7566238 7677495 7788248 7828979
2215 7828979 8042840 8192879 8417024 8583631 8794203 8875461 9011215 9284490 9550504 9844301
2205 9844301 10071605 10230957 10446024 10699965 10981317 11218918 11511489 11865933 12252272 12704290
2195 12704290 13154528 13547751 14080043 14664568 15123217 15627553 16318813 17025663 17855448
2186 17855448 18673441 19562468 20483757 21294575 22164885 23186162 24183552 24950796 25688196
2177 25688196 26257002 26532891 26615318 26329310 25701509 24736800 23649675 22618974 21464858
$$ packed form
2246D629361N0332j6816O5919K40206R9754N8768J04173P2286O9781K6411Q7805
2235E487980Q3961M2739J59507J28217O4552J33946Q7367J29247J92353O1426
2225F571295J8776J50345J67018J55786J40374J41000K21644J11257J10753M0731
2215G828979K13861J50039K24145J66607K10572Q1258J35754K73275K66014K93797
2205I844301K27304J59352K15067K53941K81352K37601K92571L54444L86339M52018
2195A2704290M50238L93223N32292N84525M58649N04336O91260P06850Q29785
2186A7855448Q17993Q89027R21289Q10818Q70310J021277R97390P67244P37400
2177B5688196N68806K75889Q2427k86008o27801r64709j087125j030701j154116
$$ plain form
2168 21464858 20412583 19612807 18796300 18001030 17427745 16900287 16369806 15775839 15302694
2159 15302694 14918869 14634848 14369450 14096034 13907037 13602650 13290790 13191694 13054000 12829988
2149 12829988 12812240 12668322 12525535 12530057 12526446 12628806 12605007 12650498 12697735 12742375 12855121
2138 12855121 12718592 12246019 11556225 10999520 10499706 10155025 9874581 9657310 9359647
2129 9359647 9170289 8976055 8760291 8650142 8495736 8311695 8214060 8138728 8193477 8053804
2119 8053804 7974233 7957992 7934219 7939407 7927492 7956788 7905697 8014396 8247231 8589775 8831982
2108 8831982 9229611 9607915 10095620 10486097 10526177 9693672 8582991 7870104 7299563 6905514
2098 6905514 6655886 6390724 6151785 6052484 5979176 5764046 5673170 5611128 5629035 5550200 5364844
$$ packed form
2168B1464858j052275p99776q16507p95270n73285n27458n30481n93967m73145
2159A5302694l83825k84021k65398k73416j88997l04387l11860r9096j37694k24012
2149A2829988j7748j43918j42787M522l611J02360k3799M5491M7237M4640J12746
2138A2855121j36529m72573o89794n56705m99814l44681k80444k17271k97663
2129I359647j89358j94234k15764j10149j54406j84041r7635p5332N4749j39673
2119H053804p9571j6241k3773N188j1915K9296n1091J08699K32835L42544K42207
2108H831982L97629L78304M87705L90477M0080q32505j110681p12887n70541l94049
2098F905514k49628k65162k38939r9301p3308k15130r0876o2042J7907p8835j85356
$$ plain form
2087 5364844 5314649 5291617 5255124 5237678 5250686 5220433 5291211 5263118 5296545 5289084 5429234
2076 5429234 5568575 5715488 5903386 6032948 6232759 6448490 6423522 5869153 5251763 4954021
2066 4954021 4658235 4432961 4346504 4348810 4193322 4116079 4060462 3903678 3868978 3753003 3795948
2055 3795948 3743560 3648516 3567321 3556683 3485654 3423210 3432060 3376716 3222873 3199662 3281652
2044 3281652 3246842 3246662 3225927 3155224 3094832 3126889 3023643 2955312 2875062 2930891 3003372 3013212
2032 3013212 2980547 2772930 2738190 2844138 2937199 2853723 2717324 2691243 2747632 2670725 2604180
2021 2604180 2584572 2592992 2565826 2634795 2657470 2704722 2582593 2551268 2559528 2460823 2508968 2523716
2009 2523716 2539150 2614394 2579407 2553328 2543893 2519721 2493155 2539730 2621165 2509248 2429271
$$ packed form
2087E364844n0195k3032l6493j7446J3008l0253P0778k8093L3427p461J40150
2076E429234J39341J46913J87898J29562J99811K15731k4968n54369o17390k97742
2066D954021k95786k25274q6457K306j55488p7243n5617j56784l4700j15975M2945
2055C795948n2388r5044q1195j0638p1029o2444Q850n5344j53843k3211Q1990
2044C281652l4810j80k0735p0703o0392L2057j03246o8331q0250N5829P2481R840
2032C013212l2665k07617l4740J05948R3061q3476j36399k6081N6389p6907o6545
2021B604180j9608Q420k7166O8969K2675M7252j22129l1325Q260r8705M8145J4748
2009B523716J5434P5244l4987k6079r435k4172k6566M6575Q1435j11917p9977
$$ plain form
1998 2429271 2483455 2579223 2568776 2471256 2556131 2485886 2323542 2334250 2327254 2279997 2288598 2292569
1986 2292569 2279363 2244835 2260516 2339344 2293081 2254987 2191197 2165576 2184756 2113025 2089482
1975 2089482 2008143 2071741 2174010 2096669 2001413 1981370 2061067 2036706 2047130 2075070 2005772
1964 2005772 1927870 1904656 1900863 1843785 1804167 1871190 1818711 1733332 1688595 1743306 1779236 1795601
1952 1795601 1920538 1903042 1770414 1766305 1709351 1717509 1691131 1719360 1734987 1634629 1751570
1941 1751570 1826432 1760026 1810274 1881518 1882711 1765107 1785818 1909978 1909379 1912905 1930781 1991147
1929 1991147 1904328 1903348 2010726 1932026 1886542 1957085 1936215 1897557 1905197 1921207 1915930 1920101
1917 1920101 1982412 1837501 1812268 1934996 2026243 1975920 2013835 2018521 2020540 1974162 1975198 2030709
$$ packed form
1998B429271N4184R5768j0447r7520Q4875p0245j62344J0708o996m7257Q601L971
1986B292569j3206l4528J5681P8828m6263l8094o3790k5621J9180p1731k3543
1975B089482q1339O3598J02269p7341r5256k0043P9697k4361J0424K7940o9298
1964B005772p7902k3214l793n7078l9618O7023n2479q5379m4737N4711L5930J6365
1952A795601J24937j7496j32628m109n6954Q158k6378K8229J5627j00358J16941
1941A751570P4862o6406N0248P1244J193j17604K0711J24160n99L526J7876O0366
1929A991147q6819r80J07378p8700m5484P0543k0870l8658P640J6010n277M171
1917A920101O2311j44911k5233J22728R1247n0323L7915M686K019m6378J036N5511
$$ plain form
1905 2030709 2008607 2042594 2000851 1884634 1944746 2048444 2074093 2080640 2104376 2221903 2329792
1894 2329792 2310969 2381641 2461762 2447643 2464138 2589263 2654724 2616507 2651745 2674549 2694189
1883 2694189 2726199 2736406 2707091 2780524 2891145 2818883 2664673 2669161 2826880 2845788 2912283
1872 2912283 2996185 2997399 2892920 2980942 3064716 3101466 3145474 3164198 3217323 3206706 3227968
1861 3227968 3325073 3441462 3475495 3619616 3720353 3776960 3838848 3928215 4014225 4139684 4284830
1850 4284830 4410102 4559019 4676227 4855638 4922978 5025219 5124672 5176181 5290432 5342335
1840 5342335 5437606 5547465 5588046 5618835 5728984 5761208 5717289 5742116 5805635 5920728 5999725
1829 5999725 6045587 6273708 6425005 6647210 6830528 7003008 7181924 7347992 7592103 7857765
$$ packed form
1905B030709k2102L3987m1743j16217O0112J03698K5649O547K3736J17527J07889
1894B329792j8823P0672Q0121j4119J6495J25125O5461l8217L5238K2804J9640
1883B694189L2010J0207k9315P3433J10621p2262j54210M488J57719J8908O6495
1872B912283Q3902J214j04479Q8022Q3774L6750M4008J8724N3125j0617K1262
1861C227968R7105J16389L4033J44121J00737N6607O1888Q9367Q6010J25459J45146
1850D284830J25272J48917J17208J79411O7340J02241R9453N1509J14251N1903
1840E342335R5271J09859M0581L0789J10149L2224m3919K4827O3519J15093P8997
1829E999725M5862K28121J51297K22205J83318J72480J78916J66068K44111K65662
$$ plain form
1819 7857765 8061087 8294058 8542743 8805159 9120152 9424051 9691935 9928514 9923826 9994949
1809 9994949 9889606 9612390 9321916 9174380 8977208 8670731 8423221 8297443 8292029 8247297
1799 8247297 8219636 8309698 8396916 8546875 8802987 8982154 9072796 9228361 9314572 9443612
1789 9443612 9614778 9875720 9985043 10107080 10201637 10247999 10299623 10165178 10179645 9994529
1779 9994529 9614100 9398303 9237072 8939120 8674778 8310763 7963931 7641047 7488023 7332607
1769 7332607 7164629 7085792 7019314 7065039 6947144 7002181 7045084 7114052 7102218 7085053 7086202
1758 7086202 6983653 6764038 6704531 6559173 6406573 6248172 5898024 5646606 5356210 5097006
1748 5097006 4907087 4703409 4491030 4309436 4171504 3985746 3885489 3762177 3683388 3546023
$$ packed form
1819G857765K03322K32971K48685K62416L14993L03899K67884K36579m688P1123
1809I994949j05343k77216k90474j47536j97172l06477k47510j25778n414m4732
1799H247297k7661R0062Q7218J49959K56112J79167R0642J55565Q6211J29040
1789I443612J71166K60942J09323J22037R4557M6362N1624j34445J4467j85116
1779I994529l80429k15797j61231k97952k64342l64015l46832l22884j53024j55416
1769G332607j67978p8837o6478M5725j17895N5037M2903O8968j1834j7165J149
1758G086202j02549k19615n9507j45358j52600j58401l50148k51418k90396k59204
1748E097006j89919k03678k12379j81594j37932j85758j00257j23312p8789j37365
$$ plain form
1738 3546023 3414124 3312230 3256791 3223306 3171032 3027802 2967977 2896401 2834859 2928097 2829509
1727 2829509 2784995 2716932 2667426 2585621 2611881 2515105 2394906 2248222 2163495 2112081 2080588
1716 2080588 2031405 2100012 2097727 2006179 1886277 1883293 1807656 1855031 1770121 1783021 1629713
1705 1629713 1573279 1574778 1545901 1471317 1495300 1325941 1331693 1332382 1348969 1331818 1364454 1356321
1693 1356321 1261947 1275668 1238988 1229560 1223642 1217372 1197290 1198133 1256778 1168297 1038087 1077112
1681 1077112 1092231 1078849 944753 973225 935860 782357 766849 800158 731382 779360 780126
1670 780126 789850 702273 696046 759253 804289 717462 696553 698363 748504 789821 717889 619237
1658 619237 600763 678633 617797 663905 720427 711585 651098 596797 635375 668381 568490 540882
$$ packed form
1738C546023j31899j01894n5439l3485n2274j43230n9825p1576o1542R3238r8588
1727B829509m4514o8063m9506q1805K6260r6776j20199j46684q4727n1414l1493
1716B080588m9183O8607k285r1548j19902k984p5637M7375q4910J2900j53308
1705A629713n6434J499k8877p4584K3983j69359N752O89J6587j7151L2636q133
1693A356321r4374J3721l6680r428n918o270k0082Q43N8645q8481j30210L9025
1681A077112J5119j3382j34096K8472l7365j53503j5508L3309o8776M7978P66
1670G80126R724q7577o227O3207M5036q6827k0909J810N0141M1317p1932r8652
1658F19237j8474P7870o0836M6108N6522q842o0487n4301L8578L3006r9891k7608
$$ plain form
1646 540882 592513 582126 531605 392207 445917 461950 461190 406219 368121 404859 414146 427135
1634 427135 325342 343382 301475 240967 322831 399376 334276 150471 137824 205753 227539
1623 227539 239278 336702 208378 216279 249322 241873 325955 308243 209902 284150 324941 363062
1611 363062 289077 207519 137909 198297 184090 186024 263129 359717 249329 199058 229799 174464
1599 174464 185291 242925 199708 143440 144712 244691 102477 65247 189341 207152 83601
1588 83601 43984 103435 114208 188977 231852 156930 32325 94836 122816 145550 148292 176360
1576 176360 161927 150955 218282 116110 88642 165160 84199 46587 101260 184197 160959
1565 160959 117352 4378 46231 40476 92404 192470 255847 228462 155188 162359 116623 105150
$$ packed form
1646E40882N1631j0387n0521j39398N3710J6033p60n4971l8098L6738R287J2989
1634D27135j01793J8040m1907o0508Q1864P6545o5100j83805j2647O7929K1786
1623B27539J1739R7424j28324P901L3043p449Q4082j7712r8341P4248M0791L8121
1611C63062p3985q1558o9610O0388j4207J934P7105R6588j10388n0271L0741n5335
1599A74464J0827N7634m3217n6268J272R9979j42214l7230J24094J7811j23551
1588H3601l9617N9451J0773P4769M2875p4922j24605O2511K7980K2734K742K8068
1576A76360j4433j0972O7327j02172k7468P6518q0961l7612N4673Q2937k3238
1565A60959m3607j12974M1853n755N1928J00066O3377k7385p3274P171m5736j1473
$$ plain form
1553 105150 86515 119335 61185 -56348 -13796 25822 65879 104727 158603 93129 110144
1542 110144 106124 160198 203212 201340 208435 150344 192090 166046 247737 232932 214432 210823
1530 210823 237193 171047 168953 266046 349619 290632 221954 218493 139323 173881 212471 233209
1518 233209 297642 270046 182697 179802 162672 215015 199244 167962 184038 247095 210197 282235
1506 282235 295662 238738 168619 207246 195950 277657 230444 200273 174406 140051 176887 208536
1494 208536 173429 209755 208623 222094 202876 302690 233509 226439 260560 277541 224914 190300
1482 190300 164386 117925 218086 161746 149827 168129 109221 114858 200297 201011 225206 247442
1470 247442 201498 101979 64935 39266 88755 71760 193097 257124 173621 57068 38788
$$ packed form
1553A05150j8635L2820n8150j17533M2552L9618M0057L8848N3876o5474J7015
1542A10144m020N4074M3014j872P095n8091M1746k6044Q1691j4805j8500l609
1530B10823K6370o6146k094R7093Q3573n8987o8678l461p9170L4558L8590K0738
1518B33209O4433k7596q7349k895j7130N2343j5771l1282J6076O3057l6898P2038
1506B82235J3427n6924p0119L8627j1296Q1707m7213l0171k5867l4355L6836L1649
1494B08536l5107L6326j132J3471j9218R9814o9181p070L4121J6981n2627l4614
1482A90300k5914m6461J00161n6340j1919J8302n8908N637Q5439P14K4195K2236
1470B47442m5944r9519l7044k5669M9489j6995J21337O4027q3503j16553j8280
$$ plain form
1459 38788 123276 236726 217141 114612 112405 155322 43681 28337 170716 141162 93709
1448 93709 111211 166356 162933 196552 235840 227428 203949 266514 183870 64573 -26622 42134
1436 42134 105021 65933 12157 -19608 86243 57933 96435 53721 32480 -27078 67795 92893
1424 92893 69189 39926 108683 110617 113467 66387 45955 24003 80513 92584 27407 -27288
1412 -27288 -15372 -27199 -30192 2387 -980 -54902 9013 -7540 -41624 -4887 92986 134896
1400 134896 35955 -56626 -83310 -45527 -137295 -75052 -11676 -84393 -180813 -128264 -105988 -100962
1388 -100962 -51326 -64570 -57136 -46698 20100 -23125 -121442 -27956 -48573 -69054 -64223 -64379
1376 -64379 -38723 -16950 55918 27751 -31027 -123711 -148407 -115445 -91745 -57759 -128608 -82837
$$ packed form
1459C8788Q4488J13450j9585j02529k207M2917j11641j5344J42379k9554m7453
1448I3709J7502N5145l423L3619L9288q412k3479O2565q2644j19297r1195O8756
1436D2134O2887l9088n3776l1765J05851k8310L8502m2714k1241n9558R4873K5098
1424I2893k3704k9263O8757J934K850m7080k0432k1952N6510J2071o5177n4695
1412b7288J1916j1827k993L2579l367n3922O3915j6553l4084L6737R7873M1910
1400A34896r8941r2581k6684L7783r1768O2243O3376p2717r6420N2549K2276N026
1388a00962M9636j3244P434J0438O6798m3225r8317R3486k0617k0481M831j56
1376f4379K5656K1773P2868k8167n8778r2684k4696L2962K3700L3986p0849M5771
$$ plain form
1364 -82837 27304 -18168 -27737 -9288 -14806 -59082 -104727 -121113 -200118 -169614 -108293 -61767
1352 -61767 -65923 -13116 -106619 -134514 -177036 -88914 -32077 -86747 -118882 11605 37 -61351
1340 -61351 -62244 -82631 -68181 -203482 -147645 -101812 -147831 -148539 -76980 10791 -56073 51504
1328 51504 41467 -48735 -62198 -13300 3570 -44052 -104046 -120912 -66938 -71167 -75134 -63134
1316 -63134 -51812 -43532 -51943 -142937 -110874 -86844 -152602 -87735 951 -22046 -16990 -77899
1304 -77899 -62701 -40104 -68089 -164006 -226383 -225429 -207244 -68788 -48349 -124020 -89390 -129346
1292 -129346 -96868 -475 9452 -164666 -92216 2323 56422 7130 -61763 -40457 -32312 -99349
1280 -99349 -54417 -1701 42395 27419 -42287 -65853 10171 12203 5397 52395 -41918 -107235
$$ packed form
1364h2837J10141m5472r569J8449n518m4276m5645j6386p9005L0504O1321M6526
1352f1767m156N2807r3503k7895m2522Q8122N6837n4670l2135J30487j1568o1388
1340f1351q93k0387J4450j35301N5837M5833m6019p08P1559Q7771o6864J07577
1328E1504j0037r0202j3463M8898J6870m7622n9994j6866N3974m229l967J2000
1316f3134J1322Q280q411r0994L2063K4030o5758O4867Q8686k2997N056o0909
1304g7899J5198K2597k7985r5917o2377R54J8185J38456K0439p5671L4630l9956
1292a29346L2478R6393R927j74118P2450R4539N4099m9292o8893K1306Q145o7037
1280i9349M4932N2716M4096j4976o9706k3566P6024K032o806M6998r4313o5317
$$ plain form
1268 -107235 -79480 -20141 -40855 -131862 -51510 -54105 -56845 12188 -9815 -153322 -143929 -38862
1256 -38862 -40317 -148839 -165251 -84865 -82168 -3336 18597 16954 31223 82546 96410 90257
1244 90257 47228 105812 66968 83000 44877 52528 22448 28904 38450 5517 -112563 -111846 -98783
1231 -98783 -75409 -72977 -57494 -61390 -77839 -154834 -92547 -127867 -73592 -16698 -31418 -46137
1219 -46137 25324 47365 -50380 18792 71398 -4349 -69213 -34408 -48987 -87031 -88905 -68252
1207 -68252 -20018 -51793 -14735 -68825 -97204 -106467 -44059 -15827 -134299 -120253 -95743 -26219
1195 -26219 -39791 13665 -45729 -92612 -55971 8299 96819 72473 81072 70328 106989 99499
1183 99499 69147 73166 -17156 -23607 -95069 -95987 -62759 -67803 -58371 17799 137680 223563 52657
$$ packed form
1268a07235K7755N9339k0714r1007Q0352k595k740O9033k2003j43507R393J05067
1256c8862j455j08522j6412Q0386K697P8832K1933j643J4269N1323J3864o153
1244I0257m3029N8584l8844J6032l8123P651l0080O456R546l2933j18080P17J3063
1231i8783K3374K432J5483l896j6449p6995O2287l5320N4275N6894j4720j4719
1219d6137P1461K2041r7745O9172N2606p5747o4864L4805j4579l8044j874K0653
1207f8252M8234l1775L7058n4090k8379r263O2408K8232j18472J4046K4510O9524
1195b6219j3572N3456n9394m6883L6641O4270Q8520k4346Q599j0744L6661p490
1183I9499l0352M019r0322o451p1462r18L3228n044R432P6170J19881Q5883j70906
$$ plain form
1170 52657 -29639 -27717 32959 -18146 76858 57107 10863 -54484 -3696 21287 -45911 -30075
1158 -30075 -51555 -14912 -17905 120277 36089 -27276 30388 127547 33277 -12363 114440 111512
1146 111512 68880 71260 94554 -119 -70876 -33140 89111 64125 -40615 325 -83362
1135 -83362 -29146 -23659 -45417 -34030 3361 44267 49456 75225 69994 54517 133502 163722
1123 163722 56942 -2284 -26576 23174 67682 46325 18701 117612 101900 52133 38082
1112 38082 98622 140250 175943 115908 7831 108924 243019 187113 196619 184738 246995
1101 246995 242871 302041 209170 210900 297741 215561 179781 208624 215323 280420 229241 135089
1089 135089 225113 236267 150882 145694 133462 109565 112337 187893 249982 176171 304883 393875
$$ packed form
1170E2657q2296J922O0676n1105R5004j9751m6244o5347N0788K4983o7198J5836
1158c0075k1480L6643k993J38182q4188o3365N7664R7159r4270m5640J26803k928
1146A11512m2632K380K3294r4673p0757L7736J22251k4986j04740M0940q3687
1135h3362N4216N487k1758J1387L7391M0906N189K5769n231j5477P8985L0220
1123A63722j06780n9226k4292M9750M4508k1357k7624R8911j5712m9767j4051
1112C8082O0540M1628L5693o0035j08077J01093J34095n5906R506j1881O2257
1101B46995m124N9170r2871J730Q6841q2180l5780K8843O699O5097n1179r4152
1089A35089R0024J1154q5385n188j2232k3897K772P5556O2089p3811J28712Q8992
$$ plain form
1077 393875 323687 348959 402318 317962 294718 345219 308794 269323 286343 267775 272027 316389
1065 316389 422060 345129 305402 341055 240411 319293 407435 431064 335432 341689 463075
1054 463075 508392 390836 468100 566792 542624 498052 526027 576614 535510 571358 569658 587488
1042 587488 634230 649148 660003 680322 707736 747774 776260 813868 842962 890692 884309 987290
1030 987290 959888 987238 1012346 1099278 1036497 1030285 1005989 1028842 1107152 1166939 1160713 1222800
1018 1222800 1317332 1418629 1425851 1374946 1362034 1327804 1339369 1321872 1273831 1403390 1466849
1007 1466849 1483186 1558233 1643182 1692474 1793045 1815911 1820873 1840591 1925107 2057588 2115672
996 2115672 2259386 2400190 2403966 2549141 2729020 2873055 3007102 3167898 3276554 3385475
$$ packed form
1077C93875p0188K5272N3359q4356k3244N0501l6425l9471J7020j8568M252M4362
1065C16389J05671p6931l9727L5653j00644P8882Q8142K3629r5632O257J21386
1054D63075M5317j17556P7264R8692k4168m4572K7975N0587m1104L5848j700J7830
1042E87488M6742J4918J0855K0319K7414M0038K8486L7608K9094M7730o383J02981
1030I87290k7402K7350K5108Q6932o2781o212k4296K2853P8310N9787o226O2087
1018A222800R4532J01297P222n0905j2912l4230J1565j7497m8041J29559O3459
1007A466849J6337P5047Q4949M9292J00571K2866M962J9718Q4516J32481N8084
996B115672J43714J40804L776J45175J79879J44035J34047J60796J08656J08921
$$ plain form
986 3385475 3495202 3689868 3866297 4168184 4564729 4954512 5284270 5712773 6189006 6769530
976 6769530 7260254 7678321 8119429 8639947 9338672 10334882 11420527 12897515 14614525
967 14614525 17167573 19956161 22877129 25946531 29290742 32635740 36290180 34840494
959 34840494 25854921 19047288 14862488 12286348 10442568 9066123 7890147 7020956
951 7020956 6320640 5787242 5288682 4859697 4663487 4593760 4479883 4069399 3669766 3339619
941 3339619 3093265 2814454 2612498 2513973 2369279 2195735 2085568 1950352 1914993 1802825
931 1802825 1760379 1671755 1625695 1640252 1499473 1352849 1281387 1243204 1192381 1143800 1105644
920 1105644 998679 874208 908534 948396 846801 805103 742377 701070 714991 697623 613851
$$ packed form
986C385475J09727J94666J76429L01887L96545L89783L29758M28503M76233N80524
976F769530M90724M18067M41108N20518O98725R96210J085645J476988J717010
967A4614525K553048K788588K920968L069402L344211L344998L654440j449686
959C4840494q985573o807633m184800k576140j843780j376445j175976q69191
951G020956p00316n33398m98560m28985j96210o9727j13877m10484l99633l30147
941C339619k46354k78811k01956r8525j44694j73544j10167j35216l5359j12168
931A802825m2446q8624m6060J4557j40779j46624p1462l8183n0823m8581l8156
920A105644j06965j24471L4326L9862j01595m1698o2726m1307J3921j7368q3772
$$ plain form
909 613851 568722 663530 652213 563914 562323 619455 592134 548489 422639 340831 395181 523395
897 523395 499528 538664 588877 611937 547458 489873 413328 398140 385572 368983 501587 539786
885 539786 448533 406417 445638 369315 308336 305271 391107 378058 351995 296323 227586 221138
873 221138 340154 327973 340314 347328 373648 304145 219842 219561 301031 294315 251502 251284 231482
860 231482 206124 232909 143263 153057 213777 184752 114512 46597 82174 173592 117630 178133
848 178133 283885 298676 232598 173681 120045 113564 124703 153007 82663 79976 94494 105175
836 105175 136872 34268 65396 117213 120618 192009 143614 99712 68343 70440 15735 -49275
824 -49275 -29558 -22393 -96158 13735 5694 -21528 -72237 -10285 2050 -135405 -2195 72423
$$ packed form
909F13851m5129R4808j1317q8299j591N7132k7321m3645j25850q1808N4350J28214
897E23395k3867L9136N0213K3060o4479n7585p6545j5188j2568j6589J32604L8199
885E39786r1253m2116L9221p6323o0979l065Q5836j3049k6063n5672o8737o448
873B21138J19016j2181J2341P014K6320o9503q4303k81Q1470o716m2813k18j9802
860B31482k5358K6785q9646R794O0720k9025p0240o7915L5577R1418n5962O0503
848A78133J05752J4791o6078n8917n3636o481J1139K8304p0344k687J4518J0681
836A05175L1697j02604L1128N1817L405P1391m8395m3902l1369K097n4705o5010
824d9275J9717P165p3765J09893q041k7222n0709O1952J2335j37455J33210P4618
$$ plain form
812 72423 69113 32191 24894 25910 12565 68858 99069 158225 123343 8744 3793 37030 24566
799 24566 -8659 -63577 -6427 38947 54007 43561 -10986 6908 24706 47467 -65531 -14990
787 -14990 -49202 -14274 -19374 -39856 14802 89055 15207 -13808 -21629 -43402 -40556 -44240 -58240
774 -58240 -33337 36878 101448 66132 28378 2208 123345 111237 72815 21993 62072 14340
762 14340 -32706 35559 -12700 -85250 -95503 -47167 -92422 -52290 -40347 -42889 -116958 -79361
750 -79361 35961 -13391 -71861 -9010 14498 28567 42378 -16652 -52121 -1601 -95239 -23504
738 -23504 28750 -7797 -20204 -112351 -31392 21729 -23304 99417 94673 31892 146984 114556
726 114556 143996 46262 51236 48199 30449 -62248 -73952 -55887 7846 31276 392 -9948
$$ packed form
812G2423l310l6922p297J016j3345N6293L0211N9156l4882j14599m951L3237j2464
799B4566l3225n4918N7150M5374J5060j0446n4547J7894J7798K2761j12998N0541
787a4990l4212L4928n100k0482N4658P4253p3848k9015p821k1773K846l684j4000
774e8240K4903P0215O4570l5316l7754k6170J21137j2108l8422n0822M0079m7732
762A4340m7046O8265m8259p2550j0253M8336m5255M0132J1943k542p4069L7597
750g9361J15322m9352n8470O2851K3508J4069J3811n9030l5469N0520r3638P1735
738b3504N2254l6547j2407r2147Q0959N3121m5033J22721m744o2781J15092l2428
726A14556K9440r7734M974l037j7750r2697j1704J8065O3733K3430l0884j0340
$$ plain form
714 -9948 9242 69508 3994 -3491 -137650 -54474 -43992 -16440 1080 -122727 -153445 -147631
702 -147631 -106198 -57671 -137482 -149517 -91467 -82169 -60465 -51750 28248 77225 -335 -46001
690 -46001 -2360 8119 -58919 17259 26444 3243 -20106 -49063 80466 45797 30520 30604 46274
677 46274 70216 13407 186310 212355 189100 168548 234860 130869 46073 28216 66766 57247
665 57247 -4432 41587 8293 52608 50354 109817 102363 10312 76583 45356 -56836 20256
653 20256 -20500 -59651 -49686 -69722 -110772 13302 -35786 -3576 27958 62100 73697 -4799
641 -4799 -298 -3935 -8145 36648 4816 -33542 -64309 -16073 15128 -29558 -132071 -168973 -84219
628 -84219 -19176 -49242 -123291 -113743 -82191 -120702 -164186 -79557 -128780 -98422 -39124 -12684
$$ packed form
714i948J9190O0266o5514p485j34159Q3176J0482K7552J7520j23807l0718N814
702a47631M1433M8527p9811j2035N8050R298K1704Q715P9998M8977p7560m5666
690d6001M3641J0479o7038P6178R185k3201k3349k8957J29529l4669j5277Q4J5670
677D6274K3942n6809J72903K6045k3255k0552O6312j03991q4796j7857L8550r519
665E7247o1679M6019l3294M4315k254N9463p454r2051O6271l1227j02192P7092
653B0256m0756l9151R965k0036m1050J24074m9088L2210L1534L4142J1597p8496
641d799M501l637m210M4793l1832l8358l0767M8236L1201m4686j02513l6902Q4754
628h4219O5043l0066p4049R548L1552l8511m3484Q4629m9223L0358N9298K6440
$$ plain form
616 -12684 -41010 12665 83452 62961 6294 -18224 -33303 1509 -44190 -14042 -927 35135
604 35135 -57517 -81342 -27590 -16174 -4467 26500 -28766 26240 66149 -41978 -73737 -56480
592 -56480 19524 9861 33360 -1022 -29366 -28021 -111713 -169679 -144453 -73855 -24418 -51974
580 -51974 -79154 -80251 -65766 -6889 58189 25604 -13704 45436 80955 -33196 22655 50130
568 50130 22953 -43781 -55773 -59167 -29958 27907 338 -70589 -82880 -25627 -26782 -35993 5843
555 5843 32756 -46110 -110364 -12456 37918 33820 104248 126470 120023 -2115 -6312 84662 19059
542 19059 24525 127193 15047 -43322 22552 -5968 -127923 57611 186683 45901 -33959
531 -33959 13497 65268 132459 5662 -75622 -60553 -114864 -29592 -137360 -139900 22507 123144
$$ packed form
616a2684k8326N3675P0787k0491n6667k4518j5079L4812m5699L0148J3115L6062
604C5135r2652k3825N3752J1416J1707L0967n5266N5006L9909j08127l1759J7257
592e6480P6004r663K3499l4382k8344J345q3692n7966K5226P0598M9437k7556
580e1974k7180j097J4485N8877O5078l2585l9308N9140L5519j14151N5851K7475
568E0130k7177o6734j1992l394K9209N7865k7569p0927j2291N7253j155r211M1836
555E843K6913p8866o4254R7908N0374m098P0428K2222o447j22138m197R0974o5603
542A9059N466J02668j12146n8369O5874k8520j21955J85534J29072j40782p9860
531c3959M7456N1771O7191j26797q1284J5069n4311Q5272j07768k540J62407J00637
$$ plain form
519 123144 23168 -51795 -62951 2156 26458 82859 63494 -53089 20794 -4775 -55191 -55701
507 -55701 -61732 54210 56558 -1722 -27541 -708 1831 104334 95362 -21097 -37508 -52579
495 -52579 15969 -24384 23856 84325 55848 -6704 -22990 -68116 22619 30908 -102902 -85050
483 -85050 -87846 -7256 -99196 -77777 20692 119566 103476 63927 89646 110803 54268 39614
471 39614 -73105 -67040 57412 56261 87009 -32817 50152 70497 53583 166282 123408 6010
459 6010 -33710 -110264 -69740 -78181 -47666 -126 -79042 -48651 3426 34963 27422 80564 118253
446 118253 47490 -32274 18587 -24356 -43464 67690 95602 16706 9022 96841 91039 67581
434 67581 32407 19521 -90870 -55970 -15835 140 38097 102024 -4413 -23532 25994 -1113
$$ packed form
519A23144r9976p4963j1156O5107K4302N6401j9365j16583P3883k5569n0416n10
507e5701o031J15942K348n8280k5819K6833K539J02503q972j16459j6411j5071
495e2579O8548m0353M8240O0469k8477o2552j6286m5126R0735Q289j33810J7852
483h5050k796Q0590r1940K1419R8469R8874j6090l9549K5719K1157n6535j4654
471C9614j12719O065J24452j151L0748j19826Q2969K0345j6914J12699m2874j17398
459F010l9720p6554M0524q441L0515M7540p8916L0391N2077L1537p541N3142L7689
446A18253p0763p9764N0861m2943j9108J11154K7912p8896p684Q7819n802k3458
434F7581l5174j2886j10391L4900M0135J5975L7957O3927j06437j9119M9526k7107
$$ plain form
422 -1113 7957 39115 9376 18205 -3942 45091 124843 107198 58801 67884 36361 1784 49359
409 49359 4572 24361 49380 131571 103978 109223 154283 151908 106201 179102 79417 78528 50972
396 50972 -62514 -15371 35120 16307 138128 206345 125749 112102 102016 193324 176407 128161
384 128161 137083 171279 94974 53830 88905 132567 148537 90889 55221 88300 126306 102733
372 102733 148231 198733 102434 202991 182421 115613 18058 28018 80067 34139 52208 30533
360 30533 68752 39179 -22284 -12762 104306 89387 123186 148443 126386 99483 115353 81558
348 81558 -11924 26284 -8754 -43372 73066 124839 40951 19190 83458 127980 38393 40821
336 40821 138835 92481 85798 70732 158564 85311 32915 83548 70646 -6335 -114089 -68939
$$ packed form
422a113R070L1158k9739Q829k2147M9033P9752j7645m8397R083l1523l4577M7575
409D9359m4787J9789K5019Q2191k7593N245M5060k375m5707P2901r9685q89k7556
396E0972j13486M7143N0491j8813J21821O8217q0596j3647j0086R1308j6917m8246
384A28161Q922L4196p6305m1144L5075M3662J5970n7648l5668L3079L8006k3573
372A02733M5498N0502r6299J00557k0570o6808r7555R960N2049m5928J8069k1675
360C0533L8219k9573o1463R522J17068j4919L3799K5257k2057k6903J5870l3795
348H1558r3482L8208l5038l4618J16438N1773q3888k1761O4268M4522q9587K428
336D0821R8014m6354o683j5066Q7832p3253n2396N0633j2902p6981j07754M5150
$$ plain form
324 -68939 51343 153261 124529 126194 140865 217755 159292 130590 139817 168146 218271 163099
$$ packed form
324f8939J20282J01918k8732J665J4671P6890n8463k8702R227K8329N0125n5172
$$ [...]
##END NTUPLES=NMR SPECTRUM
##END=
