##TITLE=1H_EC-3028(III-2)
 CDCl3, 8 sc, 
 25.9.2020
##JCAMPDX= 6.0         $$ Bruker NMR JCAMP-DX V2.0
##DATA TYPE= NMR FID
##DATA CLASS= NTUPLES
##ORIGIN= UXNMR, Bruker Analytische Messtechnik GmbH
##OWNER= root
$$ XWIN-NMR		Version 3.5
$$ Fri Sep 25 10:11:17 2020 Russian Standard Time (UT+4h)  she@DPX200
##.OBSERVE FREQUENCY= 200.1315066352
##.OBSERVE NUCLEUS= ^1H
##.DELAY= (6, 6)
##.ACQUISITION MODE= SIMULTANEOUS
##.ACQUISITION SCHEME= undefined
##.AVERAGES= 8
##.DIGITISER RES= 18
##SPECTROMETER/DATA SYSTEM= spect
##.PULSE SEQUENCE= zg30
##.SOLVENT NAME= CDCl3
##.SHIFT REFERENCE= (INTERNAL, CDCl3, 0, 15.7039)
##AUDIT TRAIL= $$ (NUMBER, WHEN, WHO, WHERE, WHAT)
$$ ##TITLE= Audit trail, XWIN-NMR		Version 3.5
$$ ##JCAMPDX= 5.01
$$ ##ORIGIN= Bruker BioSpin GmbH
$$ ##OWNER= she
$$ F:/spectra/data/she/nmr/H-F/1/audita.txt
$$ ##AUDIT TRAIL=  $$ (NUMBER, WHEN, WHO, WHERE, WHAT)
(   1,<2020-09-25 10:09:43.20 +0400>,<she>,<DPX200>,
      <created by zg, POWCHK disabled, PULCHK disabled
       configuration hash MD5:
       00 E9 B6 7A A2 85 ED C7 34 08 36 98 17 FE 4E 26
       data hash MD5: 16K
       B9 CE 15 45 7D D2 9F E6 3C 4E 28 73 98 A0 1B 23>)
$$ ##END=
$$ 
$$ hash MD5
$$ F4 78 B5 8D 34 19 ED 65 4D EE 32 EE 60 67 39 46
##$RELAX= 
##$RELAX= 
##$RELAX= 
##$RELAX= 
##$RELAX= 
##$RELAX= 
$$ Bruker specific parameters
$$ --------------------------
##$DU= <F:/spectra>
##$EXPNO= 1
##$NAME= <H-F>
##$PROCNO= 1
##$TYPE= <nmr>
##$USER= <she>
##$AMP= (0..31)
100 100 100 100 100 100 100 100 100 100 100 100 100 100 100 100 100 100 
100 100 100 100 100 100 100 100 100 100 100 100 100 100 
##$AQSEQ= 0
##$AQ_mod= 1
##$AUNM= <au_zg>
##$AUTOPOS= <>
##$BF1= 200.13
##$BF2= 200.13
##$BF3= 200.13
##$BF4= 200.13
##$BF5= 200.13
##$BF6= 200.13
##$BF7= 200.13
##$BF8= 200.13
##$BYTORDA= 1
##$CFDGTYP= 0
##$CFRGTYP= 5
##$CHEMSTR= <none>
##$CNST= (0..31)
1 1 145 1 1 1 1 1 1 1 1 1 1 1 1 1 1 1 1 1 1 1 1 1 1 1 1 1 1 1 1 1 
##$CPDPRG= <>
##$CPDPRG1= <>
##$CPDPRG2= <>
##$CPDPRG3= <>
##$CPDPRG4= <mlev>
##$CPDPRG5= <mlev>
##$CPDPRG6= <mlev>
##$CPDPRG7= <mlev>
##$CPDPRG8= <mlev>
##$CPDPRGB= <>
##$CPDPRGT= <>
##$D= (0..31)
0 1.2 0 0 0 0 0 0 0 0.06 0 0.03 0 0 0 0 0.0002 0 0 0 0 0 0 0 0 0 0 0 0 
0 0 0 
##$DATE= 1601014182
##$DBL= (0..7)
120 120 120 120 120 120 120 120 
##$DBP= (0..7)
150 150 150 150 150 150 150 150 
##$DBP07= 0
##$DBPNAM0= <>
##$DBPNAM1= <>
##$DBPNAM2= <>
##$DBPNAM3= <>
##$DBPNAM4= <>
##$DBPNAM5= <>
##$DBPNAM6= <>
##$DBPNAM7= <>
##$DBPOAL= (0..7)
0.5 0.5 0.5 0.5 0.5 0.5 0.5 0.5 
##$DBPOFFS= (0..7)
0 0 0 0 0 0 0 0 
##$DE= 6
##$DECBNUC= <off>
##$DECIM= 32
##$DECNUC= <off>
##$DECSTAT= 4
##$DIGMOD= 1
##$DIGTYP= 9
##$DL= (0..7)
0 120 120 120 120 120 120 120 
##$DP= (0..7)
150 150 150 150 150 150 150 150 
##$DP07= 0
##$DPNAME0= <>
##$DPNAME1= <>
##$DPNAME2= <>
##$DPNAME3= <>
##$DPNAME4= <>
##$DPNAME5= <>
##$DPNAME6= <>
##$DPNAME7= <>
##$DPOAL= (0..7)
0.5 0.5 0.5 0.5 0.5 0.5 0.5 0.5 
##$DPOFFS= (0..7)
0 0 0 0 0 0 0 0 
##$DQDMODE= 0
##$DR= 18
##$DS= 0
$$ [...]
##$SUBNAM2= <"">
##$SUBNAM3= <"">
##$SUBNAM4= <"">
##$SUBNAM5= <"">
##$SUBNAM6= <"">
##$SUBNAM7= <"">
##$SUBNAM8= <"">
##$SUBNAM9= <"">
##$SW= 16.880792210976
##$SWIBOX= (0..15)
0 0 2 0 0 0 0 0 0 0 0 0 0 0 0 0 
##$SW_h= 3378.37837837838
##$TD= 16384
##$TD0= 1
##$TE= 0
##$TE2= 300
##$TE3= 300
##$TEG= 300
##$TL= (0..7)
0 120 120 120 120 120 120 120 
##$TP= (0..7)
150 150 150 150 150 150 150 150 
##$TP07= 0
##$TPNAME0= <>
##$TPNAME1= <>
##$TPNAME2= <>
##$TPNAME3= <>
##$TPNAME4= <>
##$TPNAME5= <>
##$TPNAME6= <>
##$TPNAME7= <>
##$TPOAL= (0..7)
0.5 0.5 0.5 0.5 0.5 0.5 0.5 0.5 
##$TPOFFS= (0..7)
0 0 0 0 0 0 0 0 
##$TUNHIN= 0
##$TUNHOUT= 0
##$TUNXOUT= 0
##$USERA1= <user>
##$USERA2= <user>
##$USERA3= <user>
##$USERA4= <user>
##$USERA5= <user>
##$V9= 5
##$VALIST= <valist>
##$VCLIST= <CCCCCCCCCCCCCCC>
##$VD= 0
##$VDLIST= <DDDDDDDDDDDDDDD>
##$VPLIST= <PPPPPPPPPPPPPPP>
##$VTLIST= <TTTTTTTTTTTTTTT>
##$WBST= 1024
##$WBSW= 4
##$XGAIN= (0..3)
0 0 0 0 
##$XL= 0
##$YL= 0
##$YMAX_a= 497012
##$YMIN_a= -394163
##$ZGOPTNS= <>
##$ZL1= 120
##$ZL2= 120
##$ZL3= 120
##$ZL4= 120
##$ABSF1= 10
##$ABSF2= 0
##$ABSG= 5
##$ABSL= 3
##$ALPHA= 0
##$AQORDER= 0
##$ASSFAC= 0
##$ASSFACI= 0
##$ASSFACX= 0
##$ASSWID= 0
##$AUNMP= <proc_1d>
##$AZFE= 0.1
##$AZFW= 0.1
##$BCFW= 1
##$BC_mod= 2
##$BYTORDP= 1
##$COROFFS= 0
##$CY= 11.3945322036743
##$DATMOD= 1
##$DC= 2
##$DFILT= <>
##$DTYPP= 0
##$F1P= 16.9975609425685
##$F2P= -3.02152046262296
##$FCOR= 0.5
##$FTSIZE= 0
##$FT_mod= 4
##$GAMMA= 1
##$GB= 0.15
##$INTBC= 1
##$INTSCL= 1
##$ISEN= 128
##$LB= 0.24
##$LEV0= 0
##$LPBIN= 0
##$MAXI= 10000
##$MC2= 0
##$MEAN= 0
##$ME_mod= 0
##$MI= 1.114404
##$NCOEF= 0
##$NC_proc= 0
##$NLEV= 6
##$NOISF1= 3.799351
##$NOISF2= 2.8
##$NSP= 1
##$NTH_PI= 0
##$NZP= 0
##$OFFSET= 15.70392
##$PC= 1
##$PHC0= -9969.491
##$PHC1= 11.8009
##$PH_mod= 1
##$PKNL= yes
##$PPARMOD= 0
##$PSCAL= 0
##$PSIGN= 0
##$REVERSE= no
##$SF= 200.130013532006
##$SI= 16384
##$SIGF1= 3
##$SIGF2= 2
##$SINO= 400
##$SIOLD= 16384
##$SREGLST= <1H.CDCl3>
##$SSB= 0
##$STSI= 0
##$STSR= 0
##$SW_p= 3612.71676300578
##$SYMM= 0
##$S_DEV= 0
##$TDeff= 0
##$TDoff= 0
##$TI= <>
##$TILT= no
##$TM1= 0
##$TM2= 0
##$TOPLEV= 0
##$USERP1= <user>
##$USERP2= <user>
##$USERP3= <user>
##$USERP4= <user>
##$USERP5= <user>
##$WDW= 1
##$XDIM= 8192
##$YMAX_p= 0
##$YMIN_p= 0
$$ End of Bruker specific parameters
$$ ---------------------------------
##NTUPLES= NMR FID
##VAR_NAME=  TIME,          FID/REAL,        FID/IMAG
##SYMBOL=    X,             R,               I
##VAR_TYPE=  INDEPENDENT,   DEPENDENT,       DEPENDENT
##VAR_FORM=  AFFN,          ASDF,            ASDF
##VAR_DIM=   8192,          8192,            8192
##UNITS=     SECONDS,       ARBITRARY UNITS, ARBITRARY UNITS
##FACTOR=    0.000296,      1,               1
##FIRST=     0,             0,               0
##LAST=      2.424536,      0,               0
##MIN=       0,             -394163,         0
##MAX=       2.424536,      497012,          0
$$ Real data points
##PAGE= N=1
##DATA TABLE= (X++(R..R)), XYDATA
$$ [...]
2023A062N89k061q88K440j582J11Q70J476k623j268K420R62l69k221J180J83N14
2040G95m70L93K09k151P81J684J106l487l37K284L34j405n29J868k263l34K018
2057D96J618l572j333L136J09j026j089K153j871j82J482O75j129j657J376P28
2073h6J176j876l32R32K69p3K46J550k717o84K378K003k944j939L346n77r79N37
2091B30J887k839q83K762O27j797j529K019n75P10j85q8l98r29J412K29J025l023
2109a345J87J964R96j782r56K241j952J35J017K033l331j356K715J346j967j348
2125a403K471j422l53R42J042j709j773K330P29j42j942N61L69l25M91m6M68k069
2143a781P60Q17J503k261j097K247K18l26j241K169j476r60J545K063j993k613
$$ y = [1062, 1651, -410, -1298, 1142, -440, -329, 541, 2017, -606, -1874, 546, 1508, 1139, -1082, 98, 281, 795, 325, 718, 927, -1224, -443, 1241, 2347, -1140, -1477, 807, 1141, -264, -793, 1075, -1188, -1522, 496, 2114, -1458, -2791, 345, 454, -572, -1661, 492, -1379, -1561, -79, 596, -533, -2190, -814, -86, 1090, -786, -1118, -186, 83, 10, 256, 1806, -911, -1595, 783, 2786, -158, -2097, 1249, 672, -307, 230, 2117, -722, -1605, 1157, 1784, -13, -1542, 477, -98, 612, 427, 339, -59, -988, 424, 653, 1678, -1345, -1158, 806, 1802, 20, -936, 1305, -647, -512, 505, 2538, -793, -2149, 566, 1912, -55, -1403, 1068, -354, -707, 235, 1277, -432, -2205, 125, 854, 712, -1230, -669, -300, -625, -134, -180, 288, -1781, -1021, -204, 1299, -962, -2059, 188, 406, 80, -1161, 1008, -468, -1428, 117, 2180, 187, -2426]
2159b426L017N46o74j173J865r35j407J846J058q06k542J684O17L91o32n11N07
2176D25k07M15o66J690j834j020J438J904j542k308K468j1r66k15K040j540k318
2193b247K880J158j231k657K390j02k92K58R6m34j147J386j1R80j981n15J428
2210d1P20m35j587J659q47l53N49K102j828k516K507J018q99j621J881m01j021
2227a113J130J046m51k708K228Q09Nj701L38J103r44P74n0M59k112M65J522N76
2245A376j026j655K081k17K08q23J186p52j399J386J302n10k716J680R83n23p59
2262a78N95L74k204J257J298k01k625P62J501m13l05n20P32q26R59l28Q58r38
2280b02j193J016J074o1k674J494N55m51m09J290l15k516J755J949q06k368J400
$$ y = [-2426, 591, 1137, 463, -710, 1155, 220, -1187, 659, 1717, 911, -1631, 53, 670, 1061, 429, -82, 425, 218, 633, -33, 1657, -177, -1197, 241, 2145, 603, -1705, 763, 752, -214, -429, 1611, 71, -2247, 633, 1791, 560, -2097, 293, 191, -101, 157, 253, -181, -1328, 58, 47, 1027, -954, -1469, -41, 679, 244, -1343, 316, -531, -884, -335, 1767, -61, -2577, -70, 948, 49, -1572, 309, -92, -1113, 17, 1063, 612, -2096, 132, 941, 946, -755, -417, 686, -258, 516, 466, 925, -1187, -722, 800, 1376, 350, -1305, 776, 559, 767, -56, 1130, 378, -1021, 365, 1667, 1157, -1559, 121, 1104, 581, -178, 417, 791, -1413, -156, 1142, 941, -1684, -922, 579, 166, -139, -659, 73, -753, 206, -122, 736, -202, -1395, -379, 695, 634, -2040, -546, 9, -442, -851, 439, 124, -2392, -637, 1312, 506, -1862, -462]
2297d62R97j094P14K86L25k090J253J004k5j094j125J291K94N93j621J418l70
2314B94q10N11J237l08k533J678J432m63j641J442K3j515J185R19l01k742J252
2331c40J457k42q40o12J262j030Q75QN41j649k07J565L03m55j776J109J05J3m59
2350c72Q54m78j819J530O96J85k463R85J538r12m05L26R29j879M66J560j14k036
2368a409O1J925l40k98m48N81j226N81J021Q7m89j458J074R05N79j503j63J407
2386H87o03k41O91O42k473M54K015R2k155J31J525j210L28L32O22j920O59J112
2404H88n7m99j064Q98j40P80p17k54K79o89M82J085J53k577N46J516J29j290J75
2423c56J030j863Q25J165N5j914j87J807k78n87o88J436p76k8O66K58r30j219
$$ y = [-462, 535, -559, 155, 441, 766, -1324, -71, 933, 908, -186, -1311, -20, 274, 867, -754, 664, 294, -516, -5, 1232, 924, -1609, 69, 1501, 1038, -603, 839, 862, -653, 532, 1451, 1150, -1592, -340, 1117, 875, 35, -577, 685, -345, 530, 538, 1079, -570, -777, 788, 1091, 636, -1140, -31, 74, 87, -372, 482, 4, -1815, -285, 411, 596, -1867, -882, 656, -256, -661, -335, 594, -1285, -819, 741, 627, -1409, -1348, 577, 237, -61, -509, 72, -1154, -573, 448, 535, 46, -1412, -338, 567, 1146, -357, -520, 887, 284, 43, 734, 1376, -1097, -643, 1372, 1464, -691, -560, 965, -245, 83, 415, 1037, -883, -224, 888, 831, 332, -732, 166, 26, 806, 89, -165, 114, -575, -93, 992, 1145, -1432, -886, 630, 759, -531, -356, 674, -1189, -364, 801, 856, -1058, -1245, 562, 284, -303, -991, 445, -331, -359, 307, 565, -365, -1584]
2441a584J706M18pj766P36R08l15r2k1M24j677J005J125L56j864q1J320j50j25
2460C16l75J058j639L25J453J28q55j520J744J9j40m25N68n29q52J471KLj392
2479f40P47O78J57r70m80J030p10M00q7J007j987m09K031L32j228j177J922q17
2497b01l00O62N98j457n35J961k18m71j172R25%K52J48m42J38r57R69L45O64j866
2517i57j81J381j66k65k82J130j270n4J206O69j713p23J834kk98p85N91l63j47
2536c95Q84J35l46j291J083P72K97j241k21Q58k72o9L08L24j390J24J538j2j289
2555b03n55J331j04m81J62K56n73p60J700J09o94j301J151K33j48m3k37J52j158
2574a163J177N48n35j311M94J034r0m17m75Q54m88L82R6M12j131j012J419J046
$$ y = [-1584, 122, 540, 533, -1233, -497, 411, 96, 4, -17, 407, -1270, -265, 860, 1216, -648, -729, 591, 441, 316, -59, 999, -640, -315, 1138, 1266, 411, -1109, 635, 654, 514, 89, 657, 128, -724, 747, 749, 752, -640, 107, 785, 942, -28, -508, 522, -188, 212, 125, 1132, -855, -1264, 767, 1099, -129, -1306, 616, -201, -501, 161, 759, -698, -1233, 728, 510, 39, -1133, -208, -208, 44, 192, -250, -112, -1069, -100, 245, 909, -957, -1138, 243, 77, -188, -470, 660, -610, -664, 542, 1211, -502, -1225, 609, 607, 309, -476, 115, -248, -395, 489, 624, 278, -1013, 70, 842, 1139, -102, -323, 535, 263, 194, 502, 826, -564, -440, 1098, 1086, -203, -758, 573, 469, -12, 150, 406, -167, -927, 773, 882, 188, -1113, 38, 271, 123, 80, -157, -5, -1163, 14, 562, 27, -1284, -790, 244, 154, -263, -738, 116, -372, 10, 106, 518, -613, -1625, -206, 840]
2592H40n59j368J314j51o87N26O59o28j416J577N60n52j078P79N68p57Q47l33
2610A41lp24O26N08M85q91r13J304J44j08p41Q54p35o35J100Q14p24j521J765
2629G46K69n29n18J59K6n92J033P8j87j481R49L37P0n01p26Q62l77K90N2M70q60
2650d30p61J463K15l51j494J218Q4q9k82M61p2j059J187L32l61j199O37N69k54
2669a86j4K04K36r97O80P15j02j164PJ193k74L5o44P77o86L02K81K46o57q66J379
2690D65N5J94j271N90O03o59j1O06o3j309P55J323p60q33jP18n31N27k21K6r20
2711g17N36N31P0l91r22P94L08P3p08M23J22r42Q09P79m55j727J025R44m35m89
2731c72j7O02r34P62M69k92j074N8J259j59m26m18P25l75J74L98K3n46r04J264
$$ y = [840, 281, -1087, 227, 76, -611, -85, 574, -54, -1470, 107, 667, 115, -963, -184, 384, -373, 474, 141, 138, -586, 40, 548, 1033, 142, -771, 533, 677, 569, -172, 682, -53, -688, 412, 1226, 502, -1019, 746, 1015, 486, -32, 127, 153, -439, 594, 672, 485, -996, -47, 290, 360, -141, -867, -5, -382, -92, -40, 430, -430, -1191, 272, 487, 136, -1358, -140, -56, -145, -427, 34, -38, -1097, 90, 422, 61, -1138, -501, 68, -186, -200, 4, 240, -757, -77, 638, 536, -628, -621, 572, 298, 333, -311, 466, -220, 82, 363, 609, -48, -914, 465, 520, 714, -557, 33, 636, -23, -34, 572, 509, -800, -45, 1278, 518, -315, -316, 402, -129, 398, 177, 203, -717, -181, 350, 420, 29, -893, -99, 209, 282, -426, -3, 119, -823, -14, 765, 310, -1417, -392, 552, 117, -372, -389, 213, -721, 41, 510, 218, -856, -798, 461, 302, -124, -542, 183, -192, -18, 380, 403, -143, -1047, 217]
2751B17L58l33p07K65L28k75M97kj70r32Q75O99m10p45L06P53o26K16l91M75p64
2772c66L03Q62j10q70n66J184j42J86n83L05l51k62R41J52l4j519Q40N61l01m21
2792a91l28N95n24M24j70M74j084L33J069j82j040r4Q61k30J15J34k87n02k37
2811h64J307k30k79o09N64Q9K9k21K08K53q52P44L74l11p62M1J182m83q3o0L29
2832C66j012N32Q84n41o22l56J179j53P3o30O57m90K05L70j21j92q01J073N21
2851I42l58j119L52O24l94K93j80L70j294M54J058k92o70n80J329o86J42j01J17
2870Gm47m02J285k76m59o18Q71J52m90P6k96L71p94J060J36o6q99N44O13n3m46
2891a31l40O11l57Q3M12j55n75l21J333j94k81o15Q18k97MK92J8j09q60J002L45
$$ y = [217, 575, 242, -465, -200, 128, -147, 350, 348, 178, -754, 121, 820, 410, -335, -29, 724, 98, 314, -77, 398, -366, -63, 799, 689, -181, -747, 437, 295, 481, -102, 203, -148, -410, 531, 683, 649, -870, -30, 531, 230, -191, -519, 76, -448, -24, -194, 280, -804, -471, 598, 416, -624, -718, 143, -87, 28, 162, -125, -627, -864, 443, 213, -66, -675, -111, -22, 7, -214, -6, 247, -605, 139, 513, 202, -560, -519, 663, 180, 97, 37, 366, -646, -114, 770, 229, -393, -749, 430, 277, 350, -280, 377, -113, 92, 462, 341, 149, -652, 421, 942, 584, -535, -183, 441, 47, 340, 160, 530, -764, -310, 748, 456, -214, -794, 535, -151, -9, -110, 7, -440, -842, 443, 167, -292, -910, -39, 113, -377, -301, -597, -226, -1020, 40, 176, 110, -789, -245, 368, 315, -131, -471, 140, -217, -134, 278, 123, -452, -773, 560, 366, 85, -530, 288, -9, -5, 287, 305, 196, -664, 338, 683]
2912F83m84k49k72O81l73J55m49O56m35K02K31O9m14p92J150R0l82n36R07o63
2932b25j83J242l83p06n94J134K28l83k76J4L68n13O73r9k69p82M79Q06k44n72
2952b85l37Q52n27r2L61K88q65l8J038l0n30l97R09k48j99j0J40k42m78J115O2
2973D87m78o72N50N25n96L76n4N4n37O70J42n5q29J76P96l42pj80M54p10K43N21
2995E34n5m20o48J065J34l25k64rM27l44L23j44k13o48Q49N79p41l41j45O33l01
3016e4K95m03L05n61J82O65j49l57m85M58R0k9MK07l98m73Q53J47o60l29O10N08
3038D26p56N8J9J09n21P91k54K38m25J18N52M0l18m55N61j24j96L09K95n43m62
3059e38Q09L31j39r16Q10k4J56k44j51rl05O10M59m18q52K14N15l04K92k28K92
$$ y = [683, 199, -50, -322, 359, -14, 141, -308, 348, -87, 115, 346, 415, 1, -791, 359, 449, 67, -469, 438, -225, -408, 834, 451, -255, -849, 285, 513, 130, -146, -132, 236, -277, 396, 297, 28, -754, -275, 531, 287, -285, -622, 230, -297, -389, -28, 260, -605, -643, 395, 365, -165, -562, 347, 99, -100, -110, 30, -212, -690, 425, 487, 9, -663, -113, 412, -184, 192, 138, 192, -345, 325, 467, 412, -417, -241, 555, 213, 206, 26, 480, -230, 13, 534, 479, 59, -589, 476, 610, 285, 21, 12, 439, 95, 418, 274, 61, -587, 262, 841, 100, -241, -386, 247, -54, 241, -162, 143, -418, -236, 429, 280, -77, -562, -104, -14, -43, -39, 168, -230, -703, 150, 297, -363, -692, -82, 426, -330, -272, -253, -144, -665, 126, -128, 110, -315, -197, 355, 395, 77, -378, 183, 59, -137, 172, 467, -76, -538, 271, 602, 463, -453, 357, 333, 489, 245, 94, 85, -220, 390, 849, 431, -421, -207, 308, 4, 296, 68, 360]
3080C60p77K24L43l9m24n34J310l77j63k24j35J12l50J120l13l82n00P42O52p72
3100a27J44p00Q25o00M92k4R4j178Q69P67o35k69k65P54j53p7K65l14k43k9P34
3121C30J99m11q50Q88K4k79K23k21K79p92O24M87r9p99J66R36l47N3m82K79l77
3142a69M68L62m72n05k08J048k22o6m07N50l15k02M18Pk94p26R95J85o57p4K01
3163h3L99n36M57r0o0n91K01O82l54l60j11O17k52N0j32J31l34L49L69J37o54
3184a65m94Q68nk03l54L83J55m24P98l73k24m47K94N31j95k31l58N15j51L91r
3205C02k08k56k63Q54j21j48l85N19j37p7J39J34l77J7M99M4l37n95O46k3J0J70
3227D07l27K71n90L40N49p74k16j80R51l21l61j48N31n09j50O40k67J22n11O98
$$ y = [360, -417, -193, 150, 111, -313, -847, 463, 86, -77, -301, -436, -324, -674, 446, 133, -249, -749, -7, 645, -127, 17, -683, 142, -458, 34, 10, 104, -1074, -205, 562, -73, -342, -607, 147, -6, -83, 182, -132, -375, -404, 330, 529, 118, -732, 156, 180, -99, 124, -97, 182, -610, 14, 501, 402, -397, -231, 705, 358, 411, -71, 208, -169, 299, 661, 189, -316, -524, 524, 302, 236, -171, 379, 64, -138, 280, 287, -7, -733, 262, 447, -210, -284, -83, 316, -220, 237, 147, 87, -504, -303, 379, 25, -335, -446, 171, -81, -31, -163, -32, -366, -17, 352, 489, -165, -659, 209, 204, 1, -353, 30, 185, -239, 559, 186, -38, -485, -191, 340, 145, -86, -444, 71, -80, 311, 302, 94, -162, -425, 429, 308, 160, -225, 294, 157, 80, 219, 353, -24, -7, 492, 536, 199, -396, 250, 227, 237, 407, 80, 351, -239, 101, 650, -124, -340, -520, 431, 110, -251, -399, 132, -377, -527, 113, -154, -32, -543, 155]
3247A55j63P8l93K91o3l59N08k33J69o74Q95J19k04k22j64N12k62K01j37K62o72
3268c56L41N30n23O2n54N88L1J77km91M54m34N77j87O4o89O62N4N1k57k8P6m52
3291c06N98J86k64l62J33O00m21l33J34K49m05L11J31k12nm51M24K38k64l75L31
3312f3q3o1L69l28k8o73J044Rn01j26M4N97k64j13j22L72l40p5P39j63l16m12
3334d94P09K9k49k00J34R3n15R10k61j40n38Q21L3p4l10k01O04p28P46l22J61
3355B08l88j45P87j27m12q9M43m09Q9N46m41j26m98Q18k29M0m92L47K81p1J89
3376C21l34R2m56O38P7l26m97L11M99m08k31J88R6m35N33J51j78l86l29J011l16
3397B1j54k35J88J2lO25o05O1n88R27J58m47m64J63M85j99M29j66j59l14K98N25
$$ y = [155, -8, 70, -323, -32, -95, -454, 54, -179, -10, -684, 211, 330, 126, -96, -260, 252, -10, 191, 54, 316, -356, -15, 515, -8, 54, -500, 88, 119, 296, 294, -197, 257, -177, 400, 213, 277, -412, 250, 304, 355, 98, 70, 146, -306, 292, 478, 214, -148, -15, 585, 164, -169, -35, 214, -191, 120, 251, 39, 34, -417, 7, 245, -19, -394, -63, -146, -207, 162, -166, -194, -867, 177, 186, -315, -441, -397, 200, -64, -177, -299, 73, -267, -342, 397, 234, -82, -494, 215, 244, -5, -205, -71, 22, -493, 417, 156, 16, -522, 299, 332, 258, -52, -253, 351, -377, 369, 47, 208, -180, -325, 462, 335, -77, -166, 277, -132, -43, 503, 62, -64, -562, 256, 27, 67, -425, -78, 203, 132, 321, -13, 79, -377, 261, 338, 12, -485, -174, 325, -83, -314, -126, -30, -465, 68, 219, 41, -345, -674, 337, 21, -133, -368, -180, -168, -171, 454, -151, -90, -678, 249, 407, -40, -504, -341, 144, -55, 374, 208, 49, -265, 33, 558]
3419E58m28j63l7K70k12P2J28j53j01r3O84k56j24l84M19K27n47L90j55r5m98
3440d98Q27K02n88j55O8N83l75K5k63K98j58J33L96j41m92l17R22l40P0l82J94
3461IJ66l23N21m13j1p25Q63pl92P4q4N32l04K26m17k9j76O12J89j84l61k84P75
3484B57k44J20l9k43J12K4M19j72l95m44P23J78k63J14l59J11j06M18j31K27m77
3505a70O4N83k37rl08O03k99O1N0k13j69m8P00m38o4m80M38K2j26L98l98k78J27
3528a91O09l60j24k56K62M53l75j78j07K00k07K17N52o13j58m0K45n2O6j55K68
3549E6l23MO33k87j41l72O78j27k45K63j65K46l82K96j89M3j85M11L57o39k38
3570c06K4L89k70M97K90l94l53L9O10l98J53q25P39l07J59m8o7M6j20L66K8l57
$$ y = [558, 130, -33, -70, 200, -12, 60, 188, 35, -66, -159, 525, 269, 145, -239, 180, 407, -140, 250, 95, 0, -498, 329, 531, -57, -212, -144, 439, 64, 89, -174, 124, -34, 99, 495, 354, -138, -455, 467, 127, 197, -185, 9, 175, -148, 373, -40, -51, -776, 87, 80, -312, -238, -322, 210, -94, 132, -285, -314, -490, 122, 311, 127, -234, -518, 257, 13, 133, 94, -149, -37, -13, 406, 234, -161, -605, 118, 296, 33, 147, -212, -101, -207, 211, 80, 307, -170, -106, 477, 240, 231, -77, 526, 227, 288, 338, 125, -44, -92, 608, 170, 106, -374, 64, 86, -40, 358, -40, -318, -191, 418, 58, -66, -322, -60, 393, 18, -160, -267, -67, -274, -57, 495, -118, -276, -316, -71, -123, -57, -212, 56, -267, -263, 370, 83, -58, -430, 248, 121, -124, 139, -26, 220, -162, 134, -55, -12, -197, 214, 571, -68, -306, -282, 107, -163, 334, 624, 230, -123, -84, 526, 128, 281, -544, 195, -112, 47, -1, -68, -22, -142, 224, 252, -105]
3592a05j90L88K96l54M57l79Lq7Q8J39k46l69K16N03k03j64o15M68p0j3M83k07
3614C9k36k31Q43j39k94l10L79K0l27K61R0k40k75L15K83m12N8k16N90k60RmK30
3637A73l46K84L41n23O1k95R18m44j00l05J64J60k02N00l40L8k67M15p1k2k7l61
3659b49L32j98K11m4J95n59K7O17j35j64l14L89j27K84rj57k23q2M64J2m03q7
3681b20MJ44QJ8j27J16j85L68L1k95l63K09N16m06%J34p3m60N86Q1o0l60k36P37
3705A67k05p2M0k8J9r5M24l55K07m38M95J25k76rj90L95k56K95p8j61j46J60K61
3728B79j55j04k6K74J05Ol58J94k29k3M72k42m9m18M6M52m60L23k92K38k48K88
3750G3K60m12m32K64L69j52k3l13R7K26O2K98m74j63n4N31j64N5l90M35j80m41
$$ y = [-105, -295, 93, 389, 35, 492, 113, 116, 29, 117, 256, 10, -359, -143, 360, 157, -7, -622, -154, -224, -237, 246, 39, -197, -428, 415, 276, -18, -328, 51, 71, -256, 5, 95, -145, -420, -105, 178, -234, -176, -392, 198, -62, -53, -57, 173, -173, 111, 452, -71, -10, -305, 613, 169, 69, -236, -72, 88, -114, 386, 46, 84, -183, 232, 161, 139, 112, -249, 83, -115, 96, 52, 247, -312, -285, 332, 197, 33, -281, 108, -19, 265, 256, 99, -124, -206, 258, 270, -133, -220, -216, -72, -64, -46, -173, -57, -242, 126, 157, -138, -501, -292, 224, -182, -182, -48, -121, -581, 5, 86, 26, -334, -570, 167, -38, -110, -70, -98, -79, -174, 250, -105, 102, -336, 159, 284, 8, -1, -191, 204, -52, 243, 165, 4, -142, 18, 279, 124, 20, -6, 268, 373, 379, 21, 215, -14, -37, 435, 193, 144, -274, -228, 224, -236, 87, -205, 33, -215, 73, 333, -79, -511, -247, 122, -30, -53, -366, -269, -43, 19, 317, -157, -320, -374, 157, -7, 48, -342, 93, -87, -528]
3772e28N34o7k87MM49P6l05J03M8R3r3J95l63O0j40J12N81m17j03k07M25j65J42
3795A47o1J21k81k2L07k65k85P4M56J13j53j53j44J49o4J20M02n59k86N08L06
3816D30m08j04j70N44n27L77j22L5j38l11O28l45k19j28M86r0K08o4j05r6j14
3837b33J44L76j92m74J95K76Kk03k4q1j9L11J56l61j86k8P76n68j5j58L75k79
3859b10K60M14l64l83j05N06J05j06k18J8K44l73L09m8o9L4l5K80k45l13J61M05
3881B67k61Q9N8N3k06p1O13n52j13Q0J61J03l00M28j98m9m41M44L36l85n48O44
3903A52j95R0j23N7P6m22M00j60k56K15j0L96l78k60J63L07o6j04L36k78J17l18
3925b61N29j60l12jJ64J0p1K23q8j52J54RL47m61o2j04O75l98j31L29j96l4L5
$$ y = [-528, 6, -61, -348, -344, 105, 181, -124, -21, 27, 120, 27, 222, -141, -81, -221, -109, 472, 55, -48, -255, 170, 5, 147, 86, 207, -74, -96, 211, -54, -339, -265, 191, 304, 151, -2, -146, 3, -61, 59, 461, -98, -384, 124, 430, 22, -82, -252, 292, -235, 142, 20, 55, -83, -394, 234, -111, -330, -458, 28, -62, 146, 82, -23, -119, -233, -89, 287, 95, -379, -184, 92, 94, -109, -133, -214, -233, 78, 234, -127, -313, -341, 435, -133, -148, -306, 69, -210, 50, 464, 100, -283, -388, 118, 223, 117, -101, -83, 161, -212, 97, 49, -20, 14, -21, 259, 14, -299, -138, 267, 6, 95, 153, 206, 0, -71, 542, -10, -123, -43, 118, 221, -79, 349, 151, 102, -339, 105, 441, 56, -492, 152, -43, 47, -76, -19, 57, -365, 35, -125, -381, -166, -176, 220, -158, -418, -255, 52, -14, -118, 218, -60, 57, -261, 268, 108, -204, -205, -41, -31, -102, 121, 33, -119, 35, 44, 391, -70, -132, -236, 439, 41, -90, 239, 43, 9, 44]
3948D4N53p85j48pM27l3j53K07j73k1RM66m50m6j52L14L15l87m5j10K71j61J85
3971A20J55j26m25K96L11m43L3o0J51m5j50K04Nk97NM51k79J09j9j10J25j44M7
3994h6l71M81j19O4K79l25j4R1K68k39J44k36J59j60j89O91n26m1q8M61L7j89
4016I2n0m1J09l15M77l31J46m81L98M26o49J88j30J39J60o3J69N5l13K68J00l51
4038Cp1O0J06l9J8R5j35J83m31M83J75p11j03K51M62o41K62k1j03kM55N7k47l86
4062b80K85J83l05r8q1K88j45q4L46l89J12P7K18k61q9Q1j46M73l63L25k89N5
4084h7Q8J13Q7l9k54p9K05K2L78k11j73l03M02K72l63j48J10J35j02K2J60k77
4106d2N6j03L88j10m83K01L70J15l27k10J37J27k65K70p0o1O5j59L30q0l2j94
$$ y = [44, 597, -188, -336, -343, 84, 51, -102, 105, -68, -89, -80, 386, -64, -110, -262, 52, 367, -20, -65, -175, 96, -65, 120, 275, 149, -276, 20, 331, -112, -79, -139, 12, -33, -183, 21, 26, -271, -266, 185, -94, 15, -4, -114, 11, -133, -86, -457, 24, -95, -31, 248, -77, -91, 0, 268, 29, 173, -63, 96, -64, -253, 438, -88, -129, -217, 244, 281, 92, 42, 1, 110, -205, 272, -59, 87, -394, 4, 430, -219, -31, -161, -22, 138, 75, 244, 299, -14, 254, 354, 3, -68, -8, 98, 59, 77, 172, 37, 220, -211, 272, 447, -264, -367, -116, 346, -295, -33, -54, -157, -159, 296, 353, 106, -280, 5, 188, -117, -215, -296, -8, -153, -237, 109, -280, -168, -91, 127, -134, -223, -142, -288, 185, -178, 147, -142, -87, 1, 114, 201, 162, -92, -171, 34, 56, 434, 223, 50, -253, 149, 421, 58, -90, 20, 155, 53, 75, 235, -42, 14, -89, 299, 189, -294, -93, 277, 392, 65, -145, -8, 119, -146, 124, 54, -7, 58, -101, 229, 149, 117, -77]
4128g7K20k46J23k5l4kr2L32j1k58j16M9K41l70L94q8j20j38K52P8k08k92L65
4151b3K25n46O29m04L12j77M4J63k75j06j49N84j41r6Q2k25J16J15P5j55O8m61
4173c45L10P8k58K79p2K25l04J60J28K2l97M21J36k85q5O9J70l64M6J72k98J53
4195c9J14J60l10j3l2L06k0k48J47J9j48q0J73k6m0r3R9L28l10j41mJ32L0J7Q6
4220A07Q6j48m1L60k65j69q4N6K18j9RJ8l09J22J78k28J23M9j93L74m07M01J37
4243C75m61l9L01L40m88k0j28L67j16n7R0J19k97J32N9j25lj21K54L8k94J26j52
4266a00J2o0L94j19p5j2n9L07l92nq5L90m48K63O2k32J47j43L74o05j5L90J72
4289A61j90k46L18m02K28n8o3L81j45N1k79M82k48J24Q7k37j90L01K33l66k7K0
$$ y = [-77, 143, -103, 20, -5, -39, -41, -133, 199, 188, -70, -186, -137, 104, -266, 128, 40, -80, -218, 34, 112, -96, -388, -23, 202, -344, 285, -119, 193, 16, 60, 223, -52, -158, -307, 277, 136, 40, 122, -103, 13, 128, 203, 48, 116, -345, -35, 43, -215, 64, -8, 217, -87, 73, 201, 223, -174, 247, 383, 98, 13, 82, 252, -112, -66, 106, -192, -39, 75, 235, -75, -88, -120, 186, 166, -82, 65, 84, -64, -144, 29, 3, -37, -130, -31, 297, -13, -154, -158, -26, 4, 21, 107, 193, 45, 4, 364, 99, -70, -154, -98, 120, 101, 110, 128, -181, -59, 119, -109, 14, 63, -130, 244, -163, 238, 375, -86, -125, 176, 516, 28, 8, -120, 247, 131, 74, 164, 283, -14, 118, 177, 52, 49, -72, 182, 220, -74, 52, -100, -88, -148, 246, 127, 52, 40, -19, 288, -104, -109, -194, 196, -252, 11, 73, -159, -12, -155, 219, -386, -401, -11, 161, -29, -275, 43, -359, -131, -189, -252, 129, -16, 35, -244, 238, -10, 114, 201, -36, -226, 75, 308, -58, -85, -65]
4311f5K65k15J42m3p6p2k48L98o9j66L51K24n30r5J07L14M5l10P4J98k8j90rJ40
4335A42k41o0O1R6r9J41O2L9k32R1J42k49p1J02K19O8m47L67j74Lk66P01l84m09
4359c98R9O73k1n91K78m51O80l27NJ41j04k74L19K30k47J96l38m9p8J04K88j31
4381Dk97j36P42k17k10J08N3K95m90L12k4l54K70J31J05l72P8J30JPm09M43l6
4404A34k37K16K71l71k46J07M26m43n6J10J30j24PK73J14k74k91L35J01k05j98
4425b21K17J79l14L04j95q9m7K44K05l69R5P0k12L2J64J0l11J52N7J01j89O7m8
4448i8RJ05j30K73m41L16l54M84L26n88J8r4L07k72J92J0q3K8L14j16j78k12O6
4471a18M20k01J08k59J20J1l8J49j01l27J38N63j50n77K69N3J40k03J07j82m8
$$ y = [-65, 200, -15, 127, 84, 8, -64, -312, 86, 17, -149, 202, 426, -104, -199, -92, 222, 267, -43, 31, 229, 201, 11, 2, 142, -99, -159, -98, -2, -101, 40, 102, 141, -91, 0, 142, -107, -178, -76, 143, 211, -236, 131, -43, -40, -306, 395, 11, -398, -299, 374, 353, -238, 40, -411, 269, -58, -53, 88, -16, -290, 29, 259, 12, 208, -130, -179, -257, -153, 135, 4, -293, -429, 313, 96, -114, -6, 47, 342, -148, 164, 140, -214, 56, 187, 292, -80, -2, 128, 129, 136, -273, 170, 134, -103, 113, 384, 13, -233, -126, 300, -143, -199, -89, 41, -83, -76, 197, 311, 37, -254, 81, 182, -23, -221, -4, 175, -139, 165, -30, -119, -166, 78, 283, -86, 9, 79, -133, -101, 63, 73, -238, -86, -29, 72, -117, -50, -98, -89, 16, -114, 159, -282, 34, -320, 164, 490, -98, -80, -174, 133, -139, 53, 63, -20, 8, 322, 206, 28, -184, -118, 302, 101, 209, -50, 70, 81, 43, 192, 91, -236, -98, 465, 315, -262, 7, 60, 200, -3, 104, -78, -126]
4492a26j25K90J89k03rq1o9J82o3J87l20M5J11K81m02r2n5K37K23k62O3j71P6
4515i4K7J32O2j91k34K21M29k73N6R0j87l15L11O7l82j1L76J51k25n3o8L34k02
4538B1o6l3R3j45p2N41J63m76l8N9J17j94K00m7j71r4K95P3k72J37j14J49M6k21
4562d9K20m4j9m90M14k32M9M8P2M0k03J51K14L2k00N6n0l37J41J53K49j74k60
4585b19N05m56j04K56J29j60p6j14L89l35j03Q4p6N4K40j64K5l4J15L67k04k17
4607i8N2j91N33l31j08K43j45j8j07P20m89j99K21K52k42n0K64k18K7r4J88k58
4629d8J48n1K00k14O8r1k7p6J95O6k40Q2j89L55l9k08O9j61M24k42k01K45n5n6
4653d6j47K42J01j28P1J05l77K89j37k32K53p4j70L15l53L03j1L28k37l2l36M17
$$ y = [-126, -251, 39, 228, 25, 16, -65, -134, 48, -15, 172, -148, -103, 8, 289, -113, -205, -260, -23, 200, -62, 1, -170, -94, -67, 65, 127, -64, -298, -77, 352, 79, 135, 225, 38, -277, 34, 101, -281, -292, 84, 235, 10, -43, -111, 223, 21, -45, -78, 15, -130, -202, 339, 502, 26, -12, 47, 164, -30, 170, 123, -48, -142, 153, 226, -46, 91, -23, 126, 172, -49, 171, 127, 108, -382, 32, -200, -151, -103, -31, 9, -194, -43, 171, 203, 3, 59, 9, -328, -187, -34, 215, 41, -219, 286, -170, -274, -18, 111, -49, -125, -239, 150, -185, -288, -204, -280, -226, 14, -150, -125, -159, -44, 323, 119, -98, -46, -237, 296, -35, -143, 100, -45, -63, -170, 550, 61, -138, 83, 335, 93, 43, 307, 89, 116, 22, 210, -48, 100, 49, 249, 35, 103, 12, -15, -91, 104, 170, -70, 12, -177, 178, 139, -69, 0, -161, 263, 21, -180, 65, 10, -46, -193, 49, 150, 22, 93, 198, -179, 110, -27, -259, -6, -80, -250, 65, -288, 15, 4, 332, 95, 63, -273, 144]
4675A44j60J40J62l71j22j6L79k89R7m5j58K20j13M62n5n56K04M56k65r2Q8k78
4697a68J85k06L68j97j04k90L17L69m25K41l8J48J3o97N75J35m74L90K7k64k9
4718a24O2K29j72m3J50k56m3k78N40q5k71J23K48J52l46L75j79k40J71J2Lk61
4740b33K03l77N95r2Q3k28jK11k56J87j93k65R8M99j38pj51R0K02k70R8J5k9j80
4764a39P5M09m10l01M48q2J81q8R2j03m3J04n9L2k26k3N53m20j15Q7J13k86K81
4787H0J77j55k13Q9L13j78m08L09J29n0j13J48k4k56J3M20q1k28j21J56no5Q6
4810B3j85m7J20N5K28k12j08K62J16k13m53K57K98k78P0J96j77o7J14N7R5l53
4832b02J52J10J30m1j63J67k49k1J88L6J11l22K27j98J92k03K61O0l18o7L80l54
$$ y = [144, -16, 124, 286, -85, -207, -223, 156, -133, -36, -81, -239, -19, -132, 330, 275, -281, -77, 379, 114, 22, 110, -168, 17, -189, 179, -18, -122, -412, -95, 274, -151, 90, 52, 200, 213, -484, 91, 226, -248, 142, 169, -95, -124, -62, 167, -5, -48, 102, -154, -197, -475, 65, -20, -291, -168, 80, 232, -114, 261, 82, -158, 13, 25, 28, -233, -30, -407, 188, 96, 179, -49, -50, 161, -95, 92, -101, -366, -268, 231, 93, 86, -65, 25, 227, -43, 55, 70, 41, -139, -64, 345, -65, -366, 82, 0, 181, 93, 185, 82, 39, 143, 84, 116, -110, -133, 420, 0, -115, -28, 85, -201, 80, 257, 102, -111, -22, 291, 113, -295, 14, 143, 93, -20, 128, 104, -152, -139, 281, 200, -28, -149, 7, 2, -63, 23, -162, -209, -89, -34, 194, -18, -126, 136, 252, 39, -414, -157, 141, -137, -67, 129, -48, -115, -1, 56, 151, -202, -50, 60, 190, 149, -14, 153, -96, -117, 71, 107, 218, -104, 123, -75, 117, -86, 175, 235, -83, -150, 230, -124]
4854a24J27n1J71J38m57K65K83m06q8J33J15p3j05o9L20m94L63k05J18k26K68
4875CK14k83p3QL72m17Q5m6k06L49j69K77J35n56J84M4K12k20o2J07L5j67J87
4898A3J60l33J80oJ25k88p7J10J6N8j4j31J10oJ2L35k41k05J95P3k1j5n4K1J03
4923A20k91J49J69l22K37o5R8j30j07M27k96j7O3K22k87Qj20M32j75k45K83j67
4945a4J45j73K13k30Nm0J06J90k58p2L5O4k12J36K34m74K56K18K8l40L16p7O5
4968A21j17lJ53k01n3j54L86k62JJ57l6l6Q9l7o7k26M11L8q2k04J63k05M99q7
4992B48m60L46k6KO3O0j32k14L52j48ll0k96K45j53l8K84O0l20Q7J7J64o2j54
5016a08J68K8l02K46J45l61JJ05J97%j94K45j06k19j48L96J71j06k25j82K10j8
$$ y = [-124, 3, -48, 123, 261, -196, 69, 352, -54, -142, -9, 106, 33, -72, -141, 179, -315, 48, -157, -39, -265, 3, 217, -66, -139, -131, 241, -176, -91, -137, -343, 6, -163, 114, 249, -307, -123, -79, 133, -87, -149, -42, -7, -174, 13, 173, -160, 20, 14, 139, -149, -226, -116, -100, -42, -56, -187, -77, -83, -71, 264, 23, -182, 13, 86, 65, 50, -4, 17, 120, -171, -22, 147, -175, 62, -3, 95, -35, -142, 285, -11, -28, 35, 257, -30, -22, -142, 290, 115, -130, 153, -14, 131, -42, 171, -59, -54, -94, 12, 202, -56, -128, -93, -29, -241, -105, 129, -345, -89, 129, 157, -183, 133, 56, 121, 4, 1, 154, -47, -100, -254, 132, -130, -129, 28, -8, -44, 45, 8, -59, -285, 126, 164, 82, -122, 41, -164, 335, 248, -212, 134, 108, 110, 173, 233, 101, -113, 239, 91, 88, 58, -238, 7, -146, -184, 100, 160, -160, -73, -56, 108, 46, -108, 60, 88, -214, 32, 177, -184, -183, -78, 119, 119, -75, 170, 64, -155, -303, 93, 264, 158, -67, -249, -39, -57]
5038e7k4J4K27m47Q9K11j33l48K72K92k39L1j9J43K50k56J36j36J40j96Q6j13
5060g7j74L56o0L0j1P7l6l6q3R6J82l15P9J30j4k80K67j46L68l04o0j48K29P7
5084A47l38P13n47j36J0L72l81o9L94j35J03j46P8k80J02m2O2L5k20L95k08P0
5106b1j3k08J11P3O9j09J00k04l4J75J50qj91K38j31J40j81L82l76j50M11r6l26
5129a99J09n6K28l07J76M20j81l24L59Lj80k8K63j13j13k14K94L5l67N3R7N52
5151E07m78l53M49J20j71M2q4j4j65K20K6Kj16K51j83J82k70K01K4l60J09J10
5173D9P8k70K15j68R0n7k9K53m17K17k46M88k29l87J85M26j97j90J68m8J22j30
5195g7l0m9N9MJ98k5j69j05P1J79n3K85j77j14M0K3J52k00J7J84%k51RK55k46
$$ y = [-57, -81, -67, 160, -287, -198, 13, -120, -468, -196, 96, -143, -112, -131, 12, 262, 6, 142, 6, 146, -50, 36, -77, -251, 105, 45, 75, 64, 141, 105, 69, -14, 82, 264, -51, 28, 158, 144, -136, 131, -15, 353, 49, -11, -159, 70, 147, -191, 522, -25, -161, -151, 221, -160, -229, 165, 30, 133, -13, 65, -215, -113, -155, -93, -58, -278, 117, -91, -21, -34, -242, -131, -58, 11, -98, 2, -202, -236, -61, 89, 81, -110, 128, -3, 137, -44, 338, -38, -188, 223, 127, -199, -90, -146, 82, -225, -49, 371, 190, -134, 225, 228, 48, 20, 283, 170, 57, -157, 137, 172, -195, -142, -45, 507, 29, -324, 125, 245, 74, 116, 32, 18, -147, 73, 99, 101, -15, 236, 53, 235, -35, 166, 190, -170, -61, 49, 127, -143, 72, -96, -6, -63, -92, 161, -256, -39, -285, 203, -26, -413, -228, 198, 1, -189, -21, -69, 53, -77, -107, -156, -97, -93, 105, 80, -89, -194, -123, 56, 3, 288, 111, -3, 37, 60, 212, 12, 29, 213, 213, -38, -29, 226, -20]
5220b0j70J27J87N9l64K47R5j4j96L5M7L1k16K46K15l99J72q7J3p6j52k7R3P4
5244h0j99M11j12j29lM01k60k61K32K30k05O4j37m6J26Lj25O7%j59K46K6j62J69
5268I7K9l17N7P5K82j20m17K55L5oj32K22k25K59j75P0J51p0PR7k4j39k3j43J34
5293b1J19n7J9l26k1M91K2l18J58J66n7j10J85k34j85R3J65Q6m06L17K3N9j0k99
5317a41K01O9n9j4k49K90k35J93J3p4m9L1rj05L40m35P1K21R8n4J26j34k95K42
5341D2K8k24j16L89q4r4j13J29J26j59KL56j75j38J27m4J18jq2k9O7M8k74J99
5365I8Q4k46L07m32K18j39L04M7k83OL26j19k02Q2j67J75j74JL9q2K33M5P1l14
5389a22P4Jj6P3o9J56m47L70J07k76K38k47K19J95l24j11K48k78J25k59K97L1
$$ y = [-20, -190, -63, 124, 183, -181, 66, 161, 147, -49, -14, 33, 64, -152, 94, 309, -90, 82, -5, 8, -68, -220, -247, -154, -80, -279, 132, 20, -109, -112, 289, 29, -232, 0, 230, 25, 89, -48, -94, 32, 35, -90, -23, -23, -182, 64, 90, -72, 97, 126, -191, -134, -59, 223, 103, -314, -59, -24, -30, -162, 60, -165, 94, -81, -11, 140, 70, 77, 174, 150, 11, -12, -155, -21, 98, 41, 60, -266, -287, 204, 226, -92, 66, 232, 175, 65, 250, 16, -169, -76, 89, 175, -231, 86, 109, 168, 158, -141, 60, 129, 70, 56, -193, 97, -138, 55, 68, -6, -55, -24, -33, -138, 202, -233, -162, 59, 157, 103, 229, 95, -200, 42, 70, -154, -270, 119, 35, -59, -172, -43, 83, -76, -74, 282, 107, -31, 96, 52, 170, 169, 87, 58, 125, 173, -101, 98, 182, -64, 243, -189, 29, -110, 194, 241, -42, -36, 290, 171, -31, 51, -116, 59, -115, -114, -75, -157, 76, 121, 192, -122, -48, -47, -63, 10, -59, 97, -350, 20, 127, -149, 89, -158, 61, 256, -68, -179, 69, -209, -84, -343, -46, -15]
5411a5j55L95k79mJ2q6P7L74l51L24j70k08J80k81K16j02j6J42N6M3J5j86J00
5434H1k16L43K1l06J87q4J78k50J04r3K88n10L03K62j55l83J25K20j77J9j1L26
5456B72l44oQ5L1k59J86K02k52K19l17L2N1J60K41j45k29l3k04L76p2R5j79kn6
5480a48M38J5j05m65J80J30k09N9j7K62k10jpJ35K31n68K60J54k78J0K86r0k20
5503a58K90m6o5l24K11K69j62q9J40j09j6K22K51k24j79k0J85j46j33o3L83j99
5525A8J69l4K1l43K03J85p6q5J0q6O8k20K57J8j17j18K25J64j48l25O5O2j31J81
5549c7q6N3L10k95M4J43l09J19l0J04o8l8J56p8p1J23jkj88J61P2m1j50J41l4
5574bk50J30K13O5j22O9l9j50j10K47L9N0q8J32j64j54L8l2K24J50j87J50m4k8
$$ y = [-15, -170, 225, -54, -58, -46, -132, -55, 319, -32, 292, 122, -86, 94, -187, 29, -73, -89, 53, 109, 152, 167, -19, 81, -135, 208, 229, -77, 110, 26, 204, -46, 58, -35, 253, -257, 46, 308, 153, -230, -105, 115, -62, -43, -54, 272, -72, -78, 7, 38, -221, -35, 167, -85, 134, -183, -151, -100, 60, 301, 156, -73, -106, -310, 66, -6, 89, -90, -92, -148, 290, 305, 200, -265, -85, 45, -164, -105, -122, 140, -70, -71, -78, 57, 288, -280, -20, 134, -144, -134, 152, 62, -158, 132, 86, 21, -303, -92, 177, 15, -74, 66, -43, -59, 163, 414, 190, 11, -9, 176, 30, -103, -166, 217, 18, 187, 153, 174, -169, 34, 219, 143, 58, 68, -18, 50, -170, 87, 105, -12, -130, 95, 259, 111, -214, -149, -87, -218, -37, -123, -70, 240, -55, -11, 132, -177, -58, -88, 16, -52, -90, 66, -12, -83, 40, 39, 37, -151, 10, 82, 41, -109, 32, -2, -252, -122, 91, 156, 34, 103, 64, -86, -196, 51, 90, 140, 52, 184, 20, -134, -96, -128, 96, 246, 59, 209, 165, 137]
5598A37k88M49k42l51M62j67K6l39L19J21l2j12K25L6m31P4Q5J60j21k65O20l66
5620@j45J94N3r3M4J21j85l0j3L2K4J17m68L31j18Ol9J20J07j41oj21K49l40L43
5645D2k26J67O0K9j09j56K30j4J75k08k70L26n8N3j13N9O9J12j87J8p8j6J45L9
5669H9j57k6p9J49j02j3M8J87k12r6K58L63j50m14J87j34J39j78K68k24R7N4M
5692E8J81l36L8J28k46q7J17J16j13k5K10J8l15J18K88o3k62J00J8q5K25j37K93
5715B39J39n15J87l5K03k35o2MQ8n8P0K25j39q3o2K5p7j07K17J39j09m7m6k29
5739b68J14P3K79n57L51L2J29k00M0J79j44j41L0L88l37N5P2J34k26j79M96j1
5761C09l51M0k7J04j12J90q2J59k01K1Q7k0o3k90J31l01M44%o7J2k50L35k8j67
$$ y = [137, -151, 298, 56, -295, 167, 0, 26, -313, 6, 127, 95, -17, 208, 244, -187, -113, -28, 132, 11, -254, 366, 0, -145, 49, 102, 9, 53, 174, -11, -41, -54, -22, 2, 119, -349, -18, -136, -130, -169, -49, 58, -83, -89, -210, 39, -301, 42, -184, -17, 43, 72, -37, -193, 37, 23, 198, -10, -280, 46, -12, 41, -72, -13, 56, 168, -19, -1, -79, -95, 50, 89, -68, -94, -173, -24, -126, -139, -91, 96, -116, -212, 46, 409, 259, -155, 32, -102, 37, -141, 127, -97, 0, 54, 58, 239, -97, -59, 69, -177, -264, -147, -31, -144, -169, 41, 59, -256, -138, 150, 87, -175, -75, -57, -142, 83, -54, 239, 378, -137, 50, 15, 218, -17, -79, -75, 13, -45, 25, 250, 111, 28, -34, -9, -86, -193, 24, 163, 54, 7, -39, -268, -154, -81, 198, -359, -8, 24, 153, -47, -7, 172, 28, -113, -83, 305, -32, 23, 95, 229, 3, -176, 320, 309, -42, -2, -29, 75, -37, 153, 71, 230, 29, 50, 137, 117, 54, -236, -105, -406, 38, 38, -29, -17, -267, 68, 40, -127]
5785a27K40J59q8o14N75M6j2m23P29L13p86R1K33k16K86p9M1J6n51m1M63pn62
5808c14L07L76p58R7kJ15P40J39p29j96J57k9M06m92M33K16K30O61j051K6m8n48
5830b64N02p56L02N45k39j23j08M2m52P39J29K33oj77k07n06r1J87K06K25l63
5851a82K7j55N16l57M67P83j505Q85r21R61l90L29l41k14J82o9N44n33r80J077
5871A24m5r66Q42K63l71K46k35M1J03J10lL64m26j79Q50n69k83M77q50J233m27
5892B99L7n58J20Q98n33j5j20M95l40J43l64J28k48R9j01j95M84j90K7K6j9L19
5914C92o18N1L96l67Q4Q7%l81K72J84r1j31n2K20J91k86J2rO2J70j93J49j07m0
5938el0K91j55j19K46k78K27l02J51n1M4p6o1J04L1l4J79n2k08J55Q2j48l44K45
$$ y = [-127, 113, 272, 184, -430, 145, 191, 179, -244, 485, 798, 12, 103, 336, 120, 406, 327, 368, 384, -167, -208, 255, 248, -314, -7, 369, -389, -292, -294, -179, 561, 700, -29, -225, -68, -97, 309, -183, 250, 466, 696, 1357, 306, 332, 284, -264, 238, -518, -216, 329, 90, -33, -141, -99, -551, 188, 317, 550, 544, 367, 160, -346, -437, -250, -44, 181, -182, -155, -310, 206, -151, 316, 1099, -406, 479, -442, 519, 129, 458, 117, -97, 85, 16, 560, 27, -953, 124, 79, -887, -45, 218, -153, 93, -142, -101, 2, 112, 109, 473, 47, -132, 718, 149, -134, 343, -507, 726, 299, 336, -222, -102, 796, 263, 248, 128, 623, 283, 426, 62, 190, -58, 41, -60, -255, 229, 39, 66, 92, 73, 392, -226, -175, 221, -146, -62, 25, 25, -356, -84, 100, 9, -122, -174, 46, 237, -49, -37, -46, 16, 186, -7, 142, 35, -5, -35, 256, 101, -18, 228, -50, 177, -125, 26, -25, 19, -57, -118, -14, 17, -17, 162, 110, -98, 57, 139, -9, -353, -108]
5962a08J63lp3J74j1l73J00K83k02J35j05O0k63J33K9J44l1o4k09K80j10p8PQ2
5986d0j53J24L31j60j03j50L31j90m3J8r9Q0O4J2K62k92j92K3L08J61m37J48J22
6009A25j41L3j27l4p6J80J18j16L20m72M40k94P2j3K01m18J26R5j52L9N8J36n7
6032D3r2O0L25m32OJ61j58K34j21K8j62n5O6K44P7k53r3J63N6k74J7m1M44j96
6056D7kk03QJ98Q2j08j20j59K20J42k11m6P2P6j90K08M0R7l80M58k91r8K32j31
6080e9L27k34R7k07P6k43J84l1ok1O9J96m00K75J04j54j35P8J69k57K66j48J48
6103I4J29l31J63j12j93K32l16O67l57m24M74J95n9k9j90nM7j94N48k22n9l40
6125b82M30J79k34K24j67L6k33k1m9K54j21J78j98j22m7J3L18l52K04j72J09m04
$$ y = [-108, 55, 52, -21, 153, 142, -231, -131, 152, -50, 85, -20, 40, -223, -90, -61, 83, 52, -12, -221, 59, -51, -129, -122, -40, -193, -69, 262, 102, -1, -151, 180, -10, -53, -35, -134, -54, 10, 22, 284, -8, -200, -177, 131, 292, -145, 3, 125, -16, 17, -110, -144, -220, -40, 78, -38, 282, -190, 250, -44, 28, 15, 216, -202, -76, 19, -133, -94, -36, 100, 43, -49, 11, 336, -96, -90, 71, -87, 147, 26, 54, -108, -163, -97, 147, 224, -29, -122, 41, 97, -177, -160, -201, 243, 47, 45, -158, -150, 48, 130, 22, -98, -257, -37, 105, -106, -152, -80, -4, -194, 14, 54, 151, -229, 229, -62, -160, 72, -59, 268, 34, 131, -76, 0, -243, -59, -90, -96, -117, -48, 148, -252, 23, 127, -27, -162, -84, 85, -172, 94, -54, 94, 223, -108, 55, -57, -250, -18, -334, 333, -24, -448, 26, 221, 162, 133, -57, -62, -15, -209, 339, 117, 58, -282, 148, 327, 93, 317, 150, 186, -47, -68, -117, 137, 16, 194, -4, -126, -173, -160, 158, -194, 10, -162, -53, -457]
6147d57N14L1k47M16l21Q1J90m09L6M8J26J57k59J81k75L66k12q1J64K13k82L
6169a7M6O9qk69J70L9J96k32J1j22P3k7K90l50M1M4N2J46p8N9k46K6K61o6k34
6194a26K16r6J78j07kn4j92L01L6k20O3l4K30j36k14m4R4K00k72J49K79j86k63
6217b00L08k95K80q8J80j20k28J94k4j42K65k17j4K34k12K19k49K2j84K19J51
6238I9k53O2qo1J35Q1L3q6J74k8J66l06n2N8j42K33k98J01J39k41L48j6j28qj12
6263a10J50R7J24k04l2l03J17L95j75P4N2l6L8m34J14K22m5Mj3R8n1k37L50k10
6287a5p7l1Kj87K92j09J97J10j53J22k15Mn4j17J83K57k00k49l6L90j31J95kk25
6311d9j50mQ1J60M7k27K76k85K38j74L6r4L80k43j73K19k31L62k0k53K38j86R3
$$ y = [-457, 57, 88, -159, 257, -64, 17, 207, -202, -166, -118, 8, 165, -94, 87, -188, 178, -34, -115, 49, 262, -20, -17, 29, 98, 90, -179, -9, 30, 226, -6, 5, -117, -44, -71, 219, -131, -90, -46, 6, 152, 74, 133, -113, -87, 174, 108, -126, 90, -6, 172, 65, 63, 9, -183, 118, 154, -66, -3, -37, 193, 57, -157, -201, -107, 93, -179, -30, 249, 63, -200, 108, -187, 93, 5, 185, 65, -163, 31, 7, -135, 130, -87, -101, 133, -79, 140, -109, -87, -271, -52, 99, -154, -92, -100, -161, -26, 55, 88, 2, 176, 148, 314, 8, -44, 14, -128, 105, -193, -92, 47, -194, 154, 138, 10, 2, -110, 40, 137, 261, 57, 25, -278, -161, 234, 59, 133, 185, 149, 187, -247, -133, 89, 44, 48, 35, 133, 82, -155, 195, -15, -92, -123, -121, -308, -16, -125, 72, 182, 29, 151, -64, -60, -114, -231, -48, 209, 9, -240, -276, 114, -17, 178, 176, -49, -199, -203, -122, 38, 85, -142, 134, -151, 87, -87, -51, -145, 235, -8, -181, 38, -193, 169, 149, -104, 134, -52, 41]
6334D1m1R0p6J06j20J19j09kj52O3K23j93J21j01j6J80k8N2J01n66L98J8n72L15
6358a49K41Ro1l62J59O5J81r2M7or2K95k26j85l6L81j55k43N5J58R0J28k52nM23
6383C68p29K95Q1l0M9k32K10K6k31M09k86R4K8M5l08J21K30r7j9k1j74K25M4j51
6407e3J90%k31K56J1ll00Q5J20l5J4Lq2K78k59j08K3K96l48R3m7J00p9K16l06
6432a66K90l47K31K7J94j92k45K34rJ67l25j14M13j74K24l82J59M3j38oJ86oj01
6455c7k59K92K19n54K42K14j75p9K62k99L88k38L5J49Oj57k62L90m5q2J14j6k78
6478a70J88j49L49j4k52j32J16K5k13j0K69K04m4k00J06O1k44J89J7k39l3K55
6500G9K3n4J5J24j80m0K65P9l28j20L35k89Q0R1o9l0k9Knm8q8K16p5N3Kj01J06
$$ y = [41, 0, 90, 14, 120, 0, 119, 10, 8, -144, -81, 142, -51, 70, -31, -47, 133, 105, 157, 258, -308, 90, 108, -464, -149, 92, 101, 40, -322, -163, -98, 83, -9, 38, 32, -60, 235, 9, -176, -212, 169, 14, -229, -174, -16, 74, 202, -50, -55, 368, -361, -66, 15, -15, 34, -198, 12, 38, -193, 216, -70, 24, 52, 97, -211, -90, 140, 43, 24, 3, -171, 54, 98, -53, 137, 137, -94, 162, 173, 170, -130, -45, 75, 40, 54, 57, -25, 253, -6, -114, -91, 205, -143, -50, -97, 3, -76, 140, -166, 124, -223, 8, 35, 229, 37, -208, 26, 17, 184, -141, -255, 158, -16, 208, -174, -15, 28, -110, -116, 70, 64, -37, -296, -4, 215, -339, -97, 117, -58, -137, 125, -174, 214, -24, 11, 160, 166, 9, -253, 137, 92, 10, 124, 108, -170, 18, -131, 218, 204, -48, -180, -64, -39, -252, -262, 7, 211, 167, -33, 73, 134, -110, 79, 96, -143, -176, 79, 102, 48, 63, 187, 7, -33, 232, 311, -17, -137, 198, -91, -11, 80, 11, -19, -48, -46, -51, -99, -187, 29, -46, 7, 9, -92, 14]
6527A4N2k65L35j6qj31j4K04m5k69K5nj01J65J42j71O1R5J06n4n5j02j12J6k0
6552a53L53j51L2n8K5k47j10K70j28J82p4j32J66j64J14L52m08J59p5j2K19j37
6574B3J96j20Q5j52j15K01O7l2J6k04J19k06P0K87m57J86Kj25J64j53J07K61k10
6597A0k61L39n3k31J90k28p3J69Q7p8J41J08k4j66j89K22q5J97j18K43%l69m0
6620b09M06k96R8j25j74L61J33k49JR7j82O8O2J69j26r6N2J30j33JJ42j21p1q4
6644a46L77j16k38K26m7j18m2m3K41P1rk21k71M28k26K35q2k8L0j36L64k57J38
6667A30l3J15j29k66L45j38j49j53M43l71K26m1K5p7j21L75j80k29J25j9Q1j91
6689b32K42q4m2J51j68K31j43NM6L68m79r6M67k15J93j62K14k62j11L0j64K85
$$ y = [14, 66, -199, 136, 120, 112, -19, -33, 171, 126, -143, -118, -123, -224, -59, 83, -88, -27, 68, 174, 120, 65, -37, -149, -133, -153, 200, 49, 81, 23, 48, -199, -309, -39, -167, 15, -59, -191, -25, -189, -75, 277, -131, 28, -47, -59, 160, 23, 219, 99, 184, 32, -83, 118, 185, 153, 169, -35, 84, -122, -52, 235, -222, -36, -34, -159, 5, -148, -41, 220, 10, -251, 88, 35, -196, -6, -234, -307, -138, -51, -129, 12, 120, 96, -70, -259, -37, -122, 75, -43, 200, 200, -169, -209, 197, -99, -1, -126, -300, 61, 194, -55, -54, 43, -139, -71, -9, 160, 34, -62, -10, 120, -13, -12, 130, 9, -62, -146, 231, 115, -123, 103, 56, -62, -104, -147, 94, 165, 156, -65, -336, 92, -134, 101, 19, -9, 21, -115, 249, -8, 130, 97, 212, 83, -183, 162, 24, -125, -278, 165, -206, 20, -21, 4, -73, -194, 181, 1, -228, -103, -122, -41, -232, 10, -74, -116, 35, -133, 98, -45, -40, 6, 374, -105, -201, 266, 51, 244, 82, 296, 34, -77, -47, -211, 74]
6711G4j66q2N02l77p1L50j68j06J8J52k53K53o5J73k03K9j37O8j0L30k56j75M21
6734C01k38Jj41K19k26J28j52L25l50J56p2K38j24l19M18k6m06J67q5K67l45K52
6756a2Q9k27K85j01j50p3J01O3q3j55J39j80M33j87R9j8j18J91o9J65l92K78J9
6779I7O4o7j18K39m8j37k19K48k22K77k52j50J44J52N3Jk73J42Rj18J43J44j96
6802h7k77L55rm3K00m7k29l1Q6J01o7p9L86k29p4n6K1J24k34O9M8L2J77j33j13
6827a09M5l6O3j21M30l05o9KJ68j89j31L86J04j15k20J07M4n1K00r1k04k7J15
6850dP6j54K76k15J27P4j26j5m0L3j62M19k97n9J97R5j83j82K14k16L74k4k1J1
6874A98k34r4K26l5n7JJ19K9j05k69K72Q2M4j6o4o2nj41LNJ66M9j25P2j79P4J96
$$ y = [74, -92, -174, 328, -49, -120, 230, 62, -44, -26, 126, -127, 126, 61, 234, 31, 60, -77, -9, -19, 311, 55, -120, 301, 63, 64, -77, 142, -84, 44, -108, 217, -133, 23, -49, 189, 65, -254, 164, 138, -268, -101, -186, 81, -264, -12, 77, -150, 135, 34, -116, -189, -88, -25, -108, -263, -124, -304, 129, -58, 41, 23, -95, 96, 27, 192, -200, 78, 97, 161, 94, -24, 215, 167, 30, -189, 59, -163, 114, -138, -288, -144, 8, 61, 62, -211, -69, -60, -178, -35, 109, -87, -364, -9, -18, -61, 139, 92, -137, -168, -82, 19, -48, -127, 259, 30, -44, -100, -79, 45, -189, -120, -72, -40, 137, 4, -109, -64, -100, -37, -158, 272, -33, -102, -100, 68, -121, -252, 134, 238, 123, -97, 10, 54, 3, 203, 112, -92, -119, -4, 72, -82, 194, -21, 106, 180, 54, 39, -1, 32, -130, 289, -8, -67, 130, 225, 42, -140, 74, -142, 232, 208, 187, 198, -36, -130, 96, 61, 4, 5, 124, 153, 48, -221, 51, 133, 177, 161, 97, 35, 30, -111, -108, -103, 63, 112, -13, 59, -120, -46, 150]
6901A50q6L2qj55Q5M9j1L8k1O9k78L4J43M4p9J71j80j3L9j9J91j98l1J58n7J82
6927B49m95L54r4j07k1K67P1m6k61J67N8j57M9k23J30R2nn6j42K16L6k19K38k06
6951a05J37p0O0J0j19k6K83q3r6L1J4k7J5K03j01j90N2l4j43P3K36j40o0Q8j77
6976a69K8r5J10J14J37m45K24J91j1N1k72J68J8l8k10K63K37j32o6o5j42O0K82
6999B38j55j29p4l8L35j15r7p7L14k96j5ML56k92rK61m10K16m9J89j73n3L13l63
7023a19J67n8j65J64J86Q5l63K43K84n09m2J49j12O6K01j67J44m2k2P7O1K0l22
7046g4M1j23L23l97K87o5O6j32k34M91j87rk14L86j49k74J60K47J34k72L56k73
7068H8j75j2J90r1J04j49J60l07J59J85m1L5j59K3M3j30K15nq7k46J09L18l07
$$ y = [150, 64, 96, 88, -67, 18, 67, 56, 94, 73, 142, -136, -102, 41, 85, 6, 177, -3, -16, 23, 4, 195, -3, -34, 124, 67, 249, -246, 108, 14, -93, -114, 153, 224, 178, -83, 84, 142, -15, 34, -189, -59, 33, 28, -28, -170, 46, 82, -137, 101, -105, 32, -38, 22, 32, -87, -113, 170, 87, -9, 22, 36, 9, 24, 227, 126, -64, -12, -46, -189, -116, 120, -20, -80, 8, -169, -141, -236, -126, -12, 125, -320, -96, 95, 84, 135, -137, 31, 49, 11, -199, 64, 301, 169, 103, 38, -104, -44, 238, 83, -46, -120, -158, 177, 62, -35, -112, 202, -94, -109, -105, 251, -41, -50, 211, -199, 17, -32, 157, -16, -69, 244, -119, 48, -10, -175, -11, 175, 260, -103, 140, 424, -85, -127, 22, -90, -24, 177, 10, 154, 112, 90, 167, 228, 248, -74, -33, -156, 167, -230, 57, -8, 58, -74, -308, 183, -4, -13, -227, 159, 10, -264, -104, 143, 277, 5, 361, 88, -87, -99, 91, 0, 104, -45, 115, -192, -33, 152, 111, 146, -13, 10, 53, -77, 138, 133, 46, -200, -91, 227, -80]
7091h0J39q0k6o7J86n3ro4P8m0JJ00k63J19j7k1J48k62Q6Q6l82L88k78J74R2r
7117e4J67K1k16M7L57n42K10J03J32m51J45J06j4n4J71Qk06K07j34J10j60J72
7139A25j6J24l5%k51L45l96j29J69P7m1N8r9q1L28j6j84N0j28o2J57j29L2M74
7163C72k09o60Q72J88j09m74K56k26M65l47j95L76m37K10l54L34M6k55J78m0o0
7184f9j22L33K8k38k6j01M90m49J40J94q0Jj30p5K28l08k0K14oK32j75J73m1k64
7208g1K10n1k25J0K93j00k33M7K09M8j54j1Q1j11J41M4j31O1j1K56k34k17J91
7231D2L1NO5j81L02k99O2l2j7k4j99M11j69q0n6J66QJ21m0k16K88l21M8R9L4j56
7257a08j11K41l5L9N6o1P9l42j14K70Q4L1R0j38K7j68n7L95k53J67j00J11j33
$$ y = [-80, 59, -21, -47, -114, 72, 19, 10, -54, 24, -16, -15, 85, -178, -59, -76, -97, 51, -211, -125, -39, -421, -33, -311, -137, -45, -54, 113, 134, -82, -35, 322, -220, -10, 93, 225, -226, -81, 25, 11, -43, 128, 136, -70, 137, 3, 113, -47, 125, 109, 233, 198, 198, -53, 292, -104, -233, -64, 13, -28, 30, -69, -150, 178, 162, -22, 28, -100, -162, -5, -134, -102, 372, 163, -497, 375, 563, 454, -20, 236, 10, 475, 128, -67, 309, -128, 82, -272, 62, 108, -147, 31, -9, -69, -191, 142, 170, -68, -94, -195, 295, -154, -14, 180, 100, 101, -29, -104, 124, -184, -204, 10, 4, 236, 61, 234, 193, -71, 139, 88, -137, -127, 166, 66, -167, -120, 89, 137, -17, -28, 53, -58, 83, 127, -4, 57, 46, 302, 68, -149, 42, 73, 78, 143, -38, 264, -35, 27, -5, -22, -46, -245, 166, -3, -83, -139, 27, 35, 156, 116, -100, 188, -133, -85, 14, 48, -108, -219, 22, -13, 26, 82, 21, 100, -242, -356, -86, -2, 29, 119, -19, 8, -160, -217, 178, -75, 92, -8, 103, -30]
7280c0N3p9J9K13j19L9l03L50k42R7k25J95J51J97k41q6k38K88j06M1K95o5k78
7303g4P6j04PL29j19o1n9J03j24K46k99m5P5J45r8r5J04r4Km7J37j37j55J77r1
7328b01L05l15J92J0R3m9k23K29k56K31M5o9J13k0l49J60K71M6l44k4Q8Ll7p1
7352a72J06k60J69L00k88J60j26K8qK23j08M7k83K67n9m1q7J28J40j81m9N8L9
7375Cp1j53J43L4N6j4q5J11K79m16Q0P9r0K15l82j05K96j5Q0p6K41j54J2O5j15
7400A8p7Q6N6O0l4P1o8L0k51k0R1R9k0j63J67J3J22k67p4k8J62N4j67L23j76R3
7426A00JL8r8k78q1M62k49J70l6J35k57P1J34k45L38j82J88k02j67M77l63N2n6
7449d8n8M2j30K08j11K26l6j2q9q5J10k6p8j7K1K5o3J38p8J89k63K1J81j63q9
$$ y = [-30, 23, -56, -37, 176, 57, 96, -207, 143, -99, -2, -227, -32, 119, 316, 75, -11, -249, 39, -67, -26, 269, 204, -74, 2, -102, -95, 234, 115, 54, -5, 98, -26, 220, -79, -124, -49, 96, -2, -97, 7, -87, -85, -132, 5, -132, -287, -110, -201, 104, -211, -19, -9, 84, 35, -188, 41, -215, 16, 61, -8, 105, 85, -264, -104, 167, 213, -131, -155, -67, -64, -101, -172, -66, -326, -157, 143, -145, 15, -111, -83, -91, 132, 24, 71, -212, 55, -4, -45, -132, -4, 136, -45, -94, -36, 3, -68, -221, -78, -44, 12, -2, -87, 24, 303, -113, -33, 46, -44, 171, -211, -316, -20, -35, 45, -31, 210, 56, 68, 133, 18, -59, 27, 83, 143, 109, 180, 112, 142, -109, -129, -38, 61, 41, -122, 45, 58, 180, -87, -161, -189, -27, 27, -140, 183, 7, 100, 101, 139, 41, -237, -318, 144, -105, 65, 29, 164, -93, -22, 112, -133, 205, 23, 211, 9, -158, 319, -44, 8, -48, -106, -64, -194, 14, -97, 129, 93, 81, -8, -93, 17, -9, -87, -104, -83, -58, -121, 17, -61, 128, -135, -114, 67, -96, -185]
7474a85K55O9k8r0r0M32m17K6J10M9k53q5k6K66p2j33K06j56j0O9J25ml3j8l7
7499c0J1J90j69KQ6k20J17P2k32N5n5L75m98K92K5j77j71J98J11P2j65K1K50m68
7523c08K53J01k03N4N0Q7j34J11n6J06J18k55J24m5N1j15j16K33j85K92j70K53
7545B46m47M21q2k26K20J03q3r7J5j19K30k55rj2o8K39j16M4j99K42q0j06K31
7568I2k6j64J10j33J03j3j61K00j98K84j41k2J20k96J73J81O7j69o0J2q2LJ44
7591B4k5k73M10p9J7P2j09p0J12l46J38K11j2j20J86l17J78j88M8K0P1J28q4m4
7615e2J53j10K64Jm03R4L00m35O7J87j44J1K19j79Qj10j5R0J8m3l5K55l56j02
7639c17L17j05J08KlK53k83J53r3k2j14K1J00OM8J60j6q5j62n6p1J68k35N3K75
$$ y = [-185, 70, 139, 111, 21, -69, 363, -54, -28, 82, 131, -122, -207, -233, 33, -39, -172, 34, -122, -132, -63, 62, 58, 25, 7, -30, -19, 171, 2, 4, 90, -130, -13, 59, -173, -118, -173, 202, -296, -4, 21, -156, -327, -129, -18, 54, -111, -90, 160, -308, -55, 46, -157, -103, -53, 34, -100, 11, -45, 61, 179, -76, 48, 3, 54, -61, -177, 56, -129, 163, -7, 246, -201, 220, 138, -88, 132, 235, 152, 55, 70, -49, 181, -74, -83, -95, -163, 76, -40, 4, -195, 47, -33, -139, 92, 66, -98, 12, -121, -18, -31, -192, 8, -190, 94, -47, -69, 51, -245, -72, 109, 176, 7, -53, -41, -123, -120, 24, -1, -274, 136, 57, 74, 146, 37, -33, 79, -267, -129, 82, 70, -50, 136, -181, -3, -191, -143, -123, -52, 76, -8, -52, 101, -9, 255, 256, -147, -53, 247, -188, -121, 66, -78, -67, 152, -27, -19, -129, -144, -54, -36, -79, -114, 141, -215, -317, 0, -105, 3, 5, 2, 255, -28, 125, 32, 10, -104, -83, 17, 23, 71, 231, 215, 130, -32, -88, -159, 9, -226, -173, 102]
7664A02j76l2J86n4j33M7L10j42n0j60RJ08q0J15J74j66l27J03R3J06l00L72o6
7687C9J61j08j47q2j26K78p3r0J05K2j36Q9O2k26K79j23j29K80R6j16l8J1j55
7710a27m7L52j87J05l6p7qj55K75j26M1O1n8K3J1rL9k27J27j82J94k18J00P9M5
7735en0q4j9J26j20j94L74J9j41J01l8j78K80j07K12m1r0j73m4L02j47J53k16
7758h0K39l31K44J09l3l30K55q6n7J87k99L35k8l24K86j8m05K64R1J32k89J19
7780a9p3j17J04PJ23J55p2j97j3J73j60K65q5J07k87K38j21j8j19K5K45J8j25
7803E4J36l65j8L69r7L03l77O9J86J14m9j26m1j03K00l63L26l09j04N7N5j39M9
7826a73K43j84J26m2N2j10P9j73K12O0rj32M17m76J60J0L6j32N7J36j12j32j41
$$ y = [102, -74, -106, 80, 26, -107, -60, 250, 108, 58, -102, -93, 15, -65, 50, 224, 58, -269, -166, -73, 33, -267, 105, 39, 200, 92, -55, -137, -263, 15, -58, -148, -43, -21, -157, -68, -6, -232, 47, -76, -205, 75, 171, 55, 17, 28, -127, -174, 178, -9, 96, 60, -17, -25, -180, 95, -31, 10, 71, 13, 36, 47, 38, 77, -150, -23, -205, -11, -229, -129, -50, -5, -55, -139, -158, -32, -152, -346, 28, 47, -94, 7, -31, -209, 71, -36, 176, 135, 45, -128, -172, 130, -17, 136, -80, 159, -172, 72, 181, 148, -182, 73, -13, -70, 117, -182, 153, 125, -199, 87, 69, -336, -72, 19, 151, -138, -19, -92, -209, -105, -98, 25, 180, 108, -89, -102, 71, -89, 176, 91, 198, -89, 149, 28, 10, -109, -84, 161, 179, 54, 190, -175, -193, 176, 79, 382, 5, 74, 260, 374, 325, 199, 158, 55, 255, -108, 218, -91, -195, -138, -83, -222, -173, 70, -114, 12, -30, 22, -88, -9, -182, 30, 90, 81, -51, 366, -110, 50, 60, 96, -36, 21, 157, 45, -87, -228]
7849b28J20K07N4j08NK49k66M2J67j45j92P6J59j5j96K09n8m24M33MJ10j59j14
7872g0L7l15L78k23J95n1j18K97j65J76j50K38q0j96Q1M3l10K03%J47m68J72J15
7895f4j11J03Q7M4j68K31n7k16J6j22L51l8K64m43J82J31l26r1K55j11j07M05
7917B15n08O76o08J36J19k20J91r3L27j88j28j58K40J33r3n9N0k27q6M29n5k30
7939a37K75j52L7J60k70J28K6N6r1j90N1J96J57j99J14j81K1K1k76O12l81J29
7961A06L9l81K80j02k02L01j6j06k0K38O5j20k29K16r6L1k34M10k9j13K2o8k33
7984b41K88Jj42j31R3K49k47L26j33k14N6J85J14j53p6J22k91M5J42j37Q8L6j91
8007b11J27j3l5k3P1J7J82j16j18R8m6N3k0J57k24pJ25M9j24J45o3J66J1j26j1
$$ y = [-228, -108, 99, 153, 45, 50, 299, 33, 75, 242, 97, -95, -19, 140, 125, -71, 138, 80, -344, 89, 93, 203, 44, -70, -33, -348, 30, -193, 2, -49, -167, 130, -35, 141, -9, 229, 149, -47, 34, 77, -233, -30, -30, 117, -351, -179, -64, -175, -72, 15, 59, -109, 122, 65, -151, -135, -257, 94, 56, 320, -123, 59, 190, -136, -227, 28, -83, -190, 215, -293, 383, -225, -89, 30, -190, 1, -92, 235, 47, -81, -239, 1, 134, 41, -18, 32, -195, -281, 148, 93, -137, 138, -14, 23, 183, -87, 41, 67, 123, 32, -158, -107, 89, 246, 47, 161, -20, 1, 22, -254, 358, -23, 106, 145, -236, 44, -58, -260, 41, 25, -81, -101, 137, 202, 82, -147, 69, -27, 4, -230, 180, 151, 38, 60, -8, -241, 47, 48, -94, -225, -132, 117, -130, 196, 63, -151, -95, 90, 204, 51, -25, 97, -194, -149, -7, -144, -56, -20, -211, -84, -97, -132, -155, -84, -67, 115, -1, -119, -21, -67, -14, -34, 123, -101, -108, 17, 66, -58, 87, 24, 190, 201, 75, 64]
8032F4m6N8o5j04J30K0k07K65nm6J51k31L2Q7p7J93l0k61pL09l38K49L3l76L2
8057a70R7J34p4J15l7J33r6mj33K73k11jJ29j41p4l9L2K76r5l03K80j75j5O2l1
8082f8L12l43K15J70j59l10n9K37j12J96k13K03k73K28K3p4K92n73N07l3n7l38
8104b29L24O4k1r1j66L2J57K13m11L11k47pQ6j00q3J09J6P1k89M56j67r5P7o4
8128e4m2O5j09O6L02j84j3N3o4q1J54o7J47l78J95K51j85M0j00l8J67j92j79L37
8152I1kj03M1J37k12O3L5q2M6nn1J08N2k38R7j1j56K31k47J07J85o3Q6k50M13
8177B72k65m2J30k87O3K34p7M8k27P0k0R4q3J70
$$ y = [64, 18, 76, 11, -93, 37, 57, -150, 115, 110, 64, 215, -16, 16, 103, 26, 219, 189, -72, -79, 230, -108, 141, 174, -202, -170, -73, 61, -13, 102, 65, 198, 102, 98, -35, 238, 27, 26, 155, 14, -60, -99, -67, 209, 114, -189, 91, -84, -99, -37, -68, 244, -99, 116, 286, 127, -183, -242, -5, -117, 79, -134, 69, -204, 24, 47, -27, 265, -308, 199, 166, 109, -229, 95, 159, 138, 47, -119, -87, 70, 283, -128, 183, -64, -71, 15, -85, -168, -59, -43, 28, -261, 195, 28, -67, 10, -54, -96, -31, -140, -74, 228, 44, 31, 84, 20, -61, 93, 26, 173, -205, -10, 241, 56, 96, -4, -42, 125, -67, -246, 91, 89, -14, 27, 164, -48, 15, 50, -32, 14, 9, -42, 66, 118, -120, -23, -34, -190, 41, -206, -99, 86, 23, 109, -141, 272, 7, -35, 95, -192, -129, 105, 28, 76, -151, -81, -101, -7, -90, 80]
8191H0
$$ Imaginary data points
##PAGE= N=2
##DATA TABLE= (X++(I..I)), XYDATA
0@%%%%%%qJ6j6J6k4L2m0M8n6P2r6J20j44J76k08K48k96L51m15M83n58O46p49Q61
30D59r82J119j273J442j626J832k060K307k579K878l204L561l951M376m840N347
46B806n900O503p164P891q692R575j0552J1637j2849J4214j5766J7543j9598K2013
60A1661k4896K8406l2786L8426m5995N6719p3164J01749j64962N34941o9519p54743
72c94163P07603k03295M1571j14322J0700K73230m39172K5563M83732m52183K5610
83c5126J82048j69323P0163m1091O4219k1132j81135R5148J09505m1583p2954
94d1261p298p5373K37340k5928k42915J59809K6890q5980Q6305o4440M1335J5090
106B3574k05980K58832l7464j14443J84965k52414J76572R5648j81951J60591
$$ y = [0, 0, 0, 0, 0, 0, 0, -8, 8, -8, 8, -16, 16, -24, 24, -32, 40, -56, 64, -80, 96, -112, 136, -160, 191, -224, 259, -299, 347, -402, 459, -523, 596, -677, 765, -861, 971, -1089, 1218, -1361, 1517, -1687, 1874, -2077, 2299, -2541, 2806, -3094, 3409, -3755, 4136, -4556, 5019, -5533, 6104, -6745, 7469, -8297, 9246, -10352, 11661, -13235, 15171, -17615, 20811, -25184, 31535, -41629, 60120, -104842, 430099, 360580, -394163, 313440, 110145, 151716, 37394, 48094, 321324, -117848, -92285, 391447, -60736, -35126, 146922, -22401, 47762, 6671, 70890, 49758, -131377, -36229, 73276, 31693, -41261, -48559, -123932, 113408, 87480, -155435, 4374, 31264, -54716, 31589, -32851, 8484, 23574, -182406, 76426, 38962, -75481, 109484, -142930, 33642, 129290, -52661, 107930]
116A07930j29401n0071J88680q7105K7653q5206j29020L03434j34969j55548J85498
127D1875L524p2866j06708J62803J04117k15419o9829K58359k1885k18609J49264
138A4626L0420j19480K8334J31278n054j79638J0494K54821j16794j77561K45088
149A16534q1493p9861N4848l555Q4189j34054j2112P8641o4797R7495k41k00156
161a44562J57331O1487j33470O5588k0070J8350o6619K9986J07940j51720k8006
172a03765J47644m8841j15498J42315J7119j00127k0182P7642Q7702j18268n2137
183h6396R1851K5541l9081J8258o9446O2099M4178j20766J26857m660q6882J6572
195b1875L5181M7217p9008j7075J09492j01840q9999K18710m9776j54219L7425
$$ y = [107930, -21471, -71542, 117138, 30033, 57686, -27520, -156540, 146894, 11925, -143623, 41875, 45399, -27467, -134175, 28628, 132745, -82674, -152503, 105856, 83971, -134638, 14626, 45046, -74434, -46100, 85178, 80124, -99514, -89020, 165801, 49007, -128554, 116534, 35041, -44820, 10028, 6473, 90662, -43392, -55504, 23137, -41660, 55835, 55594, -144562, 12769, 74256, -59214, 6374, -13696, 4654, -61965, -31979, 75961, -75759, -103765, 43879, -4962, -120460, 21855, 38974, -61153, -81335, -3693, 84009, -34259, -86396, 5455, 30996, -8085, 10173, -59273, 2826, 47004, -73762, 53095, 48435, -38447, -21875, 13306, 60523, -18485, -35560, 73932, -27908, -117907, 100803, 51027, -103192, -65767]
206f5767J00214M0958j51586M0391R6512q3784k3035R8320l9579m3970M8476l7673
218b0523K6864L213Q345k6628l3928P7028K0376p1179J5960M0851q5075R3636
230D8940L4269j01068k1156M3846R8614j13538n7833J47856k6451j50158J05825
241I146R6737r4123o9322K5159J21457r5794l9027R9259o8082m5035P8336K7737
253D6448p5581j8294K6449P7176n5875n3272O8934j5061p137k7950L4217N6021
265E6075p5487q1921J20117N2273j14386Q120L1837L0770n1943K1408O0059j04455
277d7533k499J12552l0981q7681O6798k820k6907O123L0238J8116p7522L9403
289b713J3424k1364N8172r075j11993N9655J10017r2177m8056M2961O6545q5290
$$ y = [-65767, 34447, 75405, -76181, -35790, 60722, -23062, -46097, 52223, 12644, -31326, 17150, -20523, 6341, 9554, 17899, -8729, -42657, 34371, 54747, -16432, -472, 40379, -44696, 48940, 83209, -17859, -39015, 4831, 103445, -10093, -67926, 79930, 53479, -96679, 9146, 105883, 11760, -57562, -32403, 89054, -6740, -45767, 53492, -14590, -59625, 18711, 46448, -29133, -47427, -20978, 56198, 323, -52949, 15985, 924, -6213, -34163, 54, 56075, -19412, -101333, 18784, 71057, -43329, -35209, -3372, 27398, -24545, -3137, 56922, -47533, -50032, 62520, 31539, -56142, 10656, 7836, -19071, -12948, 17290, 35406, -42116, -2713, 10711, -10653, 47519, 38444, -73549, -13894, 96123, 3946, -44110, -1149, 65396, -19894]
301a9894k8185J28590n8600r8049R0676O5827j03239rM9366k744o4258K1747J15750
314I6978j03546p4039P9306N5064m1411m2379R836M3681q609n5233O0103r191
326A0560k8586n235J3641M5097m9068l3584M2630J6487m5704M7233J518m6537
338c1548n042K9651P2979q3216m7041P6258J7767n0352M970K3482o400j3705j8079
351c0276O6046k8194k5428J4490j5112M8672k740n0019J779M3529k3648P768J4823
364B1690j5137l2106l15J02080n7488p9683Q1591M1884r5394m80R7549l5022q3434
377e4265J8194J16444o6909p6190P6980k027k9894K6702J7488m3384m567J8147
389c281L3102k6752k1195K7723l2843L6810m456l2035L3313K92m8355K3816N8827
$$ y = [-19894, -48079, 80511, 21911, -76138, 14538, 80365, -22874, -22883, 26483, 23739, -40519, -18772, 96978, -6568, -80607, -1301, 53763, 12352, -30027, -20191, 23490, 14881, -40352, 19751, 10560, -18026, -23261, -9620, 35477, -13591, -47175, -4545, 11942, -33762, 13471, 14989, -31548, -36590, -6939, 66040, -17176, -64217, 12041, 29808, -20544, -15574, 7908, 1508, -12197, -30276, 35770, 7576, -17852, -3362, -18474, 30198, 27458, -22561, -20782, 22747, -901, 6867, 21690, 6553, -25553, -25868, 76212, 18724, -60959, 20632, 62516, -32878, -33358, 64191, 29169, -54265, -36071, 80373, 13464, -62726, 14254, 12227, -17667, 9035, 26523, -16861, -21428, -3281, 29821, 3069, -18126, 9597, -23246, 13564, 9108, -22927, 10386, 10678, -37677, -13861, 44966]
402D4966l6305n0621L561R0136l6386o3108N5734k886k3220J1326K5462k1523
414b864j5771l369L3979Q98l0898K0958k2067J4093j702l123K6745k3922m6498
427e3541M1619O1357n6140l6533J9572O4984l6205n0409P8310o938o4527K3158
439a5293O6551l2588m4329J6123M7337l0829l3738P7737l7450n1021M2435M6588
451E1523k8742n2318K4930L6744j4889k6750L4009k7697j206K2536k2303K0377
463A6214j810k3179j2797L8235J3476l3894k8985L9783J0024m7812N1413p065
475A3603n2591J3693N1655n113n4755J3817L8895j5824l6116N1590n681l3421
487b0248P365L950L4115j9825l2783M318L8759m608k8770J968K2674j3336l1139
$$ y = [44966, 8661, -41960, -38399, 51737, 15351, -47757, 7977, 5091, -18129, -6803, 18659, -2864, -18635, -22004, 11975, 12873, -18025, 2933, -19134, -5041, -6743, -9866, 16879, -7043, -53541, -11922, 49435, -6705, -43238, -23666, 41318, 5113, -45296, 33014, 26076, -38451, -15293, 51258, 18670, -25659, -9536, 37801, 6972, -26766, 50971, 13521, -37500, 4935, 51523, 22781, -29537, -4607, 32137, 17248, -9502, 24507, -3190, -4396, 18140, -4163, 16214, 14404, -8775, -21572, 16663, 30139, -3755, -32740, 7043, 17067, -30745, 20668, 13603, -38988, -25295, 26360, 21247, -33508, -19691, 19204, 3380, -32736, 18854, 13173, -20248, -12883, -8933, 25182, 5357, -27426, -23108, 15651, 11043, -17727, -15759, 6915, -6421, -37560]
500c7560P1178j3039p3309L1745O1764l3597m4668N2443J6241n3426j3814R2142
512E6100k2042p7801M1325K8758p660k2823Q873K097j0817O218K2030k0250j4780
525a0772K1776k1071K9658l8k7454O978R254J980j4420J6095M024k9913j7842
538c1745O0083j653o1487R019L1764P703l7882J1306J8464j7216j8666L3445K1020
551B4155m7796N621J1992J3326o740q995J5355j4363j3191K2585J8444k4031j2990
564a6628j1135M6332J240n5014K7038J7416q095k3857K3673K7810m4521k0476
576c6217N8350R213n4327J7477J5711r084j5590K9128R081n1928J1203L4341P01
589A8059l1386R517K355j59J6353j7574M469Q168q558j5540K7561J8489l3119
$$ y = [-37560, 33618, 20579, -52730, -20985, 40779, 7182, -37486, 14957, 31198, -22228, -36042, 56100, 34058, -43743, -2418, 26340, 18680, -4143, 4730, 6827, -3990, 2228, 24258, 4008, -10772, 11004, -10067, 19591, 19553, -7901, -923, 8331, 10311, -4109, 11986, 16010, -13903, -31745, 28338, 26685, -34802, -25783, 5981, 13684, -24198, -12892, 5572, -11644, -30310, 3135, 24155, -23641, -18020, -6028, 7298, 558, -8437, 6918, -7445, -20636, 1949, 20393, -3638, -16628, -27763, 18569, 19809, -35205, -8167, 9249, 1154, -22703, 970, 28780, -15741, -36217, 22133, 31346, -22981, -5504, 10207, 1123, -14467, 14661, 23742, -28186, -16983, 17358, 18059, -13327, -3810, -1455, -1614, 14739, -2835, 1634, 9802, 1244, -14296, 13265, 31754, -1365]
602a365l2167M5687K9751o4198J9989K2234k4802j2638K7241K6512n5577j0267
614b9600N3486l757m3314K5547J0309j8197n007J1046K4572l3567r069J1796J7743
627A1988K222k6036l913J5738J0118k4099J6775O107k4541k831K6584J0129l3402
640a5161k646K2400N102l1757K6597J2411l6995L746J6509K5199l1418j9162K8023
653B848P556j1054Q49k30j635N916j2678K3649m665j6531r07O737K4164k3622
667C97j0123J6651L856k3307J7066K5538l5377k0453L1567L3959m5465j8598L9898
680A5609L047l8182J6438L6010m0038j2564J9744K3426k1460j7816K4738j0861
692a909l104J2533J81j2772l80m124J9730N632k8209K40Q354K2005k5619q048
$$ y = [-1365, -33532, 12155, 41906, -22292, -2303, 19931, -4871, -17509, 9732, 36244, -19333, -29600, 23886, 20129, -23185, 2362, 12671, -5526, -10533, 513, 25085, -8482, -17551, -5755, 11988, 14210, -11826, -15739, -1, 10117, -13982, 2793, 8900, -15641, -18472, 8112, 18241, -15161, -17807, 4593, 9695, -22062, 4535, 16946, -20049, -16303, 206, 25405, -6013, -25175, 2848, 10404, -650, 199, -31, -1666, 4250, -8428, 15221, 10556, -5975, -6882, -145, 24019, 397, -9726, 6925, 10781, -12526, 4540, 30078, -5299, -25752, 5815, 39774, -5691, -24289, 15609, 18656, -19526, -3088, 32922, -7116, -19680, 64, 23490, 2030, -15786, 8952, -1909, -5013, 7520, 7701, -5071, -5451, -9575, 10155, 15787, -12422, -12182, -3828, 18177, -7442, -15490]
706a5490K9571j5023k3578K1684K9423l5546j6354K1278J7974j8986n409J7915
718G459j7581k355J5756R437k0710j185K601Q004J2398k0514J761L500Q134p818
732a113k58K1021j4937k5778K5036L3603l6385j4634J7330J7123j9245q578L2258
745B5443k3408k0262K2197K2763k5395j6933J6167R426r024q853K2207j4223j4187
758a4082R367J8560k653k3963n00J3694J4275k0705n00M555p63j427k500K0248
772A3606j5159j9976J4526K6412j9295j4459J4134M191r343m538L2044k0871k7827
785b6555K2522K1586j2204k1898J1284O073j840p059J2951n890j1788O410L259
798c149J5465j4198j4335Q247K0083j0463j0793J4815m696j1388L721L3323k2251
$$ y = [-15490, 14081, -942, -24520, -2836, 26587, -8959, -25313, -4035, 13939, -5047, -10456, 7459, -10122, -12477, 3279, 12716, -7994, -9179, -6578, 1426, 13824, -6690, -4929, -1429, 6705, -1113, -1371, 19650, 4713, -21065, 3971, 37574, 1189, -13445, 3885, 21008, 1763, -6815, 25443, 2035, -18227, 3970, 26733, 1338, -15595, 572, 9998, 974, -7879, 14328, 105, -14082, -4715, 13845, 11192, -12771, -13271, 423, 14698, -6007, -6507, -1952, -2715, -4142, -6642, 13606, -1553, -21529, -7003, 19409, 114, -14345, -211, 3980, -5363, -9901, 22143, 1272, -26555, -4033, 17553, 5349, -16549, -5265, 808, -1032, -8091, 4860, -1030, -12818, -6408, -3149, 12316, -1882, -16217, -7970, 12113, 1650, -9143, 5672, 976, -10412, -6691, 26632, 4381]
811D381l0402K7041J9837j9692j1991K2688p771j1153N575K1021j3104k0258J5316
824A488L405N892p759p381l86Q861j906j995P229j1171n483K291K6251j4591k5107
839b0362J9956J1859j5042p002K3188q897j8320N814K7746r859k8950J6800J0409
852G340j944j0806Q012J208j1010J214J5114L805k4622N141Q682O418r543n681
866f672J1847o382o786N373J6226j5894j3020Q205J9792o018k4262J7968N242
879E619r790k009J7760m894j9286P737J8711l024k1247J6391J6o842M535N284
893H961qj3123M815N043P519q527p643M5J3294K065k0801J3318M532j3457m799
908h766K2846j195k7098N232J9912l308k2793J9321K350j9127N112J6220j487
$$ y = [4381, -26021, 1020, 20857, 1165, -10826, 11862, 4091, -7062, -1487, 19534, 6430, -13828, 1488, 4893, 10785, 3026, -4355, -4741, 4120, 2214, 219, 7448, -3723, -9206, -6915, 19336, 4745, -20362, -406, 11453, -3589, -10591, 12597, 3700, -14620, -8806, 18940, 9081, -19869, -3069, 7340, 5396, -5410, 2602, 3810, -7200, -5986, 9128, 12933, -11689, -6548, 2134, 8552, -991, -6672, 5175, -1207, -7993, -2620, 13606, -2288, -15308, -7103, 12689, 6671, -17591, 377, 5619, -4171, -6180, 11580, 6686, -12600, -4863, 13848, 10824, -10423, 5968, 5984, -858, 3677, 8961, 8953, -4170, 645, 5688, 13207, 4680, -2963, -2918, 10376, 12441, -8360, 4958, 9490, -3967, -8766, 14080, 12885, -14213, -8981, 10931, 7623, -15170, 4151, 6501, -12626, -7514, 8706, 7219]
921G219k2516O488J2239J700j2263L440K950l228K394m971J4665p503j3783N778
935g391J7968m971j8993R203Q741n678j0323K0686m229k1973J0020J7213m162
948F111k0686J0387Q434m720p430J1708J455j6114O440O186Q525j1860p211P819
962i56P951k433o749N346j950K10m583J5514k967j9548P457J2461J603j6990N757
977A23P662q011p682J7284M309k5622L590J4545N567j9190P35J1249o362l793
991e596O358N805j5958K297N681O860m293j1071N348L183L239o569M552J293o881
1006e752m558J6705O908k6574M610J4857K124j5630N202J2296j5108l683J6389
1019G786N025k2345K844R570J569m830k461N419q033L640J464N729l483q403O60
$$ y = [7219, -15297, -8809, 3430, 5130, -7133, -3693, -743, -3971, -1577, -6548, 8117, 614, -13169, -7391, 10577, 5606, -13387, -4184, 4557, -1121, -11444, 9242, 5013, -16960, -6940, 10273, 6111, -14575, -4188, 4246, -474, -7904, 3804, 5259, -10855, -4415, 1771, 10296, -1564, -8775, -956, 6995, 4562, -2187, 3159, 1209, 1419, -3164, 12350, 9383, -10165, -2708, 9753, 11356, -5634, 123, 7785, -226, -7908, 9376, 13685, -11937, -8347, 6198, 11765, -7425, -6690, 4559, -1803, -5596, 762, 6567, -9391, -7094, -1413, 5447, 1154, -9917, -4569, -1386, 1853, -4716, -164, 1129, -5752, -10310, 6395, 13303, -13271, -8661, 6196, 8320, -7310, -2108, 10188, -4920, -8603, 7786, 12811, -9534, -6690, 2880, 4449, -381, -2842, 2577, -5456, -1816, -352, 5377, 1894, -6509, -5849]
1034e849J2041M443k0017O546J0378m079r705J0848P444j9472p48J8301N099k4536
1048i306N812J0927n938k250N106O038j6332R23J1343L257r527l249L722K046
1062B572J893q159O399l168l983J88O497L711j5814o96J1111O162j4713J888P958
1077A846n791l589O927J0282j7025l456J2526O284j2798k085J1269n904j957J453
1091b018R909j0323p905J0255P212k834j0261L003L470L967o987N298L002j0572
1105d784n00P594J0663j6754m645J3104J400j1833L885J2001j3515m214J1371
1118C773R855j7845m738J6151n61o178l09O347q413J217M588K314k458p630K435
1133a452K708P344q686m579N692J925o684L167J0352j6035m025J1116J0230j5433
$$ y = [-5849, 6192, 10635, -9382, -2836, 7542, 3463, -6242, 4606, 12050, -7422, -8170, 10131, 15230, -9306, -3494, 7433, 1495, -755, 4351, 10389, -5943, -5020, 6323, 9580, 53, -3196, 526, 2572, 4465, -3694, 2705, -463, -4446, -4258, 2239, 5950, -9864, -10560, 551, 6713, -8000, -6112, 1846, -3945, -7534, -607, 9675, -7350, -10806, 1720, 8004, -4794, -6879, 4390, -1514, -3471, -2018, 7891, -2432, -10337, -82, 7130, 4296, -5965, -2962, 508, 4475, -2512, 2786, 5788, -4784, -5284, 2310, 12973, -3781, -8426, 4678, 6078, -5755, -1870, 10131, -3384, -7598, 3773, 13628, -4217, -8955, 7196, 6635, 457, 148, 6495, -1918, -701, 3887, 6201, 3743, -3887, -1452, 1256, 8600, -86, -4665, 1027, 2952, -3732, -565, 9787, -6248, -10273, 843, 11073, -4360]
1147d360p058J5019l783o309M686Q491j2158l856P192O797m226q537O723K98K724
1162A643l906J965J720m505M10O100N617j5167n5R697M772r413k549R902o919
1177f88m331P663R828j5135o027J0620O026n550q104J0154m316m006M894O636
1191G664o903q089O244N551j11q733M663J64K94J80l80M130p163j138M839P799
1207I011r525p349Q484N759n595o626J1498n656q184P829J1064j0983j1147J1889
1221D69L256l818m371Q356n570o915Q537L226j872q167J580L933M986o040k866
1236e276M776p9j556j643J1639r055q278R844Q614q256q413J1293m41n628J326
1251a133R061p906p738J0404M120m012q039N251J806J118j431N3R39n947K410
$$ y = [-4360, -11418, 3601, -182, -6491, -1805, 6686, -5472, -9328, -2136, 4661, 435, -8102, -1379, -1081, 1643, -2263, -298, 1422, -3083, -2673, 3427, 9044, -6123, -6178, 3519, 8291, -1122, -3671, 6231, -688, -5019, 2644, 12472, -2663, -8690, 1930, 7956, 2406, -5698, 4456, 140, -3866, 1028, 7664, 761, -7328, -1084, 4467, 4356, -4377, 286, 450, 744, 924, 544, 4674, -2489, -3627, 1212, 9011, -514, -7863, 621, 6380, 785, -5841, 5657, 1, -8183, -354, 10710, -273, -11420, 469, 3725, -93, -4464, 3892, -1678, -8593, -56, 3170, 1298, -6869, -5289, -1356, 3630, -2410, -5276, -500, -579, -2135, -3778, 7861, -1194, -9472, 372, 8986, 730, -7683, 3610, 3169, -2459, -1133, 7928, 22, -7716, 2688, 6808, 2796, -5243, 8, 1814, 2932, 1501, 1554, 2493, -3454, -1044]
1266a044L140O674q708p252P228N607n058m117Q220m488m513K527J0573o925j0827
1281h963J0833M819n066o739P509M00n855J571P579k677j2005O514N544M72p235
1296c299k8L771k332P71R68L028p202n48M265N495m438q361O547L067j947l758
1312d001O735l097p870N179R606k713j2973P218M834k510k439M560O95p494L917
1327c53M862K57p394K230K182K021j094n809M350L8r73j080O380l942r455N902
1343a878J0085l079j2334Q214K738o405P80Q247k515j1912O357O959j982q446
1357e171M570J900l140K438j90J119n643J730L819L232m793n319M733L566q04
1372B047n914O505j563n918L095O358k431j0229N768N618j889o401M289J028n096
$$ y = [-1044, 2096, 8770, 62, -7190, 38, 5645, 587, -3530, 4690, 202, -4311, -1784, 8789, 1864, -8963, 1870, 6689, 1623, -5116, 2393, 2793, -3062, -1491, 6088, 3411, -8594, -2080, 3464, 3936, -3299, -3327, 444, -1888, -1117, -149, 2879, -4323, -4871, -606, 4889, 451, -7910, -1363, 1704, -243, -4001, 2734, -363, -8233, -3054, 6552, 3839, -9134, -1916, 2918, 408, -2031, 2529, 3224, -4270, -353, 4509, 4766, -2628, -398, 1784, 3805, 2711, -3098, 1252, 1290, 317, -763, 5617, 1675, -7780, -1878, 8207, 5128, -7206, 1008, 3746, -2659, -1879, 6368, 3853, -8059, -1702, 5257, 3275, -5171, -601, 1299, -1841, 597, 407, 1526, -4117, -2387, 1432, 4664, -129, -5448, -715, 2851, 2047, -3867, 2638, 1075, -4843, -1748, 4610, 2179, -8050, -2282, 3336, 1447, -4954, -665, 363, -4733]
1387d733L934L289M15r135J895O539J168m335k260M238k097O95q5N182m663n197
1403e150N132M893j387p993M327L450j473l839N232Q21q598L900O345K27j0783
1418d896K826P297l332l493L693K429q590K359N935P14p409r41N122l59L84l226
1434a487J612j208O05k52K801O27q203K293N884J537q645J865M903m089j928N844
1450B159J979j1525L017P522l44o702j64N336l441Q08J300J290m533j83K967L265
1466B751r97o862L542L394L18m794L288J841o183J602O942K42j1381L587P564
1481D854k146m486K713L011p097J914N442R20p787O5N554j76r48k709K799k009
1497h6L91J470J072j967m185L178L724K52p345J630K862n04j409J497K936p443
$$ y = [-4733, -799, 2490, 2905, -6230, -4335, 2204, 3372, -963, -3223, 1015, -1082, -387, -472, 4710, 47, -5150, -18, 4875, 3488, -4505, -178, 3272, 1799, -2040, 3192, 4013, -4585, -685, 5660, 5887, -4896, -2070, 5227, 1895, -1598, 2095, 4524, -4066, -1707, 4228, 4942, -2467, -3408, 1714, 1355, 1739, -1487, 125, -1083, -478, -730, 2071, 2698, -5505, -3212, 2672, 4209, -4436, -2571, 2332, -1757, -3685, 2159, 4138, -7387, -4370, 3152, 2808, -3894, -4058, 1278, -2163, -1355, -55, 1235, -3298, -3481, -514, 2751, 1754, -5108, -1566, 1828, 2146, -2648, 640, 2481, -3702, -2100, 4842, 5084, -6297, -2710, 4854, 2708, -1778, 935, 3946, -3151, -1237, 4205, 5125, -2662, -2597, 2957, 2781, 1833, -876, 1923, -86, 305, 1775, 2847, 880, -3305, -127, 3597, 3849, -3496, -1866, 996, 492, -917, 580, 3516, -3927]
1513c927k13O356K372p672j715O342o56k854k07M478n400j549O187J413n138l763
1529e946O058N38L0k610J680n52j981K770K171R60o815L76N534K450o707O7N828
1546C851l950j337L230L751q367j151Q508l35n806o08N420m132K43K497J636n089
1562a639j297M857q9M95l868P47J779J269k460n98L600m390p9L594K889p496j803
1579d489P584p2m035l87M729n424q59N292K036n635l579O365J6j805j729K217
1595B25o57j507R77J749N8n574L361K608O41m872k47M218j461r36J463K404n595
1612c145n83N001K289m667l291O263j217j905P01L653l639l021N325K010k690
1627A084m383M478P56p14q4k89j72k385K354R11J215m087q81K901K158k191l410
$$ y = [-3927, -4140, 2216, 4588, -3084, -4799, 1543, 887, -1967, -2174, 2304, -3096, -4645, 1542, 2955, -2183, -5946, 112, 650, 680, -1930, -250, -802, -2783, -13, 2158, 3118, -3697, -3321, 2213, 4663, -2044, -1977, 3851, -99, -1436, 1794, 5545, -2822, -3973, 4535, 4200, -1606, -2214, 3206, -926, -683, 1814, 3450, -1639, -2936, 1921, 1832, 2327, -1541, -794, 985, 2254, -206, -804, 2796, -1594, -1673, 1921, 4810, -2686, -4489, 3095, 3023, -1012, -1399, 3330, -2094, -2953, 2339, 4375, -1260, -4839, 1526, 1542, -263, -1992, 225, -432, -1939, -962, 787, 845, -4729, -1368, 1240, 1881, -2991, -3238, 980, -481, -1417, 46, 2450, -3145, -3728, 1273, 3562, -1105, -4396, 1867, 650, -1255, -554, 3099, -540, -3561, 1764, 3774, 1084, -3299, 1179, 1935, 1221, 1137, 848, 676, -1709, 645, 1556, 2771, -1316, -2197, 704, 2862, 671, -2739]
1644b739N258j769k997K346M370m867m524O411K746m234l891N886j451k586L041
1659A000J923l163m197N169J386p73k768M01J170m30Q71j337K255l140j483L455
1675C39L028m381l810N405R18k820j533M888k828l454N117K173l549l986M938
1690D45J223j718j042J204j36j966K799M19M69m161Q22L396J322k796k148L344
1706A476p99l15O00K833l520l827M830K738k478m449M376N31k418L9L352j622
1722A347n311M889K544j750m661K592K605k541j47R23L71l717K245J714nk783
1738a685j579L402O30r2l042J716L32j307J229K741j360n786M142L262j733l670
1754b800K787J118m104K229L155j161n063K911K853j329j330k80J650p15R70r55
$$ y = [-2739, 2519, 750, -2247, 99, 4469, -398, -4922, 1489, 4235, 1, -3890, 1996, 545, -2041, 1000, 2923, -240, -4437, 732, 2118, 1345, -1423, -1022, 148, -282, 589, -748, 1507, -1633, -3116, 339, 3367, -1014, -4824, 581, 1499, -1321, -2854, 2034, -794, -4248, 869, 3042, -507, -4493, 445, 1668, -50, -1092, 112, -24, -1990, 809, 1228, 1697, -2464, -1642, 1754, 3076, 280, -1868, 1476, 677, 362, 962, 3795, 275, -3552, 1278, 4016, 1538, -2911, 1465, 1996, -422, -383, 2969, 1347, -3964, 925, 3469, 1719, -2942, -350, 2255, -286, -433, 490, 861, -2856, -611, 1103, 1098, -1685, -3264, 138, 768, 676, -2366, -650, -318, -1625, -396, 2345, 985, -4801, -659, 2603, 870, -2800, -13, 1105, -2999, -770, 2385, 1224, -3839, -928, 1925, 596, -734, -1014, 636, -79, 891, -64]
1770f4J034j347p76J451K355j423n273M087K267k235j597L330m02n017L623M051
1786D064k133n636M259K508k376p35J364K35l355K624J434n93l147p9K793j6n19
1803F92k402K209n12q36J028J565j521l656L495J983j400l797K543J884k519K94
1819i50J233K17m147K075L660p45m057O74K851j271O29Q9J040l259N00L125J03
1836A767k036k331L081L18r2j956J311M77k128J378J630N1m732J704L926j051
1852A317k761J197K359l844J158L104o35m453J143M425j742j753j32J840j784
1867e61J334N31l33j193j077K408R98K25m017J055K310m70j623P99J584m543J480
1884a093L146l13m900J035L918k558r75J329J106l543J458K424n46k351j072L029
$$ y = [-64, 970, -377, -1153, 298, 2653, 1230, -4043, 44, 2311, 76, -1521, 1809, 1407, -3610, 13, 4064, 1931, -3705, 554, 3062, 686, -49, 1315, 1550, -1805, 819, 2253, 1660, -1487, -1566, 1227, 1211, 692, -1710, 499, -13, -849, 179, 1744, 223, -3433, 62, 2045, 645, -3152, -609, 1275, -1244, -950, 283, 500, -3647, -1572, 2088, 1343, -2714, -2040, 811, -460, 169, 258, 1298, -1961, -1461, 1664, 1767, -269, -2600, 481, 799, 707, -1249, 62, 539, -1589, -211, 1419, 1470, -3262, -1558, 2368, 1317, -1444, -247, 2112, -1732, -574, 2530, 1895, -2558, -1415, 3010, 1268, -485, -617, 1223, -561, 773, 1304, 971, -222, -1299, 1109, 2107, 2332, -1685, -630, 1680, 1210, -413, 386, 1970, -2573, -1093, 2053, 1740, -3160, -2125, 1793, -765, -1740, -411, 695, -2848, -1390, 1034, 488, -1863, -2935, 94]
1900I4J31J8j981Q06O16o50J155N08K14l943K130L039p03l063Q65K537k240L90
1918g7J851L17m394J213L645m57k859j060L524j492k01O45N30k112o14K872L24
1935A655q44k925K345Q23k42m69n20O60j274J257J220M03l664J13L755k88k435
1952d30n55L034k515l51K436P43l615r50L963o69j593j013J829j306j63K044q80
1969Ij087j429K077Q87j11k429p4K305p40l53r6J989k935j14L767J54l628q16
1987b624M348j156j016P70J485k732j22L772j243j618j129K358J33m8r73J7K20
2004D42q81J402J16M70l433P09K837q8k344p83K945j701l83J309O90k516p95L703
2022A699l21j879j477K731m05p41J010O39j528k064L539O88j555j890J061J406
$$ y = [94, 225, 243, -1738, -932, -316, -966, 189, 697, 911, -3032, -902, 2137, 1434, -1629, -764, 1773, -467, -77, 1774, 2091, -2303, -1090, 2555, 2098, -761, -1821, 1703, 211, 10, 655, 1185, -927, -1541, 1331, 1655, 811, -2114, 231, 1054, 812, 343, -177, 483, -791, 466, 1686, 2089, -1575, -1462, 2293, 2005, -430, -985, 2049, -466, -817, 1619, 2362, -1253, -2203, 1760, 1091, -502, -1515, 314, -992, -1155, 889, 9, -1078, -2507, -430, 457, 346, -2083, -2157, 148, -592, -945, -1041, 948, -1987, -2101, 1666, 1820, -1808, -2624, 1724, 568, -448, 322, 1807, -925, -1047, 2725, 1482, -136, -1265, 1093, 1226, 1178, 205, 222, 442, -439, 963, 1079, 1549, -1884, -1175, 1662, 1574, -770, -1553, 1392, -309, -692, 617, 1307, -1209, -2004, 1699, 1378, -501, -1978, 753, 348, -393, 617, 1256, -272, -2336, 1203, 1891, 336, -1554, -493, 913]
2038I13r28J51l27M73j960J037J199K60k306j077L421l15j128j083K088j335j150
2055b067K517Q53k430k151M061N78j658q83J506l31j273K344J05q84j820K238
2071G05P87m33p38j205J715j14R2p79J621j979j220K940Q46k217k377L913k75
2088A282j978N41J485j579j925L498M66j967j852K637K00r00L12n62M12j090J603
2105E83%Q5j787o92K752R8j025j680K391o66j162J499P40j973k264M220O17k037
2123c01j956K427J36j586J718q9p63j791K362R87j029j106J78J505j016M83k69
2140a10O79j462K42J786o2j133j725K854M08p62j256J417k43j755K186Q64j109
2157H19k889K901J285j763p81J191J33j787J882M52q72k141J235J745r73l15j084
$$ y = [913, -15, 136, -191, 282, -1678, -641, 558, 818, -1488, -2565, 856, 541, -587, -1670, 418, -917, -2067, 450, 1303, -1127, -3278, 783, 1361, -297, -1180, 326, -5, -1278, 1066, 1171, 287, -1533, 705, 1492, 1059, 321, -884, 831, 717, 809, 30, 1651, -328, -1548, 1392, 2238, 21, -2356, 1557, 1282, -696, -155, 1330, -249, -2174, 1324, 1790, -177, -2029, 608, 808, -92, 220, -342, 70, -1020, 583, 583, 668, -1119, -1811, 941, 1039, 14, -1666, 725, 59, -1103, 396, 1136, -837, -3101, 1119, 1736, -301, -2257, 170, 306, -1280, 438, 349, -414, -2205, 157, 1144, 115, -991, -813, 692, -324, 159, -110, 569, -893, -651, 1135, 1073, -60, -1785, 1069, 1477, 715, -541, 876, 633, -1122, 1064, 1928, 819, -2070, 831, 2116, 353, -428, 763, 896, -891, 991, 1443, 571, -1570, -335, 1410, 437, 122, -962]
2174i62J145l46L48j85L11n08j749K175P95q46k540K023J270j537j23J497n42
2191B26k726K838J388k224j613J754J348j640L83N5J74j388J424P61n74p69j150
2208a733J965N39k93j582Q85Q24j327J162Q17p69k734K734J217j443j309J169
2224A22J079k062J256P75m82k033J411J715q94r65m82J939j099N44m12j14p85
2241d87m00K235k80q45k049K257N08o00m12J69L18j972K036Q26p97k663J296J995
2259A135j104j068L66J334k045P43J594q57j762L98K398j060k95l38N18l74J58
2276b59P62n40l93j116J393R49k59k009O49K035j235l11O71O94k721J280K619
2293B209j379k072O12K245j519N08K93k97j308N37J626r04k81j202J532J13l38
$$ y = [-962, 183, -163, 185, 0, 311, -197, -1946, 229, 1024, 178, -2362, -339, 931, -606, -729, 768, 226, -2500, 338, 1726, -498, -2111, -357, 991, -649, -266, -211, -37, -1425, -1, 760, 186, -583, -1733, 232, 771, 478, -1104, -219, 605, -722, 440, 1257, 488, -2246, 488, 1705, 262, -1047, 122, 1201, -861, 395, 1170, 688, -1345, 66, 1781, 887, -78, -560, 1379, 280, 824, 412, 298, -487, -887, 1348, 1068, 223, -1826, 431, 939, 339, -73, 96, 414, -1558, 478, 1304, 507, -2156, -860, 1135, 31, -1037, -671, 663, -1382, -639, 955, 98, -1664, -1266, 1132, 72, -223, -561, -43, -417, -259, 503, -37, -430, -1546, -153, 796, 537, -1472, -823, 1212, -23, -334, 337, 1031, -1690, -410, 2209, 830, -1242, -630, 1615, 96, 604, 897, 600, -708, -171, 1455, 551, 270, -932, 600, 713, 375]
2310C75n06J81R03j448J011N02O0k406J146K079j593j223N53J222j539O48R02
2327H67l20k058M68K345j221n39o84J536n50j45O57m66m35q58J944N9p51j568
2345a719Q40J380r49N0L0P08j834R78J329m46j519n7K467r28p92p3J185j047j8
2364d15J785m44j698m02K621l40q14m46J50K23j98J116o81o3r32J050P47l29q91
2383C9q43J782o71m45M56N16j871K5K436l06j763m41K293j208n23Q96k53p51m08
2402a040J934p35m50q34R86M80j96q2j124J178q98P79L93mj803J1K518l90j013
2421b90n10J667j553K00J542q04j263k85K345l00j071l27R25k35l94J098m33k36
2439G6r80J425P02j037n67J6J219p47K70l61N37j037K24J856r09j034o72K089
$$ y = [375, -131, 50, 953, -495, 516, 1018, 1078, -1328, -182, 1897, 304, -919, -366, 856, -683, -35, 867, 547, -1511, -1043, 1302, 81, -458, -1142, 394, -156, -301, 356, -110, -545, -1403, 541, 600, -151, -1719, -879, 501, -448, -398, -368, 340, -1494, -516, 813, 367, -1152, -1209, 1258, 330, -462, -535, 650, -397, -415, 1370, 926, -772, -1174, 1447, 1107, 293, -153, -3, 220, 22, 1138, 457, 394, -538, 512, 1259, 930, 39, -804, 978, 307, -138, 318, 834, -1037, -1012, 1424, 1118, -645, -1086, 1207, -1, -524, 372, 119, -632, -1040, 894, 159, -291, -1125, -139, 341, 145, 63, -1061, 117, -781, -2, 391, 387, -1416, -1405, 1113, 723, -290, -800, 867, -686, -486, 1056, 252, -1011, -1296, 1049, 749, -322, -649, 276, 41, -353, 745, 312, 76, -904, 521, 1223, 186, -381, -365, 854, 107, 377, 16, 553, -484, -260, 1596, 687, -347, -1019, 1070]
2457A070k70o16l34N83l43o37J712j96r58j454J981N02j270J13L48o2j164J450
2475D55J10o32q30L93J255n77m59p46J235k21k86J69K48p49j199K818j52j294
2493d62q93J660J77j462J149J46r22q20K339j15j266p37Q98Q26n10J04m92P6k35
2512e39L37R22m53n87j020K270k55r92j04N88r1q90J672m7j070r39K118J28j443
2531c95r4Q25L16o24O81K3p96r12R70J151n33n56o81R62j82R5j09L8p66m88J797
2552G22m81q18j025J800k7n54J52o9L2j014J650L56r81j150J015Q87j142J83q7
2571e51L36n51P29M88o33o70M20J143o56o0n73N72K81j87M64l69k51q37J333P99
2591A227j163j159R30R87j226O31J77k6j393J322R57j316j08m3J155q44J92lo7
$$ y = [1070, 800, 184, -150, 433, 90, -547, 1165, 969, 11, -1443, 538, 1040, -230, -117, 231, 169, -995, 455, 565, -67, -897, -504, 751, 174, -285, -1031, 204, -17, -303, -134, 114, -635, -1834, 984, 832, -462, -1355, 305, 482, -980, 169, 315, -607, -1427, 912, 797, -469, -1206, -308, 518, 8, 112, -380, -304, -539, -202, 720, 267, -320, -1340, 930, 675, -317, -421, 167, 76, -814, 858, 811, -259, -1198, 920, 1048, -395, -489, 336, 652, 28, 709, 732, -64, -976, -6, 1145, 612, 56, -625, 337, 155, 250, 141, 179, -587, -1075, 722, 241, -577, -1602, 198, 171, -383, -231, -300, -268, -1282, 368, 724, -257, -1407, -392, 495, -647, -464, -551, -215, -766, -37, 451, -182, -852, -432, 711, 55, -5, -578, -6, 275, 88, 552, 183, -68, -905, 428, 1227, 64, -1095, -165, 822, -404, 227, 404, 378, -1015, 307, 1264, -52, -160, -203, 952, 108, 300, 297, 230]
2610B30m02L27J122j070j66j093J631L92o78q02O82J31j175J466J92r75j082J468
2628A98N96j206N8J07Q9o41J155K5j081l04K44J425p13m25m07Q83n3j87j2JK4
2649b24j049J615K53p64p81Q47P34q94L75J3L6p13J124N89q84r59L43J538p52
2668D47n32J67L05o89M79R72o50p57q9J280k59n60l37J04K27p6M61k74k25r56
2688i62J038R58r87o65K71R94q13M1M18j91q64O68J132j032o71l7J158m57k40
2707b41N63q42J90j42R77m70l61o17J010L92o07o9k52Q04q87N61L40n8j260L30
2727f39J795j227j50k49P10l43K06Q00q06m39k33J431l07n56o3N5L98m73M71j52
2747B29j95n68P70P49r32o36J85J277p69J34j81L1p99P48R28o76o13l4R83n02
$$ y = [230, -172, 155, 1277, 207, 41, -1052, 579, 971, 293, -509, 173, 304, -871, 595, 787, -188, -1270, 198, 794, -412, -354, -247, -158, -799, 356, 381, -700, -1004, -760, 665, -48, -473, -880, 3, -50, -237, -249, -248, -224, -1273, 342, 595, -169, -950, -103, 631, -263, 112, 125, 161, -552, 572, 1161, 277, -682, -339, 1199, 447, -85, 82, 387, -302, 177, 1149, 499, -258, -347, 933, 674, 114, -223, -119, 108, 32, 493, 219, -6, -962, 76, 1034, 47, -618, -347, 647, -166, -125, 293, 102, -762, -94, 1038, 6, -665, -702, 456, -1, -241, 322, -520, -330, -472, 505, 35, -326, -943, 67, 459, -148, -217, -469, 335, -552, 9, 349, 291, -969, -639, 1156, -71, -221, -470, 240, -103, 103, 903, 97, -342, -575, 856, 549, -7, -70, -15, 383, -90, 381, 229, 34, -534, 236, 985, 53, -583, -398, 879, 110, 244, 63, 94, -705, 43, 971, 295, -318, -352, 631, 129]
2767A29m2l87K43L3m52J383o91n02o58J359J42p62Q1k34L44l86P98j48n54n94
2787h98K99J243p97k87l70J194n65m79Q97m43l18p2J459p68p28l20J080K3j41
2806IK50n05j20r1J106n6q25j74L08P01n12L46l48K53o05K95Q86m60o86j53J328
2827I47n43m33P6K23j69m25J127n28n17k57Q63R2o31L98k46L89n20M51n30j32
2847c65l06N48R36j048l70j92J205o41Q7K97j85p46J74J206n95m95m48Q87M43
2866C92o16J33k20l2n42J156o5o44l72M14R86o50J44l56L96l47K79L77l77l86
2886c30J87Q61l30k61l35L28pr3M37k19k24n30J440l38p34k20L63N01m01M82l47
2907B30j25n88Q22N46j119k62J47Q01o39K46r1N9Lo49J123m79l40n79J118R1n83
$$ y = [129, 87, -300, -57, -24, -476, 907, 216, -286, -944, 415, 557, -205, -124, -358, -14, -400, 398, 250, -304, -898, -599, 644, -153, -440, -810, 384, -181, -660, 237, -206, -524, -596, 863, 95, -633, -953, 127, 150, 9, 259, -246, -366, -457, 649, 593, -232, -406, -98, 603, 91, 437, 89, 342, -263, 32, 918, 458, -228, -381, 947, 404, -29, 47, 270, 101, -324, 803, 275, -242, -499, 364, 456, -175, 223, -23, 366, -154, 297, -233, -365, -671, -123, 813, -235, -605, -797, 408, -233, -146, 151, -34, -780, -606, 600, 5, -490, -938, -51, 392, -224, -91, -311, -343, -885, 271, 206, -438, -810, -396, 590, -60, 84, -272, 124, -223, 56, 433, 56, -330, -143, 718, 388, 127, -208, 120, 113, 20, 457, 238, 14, -516, 924, 586, -148, -368, -5, 496, 95, 577, 230, 105, -483, 339, 885, -234, -496, -349, 452, -187, 59, -32, 27, 30, -619, 504, 25, -315, -894, 224, 315, -268]
2928b68L8L89J7o58Q97k28n33k38O84O01j072N5k07O56k36N82l45m28Q3p6Q85
2949E98n42p0n07O34q5k29L20P7l61l06J027k69p13R9O36K56p57O09n48J34L5
2970C8K67L90p99j93r9J193o59j1k32J71k47N05K89l32l84k17Q95m69j23l99K04
2991b12K54o63R57n90j13n28R67O18q84m96L79P33m50%n0k94j94K96P17o69j14
3012c36j77R24m32o8j19j59L24j28R45o79l81m10P23M85p54j99L11K51p78Q68
3032B11L78r68qL2J011r32J56Q6L73k91R4O81r08m5n2J116n11n06r1L77M8l87
3054a36M99k52L9o57Q61M98n97n38K30N45p10L91k58k02k23P66L84q31k23k72
3074f86J060n47j29M1j2K26l59Q17l63n22L4P07J6m50n9k73N68k15N03k42l69
$$ y = [-268, -230, 159, 176, -482, 415, 187, -346, -584, 100, 701, -371, -316, -523, 133, -103, 479, 134, -294, -211, -287, 598, 56, -14, -521, 113, 28, -201, 119, 196, -165, -471, 556, 287, -426, -327, 309, 565, -192, 417, -131, 3, 38, 305, 695, -104, -297, -396, 797, 138, 127, -105, 66, -181, 324, 613, 281, -103, -320, 575, 106, -17, -416, -212, 42, -621, 336, -254, -367, -895, 72, 690, -194, -690, -311, 422, -28, -28, -78, -372, -566, -270, 447, -222, -336, -513, 411, -21, -89, -208, -367, -43, -171, 774, 95, -286, -696, 27, 512, -242, -441, -130, 121, -657, 211, 589, -379, -387, -355, 656, -276, -120, -34, 339, 48, 142, 823, -85, -130, -182, 934, 423, -83, -174, 203, 251, -136, 363, 111, 150, -507, 354, 852, 255, -283, -53, 492, -218, 173, -85, -287, -510, 256, 640, -191, -414, -686, 374, -173, -302, -261, -273, -47, -406, 411, 48, -474, -440, 267, 283, -167, -226, -499, 69, -146, 357, 115, -254]
3095b54k20K40Q82n96m55j26P29l29R8L18k70l94M6J140o13l27k1L96R4m42N05
3116D01l91r9l7O88j92o08P1J65P81q14J95o1m4%K59L96o97m78L68Q46p47m1j47
3139a86m1J27j68P18q09J41k54M70K01m15p9L8N41o25M02k37j84j50N14M46o20
3160a70l96J14N47l35J33K22m17j93M52O42p19Ro5L27r5k54L84k49J87k07O52
3181E69k94l08k87M71M29o41K14l31L59l50M39K23m47n37M98O87l99k54j20K60
3201A81J08j72M86l82k65l05R89l47o23j6N03J46n15O50m19k21R4N98m01m18j5
3222c44r2P55m69p1K23j56j10k2P77p94l59K98N49j22n08J58J63L6m10Q02l34
3243c0m28J21P81K10j099K65J19L23k62N0J14l18k0K79P42q74q9q8N68j48l58
$$ y = [-254, -474, -234, 648, 52, -403, -529, 200, -129, -31, 287, 17, -377, -331, 809, 196, -131, -152, 244, 338, -104, 401, 10, -89, -126, 562, 370, -238, -167, -2, 779, -35, 160, 99, 55, 55, 314, 710, 13, -465, -97, 749, 2, -39, -186, -227, -100, -268, 450, -359, -218, -472, -2, 199, -216, -295, -257, 284, -341, 61, -176, -360, -510, 4, 450, -170, -566, -452, 95, -240, -107, 115, -302, -495, -43, 599, -120, -111, -176, 151, 56, -198, 186, -63, 124, -83, 569, 275, -33, -320, 151, 580, -61, 153, -178, 181, -169, 270, 493, 46, -491, 7, 694, 295, 41, -79, 181, 289, 117, 603, 221, -44, -349, 640, 293, -330, -346, 157, 303, -212, 438, 19, -202, -108, 490, 89, -329, -344, -436, 319, -150, -221, 2, -154, -264, -286, 491, -303, -662, -364, 185, 63, -445, -287, -124, -88, -498, 304, -30, -458, -337, 444, 654, -445, -180, -61, 262, 0, 50, 164, -154, -174, 105, 847, -27, -116, -204, 364, 216, -142]
3264a42M69m83J73r6P68l48n81r9N76J27l87L21m38K04m23Q88R9p62r5J55O37
3285E63n28n0J9j82K44j84N23p30j27pR44l09o30K59J52J74n82O49k41m45J48
3306c40M51M3n86JK58L32m35K51P9l20j45L89M83o98j83L18L48N1j91J06l87J77
3328Bo6O46j64m79k31L67L18n64K69J17J21m61M22j26n50k55P89L72m89r0j54
3349b06J86R9L92j10n10j41j8P30j19m67j29K42L09o49O92n34J34j42M97Q8o60
3370c16nL67K85m95K72j53j03l00O93J44l74l62N8M58k45p6K3R4L3j40K98l76
3392b20m9J65M20k5m23J21j82K98RM15k76k84j73M94L43q37L40r4K47k40j61K09
3414I7j67k81J70N85m63k52K44L67L0j88J56l30J32j63M90J00n23l51L93L80n41
$$ y = [-142, 327, -156, 17, -79, 689, 341, -240, -339, 237, 364, -23, 298, -140, 64, -359, 529, 628, -134, -229, -74, 563, 35, -15, 4, -178, 66, -118, 405, -325, -452, -459, 485, 176, -454, -195, -43, 131, -451, 198, -43, -488, -340, 111, 154, -432, -431, -173, 159, -276, -25, 54, -266, -411, -22, 461, -237, -420, -102, 246, 297, 106, 212, -175, 2, -64, 582, 418, -61, -292, 75, 393, -171, 98, 215, 336, -125, 297, 171, -379, -634, 155, 527, 38, -52, -206, -20, 79, 471, 361, -149, -290, -308, 422, 303, -164, -293, -51, 258, -391, 301, -233, -99, -241, 256, 344, -316, -321, 46, 331, -164, 108, -45, -148, -448, 245, 389, 15, -347, -289, 169, -76, -152, -129, -35, -2, -142, 156, -220, -269, -104, 316, 291, -132, -11, -193, 105, 114, 529, 253, -31, -204, 290, 633, -204, 136, 42, 289, 49, -112, 97, -70, -351, -181, 404, -59, -311, -67, 300, 330, 142, 298, -32, 100, -63, 427, 527, 4, -347, 46, 426, -115]
3435a15J63j33J35j55P0M21o68k24K57Q39l67l40k69J36pJ44L11m71q6j8O76M8
3457C47o12j94N39Q1j94P6m2q2k42N05J28m74j36K52O25m21k0Pl73L99k25L88
3479C32o09K07k87N98j11k62K06jP9k86M67m4p19J05N72O9k02j19n4L23k00J54
3501B18j28j36j33K20N11n76K98m29K35J22n49L85p7J7m85R70k97o40J84K86M09
3522D05p42L47j47r4k44L87O9k52m9m0P84n01O0k96K87k5k89Q51p53j02L38N08
3544E02k62k04J29l95L43m7M34m42p6k23Q15j19o79K94M0L38l15N3j80j17j22
3565b33M18M53q21L7Q7K90j07K9L1n33N91m12O21k97l49jL72n4k38Q6j57K08r
3588A2K37J1l75M8J36L53n17K1o8K17k81r3N11n59m9K52L78k32m5l29L44K15k94
$$ y = [-115, 48, -85, 50, -105, -35, 386, -282, -506, -249, 590, 223, -117, -386, -250, -257, -113, 198, -273, -359, -377, 299, 347, -265, -459, 80, 161, -33, 43, 1, -81, -323, 182, 310, -164, -300, -48, 577, 156, 136, 143, -230, 169, -56, 332, -277, -70, -357, 241, 130, -132, 74, 73, 152, -134, 333, 289, -430, -325, 247, 316, 114, -5, -59, 264, 64, 218, 90, -46, -179, 41, 552, -24, 274, -155, 80, 202, -347, 38, -39, -22, -507, 463, 166, -474, -290, -4, 405, -337, 10, -137, -231, -475, -88, -19, -271, -320, -360, 424, -77, -17, -313, -26, -51, -340, 511, -242, -344, -6, 502, 240, 36, 165, -230, 113, 66, 500, 58, -18, -241, 574, 455, -224, 70, 110, 448, 133, 186, 6, -111, -233, 185, 638, -183, -146, -59, 231, 124, 153, 184, -349, 242, -170, 451, 154, -195, -196, 176, 122, -116, -30, -187, 21, 12, 249, 260, -115, -67, 69, 422, -95, -74, -142, 75, -206, -299, 212, -347, -396, -144, 234, 2, -43, -372, -28, 187, -107]
3611a07R1M2k93j55O08L21q83N9L57J41m42K94j44j62Q8J98L49k54j65J5M93k25
3633B26j23k8L53k34k13O25j74l87r7M14j2m51J30j34J40K4P5J50m40J38RO1j77
3656a25K78j32q3J5P6P6j92q5J47L76l54m42K56MK52k81K94k17k72L12K61j06
3678E8k68r2K08L64m04K12m30M33l32Q8P68r90K77k42O99k34m71K79L6j13o2P59
3700E43p32k9m7N41R9l41N6j89N36k54K13k66r2q0M12J56o07k15L86K47m44J3
3722i4L72m48J37J45O7k28j38Q6J92K59j02l14o6J19k76L99O3o66K00nN58m27
3744a67k4J28k44K92j60K62l03R7j00P05m33l81K62m9K02k17N26n17j58J95O21
3765E37k48n01K2J97o1j21J09L49o65J93L23L70o60K76n7M99l28j37J50P1k81
$$ y = [-107, -16, 26, -267, -422, 186, 507, -376, -317, 40, 181, -261, 33, -111, -273, -185, 13, 362, 108, -57, -42, 451, 226, 103, 75, 428, 194, -19, 606, 432, 45, -52, 362, 350, -101, 29, -105, 35, 59, 134, 284, -156, -18, -9, 52, -125, 153, 21, -62, -47, 29, 105, -87, -172, -25, 351, -3, -445, -189, -185, 67, -214, 80, -137, -409, -97, 164, 58, -210, -302, -94, 270, -134, 78, -352, 81, -251, -163, 605, -385, -108, -350, 349, 115, -356, -77, -41, -154, -216, 543, -189, -218, -265, 276, 375, 34, 90, -99, 437, 183, 396, 130, 38, -42, 370, 526, -81, -296, 90, 337, -107, -94, 278, -170, -33, 112, 179, -49, -187, -101, 91, 350, 248, -66, -132, -13, -289, 110, 173, -493, -293, -298, 260, -167, -191, -63, -307, -15, -175, 87, -216, -119, -219, 486, 53, -328, -66, -115, 87, -130, 396, -121, -279, -84, 537, 289, -212, -190, 7, -54, -175, -66, 283, -382, -189, 134, 504, -156, 120, 63, 562, 234, 97, 247, 318, 37]
3786C7mM19n17K25l05L25J6p9j30j26J80N3p1L4p4L7K26K58o99O6rL58l78R4p5
3811a39j02p9L05L59k17m94M0M03j72j2K70n09RJ88L08j70m39J63L92K24m52J16
3833hm7k16j00N93J92m25j63j4L52k82o9K34r2l70K21O90p09P8R4K35kl79J25
3856f2k1K43j32L0j04j75q9N00L97n91R8j50L72j83M8P9l93L2Q4M83m96j64K40
3879D6M86n19l3J17j92K04l26N98n20j50J42j28L99q1j9j98J7q9L66J07m52j12
3901c37K33L33k71k64N6M85k69K0J57n84M01K01J42l30m06J96J45L48q5rrl06
3923a53N7N01j52p45J94L42J55j09k45L04k9j25K04K91o34k1L2N19j66j43R9j3
3945A63j47j24L67N9m31K11J76on29K09J04J34m4o3P4n35K85K24J49n55J09n7
$$ y = [37, 33, 452, -65, 160, -145, 180, 196, 117, -13, -139, 41, 94, 23, 57, -17, 20, 246, 504, -195, -129, -138, 220, -158, -64, -139, -241, -320, -15, 344, 127, -367, -327, 76, -96, -108, 162, -347, -338, -150, 158, -12, -451, -288, 104, 328, -124, -8, -55, -271, -371, 222, 414, -11, -174, -188, 164, -118, -187, 47, -45, -415, -194, 496, -213, -135, -41, 194, 192, -187, -62, -83, 160, 28, 58, -46, -221, -310, 190, 587, -4, 94, -56, 316, 133, 181, 260, -133, -101, -17, 466, -30, -194, 46, 532, 13, -20, 97, -95, 109, -217, 381, -139, -289, -147, -275, 124, 43, 24, -174, -157, -246, 120, 227, -225, -337, -104, 229, -42, -306, -250, 235, -34, -14, 143, -441, -40, 161, 303, -27, -433, -237, -92, 256, 171, 162, 153, -153, -96, 405, 253, -492, -298, 44, 199, 90, -155, 149, 120, -5, 199, 490, -144, -165, -133, 386, 220, 77, 176, 163, 16, -108, 259, 318, -113, 98, 274, 268, -261, -52, 52, 186, 142, 79, 153, -382, -97, 127, 276, -279, -170, -227]
3967b27J41J75jj56l25L19k61M33O7n39K03n9J77l22L51j56N8qJ75L00o97J81
3989a71L19K13k20l2j90J98j12M5K88m13q9J89L85l06k35J67p0N6N8M27n45K20
4011A82l48K50Q7j61J01j29J06j66J76K20l93m1J86M00n62k6P7J93j46k19O61
4032D48o64L34j15J45k9j10Q9k84J35j36K34k47K91j09m2o2n2j4L07K34m32R9
4054B0j22j11j4P5L41j74j23l7P8p2L5J71J9Q2m21L77j0j46J19J09J15n02r8N18
4078B29O1j58N7j84l05K24K71J14m34j31O8M06Ooj20k51L53k58J43k68j4J49L96
4101C48j10k84J56j79m5j11K35P7p1k50J27L13m59K07Q5N4j25K10k33L1j48K69
4123I7M6k33q7M1K40m9k79KO3J4j44N82j77l69J76J66J52p1j80n6J01l0p5L46
$$ y = [-227, -86, 89, 88, -68, -393, -74, -335, 98, 165, -374, -171, -230, -53, -375, -24, -180, -122, -130, 45, 345, -352, -171, 148, 361, 141, 109, -81, 117, 5, 50, 338, -75, -164, 25, 410, 104, -131, 36, -34, 22, 80, 507, -38, 182, -166, 84, 171, 10, 111, -18, 88, -78, 98, 318, -75, -116, 70, 470, -92, -118, -41, 152, 6, -213, 448, -216, 118, 3, 148, 119, 9, 98, -186, -51, -187, 47, -200, 91, -18, -60, -122, -174, -188, 119, 353, -79, 20, -102, -213, -227, -152, 189, 15, -108, -145, -67, -139, -104, 67, 86, 168, -253, 124, 114, -32, 87, 196, 311, -191, -289, 229, 290, 132, 189, 5, -300, -76, 195, 309, -125, -256, -188, 218, 224, 218, 98, -153, 200, -58, 85, -183, -197, -48, 348, 238, -46, 110, -69, -114, -225, 10, 87, 16, -234, -107, 206, -253, -46, 39, 93, -32, 178, -55, -24, -172, 97, 143, -90, -177, -136, 104, 55, -224, -222, -159, -145, -289, 293, 116, -253, -77, 89, 241, 170, -10, -66, 35, 5, -70, 276]
4147B76l79n7K36M66n82q4K80k86J81p0L78m29J35j25P8K62o15N86k73L06l20
4168c6J90k04j33J53o4M05k90j34J25R2l15L80j16l02l1K28M44m74j00J77L01
4189B96m35N5L43m10k12K01M79l29j22J33l5K98p85O74k74O6j08J45j19k04J78
4210a65J66K75m90L01o7J56k34j10M91n25J27r4M74r6l25qM88k32k39L60m11N2
4232a06NM20P0n38j06N81j04q2m4K19k25J6j28L17m78LO7N01j61l44K27j61oJ75
4256A18n1J97p51N38%j1j39R7j13K74k13K01p7l99J28j63O33m59m7J81R6r6j37
4279a93J13P7M1n0L29j65l95K25LR4k52K33M5J02k41J43K20k26l56J90M25l76
4301a4J49p7k52J80K7L42n04P9K6L94k84K6j29J04M8Q9k34j4O8k68N02P6l87K08
$$ y = [276, -103, -160, 76, 542, -40, -124, 156, -130, 51, -19, 359, -70, 65, -60, 18, 280, -335, 251, -22, 284, -36, 154, -50, -183, -30, -94, 311, 21, -113, 12, 104, -211, 169, 53, -249, -280, -52, 392, -82, -182, -5, 296, -139, -84, 259, -151, -363, -162, 317, -12, -134, -1, -36, 262, -523, 151, -123, -57, -165, -20, -139, -343, -165, 1, 276, -214, 87, 20, 176, -58, -168, 323, -202, -75, -169, 305, 209, -116, -124, 364, 132, -107, 253, -158, -106, -101, 319, 389, -149, -255, 326, 222, 140, 96, 315, 90, 106, -22, 295, -183, -180, -113, 388, 227, -117, 110, -51, -57, 118, 67, 264, -487, 51, 51, 40, -99, -2, -115, 159, -54, 147, 70, -329, -201, -364, 269, -190, -237, -56, 40, -56, -193, -80, -3, 38, -12, 317, 152, -243, -18, -15, 79, -173, 60, 105, 207, -34, 109, 329, 103, -253, -63, 362, -14, 135, 58, -194, -14, 13, 355, -149, -70, -44, 350, 66, 92, -37, 67, 115, 204, -30, -44, 24, -244, 258, 334, -53, 155]
4325A55j54k2%Q7J63m20J72j52J77M4j90J55J85k37j28K23j65N6P8K78j36k99
4347a30mM34j41m78K87m7q4O8L34n9o31K33j9K95k75L19M1j31Q4M0J18n56L0J09
4371a63L22N8m84L41O0nj68O9k82K24j02K35J97k96k97L81J16k02J81J26n12L56
4393A55P8j02j52k85K46L51k60j91J71o9m7m0M12k99k28JN92m29J1KO5l1r2K17
4417G6j31k91J50J78Nl26K13J11p6j95K40R2j27o6o2M72m70m0L40l3k30J13L66
4440C09k48j56L2L70k87J52k29K55J45l39rJ08Q8P8r4K5k21J58Pj55M4k35J16
4463h6j17k52O64j16L7k71Q2K91l0l14K11j67K54m23R5L15k95J21J53Pl73J4Q6
4486a14L82k04l1P6k62n2J20R6j45N4P2J79k8l65K69l11J29J4J50J0j28j87K44
$$ y = [155, 1, -21, -21, 66, 229, -191, -19, -171, 6, 50, -140, 15, 200, -37, -165, 58, -107, -51, 27, 305, 169, -130, -134, 300, 159, -319, -32, -79, -163, -95, 239, 180, -451, -218, -237, 58, -217, 102, 143, 12, 96, 136, 254, -302, -272, -163, 159, 217, -267, 74, 134, 129, -39, 30, -252, -28, -130, 105, 302, 6, -291, 90, 206, 4, 185, 311, -201, 155, 233, 131, -21, -306, -60, 291, 31, -160, 11, -58, -105, -145, 267, -32, -260, -259, 333, -96, -85, -83, -18, -49, -141, 76, -55, -346, -196, -18, -13, -339, -126, -15, -91, -286, -46, 46, -81, -147, -209, 263, -207, -247, 93, 60, -170, -57, 309, 61, -95, -63, 307, 20, 172, -57, 198, 343, 4, -5, 103, 191, 269, 175, 200, -21, 137, 144, -11, 33, -202, -86, -203, -455, 209, 93, 130, -141, -59, 232, 202, -112, 99, -68, 186, -237, -142, 173, -122, -1, 152, 159, -214, -200, -114, 268, 64, 33, 109, -153, -205, -85, 11, -134, -80, -8, 171, 143, -222, 47, -264, -135, -121, 29, 39, -89, -276, -32]
4509c2K23l50K46j96J01M1O2J97m09k83K15L23j90J26k91Q5l9K67n1j79K71j90
4531e3J97N8k52rJ93l01m5M33J16k36L0K70j2n84K24J22J01k17n5K80m24Q9O4
4554a1M10n22j55M26Mq9k27L47j97j49KK08j2j95J16m4L92m14j89K94j32J84j16
4577f9K30k89j7j2L63k30j79K27L5j56m2J42l46J62K20l8L58o18M01P4j87l41
4599c12O45n02Q9J42M8J00m76K25L70j26j62k6J22J49l61J58J52l86j18M07nl64
4621b31J02N8P5j31K06K09l16j89J37O9K04l03j30J60j50K91K15k15l53J45M10
4642B63l08J28k08L4J28j7r3o0k8J57N0j45Mp4j20L54k12Q7J69q8pl1K63L9o25
4667c40K2M02M1l5L0j95J24J22j03K73m39K3Q3Q9j09o2K94k5l68J90K00j67j37
$$ y = [-32, 191, -159, 87, -109, -8, 33, 95, 292, -117, -400, -185, 138, -52, 74, -217, -132, -171, 96, 45, -134, 137, -53, 144, 202, -50, -59, 134, -167, -212, 221, 337, 101, 131, 401, 389, -195, 29, 151, 252, 35, -20, 260, -164, -75, -11, 399, -123, -278, 148, 152, 63, -164, 183, -14, -163, -161, 47, 35, -160, -44, -88, 304, -110, -299, -5, -137, 47, -69, 161, -128, -145, -157, 206, -24, -203, 24, 59, -97, -139, 3, -343, -181, 39, 1, 359, -259, 142, 216, 29, -312, 333, -169, -80, 62, 110, 210, -266, -41, 329, 203, 41, 15, 137, 286, -75, 83, 235, -151, -269, 138, 133, -231, -129, -71, 4, -127, 79, 288, -28, -217, -80, -11, 193, -110, -240, -80, -230, 61, 276, 61, -292, -147, 263, -45, 83, -125, -91, 37, 20, -73, -133, -161, -4, 46, -99, -95, -169, -289, 65, -147, -60, 109, 21, 14, -17, 246, 285, -340, -318, 84, 125, 90, 120, -75, 49, 171, 68, 341, -98, -75, 8, 97, -12, -74, 220, 195, -173, 17, 217, 50, -87]
4690h7k0M11k59j20O1P6k4k2j31k9K06l8J49p4k29J55J75M3j52l25K68k48J91
4713b3j49M52k01m34K75M1J48m82K37O2j0K6M33n08o3K35K59j67k10j11oK08K22
4736B34k44J58m59L39J52M2q2l88M14j07J8j31N8P9l55M33K23k84k41O5J65M9
4758A38k36J71j43P6J32R5qj59oj36J69k06l1J41j35o3Q1K02L5j89J9J94j87l65
4782d11M29j22J57l58J19K66m64K41J80N9m30Q9K34k15J38K92k04n6k7K07p6k50
4804b02J83J53P2k36k1J85j33L8P8L8l03r5K82n8J53n31K90K96j75m8J23k9l13
4827b53J59K79mk43L9q6K05K07k78or6j16L34J20k02j58K18R6j21j39K92j45j75
4850g3K97k10R0l76J99q5O1J48M0l08J29qk2K39k65j04N7K76l25r4L11n5%R3M5
$$ y = [-87, -107, 304, 45, -75, -14, 62, 38, 16, -115, -144, 62, 24, 173, 99, -130, 25, 200, 243, 91, -234, 34, -214, -23, -172, 280, 79, -355, -80, -39, 109, -373, -136, -74, -84, -58, 375, -133, -196, 39, 298, 131, -79, -190, -196, 12, 234, -10, 148, -311, 28, 180, 222, 140, -248, 166, 59, 77, -54, 4, 83, -272, 161, 384, 100, -141, -76, 89, 138, -98, 73, -70, 6, 138, 233, 225, 66, 60, -76, 93, -113, -144, -3, -138, -201, -120, 82, 117, -72, -53, 141, -46, -411, 18, -104, 53, -305, -186, 80, -384, -143, 37, 96, -334, -245, -11, -226, -88, 204, 0, -56, -83, 124, 48, -202, -19, 134, 206, -30, -51, 134, 1, 39, 117, 155, -148, -243, 39, -19, 134, -397, -107, 189, 14, -34, 89, 60, -253, -94, 185, 181, -62, -23, -109, 96, 303, 25, 19, -77, -193, 141, 261, 59, -99, 119, 215, 94, -45, 247, 102, -73, 224, 14, 104, -272, -73, -158, -97, 51, 91, -217, -88, -96, -118, 121, -144, -248, -191, 85, -240, -334, -23, -78, -78, 15, 60]
4875F0k0q5j5K4J97k65K00j27l53P5L73j30%L06o9M8m43J5M25k57R3K14L2l10
4899a2l1J87J19m4l25K52k33K21q2K08j92j47J70N8r8j64J50j39J36k59K75K30
4921B80m37J23J77O5j61l30L91k9j49N1q1k6Q3j12O3j23K68j82L28k72j94L20
4943E3r0J34j18k5L14l79R0o6K72l58J68n3K07k03j09L72l18J7L40k09L7k03L22
4966A95M7j18j15K0m5j37J42OK45l7j33k56M52o18N26k97K83q0P6j08k09q8J45
4989a04K15l13L2L73r3k02j02L66k14k6p1K32j35k56J77K66l0k11R2o1N9j45K75
5012A24j35j48O1K15Q8l91J24K46j31Lo4P5m35J74L68j82j68R6J76n9j14J59J68
5035B50j88n0r6K66l67N7m4M14k71K02m3l2j96p6J70o8j35J75O6O1L8j98J81k25
$$ y = [60, 40, -45, -60, -36, 161, -104, 96, -31, -384, -309, 64, -66, -66, 240, 171, 219, -224, -209, 216, -41, 52, 266, 298, -12, -43, 144, 263, 219, -106, 146, -87, 134, 52, 260, 68, -79, 91, 149, 51, -113, 37, -102, 34, -225, 50, 280, -157, -34, 143, 208, 47, -283, 108, 79, -70, -19, -100, -126, -43, -155, -92, -215, 53, -129, 199, -73, -267, 53, -37, 97, -21, -46, 268, -111, -21, -87, 185, -173, -5, -58, 149, -54, -163, 209, -109, -92, 248, 39, 76, -127, 195, 242, 124, 9, 29, -16, -153, -11, -5, 240, 203, 70, -186, 266, -352, 174, -123, 160, 80, 156, 48, -161, -249, -104, 111, -202, -170, 203, 110, -92, -194, 172, -42, -68, -139, 93, -42, -298, -121, 145, 115, -96, -4, -65, -6, -151, 124, -11, -159, -98, 117, 205, -186, -62, 184, 53, 56, -8, 67, -368, -194, 174, -8, -176, -80, 96, 37, -77, 82, 250, 62, 12, -84, 182, -185, -128, -172, 242, -29, 173, 130, 98, -98, -174, -4, -72, -207, -32, 34, 95, 133, -65, 116, -109]
5059a09R0J02O9k23Qjr0L04m18K37M02n75J27J35K6k12K2N4jK19k35J26j10J50
5083I7l09J78j79oK40K58k58j33J20J8k04K63k52J20j99k9M87j59j01J98j46N9
5105F3J29l55P1j06K38l0RL6k14L96r2m5l9j01jJ32J81j95l8k03K18l4j6km9K2
5131b5J09M9k38J29K9k0m3p6j00J91k2n3J14R0l6j41n7J91j19j73k85L39L4J73
$$ y = [-109, -19, 83, 152, -71, -63, -64, -154, 150, -268, -31, 371, -204, -77, 58, 84, -128, -106, -52, -53, 166, -69, 57, -53, 97, -212, -34, -213, -219, 21, 279, 21, -112, 8, 26, -178, 85, -167, -47, -246, -275, 212, 53, -48, 150, 4, 63, 192, -163, -92, -198, 40, 10, 19, 55, -159, 237, 145, 100, 61, -40, -41, 91, 272, 77, 39, -164, 54, 20, 4, 2, -47, -25, 84, 133, -105, 24, 53, 33, -10, -86, -186, 5, -17, -70, 44, 134, 98, -43, -100, 91, -28, -201, -486, -147, -113, 60]
$$ [...]
8191A45
##END NTUPLES=NMR FID
##END=
