##TITLE=1H_EC-3028(III-3)
 CDCl3, 8 sc, 
 25.9.2020
##JCAMPDX= 6.0         $$ Bruker NMR JCAMP-DX V2.0
##DATA TYPE= NMR FID
##DATA CLASS= NTUPLES
##ORIGIN= UXNMR, Bruker Analytische Messtechnik GmbH
##OWNER= root
$$ XWIN-NMR		Version 3.5
$$ Fri Sep 25 10:42:54 2020 Russian Standard Time (UT+4h)  she@DPX200
##.OBSERVE FREQUENCY= 200.1315066352
##.OBSERVE NUCLEUS= ^1H
##.DELAY= (6, 6)
##.ACQUISITION MODE= SIMULTANEOUS
##.ACQUISITION SCHEME= undefined
##.AVERAGES= 8
##.DIGITISER RES= 18
##SPECTROMETER/DATA SYSTEM= spect
##.PULSE SEQUENCE= zg30
##.SOLVENT NAME= CDCl3
##.SHIFT REFERENCE= (INTERNAL, CDCl3, 0, 15.7039)
##AUDIT TRAIL= $$ (NUMBER, WHEN, WHO, WHERE, WHAT)
$$ ##TITLE= Audit trail, XWIN-NMR		Version 3.5
$$ ##JCAMPDX= 5.01
$$ ##ORIGIN= Bruker BioSpin GmbH
$$ ##OWNER= she
$$ F:/spectra/data/she/nmr/H-F/1/audita.txt
$$ ##AUDIT TRAIL=  $$ (NUMBER, WHEN, WHO, WHERE, WHAT)
(   1,<2020-09-25 10:41:38.03 +0400>,<she>,<DPX200>,
      <created by zg, POWCHK disabled, PULCHK disabled
       configuration hash MD5:
       00 E9 B6 7A A2 85 ED C7 34 08 36 98 17 FE 4E 26
       data hash MD5: 16K
       E1 D1 68 26 F4 FA FD 64 FC 6F FE C6 FD D2 18 FE>)
$$ ##END=
$$ 
$$ hash MD5
$$ 68 2C 34 CA 84 5B C1 7F 90 39 E2 AE 72 6E E6 25
##$RELAX= 
##$RELAX= 
##$RELAX= 
##$RELAX= 
##$RELAX= 
##$RELAX= 
$$ Bruker specific parameters
$$ --------------------------
##$DU= <F:/spectra>
##$EXPNO= 1
##$NAME= <H-F>
##$PROCNO= 1
##$TYPE= <nmr>
##$USER= <she>
##$AMP= (0..31)
100 100 100 100 100 100 100 100 100 100 100 100 100 100 100 100 100 100 
100 100 100 100 100 100 100 100 100 100 100 100 100 100 
##$AQSEQ= 0
##$AQ_mod= 1
##$AUNM= <au_zg>
##$AUTOPOS= <>
##$BF1= 200.13
##$BF2= 200.13
##$BF3= 200.13
##$BF4= 200.13
##$BF5= 200.13
##$BF6= 200.13
##$BF7= 200.13
##$BF8= 200.13
##$BYTORDA= 1
##$CFDGTYP= 0
##$CFRGTYP= 5
##$CHEMSTR= <none>
##$CNST= (0..31)
1 1 145 1 1 1 1 1 1 1 1 1 1 1 1 1 1 1 1 1 1 1 1 1 1 1 1 1 1 1 1 1 
##$CPDPRG= <>
##$CPDPRG1= <>
##$CPDPRG2= <>
##$CPDPRG3= <>
##$CPDPRG4= <mlev>
##$CPDPRG5= <mlev>
##$CPDPRG6= <mlev>
##$CPDPRG7= <mlev>
##$CPDPRG8= <mlev>
##$CPDPRGB= <>
##$CPDPRGT= <>
##$D= (0..31)
0 1.2 0 0 0 0 0 0 0 0.06 0 0.03 0 0 0 0 0.0002 0 0 0 0 0 0 0 0 0 0 0 0 
0 0 0 
##$DATE= 1601016097
##$DBL= (0..7)
120 120 120 120 120 120 120 120 
##$DBP= (0..7)
150 150 150 150 150 150 150 150 
##$DBP07= 0
##$DBPNAM0= <>
##$DBPNAM1= <>
##$DBPNAM2= <>
##$DBPNAM3= <>
##$DBPNAM4= <>
##$DBPNAM5= <>
##$DBPNAM6= <>
##$DBPNAM7= <>
##$DBPOAL= (0..7)
0.5 0.5 0.5 0.5 0.5 0.5 0.5 0.5 
##$DBPOFFS= (0..7)
0 0 0 0 0 0 0 0 
##$DE= 6
##$DECBNUC= <off>
##$DECIM= 32
##$DECNUC= <off>
##$DECSTAT= 4
##$DIGMOD= 1
##$DIGTYP= 9
##$DL= (0..7)
0 120 120 120 120 120 120 120 
##$DP= (0..7)
150 150 150 150 150 150 150 150 
##$DP07= 0
##$DPNAME0= <>
##$DPNAME1= <>
##$DPNAME2= <>
##$DPNAME3= <>
##$DPNAME4= <>
##$DPNAME5= <>
##$DPNAME6= <>
##$DPNAME7= <>
##$DPOAL= (0..7)
0.5 0.5 0.5 0.5 0.5 0.5 0.5 0.5 
##$DPOFFS= (0..7)
0 0 0 0 0 0 0 0 
##$DQDMODE= 0
##$DR= 18
##$DS= 0
$$ [...]
##$SUBNAM2= <"">
##$SUBNAM3= <"">
##$SUBNAM4= <"">
##$SUBNAM5= <"">
##$SUBNAM6= <"">
##$SUBNAM7= <"">
##$SUBNAM8= <"">
##$SUBNAM9= <"">
##$SW= 16.880792210976
##$SWIBOX= (0..15)
0 0 2 0 0 0 0 0 0 0 0 0 0 0 0 0 
##$SW_h= 3378.37837837838
##$TD= 16384
##$TD0= 1
##$TE= 0
##$TE2= 300
##$TE3= 300
##$TEG= 300
##$TL= (0..7)
0 120 120 120 120 120 120 120 
##$TP= (0..7)
150 150 150 150 150 150 150 150 
##$TP07= 0
##$TPNAME0= <>
##$TPNAME1= <>
##$TPNAME2= <>
##$TPNAME3= <>
##$TPNAME4= <>
##$TPNAME5= <>
##$TPNAME6= <>
##$TPNAME7= <>
##$TPOAL= (0..7)
0.5 0.5 0.5 0.5 0.5 0.5 0.5 0.5 
##$TPOFFS= (0..7)
0 0 0 0 0 0 0 0 
##$TUNHIN= 0
##$TUNHOUT= 0
##$TUNXOUT= 0
##$USERA1= <user>
##$USERA2= <user>
##$USERA3= <user>
##$USERA4= <user>
##$USERA5= <user>
##$V9= 5
##$VALIST= <valist>
##$VCLIST= <CCCCCCCCCCCCCCC>
##$VD= 0
##$VDLIST= <DDDDDDDDDDDDDDD>
##$VPLIST= <PPPPPPPPPPPPPPP>
##$VTLIST= <TTTTTTTTTTTTTTT>
##$WBST= 1024
##$WBSW= 4
##$XGAIN= (0..3)
0 0 0 0 
##$XL= 0
##$YL= 0
##$YMAX_a= 306805
##$YMIN_a= -290516
##$ZGOPTNS= <>
##$ZL1= 120
##$ZL2= 120
##$ZL3= 120
##$ZL4= 120
##$ABSF1= 10
##$ABSF2= 0
##$ABSG= 5
##$ABSL= 3
##$ALPHA= 0
##$AQORDER= 0
##$ASSFAC= 0
##$ASSFACI= 0
##$ASSFACX= 0
##$ASSWID= 0
##$AUNMP= <proc_1d>
##$AZFE= 0.1
##$AZFW= 0.1
##$BCFW= 1
##$BC_mod= 2
##$BYTORDP= 1
##$COROFFS= 0
##$CY= 11.3945322036743
##$DATMOD= 1
##$DC= 2
##$DFILT= <>
##$DTYPP= 0
##$F1P= 16.9975609425685
##$F2P= -3.02152046262296
##$FCOR= 0.5
##$FTSIZE= 0
##$FT_mod= 4
##$GAMMA= 1
##$GB= 0.15
##$INTBC= 1
##$INTSCL= 1
##$ISEN= 128
##$LB= 0.24
##$LEV0= 0
##$LPBIN= 0
##$MAXI= 10000
##$MC2= 0
##$MEAN= 0
##$ME_mod= 0
##$MI= 1.114404
##$NCOEF= 0
##$NC_proc= 0
##$NLEV= 6
##$NOISF1= 3.799351
##$NOISF2= 2.8
##$NSP= 1
##$NTH_PI= 0
##$NZP= 0
##$OFFSET= 15.70392
##$PC= 1
##$PHC0= -9973.836
##$PHC1= 16.8009
##$PH_mod= 1
##$PKNL= yes
##$PPARMOD= 0
##$PSCAL= 0
##$PSIGN= 0
##$REVERSE= no
##$SF= 200.130013532006
##$SI= 16384
##$SIGF1= 3
##$SIGF2= 2
##$SINO= 400
##$SIOLD= 16384
##$SREGLST= <1H.CDCl3>
##$SSB= 0
##$STSI= 0
##$STSR= 0
##$SW_p= 3612.71676300578
##$SYMM= 0
##$S_DEV= 0
##$TDeff= 0
##$TDoff= 0
##$TI= <>
##$TILT= no
##$TM1= 0
##$TM2= 0
##$TOPLEV= 0
##$USERP1= <user>
##$USERP2= <user>
##$USERP3= <user>
##$USERP4= <user>
##$USERP5= <user>
##$WDW= 1
##$XDIM= 8192
##$YMAX_p= 0
##$YMIN_p= 0
$$ End of Bruker specific parameters
$$ ---------------------------------
##NTUPLES= NMR FID
##VAR_NAME=  TIME,          FID/REAL,        FID/IMAG
##SYMBOL=    X,             R,               I
##VAR_TYPE=  INDEPENDENT,   DEPENDENT,       DEPENDENT
##VAR_FORM=  AFFN,          ASDF,            ASDF
##VAR_DIM=   8192,          8192,            8192
##UNITS=     SECONDS,       ARBITRARY UNITS, ARBITRARY UNITS
##FACTOR=    0.000296,      1,               1
##FIRST=     0,             0,               0
##LAST=      2.424536,      0,               0
##MIN=       0,             -290516,         0
##MAX=       2.424536,      306805,          0
$$ Real data points
##PAGE= N=1
##DATA TABLE= (X++(R..R)), XYDATA
$$ plain form
0 0 0 0 0 0 0 0 0 0 0 0 0 0 8 -8 8 -8 8 -16 16 -23 24 -32 37 -42 48 -60 71 -81 93 -108 124 -143 164 -186
34 -186 210 -238 268 -301 337 -377 422 -469 521 -579 643 -710 785 -866 954 -1051 1159 -1277
52 -1277 1407 -1550 1709 -1887 2090 -2318 2580 -2883 3238 -3666 4186 -4840 5692 -6851 8545
67 8545 -11287 16789 -58353 179679 15223 -290516 -22130 190264 -67197 -70696 211518
78 211518 67298 -40363 165376 241486 -108942 9783 266863 71151 -151187 67657
88 67657 239331 -41897 -47290 121829 91430 -31313 66911 77171 -106805 5949 76807
99 76807 -65777 -195820 9018 49238 -139612 -117964 6044 22046 -90432 -16463 -21762
110 -21762 -29894 15834 -4615 -61883 -62608 79207 7882 -53968 -1527 97601 71582 27060
$$ packed form
0@%%%%%%%%%%%%Qj6J6j6J6k4L2l9M7n6O9p9R0j08J31j52J74k01K32k67L07l50
34a86L96m48N06n69O38p14P99q91R90j100J222j353J495j651J820k005K210k436
52a277K684k957L259l596L977m408M898n463O121o904P852r026J0532j2543J5396
67H545j9832K8076p5142K38032j64456l05739K68386K12394k57461l499K82214
78B11518j44220j07661K05739P6110l50428J18725K57080j95712k22338K18844
88F7657J71674k81228n393J69119l0399j22743R8224J0260j83976J12754P0858
99G6807j42584j30043K04838M0220j88850K1648J24008J6002j12478P3969n299
110b1762q132M5728k0449n7268p25J41815p1325o1850N2441R9128k6019m4522
$$ plain form
122 27060 70956 51082 120135 97706 42079 2217 102138 116043 -30983 596 78551 84788
134 84788 -18960 37048 53034 16401 51241 30973 -27125 -49416 83147 631 -116168
145 -116168 -44030 64781 -13312 -110901 21009 28770 -9981 -10585 30657 -22574 -12216 78745
157 78745 -20100 -66472 20668 104567 -39045 -53019 77810 72349 11748 7026 76317 21746
169 21746 51305 53914 -8859 -11198 58875 58486 -68926 -4631 56381 31969 -36454 -2237 35526
182 35526 2891 23024 -29584 -29960 -3302 34440 -52888 -75184 23821 10645 -30898 -44315
194 -44315 24041 -5993 7753 17828 -33023 -15278 39026 29360 -93643 -12477 64526 -5357
206 -5357 -71990 6844 60770 -33893 419 20423 -11056 -25662 51701 -626 -101012 12068
$$ packed form
122B7060M3896j9874O9053k2429n5627l9862R9921J3905j47026L1579P7955O237
134H4788j03748N6008J5986l6633L4840k0268n8098k2291J32563q2516j16799
145a16168P2138J08811p8093r7589J31910P761l8751o04M1242n3231J0358R0961
157G8745r8845m6372Q7140Q3899j43612j3974J30829n461o0601m722O9291n4571
169B1746K9559K609o2773k339P0073l89j27412O4295O1012k4412o8423L4217L7763
182C5526l2635K0133n2608l76K6658L7742q7328k2296R9005j3176m1543j3417
194d4315O8356l0034J3746J0075n0851J7745N4304r666j23003Q1166P7003o9883
206e357o6633P8834N3926r4663L4312K0004l1479j4606P7363n2327j00386J13080
$$ plain form
218 12068 58476 -44599 -107204 46355 43466 -70382 -28556 34745 -4846 -49184 42467 -21330
230 -21330 -67390 19354 49487 -70129 -82707 84649 25362 -75306 -20740 81174 -3890
241 -3890 -42525 44925 2966 -26926 16667 47379 -68947 -27900 80305 -86 -77727 4046
253 4046 90318 -34681 -40437 28310 18381 -28107 90 12901 -63448 6386 35477 -32815
265 -32815 -71333 35601 46685 -60128 -20753 30290 16331 -37411 10388 -6772 -29092 25444
277 25444 7418 -42806 -29012 69299 -774 -50711 10823 48830 1150 -27600 28246 -9692
289 -9692 2550 17686 -4457 -40110 15119 52766 -41184 -26876 32208 40644 -35869 -7060
301 -7060 28292 -8568 4439 2715 -13435 -33292 43569 11753 -54333 -5943 50875 11013
$$ packed form
218A2068M6408j03075o2605J53559k889j13848M1826O3301l9591m4338R1651o3797
230b1330m6060Q6744L0133j19616j2578J67356n9287j00668N4566J01914q5064
241c890l8635Q7450m1959k9892M3593L0712j16326M1047J08205q0391p7641Q1773
253D046Q6272j24999n756O8747r929m6488K8197J2811p6349O9834K9091o8292
265c2815l8518J06934J1084j06813L9375N1043j3959n3742M7799j7160k2320N4536
277B5444j8026n0224J3794R8311p0073m9937O1534L8007m7680k8750N5846l7938
289i692J2242J5136k2143l5653N5229L7647r3950J4308N9084Q436p6513K8809
301g060L5352l6860J3007j724j6150j9857P6861l1816o6086M8390N6818l9862
$$ plain form
313 11013 -55311 23880 27376 -8125 -9315 13663 -9976 -14842 42498 -15989 -35453 15330 57148
326 57148 -25253 -38612 46339 24718 -15520 -13657 28881 -13928 2299 21671 -23468 -21939
338 -21939 27226 36053 -55755 -6775 49235 8000 -41631 2733 34528 -26769 -1148 3356
350 3356 -15881 -22099 32241 483 -60232 14940 39921 -14968 -53956 29345 20363 -32678 -9071
363 -9071 5752 -9749 -18528 29953 -25438 -30704 30593 28752 -36745 -24925 57525 2038 -27049
376 -27049 1159 25853 -12891 -1196 24453 -27991 -2179 33258 13752 -47033 14100 49889
388 49889 -17750 -25767 15859 27299 -29042 4323 5522 -17867 2205 19942 -12520 -40649
400 -40649 35524 18535 -31293 -22574 30415 5558 -34053 8700 -3358 -8070 -1178 15459 -26229
$$ packed form
313A1013o6324P9191L496l5501j190K2978k3639m866N7340n8487j9464N0783M1818
326E7148q2401j3359Q4951k1621m0238J863M2538m2809J6227J9372m5139J529
338b1939M9165Q827r1808M8980N6010m1235m9631M4364L1795o1297K5621M504
350C356j9237o218N4340l1758o0715P5172K4981n4889l8988Q3301q982n3041K3607
363i071J4823j5501q779M8481n5391n266O1297j841o5497J1820Q2450n5487k9087
376b7049K8208K4694l8744J1695K5649n2444K5812L5437j9506o0785O1133L5789
388D9889o7639q017M1626J1440n6341L3365J199k3389K0072J7737l2462k8129
400d0649P6173j6989m9828Q719N2989k4857l9611M2753j2058m712O892J6637m1688
$$ plain form
413 -26229 -9208 41976 -1637 -28250 4300 49281 -14411 -17620 20116 12013 -3685 3657 16992
426 16992 -23438 17205 28254 -10556 -25326 25610 31783 -36313 -6655 18218 4814 -25959
438 -25959 4708 516 -23216 13662 4071 -23779 -21452 39647 -2560 -43155 6209 26739 -10376
451 -10376 -30737 24162 -3007 -13499 13150 12893 -21038 1117 50681 -14456 -21965 29740 43045
464 43045 -23803 -9800 44396 5540 -5963 14214 22978 -17865 21324 33194 -21454 -10071
476 -10071 34600 21933 -44473 5641 28193 -12027 -23976 9033 5492 -28663 13673 -268
488 -268 -24982 -8699 29067 -11503 -41118 19470 15745 -18059 -23364 21593 -1969 -12887 13259
501 13259 -2194 -8035 7823 27917 -21773 -5781 30172 10138 -18432 604 30700 -10418
$$ packed form
413b6229J7021N1184m3613k6613L2550M4981o3692l209L7736q103j5698P342J3335
426A6992m0430M0643J1049l8810j4770N0936O173o8096K9658K4873j3404l0773
438b5959L0667m192k3732L6878r591k7850K327O1099m2207m0595M9364K0530l7115
451a0376k0361N4899k7169j0492K6649k57l3931K2155M9564o5137p509N1705J3305
464D3045o6848J4003N4196l8856j1503K0177Q764m0843L9189J1870n4648J1383
476a0071M4671j2667o6406N0114K2552m0220j1949L3009l541l4155M2336j3941
488b68k4714J6283L7766m0570k9615O0588l725l3804n305M4957k3562j0918K6146
501A3259j5453n841J5858K0094m9690J5992L5953k0034k8570J9036L0096m1118
$$ plain form
513 -10418 1391 9530 974 -5494 18702 9796 -30619 11605 23150 -8377 -32631 16847 13795
526 13795 -28073 -5893 5480 -5716 -20739 15638 -9864 -25276 10500 14223 -22220 -26761
538 -26761 32114 1266 -25731 -3168 21265 -6059 -13429 22635 -5745 -6501 14781 20269 -22678
551 -22678 -1983 37341 -4786 -19768 8631 30152 -18357 -6846 18151 -898 -7981 7952
563 7952 10433 -27049 8574 16704 -14056 -23996 11487 13706 -29076 -5094 4192 -2770 -15565
576 -15565 3353 -6711 -15777 11131 -4823 -15791 -10149 18660 -10361 -17588 6600 2029 -3127
589 -3127 -4103 9316 -14033 7998 14659 -8829 -10521 14555 18468 -23632 3731 16754 508
602 508 -11785 12306 8243 -16605 16292 9511 -13213 -10698 30088 281 -31071 12421 19407
$$ packed form
513a0418J1809Q139q556o468K4196q906m0415M2224J1545l1527k4254M9478l052
526A3795m1868K2180J1373j1196j5023L6377k5502j5412L5776L723l6443m541
538b6761N8875l0848k6997K2563K4433k7324p370L6064k8380p56K1282N488m2947
551b2678K0695L9324m2127j4982K8399K1521m8509J1511K4997j9049p083J5933
563G952K481l7482L5623Q130l0760r940L5483K219m2782K3982R286o962j2795
576a5565J8918j0064r066K6908j5954j0968N642K8809k9021p227K4188m571n156
589c127r76J3419k3349K2031O661k3488j692K5076L913m2100K7363J3023j6246
602E08j2293K4091m063k4848L2897o781k2724K515M0786k9807l1352M3492O986
$$ plain form
615 19407 -12713 -20930 24348 -2858 -19818 10863 10633 -19882 -11101 32763 -14187 -26985 14254
628 14254 22589 -26545 -18381 31766 -4052 -20175 5065 20110 -20524 -3792 26435 -11490
640 -11490 -17667 14907 23152 -29725 -4649 26973 -1535 -19923 6949 20854 -19522 1589
652 1589 11772 -5332 -12477 14226 6773 -26724 5821 13706 -6984 -21635 12241 5529 -17841
665 -17841 1969 1552 -6326 -10226 12888 -10699 -13837 10181 3399 -13872 -9138 18871 -8512
678 -8512 -7305 5220 3101 -6607 4063 11719 -17331 5118 14961 -52 -16094 13088 16712
691 16712 -16106 2990 13282 2544 -12771 16960 5221 -16449 9432 15022 -9034 -19013
703 -19013 25096 4345 -21312 445 17248 -6347 -17454 18518 -2607 -13509 3339 14009
$$ packed form
615A9407l2120q217M5278k7206j6960L0681k30l0515Q781M3864m6950j2798M1239
628A4254Q335m9134Q164N0147l5818j6123K5240J5045m0634J6732L0227l7925
640a1490o177L2574Q245n2877K5076L1622k8508j8388K6872J3905m0376K1111
652A589J0183j7104p145K6703p453l3497L2545P885k0690j4651L3876o712k3370
665a7841J9810m17p878l900K3114k3587l138K4018o782j7271M734K8009k7383
678h512J207J2525k119r708J0670P656k9050K2449R843j5013j6042K9182L624
691A6712l2818J9096J0292j0738j5315K9731j1739k1670K5881N590k4056r979
703a9013M4109k0751k5657K1757J6803k3595j1107L5972k1125j0902J6848J0670
$$ plain form
715 14009 -15345 -11451 22897 -4432 -16354 2476 20770 -14005 -9602 16569 -389 -7996 2732
728 2732 13691 -16117 2198 15393 -4573 -12177 8549 15943 -16848 460 10134 1849 -10300
741 -10300 5293 7173 -11897 6216 3377 -3103 -8627 12875 1935 -12308 5568 6251 1673
754 1673 -7194 11263 -1648 -193 9936 1989 -2303 3531 17969 -8257 1232 13570 6715 -5986
768 -5986 5403 16318 -8626 5010 9191 727 -9434 13067 9335 -18124 2587 12079 -888
781 -888 -18421 11471 5266 -15778 45 7453 -6596 -16155 15150 -3113 -17205 2792 12939
794 12939 -11318 -15905 19888 -55 -12669 1336 15444 -8913 -6325 20062 -3058 -8750 7678
807 7678 19114 -14259 -3179 20576 258 -10903 4708 17211 -14305 -1584 10149 -2979
$$ packed form
715A4009k9354L894L4348k7329j1922J8830J8294l4775M403K6171j6958p607J0728
728B732J0959k9808J8315J3195j9966p604K0726P394l2791J7308R674q285j2149
741a0300J5593J880j9070J8113k839o480n524K1502j0940j4243J7876O83m578
754A673q867J8457j2911J455J0129p947m292N834J4438k6226R489J2338o855j2701
768e986J1389J0915k4944J3636M181q464j0161K2501l732k7459K0711R492j2967
781h88j7533K9892o205k1044J5823P408j4049r559L1305j8263j4092J9997J0147
794A2939k4257m587L5793j9943j2614J4005J4108k4357K588K6387k3120n692J6428
807G678J1436l3373J1080K3755k0318j1161J5611J2503l1516J2721J1733j3128
$$ plain form
819 -2979 -10594 4312 6492 -20482 398 5730 -7454 -17013 3686 2613 -17720 -1319 -171
832 -171 -6174 -11851 6747 -4231 -12773 4767 2629 -6310 -8012 14375 -2576 -7100 5944 7050
846 7050 -1841 -2228 13874 -5237 591 8934 6678 -6950 2627 14401 -7512 -845 5376 4752
860 4752 -10481 3270 5679 -11674 -806 3031 -3324 -16610 7098 708 -16622 -5492 4845
873 4845 -4836 -18610 7283 -2926 -12892 -3193 6991 -8602 -13147 13468 -2706 -10999 -31
886 -31 13843 -8281 -8135 14783 726 -5794 2301 13969 -9003 91 14352 -1118 -6292 6545
900 6545 14221 -12139 1730 11494 -88 -7443 6352 9308 -12498 4444 6714 -2689 -8719 9615
914 9615 4017 -13637 4471 6204 -2020 -9895 9853 720 -8281 4732 3866 -2814 -5638 12686
$$ packed form
819b979p615J4906K180k6974K0880N332j3184r559K0699j073k0333J6401J148
832a71o003n677J8598j0978q542J7540k138q939j702K2387j6951m524J3044J106
846G050q891l87J6102j9111N828Q343k256j3628R577J1774k1913O667O221o24
860D752j5233J3751K409j7353J0868L837o355j3286K3708o390j7330J1130J0337
873D845r681j3774K5893j0209r966R699J0184j5593m545K6615j6174q293J0968
886c1J3874k2124J46K2918j4057o520Q095J1668k2972R094J4261j5470n174J2837
900F545P676k6360J3869R764j1582p355J3795K956k1806J6942K270r403o030J8334
914I615n598j7654J8108J733q224p875J9748r133r001J3013q66o680k824J8324
$$ plain form
928 12686 -3455 -4972 5844 5583 -4726 -3153 12581 -4786 -1193 4715 5188 -5402 2478 10471
942 10471 -7915 642 6737 4846 -9724 5107 8721 -7375 -366 5398 3151 -11058 7578
955 7578 3798 -7973 -1014 6690 -1450 -12891 9422 1256 -8354 -3884 7571 -4070 -10597 9186
969 9186 -2263 -7646 -1384 9771 -8628 -7365 11213 -1585 -7971 502 12459 -9788 -2909
982 -2909 10391 120 -6038 3845 11940 -10658 2236 10690 819 -7646 6510 10412 -10369 2781
996 2781 6450 -48 -8123 6866 3018 -11249 2725 2396 -4498 -10793 7424 -3698 -12365 549
1010 549 871 -7019 -9905 7171 -7546 -8393 1822 1895 -8611 -4935 10324 -6975 -3927 4261 6086
1025 6086 -6929 1000 11197 -4486 503 5970 6859 -6857 7029 9343 -4818 671 6857 5157
$$ packed form
928A2686j6141j517J0816k61j0309J573J5734j7367L593N908M73j0590P880P993
942A0471j8386Q557O095j891j4570J4831L614j6096P009N764k247j4209J8636
955G578l780j1771O959P704q140j1441K2313q166r610M470J1455j1641o527J9783
969I186j1449n383O262J1155j8399J263J8578j2798o386Q473J1957k2247O879
982b909J3300j0271o158R883Q095k2598J2894Q454r871q465J4156L902k0781J3150
996B781L669o498q075J4989l848j4267J3974l29o894o295J8217j1122q667J2914
1010E49L22p890k886J7076j4717q47J0215P3j0506L676J5259j7299L048Q188J825
1025F086j3015P929J0197j5683M989N467Q89j3716J3886K314j4161N489O186j700
$$ plain form
1039 5157 -9278 6878 4141 -5778 -2312 4795 -1333 -11797 6094 -1623 -8788 -5385 5195 -6062
1053 -6062 -12895 5489 -2278 -7943 -4910 7241 -6454 -5882 7824 140 -3794 1335 12639 -4733
1067 -4733 977 11722 4913 -476 6819 14484 -3002 6935 11566 4892 -1319 9915 10654 -6608
1081 -6608 6319 8111 953 -6942 7547 2799 -10165 1769 2162 -5480 -10617 5991 -4855 -12125
1095 -12125 -548 567 -8353 -10410 7189 -6147 -8106 645 3328 -6323 -3325 10468 -4785
1108 -4785 -1760 5890 7629 -4997 4080 13153 -1634 1884 8391 9337 -5231 7287 10073 -2088
1122 -2088 1077 7533 4700 -8936 6408 4625 -5557 -4392 4524 -250 -11599 3628 -1423 -7198
1136 -7198 -6347 3609 -5423 -10423 3745 -2716 -6250 -4961 6483 -5868 -5014 5690 -65 -2947
$$ packed form
1039E157j4435J6156k737r919L466P107o128j0464J7891p717p165L403J0580j1257
1053f062o833J8384p767n665L033J2151j3695N72J3706p684l934N129J1304j7372
1067d733N710J0745o809n389P295P665j7486R937M631o674o211J1234P39j7262
1081f608J2927J792p158p895J4489m748j2964J1934L93p642n137J6608j0846p270
1095a2125J1577J115q920k057J7599j3336j959Q751K683r651K998J3793j5253
1108d785L025P650J739j2626R077R073j4787L518O507R46j4568J2518K786j2161
1122b088L165O456k833j3636J5344j783j0182J165Q916m774j1349J5227n051n775
1136g198Q51R956r032n000J4168o461l534J289J1444j2351Q54J0704n755k882
$$ plain form
1150 -2947 61 8701 -5439 699 7447 1622 -3206 3243 9392 -6334 2082 5394 1260 -5491
1164 -5491 3773 4540 -8601 1080 2047 -2672 -9104 3782 -1023 -10992 -806 203 -4867 -9775 4390
1179 4390 -4305 -9048 359 930 -6345 -6647 8180 -4702 -5896 2883 4980 -5974 -2477 10528
1193 10528 -3536 -2718 4043 6767 -6666 1450 9628 -4170 -2693 4542 6380 -8953 1938 5877
1207 5877 -4671 -3764 3155 2334 -10594 2725 1688 -5712 -4630 3813 -746 -10271 4331 934
1221 934 -4094 -4023 6173 -1466 -5237 6550 973 -2084 -539 9537 -2321 -1741 7284 2687 -1489
1236 -1489 520 8907 -3368 488 4771 1332 -2600 1676 5240 -6630 1112 2440 -503 -6406
1250 -6406 1666 1900 -7791 459 281 -2394 -7136 4026 -607 -7651 1382 2248 -2309 -6436 7504
$$ packed form
1150b947L008Q640j4140O138O748n825m828O449O149j5726Q416L312m134o751
1164e491R264P67j3141R681R67m719o432J2886m805r969J0186J009n070m908J4165
1179D390q695m743R407N71p275l02J4827j2882j194Q779K097j0954L497J3005
1193A0528j4064Q18O761K724j3433Q116Q178j3798J477P235J838j5333J0891L939
1207E877j0548R07O919q21j2928J3319j037p400J082Q443m559r525J4602l397
1221I34n028P1J0196p639l771J1787n577l057J545J0076j1858N80R025m597m176
1236a489K009Q387j2275L856M283l439l932M276L564j1870P742J328k943n903
1250f406Q072K34r691Q250j78k675m742J1162m633p044R033Q66m557m127J3940
$$ plain form
1265 7504 -212 -4488 2323 5298 -1351 -2690 9890 -722 -1614 4778 7721 -2719 -154 10811
1279 10811 -317 -1033 3901 7434 -4901 1092 7866 -2334 -1691 3365 4728 -8169 2016 4993
1293 4993 -4280 -4756 3162 3136 -9185 2271 2417 -3861 -4287 4208 871 -7945 3769 1966 -2447
1308 -2447 -3430 6580 131 -4885 4716 2480 -525 -1863 6903 -1773 -890 4919 1459 -1606 183
1323 183 6905 -3636 -243 2949 548 -3296 796 3731 -6060 713 1084 -1281 -5571 2433 1471
1338 1471 -7524 381 1099 -1032 -6262 3280 -567 -5498 1521 1587 -2337 -5041 6319 -1252 -4244
1353 -4244 1795 3910 -2551 -3215 7730 -1117 -1930 2244 5191 -3251 -649 8098 -2132 -2227 3421
1368 3421 6822 -5449 -166 6830 -1557 -3162 2139 5209 -6752 1222 4375 -2482 -4230 2816
$$ packed form
1265G504p716m276O811K975o649j339J2580j0612q92O392K943j0440K565J0965
1279A0811j1128p16M934L533j2335N993O774j0200O43N056J363j2897J0185K977
1293D993r273m76P918k6j2321J1456J46o278m26Q495l337q816J1714j803m413
1308b447r83J0010o449n016R601k236l005j338Q766q676Q83N809l460l065J789
1323A83O722j0541L393L192k401l844M092K935r791O773L71k365m290Q004r62
1338A471q995P905P18k131n230R542l847m931P019O6l924k704J1360p571k992
1353d244O039K115o461o64J0945q847q13M174K947q442K602Q747j0230r5N648
1368C421L401j2271N283O996q387j605N301L070j1961P974L153o857j748P046
$$ plain form
1382 2816 3226 -8205 1291 2662 -2190 -5881 2555 881 -6950 1617 348 -3027 -4798 4124 -1942
1397 -1942 -5959 2401 639 -2767 -3518 5460 -2442 -2864 2613 1495 -1645 -309 5955 -3412 80
1412 80 4239 2616 -2761 1233 5935 -2710 1177 2392 1754 -2823 3326 2717 -4423 1705 2081 -569
1428 -569 -5210 4014 424 -5189 -156 1100 -1830 -5501 4178 -2504 -4720 436 2666 -3852 -4728
1443 -4728 5918 -1731 -3390 -64 4896 -2950 -2080 5639 -285 -661 2130 5732 -3401 1379 6985
1458 6985 320 -1310 3070 6699 -3379 1466 4246 211 -1719 2339 2897 -5883 1418 1367 -2493
1473 -2493 -5347 2056 -188 -7591 -618 -280 -2747 -6081 1130 -2564 -5517 497 -910 -3157 -3994
1488 -3994 4059 -2650 -2859 1871 1743 -1185 -752 5170 -1272 1770 3573 2585 -658 3619 5955 -2491
$$ packed form
1382B816M10j1431R496J371m852l691Q436j674p831Q567j269l375j771Q922o066
1397a942m017Q360j762l406p51Q978p902m22N477j118l140J336O264r367L492
1412H0M159j623n377L994M702q645L887J215o38m577O149o09p140O128L76k650
1428e69m641R224l590n613N033J256k930l671R679o682k216N156K230o518q76
1443d728J0646p649j659L326M960p846Q70P719n924l76K791L602r133M780N606
1458F985o665j630M380L629j0078M845K780m035j930M058N58q780P301n1l860
1473b493k854P403k244p403O973L38k467l334P211l694k953O014j407k247q37
1488c994Q053o709k09M730j28k928M33N922o442L042J803r88l243M277K336q446
$$ plain form
1504 -2491 2314 4585 3210 -2689 3487 3499 -2780 1443 2056 -483 -5079 3819 -371 -5511 -853 1689
1520 1689 -2562 -7003 2767 -1895 -4879 -2095 876 -3483 -4356 3790 -3080 -3692 521 3817 -3721
1535 -3721 -2121 5448 190 -1412 1418 5343 -2721 1309 5018 -283 -798 2958 5121 -4325 1422
1550 1422 4140 -161 -3400 1241 3230 -4513 455 225 -1492 -4139 1512 -911 -5993 392 -297
1565 -297 -2332 -4983 2269 -1075 -3913 377 281 -1257 -2076 3898 -2497 -1089 3249 2464 -1768 -75
1581 -75 6342 -1007 200 2724 3547 -1378 1985 4749 -2121 1312 2963 2028 -3892 2937 3413 -3433
1597 -3433 -669 1944 1128 -4699 2343 84 -3406 -424 2027 -1634 -5164 4116 -236 -3759 -1405
1612 -1405 3649 -1768 -3785 3903 -406 -1437 249 3875 -2416 -1064 5013 -370 -2101 814 5436
$$ packed form
1504b491M805K271j375n899O176J2o279M223O13k539m596Q898m190n140M658K542
1520A689m251m441R770m662k984K784K971m359q73Q146o870o12M213L296p538
1535c721J600P569n258j602K830L925q064M030L709n301n15L756K163r446N747
1550A422K718m301l239M641J989p743M968k30j717k647N651k423n082O385o89
1565b97k035k651P252l344k838M290r6j538q19N974o395J408M338p85m232J693
1581g5O417p349J207K524Q23m925L363K764o870L433J651r35n920O829M76o846
1597c433K764K613q16n827P042k259l490K982K451l661l530R280m352l523K354
1612a405N054n417k017P688m309j031J686L626o291J352O077n383j731K915M622
$$ plain form
1627 5436 -2977 -921 3228 377 -1309 215 2945 -3836 1125 1968 -1268 -2893 1734 1883 -4636
1642 -4636 777 949 -382 -3098 1672 32 -3044 1892 257 -1058 -2323 4317 -378 -2663 2038
1657 2038 2000 -137 -1672 4331 -379 246 1878 1555 -708 321 4344 -1941 -230 1882 2718 -2660
1673 -2660 240 3208 -2306 -265 562 453 -3611 1576 1214 -3997 -785 1643 182 -5392 2032 819
1689 819 -2737 -1626 1440 -148 -3489 3049 -729 -2254 -219 3700 -1770 -3451 3906 437 -1564
1704 -1564 -669 3622 -1363 -1134 2822 -575 -1089 526 3515 -3904 -165 3151 -383 -2724 235 3258
1720 3258 -3764 -148 789 -756 -2184 1571 840 -4269 848 1350 -909 -3462 2248 710 -3170 447
1736 447 373 77 -1967 2580 -1401 -1452 2184 924 -1263 -1488 4439 -1269 -725 1371 1973 -1045 14
$$ packed form
1627E436q413K056M149k851j686J524K730o781M961Q43l236j625M627J49o519
1642d636N413J72j331k716M770j640l076M936j635j315j265O640m695k285M701
1657B038l8k137j535O003m710O25J632l23k263J029M023o285J711K112Q36n378
1673b660K900K968n514K041Q27j09m064N187l62n211L212K428j461n574P424j213
1689H19l556J111L066j588l341O538l778j525K035L919n470j681P357l469k001
1704a564Q95M291m985K29L956l397n14J615K989p419L739L316l534k341K959L023
1720C258p022L616R37j545j428L755p31n109N117N02k259k553N710j538l880L617
1736D47p4k96k044M547l981n1L636j260k187k25N927n708N44K096O02l018J059
$$ plain form
1753 14 3258 -1947 414 1892 1386 -3164 985 3455 -2649 -1139 1242 1838 -3402 440 817 -2420
1769 -2420 -665 465 -436 -4671 1932 140 -3094 -2084 1573 -409 -4739 1321 -300 -1751 -1535
1784 -1535 1933 -1741 -2479 3101 -431 -1909 -534 4443 -1320 -1845 2809 1116 -580 10 3754 -1486
1800 -1486 665 2845 907 -1205 1547 3681 -2725 371 1782 1235 -1924 659 1583 -2118 837
1815 837 -101 -793 -2306 1977 -449 -3355 594 531 -1101 -3181 2132 -792 -1251 444 458 -1266 -931
1832 -931 3118 -1790 -739 1571 2168 -1594 -454 3550 -766 574 784 1739 -949 1302 2333 -2032
1848 -2032 848 1797 1322 -3412 1422 1598 -1761 -932 661 790 -3231 1518 -623 -1951 -746 1321
1864 1321 -1148 -3619 2255 274 -1376 -2035 2289 -56 -1965 1660 114 190 -540 2703 -1072 -191
$$ packed form
1753A4L244n205K361J478n06m550M149K470o104J510K381N96n240L842L77l237
1769b420J755J130r01m235O603j792l234J010L657j982m330O060j621j451K16
1784a535L468l674p38N580l532j478J375M977n763n25M654j693j696N90L744n240
1800a486K151K180j938k112K752K134o406L096J411n47l159K583R24l701K955
1815H37r38o92j513M283k426k906L949o3j632k080N313k924m59J695J4j724L35
1832i31M049m908J051K310N97l762J140M004m316J340K10R55k688K251J031m365
1848b032K880R49m75m734M834J76l359Q29J593J29m021M749k141j328J205K067
1864A321k469k471N874j981j650o59M324k345j909L625j546P6p30L243l775Q81
$$ plain form
1880 -191 2938 725 -852 -50 3633 -730 311 1133 861 -549 683 1972 -2441 1290 1131 -36
1896 -36 -2362 1367 1426 -2952 145 251 343 -2453 1174 -721 -1858 1154 307 -1064 -2218 3179 -697
1913 -697 -1683 372 1415 -832 -1370 2493 -1440 -70 892 1030 -2155 414 3041 -2183 -1119 1248
1929 1248 2092 -3144 -396 1575 -1783 -780 334 641 -3773 1213 1184 -2412 -1749 1451 1065 -3714
1945 -3714 868 707 -505 -1353 1364 422 -1784 2507 374 -396 -637 3452 45 -1415 2237 1173
1961 1173 305 -814 2868 -769 -358 1344 13 -958 -365 2474 -2574 -598 741 640 -2229 -953
1977 -953 1477 -1987 -354 -834 -559 -2308 583 322 -2958 74 487 66 -2837 1348 547 -1204 467
1994 467 671 438 -1123 2676 -514 -667 1357 2309 -797 -1441 3360 -110 -568 177 1784 -849 -504
$$ packed form
1880a91L129k213j577Q02L683m363J041Q22k72j410J232J289m413L731j59j167
1896c6k326L729N9m378L097J06R2k796L627j895j137L012q47j371j154N397l876
1913f97r86K055J043k247n38L863l933J370R62J38l185K569K627n224J064K367
1929A248Q44n236K748J971l358J003J114L07m414M986k9l596O63L200l86m779
1945c714M582j61j212q48K717r42k206M291k133p70k41M089l407j460L652j064
1961A173q68j119L682l637M11J702j331r71N93K839n048J976J339j01k869J276
1977i53K430l464J633m80K75j749K891k61l280L032M13m21k903M185q01j751J671
1994D67K04k33j561L799l190j53K024R52l106o44M801l470m58P45J607k633L45
$$ plain form
2011 -504 1889 -1299 -479 291 1433 -2901 -182 1777 -1339 -1585 -510 1677 -2528 320 -3 -955
2027 -955 -486 969 530 -2760 2162 1044 -695 -1255 2185 1137 -1423 1746 760 534 -502 2080
2043 2080 -74 -205 2516 762 -26 -593 2896 -780 -400 831 761 241 -199 1596 -1740 605 248
2060 248 -213 -1628 144 1275 -2471 -29 37 475 -1930 637 315 -1536 979 126 -257 -2112 1965
2077 1965 287 -1794 68 961 115 -1947 1797 -289 -392 292 932 -822 -729 2630 -995 -865 462
2094 462 2208 -1433 -939 1805 -379 -4 25 1444 -1880 1111 1499 -1089 -624 1166 1717 -2377 831
2111 831 1438 -179 -1305 637 1034 -2016 1341 371 -598 -795 1812 -127 -2250 1245 503 -117 -1675
2128 -1675 1583 -700 -1078 775 -289 -727 -453 1898 -2037 -550 1147 383 -1466 -516 1964 -1718
$$ packed form
2011e04K393l188Q20P70J142m334K719J959l116k46J075K187m205K848l23r52
2027i55M69J455m39l290M922j118j739n60L440j048k560L169r86k26j036K582
2043B080k154j31K721j754p88n67L489l676L80J231p0n20m40J795l336K345l57
2060B48m61j415J772J131l746K442O6M38k405K567l22j851K515q53l83j855M077
2077A965j678k081J862Q93q46k062L744k086j03O84O40j754R3L359l625J30J327
2094D62J746l641M94K744k184L75K9J419l324K991L88k588M65J790N51m094L208
2111H31O07j617j126J942L97l050L357r70r69j97K607j939k123L495p42o20j558
2128a675L258k283l78J853j064m38K74K351l935J487J697p64j849R50K480l682
$$ plain form
2144 -1718 131 483 246 -990 1111 995 -2352 424 627 419 -2304 958 846 -1472 27 343 327
2161 327 -1899 1325 -433 -1375 392 620 -531 -1782 1838 -418 -986 -628 1058 -441 -988 1781
2177 1781 -759 -446 232 1781 -1550 -71 2246 -269 -688 217 2176 -1149 173 880 51 209 461
2194 461 1229 -1725 980 824 -616 -1212 1037 1128 -2150 453 -143 -130 -1089 768 -461 -1464 1163
2211 1163 -221 -817 -1218 2123 -590 -1483 495 443 -309 -1161 1640 -1182 -26 887 229 -966 71
2228 71 1812 -1454 89 826 1095 -984 222 1156 -1237 790 260 129 -1641 1326 636 -1789 259
2245 259 657 331 -2165 1355 58 -672 7 494 -383 -1166 1918 -510 -808 226 1588 -618 -1017
2262 -1017 1751 159 128 -27 1578 -601 467 1478 -443 -21 567 1607 -1732 585 978 -80
$$ packed form
2144a718J849L52k37j236K101j16l347K776K03k08k723L262j12k318J499L16j6
2161C27k226L224j758r42J767K28j151j251L620k256n68L58J686j499n47K769
2177A781k540L13O78J549l331J479K317k515m19R05J959l325J322P07q29J58K52
2194D61P68k954K705j56j440n96K249R1l278K603n96J3r59J857j229j003K627
2211A163j384n96m01L341k713q93J978n2p52q52K801k822J156R13o58j195J037
2228G1J741l266J543P37K69k079J206R34k393K027n30j31j770K967o90k425K048
2245B59L98l26k496L520j297p30O79M87q77p83L084k428k98J034J362k206l99
2262a017K768j592l1j55J605k179J068J011j921M22N88J040l339K317L93j058
$$ plain form
2278 -80 -774 209 1252 -1624 485 140 -624 -962 942 86 -1998 380 40 -409 -1833 937 -138
2295 -138 -1221 430 -336 13 -961 1211 -814 -787 994 645 -658 -845 1840 -841 -238 665 549 -407
2313 -407 293 1460 -1413 252 860 605 -1525 500 1475 -1260 -217 391 600 -1720 829 387 -1008
2330 -1008 330 548 -89 -1880 1625 241 -866 -295 983 0 -1375 1443 -516 -287 310 1175 -731
2347 -731 -318 1881 -488 -511 -68 1605 -1029 -459 1061 -323 -209 -37 1140 -1781 485 769 -376
2364 -376 -923 276 1184 -1692 176 228 310 -1080 191 -195 -1112 606 -298 -247 -936 1088 -253 -804
2382 -804 428 155 137 -1177 1069 -661 -437 593 329 -415 -588 1569 -1181 -297 443 897 -695 -179
2400 -179 1089 -538 390 103 646 -694 993 906 -1032 330 818 674 -1384 1288 485 -310 34 550
$$ packed form
2278h0o94R83J043k876K109l45p64l38J904q56k084K378l40m49j424K770j075
2295a38j083J651p66L49r74K172k025K7J781l49j303j87K685k681O03R03j16r56
2313d07P00J167k873J665O08k55k130K025R75k735J043O08K09k320K549m42j395
2330a008J338K18o37j791L505j384j107N71J278r83j375K818j959K29N97Q65j906
2347g31M13K199k369k3M43J673k634N70J520j384J14J72J177k921K266K84j145
2364c76n47J199R08k876J868N2Q2j390J271l86r17J718r04N1o89K024j341n51
2382h04J232k73j8j314K246j730K24J030k64p44j73K157k750Q84P40M54j592N16
2400a79J268j627R28k87N43j340J687q7j938J362M88j44k058K672q03p95L44N16
$$ plain form
2418 550 443 -1020 1411 -228 -544 -137 1277 -467 -1580 1500 -177 -580 -681 675 -845 -849 794
2435 794 -864 -594 -126 1064 -1357 -432 1040 -187 -370 -102 1178 -1030 393 200 -136 -280 700
2452 700 751 -1422 775 455 144 -849 735 481 -1043 378 -102 75 -1057 683 -430 -1036 497
2469 497 -208 -314 -1263 1076 -538 -741 144 201 -377 -249 918 -946 335 598 469 -478 676 1518
2487 1518 -681 299 720 919 -617 1003 826 -296 718 530 527 -1276 1198 378 -944 -582 321 344
2505 344 -1866 372 -351 -659 -782 196 -753 -1601 771 -749 -848 -744 753 -812 -1024 747 -74 -285
2523 -285 -157 1474 -862 131 914 163 -194 508 1795 -645 513 893 843 -353 293 1190 -944 739
2541 739 182 104 -878 669 151 -1371 -50 -422 -365 -1465 304 -765 -672 -287 -193 -716 -992 714 -925
$$ packed form
2418E50j07j463K431j639l16M07J414j744j113L080j677m03j01J356j520mJ643
2435G94j658K70M68J190k421R25J472j227j83K68J280k208J423j93l36j44R80
2452G00N1k173K197l20l11r93J584k54j524J421m80J77j132J740j113o06J533
2469D97p05j06r49K339j614k03Q85N7n78J28J167j864J281K63j29r47J154Q42
2487A518k199R80M21J99j536J620j77j122J014j88lj803K474q20j322L62R03K3
2505C44k210K238p23l08j23R78r49q48K372j520r9J04J497j565k12J771q21k11
2523b85J28J631k336R93P83p51l57P02J287k440J158L80n0j196O46Q97k134J683
2541G39n57p8r82J547n18j522J321l72N7j100J769j069R3L85R4n23k76J706j639
$$ plain form
2560 -925 -598 265 627 -492 -276 1508 -143 424 335 935 -256 621 1599 -309 474 827 1268 -671
2578 -671 728 858 -248 -120 109 726 -1083 525 -484 -707 -324 -45 -561 -1777 122 -524 -641 -1428
2596 -1428 57 -477 -1492 375 -501 -620 -705 1032 -660 -522 968 108 -255 -117 1716 -297 335
2613 335 1057 722 89 598 1570 -573 676 821 431 -530 377 673 -933 470 5 -174 -869 872
2631 872 257 -901 333 -142 -436 -1284 822 -319 -933 82 176 -429 -628 874 -567 31 337 755
2649 755 -304 -269 1136 -416 201 521 973 -380 278 884 -447 383 365 477 -1109 766 296 -604
2667 -604 -324 141 601 -1571 111 -175 -460 -607 111 -198 -1149 484 -359 -376 -637 767 -140 -1036 891
2686 891 -295 112 -131 1124 -381 -107 949 24 19 42 1415 -568 191 646 288 -417 -34 1167 -873
$$ packed form
2560i25L27Q63L62j119K16J784j651N67q9O00j191Q77R78j908P83L53M41j939
2578f71J399J30j106J28K29O17j809J608j009k23L83K79n16j216J899o46j17p87
2596a428J485n34j015J867q76j19q5J737j692J38J490q60l63J38J833k013O32
2613C35P22l35o33N09R72k143J249J45l90r61R07K96j606J403m65j79o95J741
2631H72o15j158J234m75k94q48K106j141o14J015R4o05j99J502j441N98L06M18
2649G55j059L5J405j552O17L20M52j353O58O06j331Q30j8J12j586J875m70r00
2667f04K80M65M60k172J682k86k85j47P18l09r51J633q43j7k61J404r07q96J927
2686H91j186M07k43J255j505K74J056r25nK3J373j983P59M55l58p05L83J201k040
$$ plain form
2705 -873 107 366 262 -649 448 459 -970 266 -164 302 -1355 576 -57 -681 59 -92 57 -728 1102
2724 1102 -164 -569 444 369 43 -538 1091 56 252 198 863 -544 -354 917 -734 -127 -94 591
2742 591 -1148 -125 560 -789 -655 -109 534 -1059 133 -27 -750 -327 107 326 -1440 522 27 -353
2760 -353 -442 176 182 -617 955 -8 -122 -206 860 19 -641 903 247 -93 47 1005 -318 -471 652 151
2780 151 -211 24 1004 -487 -28 310 268 -558 -163 588 -663 153 13 177 -728 12 389 -656 284
2799 284 -60 359 -1122 564 104 -742 62 409 257 -914 882 -125 -140 -1 297 -181 -625 1080
2817 1080 -440 -52 -31 479 -388 -426 770 -505 -274 -222 331 -833 228 479 -622 -427 -12 777 -1184
2836 -1184 569 604 -408 -211 52 321 -1005 805 39 -187 -323 838 309 -845 589 57 165 -587
$$ packed form
2705h73R80K59j04r11J097J1j429J236m30M66j657J931o33o24P40j51J49p85J830
2724A102j266m05J013p5l26n81J629j035J96n4O65j407J90J271j651O07L3O85
2742E91j739J023O85j349J34N46O43j593J192j60p23M23M34K19j766J962m95l80
2760c53q9O18Op99J572r63j14q4J066q41o60J544o56l40J40R58j323j53J123n01
2780A51l62K35R80j491M59L38m2q26L95P51j251Q16j40J64r05P40L77j045R40
2799B84l44M19j481J686m60q46Q04L47j52j171J796j007j5J39K98m78m44J705
2817A080j520L88K1N10q67l8J196j275K31N2N53j164J061K51j101J95M15P89j961
2836a184J753L5j012J97K63K69j326J810p66k26j36J161n29j154J434n32J08p52
$$ plain form
2854 -587 778 -112 -502 746 -28 -31 -62 1122 -498 3 514 70 -106 -176 975 -607 -15 127 172 -334
2874 -334 -52 537 -909 390 393 141 -829 190 182 -751 35 -192 154 -725 204 -127 -479 44 119 -237 -1085
2895 -1085 810 1 -220 -150 89 -59 -451 510 -534 58 106 590 -635 -232 494 -419 -84 -68 665 -806
2915 -806 32 414 -36 55 121 755 -807 566 557 -13 -133 388 667 -866 554 104 63 -464 403 187
2935 187 -262 452 -131 96 -448 654 -122 -426 546 -113 386 -339 956 -379 -40 371 68 2 25 948
2955 948 -707 30 -26 64 -414 -93 761 -634 334 -102 495 -600 400 149 -714 43 93 -49 -804 422
2975 422 -221 -218 -7 -53 -43 -648 581 -210 -289 85 508 -296 -466 937 -404 99 -111 691 -235 109 747
2996 747 -3 -72 134 933 -532 79 702 133 -211 -163 527 -656 150 188 182 -111 -112 340 -843 248 21
$$ packed form
2854e87J365q90l90J248p74ll1J184j620N01N11m44j76p0J151j582N92J42M5n06
2874c34K82N89j446J299Lk52r70J019qr33P86k27L46q79R29l31l52N23P5l56q48
2895a085J895q09k21P0K39j48l92R61j044N92M8M84j225M03P26r13L35J6P33j471
2915h06Q38L82m50R1O6O34j562J373rn70j20N21K79j533J420m50m1n27Q67k16
2935A87m49P14n83K27n44J102p76l04R72o59M99p25J295j335L39M11l03o6K3R23
2955I48j655P37n6R0m78L21Q54j395R68m36N97j095J000k51q63P57N0j42p55J226
2975D22o43LK11m6J0o05J229p91p9L74M23q04j70J403j341N03k10Q02r26L44O38
2996G47p50o9K06P99j465O11O23n69l44M8O90j183Q06L8ok93jM52j183J091k27
$$ plain form
3017 21 214 -507 497 87 -579 365 54 246 -567 912 -155 -168 505 77 -92 -587 842 -489 187
3036 187 124 211 -42 -286 882 -475 120 63 379 -511 -90 272 -480 -44 -349 350 -682 367 53 -559
3056 -559 283 146 -218 -545 669 61 -544 74 237 137 -518 591 -121 215 -14 557 29 -188 868
3075 868 -238 256 256 825 4 -118 533 -147 125 -122 511 -308 -102 148 166 -371 -108 341 -799 177
3095 177 57 -268 -443 76 164 -627 367 -66 -161 -690 380 155 -707 189 -91 290 -567 567 28 -248
3115 -248 213 103 -37 -245 494 -364 -156 114 114 -310 -194 600 -359 331 -49 117 -468 -77 428 -519 -84
3136 -84 -215 469 -713 16 117 -236 91 12 196 -724 632 -9 -293 26 167 -11 -538 772 -17 -95
3156 -95 17 511 -11 -333 575 -120 126 -86 580 -439 -59 256 -169 -151 -160 476 -594 -63 194 -91 -409
$$ packed form
3017B1J93p21J004m10o66R44l11J92q13J479j067j3O73m28j69m95J429j331O76
3036A87o3Q7k53k44J168j357N95n7L16q90M21L62p52M36l05O99j032J049l14o12
3056e59Q42j37l64l27J214o08o05O18J63j00o55J109p12L36k29N71n28k17J056
3075H68j106M94%N69q21j22O51o80K72k47O33q19K06K50J8n37K63M49j140R76
3095A77j20l25j75N19Q8p91R94m33r5n29J070k25q62Q96k80L81q57J134n39k76
3115b48M61j10j40k08P39q58K08K70%m24J16P94r59O90l80J66n85L91N05r47M35
3136h4j31O84j182P29J01l53L27p9J84r20J356o41k84L19J41j78n27J310p89p8
3156i5J12M94n22l22R08o95K46k12O66j019L80L15m25J8rO36j070N31K57k85l18
$$ plain form
3177 -409 -245 587 -712 238 221 -29 -243 169 335 -473 124 67 251 -386 76 -50 -392 239 -204 -32
3197 -32 -723 242 -66 -306 -86 -53 30 -365 379 -299 -215 57 59 -375 -279 240 -338 152 21 330 -448 -80
3219 -80 422 -82 450 -18 358 -523 549 364 -129 -90 165 486 -135 722 242 45 -73 370 29 -297
3239 -297 493 -96 37 -350 451 -22 -269 570 -269 -68 -369 531 -504 -432 155 -235 -54 -178 475 -912
3259 -912 32 43 58 -380 -6 478 -687 108 -14 103 -352 306 526 -454 428 110 17 -210 285 247 -395
3280 -395 362 19 412 -445 727 120 15 35 106 100 -526 573 -175 254 10 297 -88 -128 672 -318 146
3301 146 158 25 -440 26 347 -205 -8 -161 -72 -547 256 334 -298 186 18 354 -667 151 -10 -92 -9
3322 -9 43 123 -175 532 38 250 -274 483 -21 -285 497 19 20 -285 557 -443 -255 296 -65 -31 -303 449
$$ packed form
3177d09J64Q32j299R50j7k50k14M12J66q08N97n7J84o37M62j26l42O31m43J72
3197c2o91R65l08k40K20L3Q3l95P44o78Q4K72Km34R6N19n78M90j31L09p78L68
3219h0N02n04N32m68L76q81J072j85m93L9K55L21o21Q57m80j97j18M43l41l26
3239b97P90n89J33l87Q01m73k47Q39q39K01l01R00j035P2N87l90J81j24O53j387
3259i12R44J1J5m38L74M84j165P95j22J17m55O58K20r80Q82l18r3k27M95l8o42
3280c95P57l43L93q57J172o07j05K0P1oo26J099p48M29k44K87l85m0Q00r90M64
3301A46J2j33m65M66L21n52J97j53Q9m75Q03P8o32M84j68L36j021Q18j61q2Q3
3322iN2Q0k98P07m94K12n24P57n04k64P82m78Jl05Q42j000J88N51l61L4k72P52
$$ plain form
3344 449 -715 -32 220 -142 -416 -135 337 -479 239 26 -62 -574 40 44 -267 191 -138 330 -362 354 -129
3365 -129 -334 273 125 59 -153 685 -164 138 190 528 31 -319 594 44 280 122 206 -18 152 548 -225
3386 -225 267 -109 165 -179 161 235 -220 -123 -313 350 -653 104 -8 -311 149 -295 -8 -716 166 -155
3406 -155 -215 -231 133 28 -494 560 179 10 -142 588 -205 -299 307 77 -167 -277 494 -269 -191 20 33
3427 33 -34 -105 394 -571 92 -13 118 -161 68 314 -593 -159 169 -139 -380 147 53 -416 105 -65 -69 -542
3449 -542 376 99 -274 206 106 354 -312 471 -132 -1 -137 87 -41 -222 656 -238 1 272 74 -209
3469 -209 -117 340 -351 28 173 5 -278 29 361 -280 -186 -455 302 -357 204 -39 -192 -176 -179 -79 -620 279
3491 279 -32 142 -156 17 75 -457 476 -98 80 -321 387 -37 -121 159 -173 -128 -44 363 -432 33 152
$$ packed form
3344D49j164O83K52l62k74K81M72q16P18k13q8n12O14Ml11M58l29M68o92P16m83
3365a29k05O07j48o6k12Q38q49L02N2L38m97l50R13n50K36j58Q4k24J70L96p73
3386b25M92l76K74l44L40P4m55R7j90O63j003P57j12l03M60m44K87p08Q82l21
3406a55o0j6L64j05n22J054l81j69j52P30p93r4O06k30k44j10P71p63P8K11J3
3427C3o7p1M99r65O63j05J31k79K29K46r07M34L28l08k41N27r4m69N21j70mm73
3449e42R18k77l73M80j00K48o66P83o03J31j36K24j28j81Q78q94K39K71j98k83
3469b09R2M57o91L79J45j68k83L07L32o41R4k69P57o59N61k43j53J6lJ00n41Q99
3491B79l11J74k98J73N8n32R33n74J78m01P08m24q4K80l32M5Q4M07p95M65J19
$$ plain form
3512 152 215 -69 -221 380 -81 115 183 188 122 -15 536 -24 354 179 240 -303 207 263 -161 130 245 10
3534 10 -339 263 34 12 -71 69 255 -371 344 -280 -245 -214 4 -272 -434 277 -463 -22 -281 379 -271 -159
3556 -159 235 -257 273 -116 438 -200 203 50 55 117 2 402 -298 330 -56 -75 15 151 147 -498 152 -257
3578 -257 -150 -352 71 -153 -504 171 -166 -379 -428 106 -583 -522 196 -299 -211 -288 326 -281 -161 26 115 112
3600 112 -45 401 -125 277 188 223 29 250 241 132 270 -16 282 -224 482 448 205 44 -58 334 -463 579
3622 579 -114 -179 -146 82 28 -446 333 -139 -279 -91 54 -256 -505 318 -176 -216 -163 68 -247 -19 301 -27
3644 -27 231 -178 442 -176 -26 196 -157 5 30 183 -81 348 2 -378 -131 248 123 -361 391 107 -81
3665 -81 -276 421 26 -114 39 -84 -106 -432 361 6 -187 350 110 43 -250 483 -63 -91 125 26 -188 -31
$$ packed form
3512A52O3k84j52O01m61J96O8No6j37N51n60L78j75O1n43N10N6m24K91J15k35
3534A0l49O02k29k2q3J40J86o26P15o24L5L1K18k76j62P11p40M41k59O60o50J12
3556a59L94m92N30l89N54o38M03j53NO2j15M00p00O28l86j9R0J36mo45O50m09
3578b57J07k02M23k24l51O75l37k13m9N34o89O1P18m95Q8p7O14o07J20J87Q9l
3600A12j57M46n26M02q9L5j94K21rj09J38k86K98n06P06l4k43j61j02L92p97J042
3622E79o93o5L3K28n4m74P79m72j40J88J45l10k49Q23m94m0N3K31l15K28L20l28
3644b7K58m09O20o18J50K22l53J62K5J53k64M29l46l80K47L79j25m84P52k84j88
3665h1j95O97l95j40J53j23k2l26P93l55j93N37k40o7k93P33n46k8K16r9k14J57
$$ plain form
3687 -31 175 -426 310 -37 59 -104 54 257 -292 17 -148 96 -344 -56 70 -317 -4 116 -164 -490 138
3708 138 -162 -71 -25 60 -39 -356 -47 -49 33 -6 -92 -75 -80 520 -22 28 -47 364 -290 69 212 -137 18 2 404
3733 404 -242 110 112 -131 -129 -134 279 -329 61 -237 51 -142 -23 172 -427 -19 -109 206 -296 327 -127 -151 216
3756 216 -128 130 -128 397 133 -78 210 119 92 -54 372 -69 81 -87 195 -200 -455 335 -284 181 -187
3777 -187 -19 -293 -219 -411 -357 208 -165 -138 -321 110 39 -425 -18 -123 79 -178 305 -41 -236 -20 97
3798 97 174 -331 279 -45 155 77 134 -20 68 297 -32 84 6 314 -18 76 91 -184 -148 197 112 -251 -71
3821 -71 56 -108 -230 90 166 -243 83 -53 138 -295 279 233 -376 267 17 264 -142 378 172 44 374
3842 374 93 120 33 310 -17 98 70 -72 35 -371 282 -274 231 -317 -55 -193 3 315 -469 177 -80
$$ packed form
3687c1K06o01P36l47R6j63J58K03n49L09j65K44m40K88J26l87L13J20k80l26O28
3708A38l00R1M6Q5r9l17L09kQ2l9q6J7nO00n42N0p5M11o54L59J43l49J55j6M02
3733D04o46L52Kk43KnM13o08L90k98K88j93J19J95n99M08r0L15n02O23m54k4L67
3756B16l44K58k58N25k64k11K88r1k7j46M26m41J50j68K82l95k55P90o19M65l68
3777a87J68k74P4j92N4N65l73K7j83M31p1m64M07j05K02k57M83l46j95K16J17
3798I7P7n05O10l24K00p8N7j54Q8K29l29J16p8L08l32R4J5k75L6L45q5l63J80
3821g1J27j64j22L20P6m09L26j36J91m33N74m6o09O43k50K47m06N20k06j28L30
3842C74k81K7q7K77l27J15k8j42J07m06O53n56N05n48K62j38J96L12p84O46k57
$$ plain form
3863 -80 102 -370 11 129 -222 91 36 35 -438 115 115 -161 -34 167 382 -55 335 -59 -107 -32 153 200 -22
3886 -22 352 -245 53 -104 171 -52 -60 143 -247 -78 -127 385 -256 85 70 195 -97 -57 218 -301 19 75
3908 75 -66 -9 93 62 -37 198 -10 105 -17 142 122 -394 157 92 121 -172 142 37 -204 158 -101 -47 -272
3931 -272 421 -3 -241 53 83 -101 -513 262 -312 38 22 133 55 -94 108 -330 -78 147 441 -1 328
3952 328 194 -178 -18 -289 366 -201 370 -47 -144 -117 68 316 -373 255 -117 193 -157 220 257 -206 128
3973 128 -173 100 -298 15 -101 -64 0 -214 -121 -37 214 -334 190 332 230 253 -12 377 -24 113 -90 392
3995 392 91 -206 325 -165 246 11 121 -303 -63 179 -172 242 -65 152 -283 13 -193 -63 168 -187
4015 -187 245 -390 118 -202 -87 147 -154 -87 -211 393 -318 81 -81 115 -407 38 322 -248 291 -24
$$ packed form
3863h0J82m72L81J18l51L13n5jm73N53%k76J27K01K15m37L90l94m8P5J85M7k22
3886b2L74n97K98j57K75k23qK03l90J69m9N12o41L41j5J25k92M0K75n19L20N6
3908G5j41N7J02l1r9K35k08J15j22J59k0n16N51o5K9k93L14j05k41L62k59N4k25
3931b72O93m24k38K94L0j84m12P75n74L50j6J11p8j49K02m38K52K25K94m42L29
3952C28j34l72J60k71O55n67N71m17r7K7J85K48o89O28l72L10l50L77L7m63L34
3973A28l01K73l98L13j16L7O4k14R3Q4K51n48N24J42j02K3k65L89m01J37k03M82
3995C92l01k97N31m90M11k35J10m24K40K42l51M14l07K17m35K96k06J30K31l55
4015a87M32o35N08l20J15K34l01O7j24O04p11L99j62J96n22M45K84n70N39l15
$$ plain form
4035 -24 157 -69 323 198 -120 54 90 507 -14 193 111 318 112 13 358 -209 345 -147 73 -62 212
4056 212 79 -99 96 -110 -15 -301 69 -254 46 -139 -363 -32 -142 113 -605 -24 335 15 -103 -53 301
4077 301 -278 283 59 67 -100 -27 391 -369 280 -34 188 -143 120 163 -216 108 -49 1 -168 122 -144 -357
4099 -357 54 -211 200 -425 60 -447 53 145 31 76 -135 254 -103 175 -106 345 -366 119 366 -196 328
4120 328 -19 32 -133 121 -63 -72 108 145 230 -189 504 -62 8 -187 25 -50 -230 261 -262 100 105 174 227 -193
4144 -193 303 -297 -186 -25 291 -73 80 111 -38 -122 -73 122 -14 -24 320 -215 -223 11 233 -141 201 -36
4166 -36 272 -177 -76 76 48 28 52 312 -136 339 -61 -158 161 -128 54 -79 18 -21 187 -50 375 -54
4188 -54 -1 364 -132 97 122 388 -204 -20 287 -49 228 -318 232 -337 -97 111 -175 5 95 161 -358 287
$$ packed form
4035b4J81k26L92j25l18J74L6M17n21K07q2K07k06r9L45n67N54m92K20j35K74
4056B12j33j78J95k06R5k86L70l23L00j85k24L31j10K55p18N81L59l20j18N0L54
4077C01n79N61k24Qj67P3M18p60O49l14K22l31K63M3l79L24j57N0j69K90k66k13
4099c57M11k65M11o25M85n07N00R2j14M5k11L89l57K78k81M51p11M85K47n62N24
4120C28l47N1j65K54j84rJ80L7Q5m19O93n66P0j95K12p5j80M91n23L62NO9N3m20
4144a93M96o00J11J61L16l64J53L1j49q4M9J95j36j0L44n35qK34K22l74L42k37
4166c6L08m49J01J52k8k0K4K60m48M75m00r7L19k89J82j33R7l9K08k37M25m29
4188e4N3L65m96K29K5K66n92J84L07l36K77n46N50n69K40K08k86J80R0O6n19O45
$$ plain form
4210 287 -26 -215 7 19 324 -256 311 -214 -83 180 30 96 -325 155 -231 63 -242 73 -114 -213 182
4231 182 -19 242 -229 164 -51 4 187 -166 165 -176 -184 -282 -39 -170 -50 -110 -115 295 -320 -15 -93 160 -114
4254 -114 -27 255 -83 74 -56 64 -287 295 -264 43 93 121 -68 -71 200 -163 -64 238 -21 212 -39 296
4276 296 -156 99 -125 169 127 15 191 -91 -13 -186 101 -126 3 291 222 81 92 55 -156 14 -40 -137
4298 -137 19 72 105 -261 91 -50 -27 124 -24 -26 -156 76 61 357 -95 91 -183 -33 240 -156 -111 -61 191
4321 191 -257 63 10 -20 -69 -185 -7 -228 80 104 -226 -333 -61 312 -254 -160 -47 293 113 139 -56 -44
4343 -44 213 42 266 -201 153 -86 -92 16 140 30 -272 190 -59 20 -77 -151 94 15 232 -87 423 30
4365 30 72 -148 47 164 -252 343 -270 233 -122 -150 -98 -113 114 -100 172 85 71 -7 -149 -138 121 227 -99
$$ packed form
4210B87l13j89K22J2L05n80N67n25J31K63j50O6m21M80l86K94l05L15j87r9L95
4231A82k01K61m71L93k15N5J83l53L31l41qr8K43j31J20o0nM10o15L05p8K53k74
4254a14Q7K82l38J57j30J20l51N82n59L07N0K8j89lK71l63R9L02k59K33k51L35
4276B96m52K55k24K94m2j12J76k82P8j73K87k27J29K88o9j41J1l7k11J70n4r7
4298a37J56N3L3l66L52j41K3J51j48kj30K32j5K96m52J86k74J50K73l96M5N0K52
4321A91m48L20n3l0m9j16J78k21L08K4l30j07K72L73n66R4J13L40j80K6j95J2
4343d4K57j71K24m67L54k39oJ08J24j10l02M62k49P9r7p4K45p9K17l19N10l93
4365C0M2k20J95J17m16N95o13N03l55k8N2j5K27k14K72q7j4p8j42J1K59J06l26
$$ plain form
4388 -99 -36 -17 -108 -64 88 -38 -286 143 -126 54 -312 11 172 -156 10 -247 152 -88 361 88 -45 57
4410 57 189 -34 8 315 -227 191 -138 -36 -273 70 159 -133 -73 -68 16 -118 15 -33 -200 111 -58 13 -315
4433 -315 356 143 49 53 -57 30 15 194 -169 -72 -162 203 110 -68 113 -144 108 -76 53 49 115 -82 -167 -111
4457 -111 -277 319 -234 -63 -36 -73 210 -135 -112 -194 -117 -35 -113 -102 101 158 -190 154 62 -63 -238 152 -61
4480 -61 -30 64 202 167 38 100 85 74 109 -175 92 -216 168 -194 14 -86 160 268 -195 64 -257 55 -116
4503 -116 -128 -155 92 210 -228 86 -164 293 -295 -21 165 -286 352 -64 211 -204 94 -18 164 230 165
4524 165 182 -29 211 157 -64 -56 -57 3 -165 -1 -107 -67 -177 5 -329 -124 244 12 -125 -214 8 -171 -238
4547 -238 -138 -281 -145 -136 122 -148 -94 -211 205 -37 3 233 -20 403 109 163 116 116 202 -59 86 -34 264
$$ packed form
4388i9O3J9r1M4J52j26k48M29k69J80l66L23J61l28J66k57L99k40M49k73j33J02
4410E7J32k23M2L07n42M18l29J02k37L43Q9k92O0NQ4j34J33m8j67L11j69P1l28
4433c15O71k13r4Mj10Q7j5J79l63R7r0L65r3j78J81k57K52j84J29mO6j97q5N6
4457a11j66N96n53J71K7l7K83l45K3q2P7Q2p8J1K03N7l48L44r2j25j75L90k13
4480f1L1R4J38l5j29O2j5j1L5k84K67l08L84l62K08j00K46J08m63K59l21L12j71
4503a16j2k7K47J18m38L14k50M57n88K74J86m51O38m16K75m15K98j12J82O6o5
4524A65J7k11K40n4k21QjO0j68J64j06M0j10J82l34K05L68k32j37q9K22j79o7
4547b38J00j43J36RK58k70N4j17M16k42M0K30k53M23k94N4m7%Q6k61J45j20K98
$$ plain form
4570 264 -421 51 -40 -327 -29 -66 45 72 293 -253 -163 32 -83 -18 -32 -36 -245 -289 -327 -56 206 -41 76
4593 76 -57 78 -33 115 -206 -75 1 -47 146 87 122 82 288 -20 -6 181 205 249 28 196 173 119 -63 1
4617 1 -174 -278 -245 -81 63 -194 39 -209 -147 -82 -55 -43 -107 -4 -130 135 -260 24 154 86 86 -183 90 128
4641 128 -16 80 206 169 71 189 198 78 18 197 -59 24 364 160 68 -230 239 -30 131 -70 101 75 -245
4664 -245 126 -220 57 -62 -24 61 -43 130 -109 -213 38 -75 -529 110 -2 19 24 -6 261 4 -38 62
4686 62 94 93 -112 27 -104 164 -78 -18 137 21 39 -274 302 -117 262 14 -251 -11 2 111 -64 -160 -197
4709 -197 74 -106 193 -46 -111 44 -102 -141 56 -39 42 -6 -60 247 108 -412 155 -85 302 -237 153 225
4731 225 -147 205 -14 96 -285 231 357 23 102 -94 -138 -71 204 -156 -44 85 -331 -15 -137 185 -74
$$ packed form
4570B64o85M72r1k87K98l7J11K7K21n46R0J95j15O5j4mk09m4l8K71K62k47J17
4593G6j33J35j11J48l21J31P6m8J93n9L5m0K06l08J4J87K4M4k21J68k3n4j82O4
4617Aj75j04L3J64J44k57K33k48O2O5K7J2o4J03j26K65l95K84J30o8%k69K73L8
4641A28j44R6J26l7r8J18Rj20o0J79k56Q3L40k04r2k98M69k69J61k01J71k6l20
4664b45L71l46K77j19L8Q5j04J73k39j04K51j13m54O39j12K1Nl0K67k57m2J00
4686F2L2jk05J39j31K68k42O0J55j16J8l13N76m19L79k48k65K40J3J09j75r6l7
4709a97K71j80K99k39o5J55j46l9J97r5Q1m8n4L07j39n20N67k40L87n39L90P2
4731B25l72L52k19J10l81N16J26l34P9j96m4O7K75l60J12J29m16L16j22L22k59
$$ plain form
4752 -74 -49 -124 104 -172 115 192 -296 130 -118 125 -198 49 22 -57 194 98 -228 -33 19 -37 189 17 10 184
4776 184 27 124 -299 198 -15 -104 165 -52 234 37 246 -88 18 -46 -121 -147 -71 -77 -108 159 38 274 53
4799 53 122 -77 167 41 -60 8 -21 -178 100 64 72 -347 41 86 31 98 -157 -80 -323 307 -84 -158 -340 -8
4823 -8 7 -89 369 6 181 -150 54 27 -67 -35 28 27 -362 172 25 -66 -69 120 62 30 -13 -137 252 59 119 -401
4849 -401 122 -23 -351 29 127 124 -349 129 -5 -55 120 224 62 -77 -15 -124 28 123 18 -30 -239 -215 -161
4872 -161 126 -140 98 -482 -173 371 -47 67 -47 335 -96 164 330 -19 -11 -152 76 -196 12 -54 53
4893 53 146 -153 192 31 280 -149 0 111 -22 301 -186 -106 -122 -7 -282 14 22 189 173 184 200 -144 147
4916 147 -154 -125 -63 -7 -28 -67 124 -81 -94 7 -17 30 -55 143 -205 1 -115 99 51 -25 97 -90 50 -4
$$ packed form
4752g4K5p5K28k76K87P7m88M26k48K43l23K47k7p9K51r6l26J95N2n6K26j72pJ74
4776A84j57R7m23M97k13q9K69k17K86j97K09l34J06o4p5k6P6ol1K67j21K36k21
4799E3O9j99K44j26j01O8k9j57K78l6Qm19L88M5n5O7k55P7k43O30l91p4j82L32
4823hJ5r6M58l63J75l31K04k7r4L2O3jl89N34j47r1lJ89n8l2m3j24L89j93O0n20
4849d01N23j45l28L80R8lm73M78j34n0J75J04j62j39O2j09J52R5j05m8k09K4N4
4872a61K87k66K38n80L09N44m18J14j14L82m31K60J66l49Qj41K28k72K08o6J07
4893E3R3k99L45j61K49m29J49J11j33L23m87Q0j6J15k75K96QJ67j6J1J6l44K91
4916A47l01K9O2N6k1l9J91k05j3J01k4M7q5J98l48K06j16K14m8p6J22j87J40n4
$$ plain form
4940 -4 57 66 -91 -186 -21 221 40 189 -19 338 -155 94 15 -58 -111 -202 250 -54 125 -232 189 -40 -52 -54
4964 -54 -192 -33 140 -72 -268 -175 -122 -61 -45 -53 338 -254 221 -58 -118 41 -338 207 -71 108 91 -11 -51
4987 -51 6 -8 107 1 -86 196 0 82 -49 112 -137 -111 41 -175 214 -190 -283 -202 -36 29 -243 102 -78
5010 -78 14 -80 -143 -70 76 -310 -266 -30 -73 46 94 -8 -120 -137 -78 -338 187 14 29 148 82 317 172 76
5034 76 56 305 159 46 39 79 -83 -25 42 128 -177 -31 -42 -86 -222 -179 -219 6 -267 44 -129 -82 -91 121 -142
5059 -142 43 85 -6 109 -118 -133 -9 80 -95 -133 -191 23 94 134 3 195 256 -66 -198 206 -109 162 -94
5082 -94 30 -51 11 227 -150 -10 42 37 -40 -24 -257 -125 237 -56 53 -36 198 -26 134 95 -129 113 117 76
5106 76 -193 86 163 -171 -195 142 244 85 323 -11 -23 -23 -204 55 -134 -87 15 224 -10 85 -79 -252 101
$$ packed form
4940dO1Rj57r5J65K42j81J49k08L57m93K49p9p3n3r1M52l04J79l57M21k29j2k
4964e4j38J59J73k12j96R3N3O1J6qL91n92M75k79o0J59l79N45k78J79j7j02m0
4987e1N7j4J15j06q7K82j96Q2j31J61k49K6J52k16L89m04r3Q1J66O5k72L45j80
5010g8R2r4o3P3J46l86M4K36m3J19M8j02j12j7N9k60N25j73J5J19o6K35j45r6
5034G6k0K49j46j13pM0j62N8O7Q6l05J46j1m4j36M3m0K25k73L11j73M7rK12k63
5059a42J85M2r1J15k27j5J24Q9j75l8n8K14P1M0j31J92O1l22j32M04l15K71k56
5082i4J24q1O2K16l77J40N2np7J6k33J32L62k93J09q9K34k24J60l9k24K42Mm1
5106G6k69K79P7l34k4L37J02j59K38l34j2%j81K59j89M7J02K09k34R5j64j73L53
$$ plain form
5129 101 -216 274 -195 -48 -93 -122 162 -35 127 11 42 -38 -177 9 55 -204 -92 -34 -92 -54 -30 120 254
5152 254 -201 131 -91 214 -163 257 42 -58 137 -40 11 2 218 154 -161 -134 -106 41 76 310 -195 41
5174 41 -67 106 -70 13 -85 -30 38 -182 255 68 93 -321 -80 -50 82 -12 50 74 -157 148 267 -156 -159 -165 131
5199 131 -78 185 -203 -63 -102 111 140 -370 -129 40 -254 -191 -81 -114 71 127 36 218 -272 251 281 -203
5221 -203 49 222 -62 -184 64 -92 -33 -155 207 86 -94 160 -81 63 82 23 -76 171 264 9 132 -266
5243 -266 67 -66 -112 308 -25 76 80 6 -57 205 151 85 -80 128 1 -150 74 -123 -39 28 -104 -58 -210
5266 -210 -103 -171 46 -247 9 -7 -141 -2 65 -52 -6 206 -178 46 238 -43 -177 90 -170 -205 88 -56
5288 -56 46 -37 -57 182 -29 -61 -12 -64 -130 -34 -95 4 188 -267 233 20 291 43 -90 64 185 153 -235 220
$$ packed form
5129A01l17M90m69J47m5k9K84j97J62j16L1q0j39J86M6k59J12N8n8L8K4J50J34
5152B54m55L32k22L05l77M20k15j00J95j77N1rK16o4l15K7K8J47L5K34n05K36
5174D1j08J73j76Q3r8N5O8k20M37j87K5m14K41L0J32r4O2K4k31L05J19m23loK96
5199A31k09K63l88J40l9K13K9n10K41J69k94O3J10l3J85N6r1J82m90N23L0m84
5221b03K52J73k84j22K48j56N9j22L62j21j80K54k41J44J9n9r9K47R3k55J23l98
5243b66L33j33m6M20l33J01Mp4o3K62n4o6j65K08j27j51K24j97Q4O7j32M6j52
5266b10J07o8K17k93K56j6j34J39O7j17M6K12l84K24J92k81j34K67k60l5K93j44
5288e6J02q3k0K39k11l2M9n2o6R6o1R9J84m55N00k13K71k48j33J54J21l2l88M55
$$ plain form
5312 220 -133 -61 -94 -142 -196 15 229 -201 182 -136 26 225 -71 139 -405 -233 -154 84 1 187 6 -202
5334 -202 -40 -69 15 -136 -5 58 58 183 10 96 -87 101 -11 -14 31 -4 -44 -12 24 -454 -69 -195 -62 -332
5358 -332 -40 -44 -181 54 -361 103 19 -158 12 -2 86 -122 66 -20 -47 9 162 108 -144 -162 221 -68 -116 -254
5382 -254 -125 48 218 18 -4 57 -26 -65 64 -15 11 92 40 222 -270 48 -9 133 16 -61 37 -120 22 -108
5406 -108 8 109 82 115 -43 123 -105 371 114 -37 -20 76 177 113 16 -87 22 -72 371 113 205 73 -16
5429 -16 47 -78 214 -20 264 8 109 316 -114 264 -129 92 -107 116 52 -60 -165 -125 -73 20 -74 -203
5451 -203 -156 145 67 123 176 183 -102 -90 67 -160 -22 215 25 -54 208 -169 -16 96 170 237 150 34 194 -64
5475 -64 54 275 -15 389 -74 88 -46 -19 -56 -85 409 -196 -9 -193 112 247 -66 -49 -42 255 -390 -42
$$ packed form
5312B20l53P2l3m8n4K11K14m30L83l18J62J99k96K10n44J72P9K38q3J86j81k08
5334b02J62k9Q4j51J31O3%J25j73Q6j83J88j12lM5l5m0L2L6m78L85j26J33k70
5358c32K92mj37K35m15M64q4j77J70j4Q8k08J88q6k7N6J53n4k52j8L83k89m8j38
5382b54J29J73J70k00k2O1q3l9J29p9K6Q1n2J82m92L18n7J42j17p7R8j57J42j30
5406a08J16J01k7L3j58J66k28M76k57j51J7R6J01o4r7j03J09r4M43k58R2j32q9
5429a6O3j25K92k34K84k56J01K07m30L78l93K21j99K23o4j12j05M0N2R3r4j29
5451b03M7L01p8N6N3Pk85J2J57k27J38K37j90p9K62l77J53J12P4O7q7j16J60k58
5475f4J18K21k90M04m63J62j34K7l7k9M94o05J87j84L05J35l13J7PK97o45L48
$$ plain form
5497 -42 33 -100 -188 -177 170 -133 57 205 -112 215 299 -78 -254 67 49 -70 -37 -78 151 -218 252 50 -13
5520 -13 -174 66 68 -142 288 -88 118 0 22 -165 143 176 134 121 -71 115 -111 -28 -49 -102 183 -6 182
5543 182 166 78 90 257 -37 71 105 -193 95 -99 139 101 46 197 39 -75 22 160 5 59 116 -20 40
5566 40 -187 -52 -100 365 -95 139 121 194 69 -64 42 147 20 -57 -91 -159 67 -82 92 140 -290 -118 -73
5589 -73 -61 -51 13 181 -63 76 146 -200 84 43 -24 64 -4 1 89 119 -145 109 175 -31 -143 144 11 83 -164
5614 -164 -16 135 58 -49 154 243 -233 176 -123 -67 231 -19 55 -79 111 11 122 -36 -3 -80 7 -92 151
5637 151 226 76 154 -69 -70 -15 -150 109 160 229 -112 138 -129 -139 -4 -74 -160 -96 2 -20 73 28 104 15 -42 46
5663 46 -194 -49 -34 139 -172 -121 102 -262 11 97 -85 -16 71 -179 236 -130 0 -52 -55 47 -55 -25 -151
$$ packed form
5497d2P5j33q8J1L47l03J90J48l17L27Q4l77j76L21j8j19L3m1K29l69M70k02o3
5520a3j61K40Kk10M30l76K06j18K2j87L08L3m2j3j92J86k26Q3k1n3K85j89J88
5543A82j6q8J2J67k94J08L4k98K88j94K38l8n5J51j58j14R7J38j55N4N7j36O0
5566D0k27J35m8M65m60K34j8P3j25j33J06J05j27p7l4o8K26j49J74M8m30J72M5
5589g3J2J0O4J68k44J39P0l46K84m1o7Q8o8NQ8L0k64K54O6k06j12K87j33P2k47
5614a64J48J51p7j07K03Q9m76M09k99N6K98k50P4j34J90j00J11j58L3p7Q7r9K43
5637A51P5j50P8k23jN5j35K59N1O9l41K50k67j0J35p0q6O4R8k2R3m5P6q9n7Q8
5663D6k40J45J5J73l11N1K23l64K73Q6j82O9Q7k50M15l66J30n2lJ02j02L0j26
$$ plain form
5686 -151 36 -40 -68 168 -214 59 -215 246 -16 100 80 -80 27 -153 -64 71 -81 126 -49 -277 -232 40
5708 40 -276 -82 -120 75 127 -34 180 -12 48 -164 104 1 -163 -40 -44 33 38 74 -162 325 28 -91 180
5731 180 -67 -125 -209 247 17 67 -166 -207 180 -202 -91 -159 122 17 -17 63 148 282 122 -64 -83 24 3
5754 3 0 79 157 17 -104 8 -165 143 38 -121 163 57 224 79 131 -172 182 133 -145 203 184 43 -24
5777 -24 178 -242 111 59 50 179 76 109 29 62 -78 -56 28 -298 38 51 121 -221 178 45 25 12 -154 132
5801 132 -15 32 -209 247 -57 103 102 -208 -68 112 -73 -183 58 34 -66 5 -51 38 6 -110 -93 125 -61
5824 -61 130 -103 -194 318 -20 -4 75 186 -157 16 100 133 -57 -98 84 19 81 77 121 -217 -24 161 -163 4
5848 4 -30 -57 -67 41 208 159 5 -186 183 -167 -159 9 -348 -114 -64 11 -240 -62 -3 -117 170 -4 111 -131
$$ packed form
5686a51J87p6k8K36l82K73k74M61k62J16k0j60J07j80Q9J35j52K07j75k28M5K72
5708D0l16J94l8J95N2j61K14j92O0k12K68j03j64J23mP7NL6k36M87k97j19K71
5731A80k47n8q4M56k30N0k33m1L87l82J11o8K81j05l4Q0Q5J34j60j86j9J07k1
5754ClP9P8j40j21J12j73L08j05j59K84j06J67j45N2l03L54m9k78L48j9j41o7
5777b4K02m20L53n2rJ29j03L3q0L3j40K2Q4l26L36J3P0l42L99j33k0j3j66K86
5801A32j47M7k41M56l04J60jl10J40J80j85j10K41k4j00P1n6Q9l2j16J7K18j86
5824f1J91k33r1N12l38J6P9J11l43J73Q4L3j90m1J82o5O2mM4l38J93J85l24J67
5848Dl4k7j0J08J67m9j54j91L69l50QJ68l57K34N0P5k51J78N9j14K87j74J15k42
$$ plain form
5872 -131 123 -38 31 115 -128 -47 137 45 -44 -42 61 -186 1 -26 74 68 35 -119 326 -10 -15 91 -48 -12 -6
5897 -6 280 -179 121 -69 32 -8 51 -161 -59 118 3 -106 63 143 -43 140 59 63 49 245 -63 -116 -152 32
5921 32 -102 68 -75 143 -72 -102 -79 -185 -30 189 -28 -46 253 -90 -43 -84 -266 -152 -40 -19 123 185 -192
5944 -192 -166 -76 -270 -88 85 144 11 -107 -76 113 105 -41 226 43 14 -58 12 -21 -4 136 41 -43 20 -7 -36
5969 -36 62 -134 -23 335 -183 -149 -82 -162 117 83 165 -123 232 -312 82 -188 -91 141 -122 329 120 22 -126
5992 -126 -21 -108 117 -1 -246 144 -56 245 -80 -26 -7 26 -211 -201 16 64 47 -56 -44 -113 -9 -49 38 -237
6016 -237 -53 22 10 -37 145 88 180 298 183 -214 141 -145 18 131 -25 89 -95 -149 -218 42 -160 -12
6038 -12 -102 20 106 144 62 25 102 -188 278 -58 -54 71 -58 109 -274 -105 13 101 -89 58 85 187 121 160
$$ packed form
5872a31K54j61O9Q4k43Q1J84r2q9KJ03k47J87k7J00ol3j54M45l36nJ06j39L6O
5897fK86m59L00j90J01m0N9k12J02J77j15j09J69Q0j86J83q1Mj4J96l08n3l6J84
5921C2j34J70j43K18k15l0K3j06J55K19k17j8K99l43M7m1j82J14J12K1J42O2l77
5944a92K6R0j94J82J73N9j33j18L1J89qj46K67j83k9p2P0l3J7J40r5q4O3k7k9
5969c6R8j96J11L58n18L4O7q0K79l4Q2k88L55n44L94k70R7K32k63M51k09r8j48
5992a26J05q7K25j18k45L90k00L01l25N4J9L3k37J0K17M8j7j03J2o9J04m0Q7k75
6016b37J84P5j2m7J82n7R2J18j15l97L55k86J63J13j56J14j84n4o9K60k02J48
6038a2r0J22Q6L8q2l7P7k90M66l36MJ25j29J67l83J69J18Q8j90J47K7J02o6L9
$$ plain form
6062 160 -134 -198 104 85 137 330 78 -15 85 198 -6 30 314 -41 -14 -214 88 92 49 -97 53 -6 -95 211
6086 211 -158 41 68 -39 -65 180 41 59 -132 191 53 132 21 -131 -54 107 -62 -32 -97 112 55 96 82
6109 82 -91 396 -74 60 142 -248 10 145 -19 234 -22 -126 -84 -16 -67 96 -166 -21 -181 -63 29 143
6131 143 -71 239 -78 81 71 27 -15 -179 43 -79 -56 -329 -105 292 -138 51 -86 -36 -63 -208 67 58 85
6154 85 232 -114 -188 147 -59 105 103 29 182 73 -55 -149 41 -21 -2 -44 51 166 -148 -10 168 210 -100 72
6178 72 -22 47 208 -117 4 -123 36 -113 -162 218 -15 -18 82 162 221 148 -201 123 183 14 222 -48 -110 173
6202 173 91 105 -170 -112 167 227 -103 55 -22 227 9 61 -94 7 163 -120 -44 -149 -373 98 -121 68
6224 68 7 -147 -106 182 101 124 138 -168 -186 80 26 -24 3 -176 -277 -117 126 56 55 -90 -125 -229 93 -217 129
$$ packed form
6062A60k94o4L02j9N2J93k52r3J00J13k04L6K84l55K7k00L02Mm3j46J50n9q9L06
6086B11l69J99K7j07k6K45j39J8j91L23j38P9j11j52P7J61j69L0o5K09n7M1j4
6109H2j73M87m70J34Q2l90K58J35j64K53k56j04M2O8n1J63k62J45j60J18R2J14
6131A43k14L10l17J59j0m4m2j64K22j22K3k73K24L97m30J89j37N0k7j45K75rK7
6154H5J47l46p4L35k06J64kp4J53j09j28r4J90o2J9m2R5J15l14J38J78M2l10J72
6178G2r4O9J61l25J21j27J59j49m9L80k33lJ00Q0N9p3l49L24O0j69K08k70o2K83
6202A73q2J4k75N8K79O0l30J58p7K49k18N2j55J01J56k83P6j05k24M71k19J89
6224F8o1j54M1K88q1K3J4l06j8K66n4n0K7j79j01J60K43p0jj45l5j04L22l10L46
$$ plain form
6249 129 -172 78 23 -29 22 242 146 -49 -22 15 248 -230 269 -391 -41 170 -166 -79 -87 174 -151 -231 -177 292
6273 292 -145 86 -206 -138 -35 -146 123 -110 -39 144 304 110 98 -169 10 130 -5 -29 -125 142 -141 -218
6295 -218 85 -125 14 119 -49 5 -305 -127 -21 181 122 300 -62 -25 216 -13 -90 -27 -62 -185 28 47
6317 47 -29 25 -103 -74 -101 -226 -9 84 154 -207 251 -87 -163 2 51 125 -3 109 305 -10 -31 53 -207 54
6341 54 -9 -37 107 19 25 44 271 196 -266 114 71 147 -192 176 -167 49 142 139 23 -166 -24 -147 6 -119
6365 -119 143 -74 -38 197 144 10 -199 -109 -83 -56 -200 129 -47 -106 38 172 -65 -12 153 -78 176 -57
6387 -57 13 -23 85 -110 -199 60 -285 -80 -361 -199 -26 -46 -105 -37 10 20 -41 -96 -80 35 64 -199 170 63
6411 63 -160 70 -113 -14 -9 -113 30 -97 243 92 -249 180 115 170 -272 83 203 152 12 -106 226 -50
$$ packed form
6249A29l01K50n5n2N1K20r6j95K7L7K33m78M99o60L50K11l36Q7qK61l25q0N4M69
6273B92m37K31k92O8J03j11K69k33P1J83J60j94j2k67J79J20j35k4r6K67k83p7
6295b18L03k10J39J05j68N4l10J78J06K02n9J78l62L7K41k29p7O3l5j23K13J9
6317D7p6N4j28K9k7j25K17R3P0l61M58l38p6J65M9P4j28J12J96l15k1Q4k60K61
6341E4o3k8J44q8OJ9K27p5m62L80m3P6l39L68l43K16R3lj16j89J42j23J53j25
6365a19K62k17L6K35n3j34k09R0K6K7j44L29j76n9J44J34k37N3J65k31K54k33
6387e7P0l6J08j95q9K59l45K05k81J62J73k0n9O8M7J0o1n5J6J15K9k63L69j07
6411F3k23K30j83R9Nj04J43j27L40j51l41M29o5N5m42L55J20n1j40j18L32k76
$$ plain form
6433 -50 -98 25 -6 211 6 -11 67 236 -255 109 86 231 -122 53 214 106 -55 -121 71 -119 -99 -46 45
6456 45 -118 -194 12 -18 14 105 -90 147 -226 117 -35 -32 -75 -23 94 -106 -54 -156 -55 -63 23 -71 -12 -20 -235 62
6482 62 157 126 123 -66 8 -82 -175 181 -126 118 -169 -100 -239 90 120 -18 311 173 182 24 59 -89 70 178
6506 178 220 -17 39 -205 72 2 159 214 -167 13 234 -194 -108 210 -29 -98 -91 -50 -6 186 -26 -129 -172 31
6530 31 -51 1 -22 -63 114 136 -80 -11 56 -19 -76 -150 48 208 138 -183 -21 -30 117 16 194 257 -67 -183 -38
6555 -38 -118 149 20 56 80 97 -5 85 -210 200 76 -136 -57 -216 160 215 65 110 141 87 -132 234 -50 133
6579 133 -78 90 217 -38 -275 -181 -107 -63 135 130 16 125 -8 39 29 -58 28 120 112 33 -85 -253 76 90 -80
6604 -80 34 41 1 25 158 112 -62 -8 72 -213 63 96 110 69 -279 -48 47 -59 -150 19 18 -12 -80 72 129 -236
$$ packed form
6433e0m8J23l1K17k05j7P8J69m91L64k3J45l53J75J61j08j61o6J92j90K0N3R1
6456D5j63p6K06l0L2R1j95K37l73L43j52Lm3N2J17k00N2j02J01qQ6r4N9qk15K97
6482F2R5l1lj89P4r0r3L56l07K44k87O9j39L29L0j38L29j38Rj58L5j48J59J08
6506A78M2k37N6k44K77p0J57N5l81J80K21m28Q6L18k39o9PM1M4J92k12j03m3K03
6530C1q2N2k3m1J77K2k16O9O7p5n7p4J98J60p0l21J62rJ47j01J78O3l24j16J45
6555c8q0K67j29L6K4J7j02R0k95M10j24k12P9j59L76N5j50M5L1n4k19L66k84J83
6579A33k11J68J27k55k37R4P4M4J98nj14J09j33M7j0q7Q6R2qp9j18j68L29J4j70
6604h0J14Pm0K4J33m6j74N4Q0k85K76L3J4m1l48K31R5j06r1J69jl0o8J52N7l65
$$ plain form
6630 -236 -58 -247 -52 21 -29 113 18 -39 -39 95 -75 262 -78 -50 131 68 -3 280 19 -32 37 203 -44 232
6654 232 -90 -85 53 -25 -76 -253 6 97 184 44 70 51 -210 -249 -97 130 -126 14 14 59 75 -58 -25 -240 185
6679 185 -107 -84 -56 -79 -69 -56 -49 10 51 -159 120 -164 299 96 -180 -164 -79 63 -23 103 -74 169 126 156 93
6704 93 172 10 -274 -193 78 71 -166 137 -213 -305 4 121 -132 177 166 58 -48 -42 18 95 -16 -19 48 83 -81
6729 -81 -95 88 84 156 -253 71 94 -143 -103 21 171 53 162 -31 5 28 187 165 -115 -48 96 -40 92 295
6753 295 -43 -19 140 147 221 20 110 -76 190 -93 -123 56 190 -278 -62 21 -182 -16 40 -143 -180 7 64
6776 64 -40 -352 -46 -316 32 286 -83 78 26 -47 153 -363 88 -114 -99 37 -75 -78 212 48 -31 -121 -99
6799 -99 -234 -96 98 175 -149 95 -84 287 -125 69 -22 -187 153 7 -135 -183 67 78 -226 -59 270 44
$$ packed form
6630b36J78j89J95P3n0J42r5n7%J34j70L37l40K8J81o3p1K83k61n1O9J66k47K76
6654B32l22NJ38p8n1j77K59R1Q7j40K6j9k61l9J52K27k56J40%M5J6j33L3k15M25
6679A85k92K3K8k3J0J3PN9M1k10K79k84M63k03k76J6Q5J42q6J26j77K43m3L0o3
6704I3P9j62k84Q1K71pk37L03l50r2L09J17k53L09j1j08j06OO0P7j11lO7L5j64
6729h1j4J83mP2m09L24K3k37M0J24J50j18J09j93L6K3J59k2k80O7J44j36J32K03
6753B95l38K4J59PP4k01R0j86K66k83l0J79J34m68K16Q3k03J66N6j83l7J87N7
6776F4j04l12L06k70L48K54l69J61n2p3K00n16M51k02J5J36j12lK90j64p9r0K2
6799i9j35J38J94P7l24K44j79L71m12J94r1j65L40j46j42m8K50J1l04J67L29k26
$$ plain form
6821 44 -216 -76 48 -205 127 -36 56 -323 -139 -138 12 -101 160 -142 -168 -26 -94 92 125 88 55 3 -16 -10
6845 -10 125 77 29 93 75 59 162 56 -274 5 -1 134 112 90 -120 -48 -138 113 9 -175 -55 -211 6 -249
6869 -249 -235 -78 82 -92 -285 118 -302 38 51 -31 -216 25 26 -40 -45 35 169 141 137 63 -72 -110 117 24 144
6894 144 215 -82 61 -94 -29 114 104 -255 -232 84 170 -140 72 99 -196 -74 -12 83 19 132 -2 -72 -76 4
6918 4 -184 158 -58 -309 77 -245 -31 -13 -43 -75 49 -51 -112 -18 -68 73 -12 -320 23 83 -93 -204 82
6941 82 135 124 71 13 27 30 -121 113 172 -163 53 -3 134 -90 6 -210 -6 61 -114 -230 45 -104 -32 228
6965 228 95 -14 -81 -63 99 45 -5 -13 190 -20 241 -31 -95 53 -76 187 -5 -146 191 102 63 36 -38 -64
6989 -64 167 -7 -51 100 133 -91 -89 6 61 -110 66 0 246 -186 -6 -177 -4 80 157 9 3 89 56 45 -185
$$ packed form
6821D4k60J40J24k53L32j63R2l79J84JJ50j13K61l02k6J42o8J86L3l7l3n2j9O
6845a0J35m8m8O4j8j6J03j06l30K79oJ35k2k2k10P2r0K51j04j84J20j56K17k55
6869b49J4J57J60j74j93M03m20L40J3q2j85K41Jo6nQ0J34k8mp4j35l8K27r3J20
6894A44P1k97J43j55O5J43j0l59K3L16Q6l10K12K7k95J22O2R5o4J13j34p0mQ0
6918Dj88L42k16k51L86l22K14J8l0l2J24j00o1R4n0J41q5l08L43O0j76j11K86
6941H2N3j1n3n8J4Lj51K34N9l35K16n6J37k24R6k16K04O7j75j16K75j49P2K60
6965B28j33j09o7J8J62n4n0qK03k10K61k72o4J48j29K63j92j41L37q9l9k7p4k6
6989f4K31j74m4J51L3k24KR5N5j71J76o6K46m32J80j71J73Q4P7j48oQ6l3j1k30
$$ plain form
7014 -185 -5 70 231 74 -111 0 212 4 36 11 25 9 80 -61 -21 63 85 44 -21 27 -98 -118 -22 2 119
7039 119 -119 -81 -184 89 195 -52 -83 -43 -4 1 -134 29 -74 4 40 -122 230 -94 16 28 -109 -2 -23
7062 -23 159 -100 -69 -15 266 -142 -328 -40 -46 -22 -38 12 -184 -65 29 46 67 126 -307 196 -123 -61 -72 47 138
7087 138 8 -20 5 -7 -167 -90 243 -55 83 13 35 -136 2 31 -66 -196 89 190 72 -84 235 -32 208
7110 208 96 -160 224 27 124 -53 107 179 -22 -133 -38 6 -180 -20 -23 85 -58 34 -25 240 189 110 55 -284
7134 -284 -103 -127 -9 -5 9 1 65 95 -103 -174 125 35 -46 -238 -84 110 -95 32 73 -20 -44 -30 167 -31 71
7159 71 19 -14 59 -25 14 14 83 5 -26 -75 52 64 -24 158 193 -134 61 103 -31 18 86 141 -145 216 209 -34 57
7186 57 10 -32 -90 82 35 13 74 126 -96 -3 51 8 -92 35 14 -193 -259 41 192 -149 55 287 154 0
$$ packed form
7014a85J80P5J61j57j85J11K12k08L2k5J4j6P1j41M0Q4K2m1o5M8j25k0R6K4J17
7039A19k38L8j03K73J06k47l1M0L9Nj35J63j03P8L6j62L52l24J10J2j37J07k1
7062b3J82k59L1N4K81m08j86K88oK4j6N0j96J19R4J7K1N9m33N03l19O2j1J19R1
7087A38j30k8K5j2j60P7L33k98J38p0K2j71J38K9r7j30K85J01j18j56L19k67K40
7110B08j12k56L84j97R7j77J60P2k01j11R5M4j86J60lJ08j43R2n9K65n1p9n5l39
7134b84J81k4J18MJ4qO4L0j98p1K99r0q1j92J54J94k05J27M1r3k4J4J97j98J02
7159G1n2l3P3q4L9%O9p8l1m9J27J2q8J82L5l27J95M2j34M9O8N5k86L61pk43R1
7186E7m7m2n8J72m7k2O1N2k22R3N4m3j00J27k1k07o6L00J51l41K04K32j33j54
$$ plain form
7210 0 105 42 103 34 256 -126 24 56 42 -11 264 202 160 82 -82 155 -21 51 -152 -8 -221 192 -41 -22
7234 -22 -168 -110 295 -123 128 145 -237 289 110 -14 159 -15 -216 -6 -59 -75 28 110 -122 39 -8 -222
7256 -222 -88 95 192 231 -240 -165 0 54 -30 202 105 120 21 -68 -100 33 -95 -24 -188 -86 62 -128 43 138
7280 138 -64 81 5 159 8 -269 254 -45 -166 64 -16 165 123 217 131 62 12 198 312 9 -103 -19 -68
7303 -68 259 168 282 -56 17 125 -18 96 -110 -42 -65 119 -79 -115 -23 48 65 171 -41 -181 -133 202 40
7326 40 174 -183 36 -15 105 97 165 -66 -10 7 -83 104 397 246 -37 25 -91 43 -63 -78 314 226 -29 84
7350 84 62 -5 62 269 79 263 -159 -217 209 -149 -71 243 3 207 39 -20 -12 -71 -181 248 227 110 56 -26
7374 -26 -79 81 -53 139 -51 -119 -30 173 151 -89 -122 -103 -4 -148 -18 8 9 -17 178 -83 76 252 215 -45
$$ packed form
7210@J05o3O1o9K22l82J50L2j4n3K75o2m2p8j64K37j76P2k03J44k13M13k33J9
7234b2j46N8M05m18K51J7l82N26j79j24J73j74k01K10n3j6J03Q2k32J61m7k14
7256b22J34J83R7L9m71P5J65N4q4K32r7J5r9q9l2J33j28P1j64J02J48j90J71R5
7280A38k02J45p6J54j51k77N23k99j21K30q0J81m2R4q6o9n0J86J14l03j12Q4m9
7303f8L27r1J14l38P3J08j43J14k06O8k3J84j98l6R2P1J7J06k12j40M8L35j62
7326D0J34l57K19n1J20qO8k31N6J7r0J87K93j51k83O2j16J34j06j5L92q8k55J13
7350H4k2o7O7K07j90J84m22n8M26l58P8L14k40K04j68n9Qn9j10M29k1j17n4q2
7374b6n3J60j34J92j90o8Q9K03k2k40l3J9R9j44J30K6Jk6J95k61J59J76l7k60
$$ plain form
7398 -45 -39 -249 56 -194 -76 -162 96 -91 -79 99 106 -105 -120 20 30 169 -232 -71 190 34 206 13 -50
7421 -50 7 95 -31 23 -261 166 -44 -244 -140 -194 14 3 159 -91 -123 -199 -8 52 39 -69 -309 47 10 109
7445 109 113 -109 -32 -137 212 210 39 -23 -17 109 232 227 -49 131 -58 310 -22 84 52 137 193 292 205 -270 -43
7470 -43 113 -139 -43 -42 2 -162 -42 -17 80 -4 -117 82 151 -58 110 -93 148 322 -63 56 -251 31 -96
7493 -96 -215 231 85 74 100 -204 -49 -11 314 227 -24 -20 -32 71 -43 -101 -177 -1 68 -213 68 39 -80 -51
7517 -51 -163 31 -35 -150 137 -250 -204 76 167 134 28 -32 -90 5 -6 -118 1 148 20 -10 -125 -69 162 49
7541 49 -142 -178 -30 -4 39 -127 -46 -216 -115 315 88 136 -9 -29 245 -38 87 -12 19 80 -109 142 27
7564 27 -190 -310 -32 159 148 -112 88 -16 -312 -78 -95 109 -51 -33 155 133 -52 63 -162 265 44 148
$$ packed form
7398d5Ok10L05k50J18q6K58j87J2J78Pk11j5J40J0J39m01J61K61j56J72j93o3
7421e0N7Q8j26N4k84M27k10k00J04n4K08j1J56k50l2p6J91O0j3j08k40L56l7R9
7445A09Mk22P7j05L49kj71o2OJ26J23nk76J80j89L68l32J06l2Q5N6R9q7m75K27
7470d3J56k52R6JM4j64J20K5R7q4j13J99O9k09J68k03K41J74l85J19l07K82j27
7493i6j19M46j46j1K6l04J55L8L25q7k51Mj2J03j14n8p6J76O9k81K81k9j19K9
7517e1j12J94o6j15K87l87M6K80R1l3j06o0n8R5j1j12J19J47j28l0j15N6K31j13
7541D9j91l6J48K6M3j66Q1j70J01M30k27M8j45k0K74k83J25r9L1O1j89K51j15
7564B7k17j20K78J91j1k60K00j04k96K34j7K04j60J8J88k2j85J15k25M27k21J04
$$ plain form
7586 148 155 -84 139 -6 77 150 -181 -156 -32 -60 25 -112 172 -99 195 123 -15 309 46 27 57 1 -59 -44
7610 -44 28 141 212 -16 -146 -230 202 154 270 0 255 2 -65 -15 -218 86 9 10 6 135 112 -26 202 131 136
7635 136 -5 -25 123 -21 39 7 -23 -7 -110 -128 81 8 181 -70 225 271 93 -280 129 -67 -144 -325 -95
7658 -95 -31 271 -31 -90 98 66 -129 86 141 134 306 110 158 215 143 -147 -178 77 52 -89 102 -133 4 -29
7682 -29 -74 78 39 114 -126 54 54 -147 -144 -92 84 -22 -50 84 -41 110 -84 -247 -74 113 236 -9 132
7705 132 -7 79 3 -137 -112 84 116 -69 80 -4 44 33 -116 153 126 -99 142 132 34 -109 -61 -17 101 314
7729 314 27 30 114 -168 57 -153 73 267 271 -37 90 -61 -175 108 81 -228 -165 -135 -148 -163 257 -1 47 52
7753 52 89 61 44 -89 40 54 -223 183 -95 194 201 -265 -84 196 184 -134 86 -176 92 63 53 -37 171 174
$$ packed form
7586A48Pk39K23j45Q3P3l31K5J24k8Q5j37K84k71K94p2j38L24k63j9L0n6o0J5
7610d4P2J13P1k28j30q4M32m8J16k70K55k53o7N0k03L04p7JmJ29k3j38K28p1N
7635A36j41k0J48j44O0l2l0J6j03j8K09p3J73k51K95M6j78l73M09j96p7j81K30
7658i5O4L02l02n9J88l2j95K15N5pJ72j96M8N7p2k90l1K55k5j41J91k35J37l3
7682b9m5J52l9P5k40J80%k01LN2J76j06k8J34j25J51j94j63J73J87J23k45J41
7705A32j39Q6p6j40K5J96L2j85J49q4M8j1j49K69k7k25K41j0r8j43M8M4J18K13
7729C14k87LQ4k82K25k10K26J94Ml08J27j51j14K83k7l09O3L0j3j5M20k58M8N
7753E2L7k8j7j33J29J4k77M06k78K89Pm66J81K80j2l18K20k62K68k9j0r0K08L
$$ plain form
7777 174 154 40 273 -104 -190 116 -157 120 179 188 -44 -146 -59 -42 -11 0 140 -114 -97 -17 69 -35 -121 -149 143
7802 143 143 -142 122 140 -123 93 -69 -26 -139 4 85 39 -106 56 -198 221 79 -244 -35 143 -73 -2
7824 -2 -119 -130 67 188 -99 118 -10 -94 208 -187 75 -47 116 252 -37 -39 153 169 12 -24 185 -132 12
7847 12 -71 28 146 -37 142 33 214 107 60 -63 -9 -280 -89 135 -56 -100 58 0 -103 113 72 116 -25
7870 -25 76 77 121 14 -68 71 -109 -119 115 -57 1 -64 -34 -159 46 -63 -41 130 -70 -155 60 -45 81 144
7894 144 -101 46 -211 117 183 17 -13 136 16 118 -147 -172 20 59 -34 -154 76 84 37 106 -153 -219 -100
7917 -100 14 -189 -69 147 -53 -20 -50 10 42 -25 108 240 -24 -121 -90 103 149 22 114 -37 -39 -61 57 -22
7941 -22 -14 98 188 -73 -150 -114 -51 36 160 -139 -87 199 -60 -9 89 -20 96 -48 0 90 17 -67 56 -92 -129
$$ packed form
7777A74k0j14K33l77q6L06k73K77N9Rk32j02Q7J7L1J1J40k54J7Q0Q6j04q6k8K92
7802A43%k85K64J8k63K16j62M3j13J43Q1m6j45J62k54M19j42l23K09J78k16P1
7824bj17j1J97J21k87K17j28q4L02l95K62j22J63J36k89kJ92J6j57l6K09l17J44
7847A2q3R9J18j83J79j09J81j07m7j23N4k71J91K24j91m4J58n8j03K16m1M4j41
7870b5J01JM4j07q2J39j80j0K34j72N8o5L0j25K05j09K2J71k00q5K15j05J26O3
7894A44k45J47k57L28O6j66l0J49j20J02k65k5J92L9r3j20K30Qm7O9k59o6J19
7917a00J14k03J20K16k00L3l0O0L2o7J33J32k64r7L1J93M6j27R2j51kk2J18p9
7941b2QJ12R0k61p7L6O3Q7J24k99N2K86k59N1R8j09J16j44M8R0p3q4J23j48l7
$$ plain form
7966 -129 103 29 156 -37 -84 61 -108 -174 -10 17 -228 -92 25 92 -162 2 122 71 -115 -114 199 -114 -7
7989 -7 -206 -96 -22 -65 -146 34 -71 -90 10 -37 217 -187 50 177 -181 170 244 -137 245 254 213 -80 -249 -259
8013 -259 99 146 32 -71 -78 -276 2 -21 264 27 -144 29 20 -94 -26 89 152 -12 143 58 44 89 -72 -84
8037 -84 -86 -15 -303 -50 37 -148 -92 -71 67 -10 152 157 -53 -46 146 111 -236 -118 -153 32 -85 211 266 59 -27
8062 -27 -3 -114 87 90 17 104 -85 -94 141 183 -20 54 -13 -179 -126 148 24 56 -41 121 184 17 79 318 -151
8087 -151 -97 17 -42 3 -82 220 -269 -257 184 276 -77 160 151 -202 3 148 -135 178 77 61 29 88 134 304
8111 304 -11 75 70 -236 79 -22 57 9 -99 -39 119 -185 -188 117 -56 1 1 -80 -28 -89 -242 118 -68 -137 133
8136 133 -159 6 242 167 -113 -14 -93 -66 11 28 101 149 96 79 -24 46 -18 88 10 -90 151 -103 116 -35
$$ packed form
7966a29K32p4J27j93m7J45j69o6J64K7k45J36J17O7k54J64J20n1j86JL13l13J07
7989gj99J10P4m3q1J80j05j9J00m7K54m04K37J27l58L51P4l81L82Rm1k93j69j0
8013b59L58M7j14j03pj98K78k3K85k37j71J73rj14O8J15O3j64J55q5j4M5j61j2
8037h4kP1k88K53Q7j85N6K1J38p7J62Nk10PJ92l5l47J18l5J85j17K96N5k07q6
8062b7K4j11K01Lp3Q7j89rK35M2k03P4o7j66N3K74j24L2r7J62O3j67O2K39m69
8087a51N4J14n9M5q5L02m89J2M41R2l53K37rl53K05J45k83L13j01j6l2N9M6J70
8111C04l15Q6nl06L15j01P9m8j08O0J58l04lL05j73N7%q1N2o1j53L60j86o9K70
8136A33k92J65K36p5k80R9p9K7P7J7P3M8n3j7j03P0o4J06p8j00K41k54K19j51
$$ plain form
8160 -35 -21 0 -127 -51 127 241 -284 -71 98 -144 -21 -73 160 -239 -166 -227 60 -71 -10 -64 170 -250 81
8183 81 10 91 -66 -159 -60 208 65 118
$$ packed form
8160c5J4K1j27P6J78J14n25K13J69k42J23n2K33l99P3o1K87j31O1n4K34m20L31
8183H1p1Q1j57r3R9K68j43N3
8191A18
$$ Imaginary data points
##PAGE= N=2
##DATA TABLE= (X++(I..I)), XYDATA
$$ plain form
0 0 0 0 0 0 0 0 0 0 0 0 -8 8 -8 12 -16 17 -24 32 -40 44 -56 64 -75 88 -104 123 -144 163 -188 217 -249 283
32 283 -321 363 -411 461 -517 579 -647 721 -801 890 -987 1092 -1209 1334 -1473 1621 -1786
49 -1786 1969 -2167 2387 -2632 2904 -3206 3552 -3945 4393 -4918 5537 -6281 7199 -8354
63 -8354 9865 -11934 14955 -19788 28769 -51130 224791 286436 -158025 106680 306805 70071
75 70071 -91361 226037 114901 -44851 115740 233305 -59619 -43102 269052 72996
85 72996 -172219 -1305 189842 -94306 -198368 34642 2412 -118180 -65658 40354 -117576
96 -117576 -36265 90236 -39727 -137986 20746 119294 -109581 -98684 44933 59985 -52770
107 -52770 -8109 74875 30601 95887 77010 48993 42231 148346 100776 -20967 44657 100806
$$ packed form
0@%%%%%%%%%%qJ6j6K0k8L3m1N6p2Q4j00J20j39J63j92K27k67L07l51M05m66N32
32B83o04O84p74Q72r78J096j226J368j522J691j877K079k301K543k807L094l407
49a786L755m136M554n019N536o110O758p497Q338r311J0455j1818J3480j5553
63h354J8219k1799K6889l4743M8557p9899K75921O1645m44461K64705K00125k36734
75G0071j61432L17398j11136j59752J60591J17565k92924J6517L12154j96056
85G2996k45215J70914J91147k84148j04062K33010l2230j20592N2522J06012j57930
96a17576Q1311J26501j29963r8259J58732R8548k28875J0897J43617J5052j12755
107e2770M4661Q2984m4274O5286j8877k8017o762J06115m7570j21743O5624N6149
$$ plain form
119 100806 73540 -22741 33970 33650 57727 62200 -8949 -7270 45189 84247 -75469 -65427
131 -65427 24876 4327 -93574 -81516 -3091 -66222 -28435 -28035 -52666 -55160 47413 24649
143 24649 -117295 -26115 65927 3966 -120327 205 51583 -31060 -17236 20523 19594 -7382
155 -7382 89733 21829 -42502 44815 100592 -16548 -88367 63644 45347 -37256 -47039 28673
167 28673 5533 -17189 26579 -37563 -25675 20141 28994 -90880 -60766 31878 -26809 -80220
179 -80220 -63386 11458 -33329 -21359 -32428 -37479 9938 21974 -23966 -74676 34558 20995
191 20995 -43002 -49218 8362 9181 -25372 16578 -26987 -4502 38983 35325 -61454 -21357 84037
204 84037 -10907 -74372 -17953 56742 -43592 -44862 17154 -16868 -21956 24868 22497 -84516
$$ packed form
119A00806k7266r6281N6711l20K4077M473p1149J679N2459L9058j59716J0042
131f5427R0303k0549r7901J2058P8425o3131L7787M00k4631k494J02573k2764
143B4649j41944R1180R2042o1961j24293J20532N1378q2643J3824L7759r29k6976
155g382R7115o7904o4331Q7317N5777j17140p1819J52011j8297q2603r783P5712
167B8673k3140k2722M3768o4142J1888M5816Q853j19874L0114R2644n8687n3411
179h0220J6834P4844m4787J1970j1069n051M7417J2036m5940n0710J09234j3563
191B0995o3997o216N7580Q19l4553M1950m3565K2485M3485l658r6779M0097J05394
204H4037r4944o3465N6419P4695j00334j270O2016l4022n088M6824k371j07013
$$ plain form
216 -84516 11453 74684 -34643 -93106 28985 69157 -81366 -40425 39913 14199 -43726
227 -43726 31956 28366 -48826 40359 63499 -29662 -69048 85101 52752 -85214 -22181 73397
239 73397 16545 -66780 40094 27392 -23476 16175 44604 -34713 -44631 80362 178 -84103
251 -84103 -13049 77738 -29089 -75885 34691 23255 -19812 -12000 31566 -33136 -1169 51474
263 51474 -27046 -54617 22817 62461 -59039 -30169 45954 24721 -23934 4489 34532 -15645
275 -15645 33534 21776 -25847 -18216 57738 16840 -67259 12978 46317 5275 -38026 25818
287 25818 16825 -6525 25517 -3138 -20551 3268 51207 -37782 -43250 33085 28981 -32073 -29258
300 -29258 43314 -2971 -1749 8077 -2638 -15185 26966 27223 -58538 -6011 44367 10910 -58289
$$ packed form
216h4516R5969O3231j09327n8463J22091M0172j50523M0941Q0338k5714n7925
227d3726P5682l590p7192Q9185K3140r3161l9386J54149l2349j37966O3033R5578
239G3397n6852q3325J06874j2702n0868L9651K8429p9317r918J24993q0184q4281
251h4103P1054R0787j06827m6796J10576j1436m3067P812M3566o4702L1967N2643
263E1474p8520k7571P7434L9644j21500K8870P6123k1233m8655K8423L0043n0177
275a5645M9179j1758m7623P631P5954m0898q4099Q0237L3339m1042m3301O3844
287B5818q993k3350L2042k8655j7413K3819M7939q8989n468P6335m104o1054K815
300b9258P2572m6285J222R826j0715j2547M2151K57q5761N2527N0378l3457o9199
$$ plain form
313 -58289 8343 46971 -15576 -7444 11613 11478 -15862 33793 -1507 -41138 15304 39292 -19229
326 -19229 -58835 40388 26697 -27995 -18818 24229 4446 -17450 24186 -21171 -21309 15702 25642
339 25642 -50178 -31002 51450 -2286 -43800 -9428 43944 -18856 -16059 15901 -11489 -11777 15409
352 15409 13072 -58518 6826 44828 -16551 -47522 21259 45824 -32791 -3417 20574 8713
364 8713 -10424 24280 983 -32920 35402 27091 -26538 -28752 56402 17886 -37721 9426 29949
377 29949 3566 -14681 27486 -16561 -11549 29846 5627 -40025 -6179 53990 -21750 -33520
389 -33520 15175 30720 -21803 -13022 21700 -17521 1344 11780 -6029 -37078 23472 30116
401 30116 -36669 -15313 29797 23677 -33273 10984 18573 -4098 6486 12495 -5612 -15230 42996
$$ packed form
313e8289O6632L8628o2547Q132J9057j35k7340M9655l5300l9631N6442K3988n8521
326a9229l9606R9223j3691n4692R177M3047j9783k1896M1636m5357j38L7011R940
339B5642p5820J9176Q2452n3736m1514L4372N3372o2800K797L1960k7390k88K7186
352A5409k337p1590O5344L8002o1379l0971O8781K4565p8615K9374K3991j1861
364H713j9137L4704k3297l3903O8322q311n3629k214Q5154l8516n5607M7147K0523
377B9949k6383j8247M2167m4047N012M1395k4219m5652L3846O0169p5740j1770
389c3520M8695J5545n2523Q781L4722l9221J8865J0436j7809l1049O0550O644
401C0116o6785K1356M5110o120n6950M4257P589k2671J0584O009j8107r618N8226
$$ plain form
414 42996 2722 -29136 5794 44823 -2356 -32725 27255 13816 -5582 -7282 12845 -17398
426 -17398 -4296 25390 -22489 -27468 9758 30399 -38119 -19705 26166 2434 -21535 -6092
438 -6092 16166 -21808 8004 9310 -19418 -13816 31076 15169 -44079 13406 36413 837 -25837
451 -25837 24899 21087 -16977 17288 14046 -8836 -6496 44236 -4753 -32498 29029 34712 -19311
464 -19311 -28357 41818 4583 -24421 1024 10057 -20136 -10794 23686 -33767 -25833 17856 11490
477 11490 -47897 -16150 33137 -19337 -29416 -344 12310 -28760 -228 10079 -25901 -4057
489 -4057 22547 2451 -39307 21383 29554 -15588 -16235 21341 16750 -19709 14588 3772 -6420
502 -6420 5178 20824 -11427 -17483 32233 5716 -19393 -7638 27867 -8339 -17477 9089 -6941
$$ packed form
414D2996m0274l1858L4930L9029m7179l0369N9980j3439j9398j700K0127l0243
426a7398J3102K9686m7879m979L7226K0641o8518J8414M5871k3732k3969J5443
438f092K2258l7974K9812J306k8728N602M4892j5907n9248N7485K3007l5576k6674
451b5837N0736l812l8064L4265l242k2882K340N0732m8989k7745O1527N683n4023
464a9311r046P0175l7235k9004K5445R033l0193R342L4480n7453P934M3689o366
477A1490n9387L1747M9287n2474j0079K9072J2654m1070K8532J0307l5980K1844
489d057K6604k0096m1758O0690Q171m5142o47L7576m591l6459L4297j0816j0192
502f420J1598J5646l2251o056M9716k6517k5109J1755L5505l6206r138K6566j6030
$$ plain form
515 -6941 -8681 -64 7277 -33279 -1834 22770 -14834 -30377 5757 24269 -30797 -9677 11454
528 11454 -1463 -16043 7836 7236 -24938 15204 18366 -10531 -20246 32807 19070 -27705 4607
541 4607 24182 5602 -18644 20220 4274 -12968 12934 13353 -15144 -14476 35235 -4641 -27284
554 -27284 4399 23305 -15551 -25084 18037 -5385 -14574 -3090 6710 -23378 -5276 20400 -18373
567 -18373 -20881 5995 19291 -26912 -11071 13937 -2844 -10146 -1126 7476 -14066 12690 4660
580 4660 -10671 -50 19197 5592 -19245 15594 9521 354 -2229 10046 -1699 46 20882
593 20882 -9230 -6918 11258 19783 -19247 -6041 22642 -3388 -12014 1843 12897 -19380 4963
606 4963 11281 -16515 -10247 18324 7818 -36197 7980 21916 -12862 -23162 16503 9478 -27335
$$ packed form
515f941j740Q617P341m0556L1445K4604l7604j5543L6134J8512n5066K1120K1131
528A1454j2917j4580K3879o00l2174M0142L162k8897r715N3053j3737m6775L2312
541D607J9575j8580k4246L8864j5946j7242K5902M19k8497O68M9711l9876k2643
554b7284L1683J8906l8856r533M3121k3422r189J1484R800l0088J8102K5676l8773
567a8373k508K6876J3296m6203J5841K5008j6781p302R020Q602k1542K6756q030
580D660j5331J0621J9247j3605k4837L4839o073r167k583J2275j1745J745K0836
593B0882l0112K312J8176Q525l9030J3206K8683k6030q626J3857J1054l2277K4343
606D963O318k7796O268K8571j0506m4015M4177J3936l4778j0300L9665p025l6813
$$ plain form
619 -27335 9278 10935 -13426 -13852 28355 -1394 -31157 17596 23086 -16690 -23762 33585 6135
632 6135 -25286 5955 19981 -9549 -14182 29276 -5765 -19082 13162 22181 -21381 -15919 31831
645 31831 -2339 -21285 604 22142 -15760 -10919 16282 -6926 -10517 5806 12230 -24926 -7
658 -7 19075 -8372 -17415 6425 16449 -18969 930 8241 -2258 -4984 10352 3387 -14865 16168
672 16168 8190 -7421 -5719 20514 3276 -11849 12547 5372 -97 790 15261 -9516 -120
685 -120 20298 -1791 -11718 5369 21517 -16692 -4224 14428 76 -12261 5577 11995 -20848
698 -20848 4673 13010 -8287 -19115 16071 12493 -27336 -86 15733 -1350 -20663 14075
710 14075 7109 -16983 5342 12554 -5792 -15348 23454 2657 -18265 4806 19101 -5438 -17017
$$ packed form
619b7335L6613J657k4361m26M2207k9749k9763M8753N490l9776p072N7347k7450
632F135l1421L1241J4026k9530m633M3458l5041j3317L2244R019m3562N462M7750
645C1831l4170j8946K1889K1538l7902M841K7201k3208l591J6323O424l7156K4919
658gJ9082k7447r043K3840J0024l5418J9899P311j0499k726J5336o965j8252L1033
672A6168p978j5611J702K6233j7238j5125K4396p175n469Q87J4471k4777R396
685a20K0418k2089r927J7087J6148l8209J2468J8652j4352j2337J7838O418l2843
698b0848K5521Q337k1297j0828L5186l578l9829K7250J5819j7083j9313L4738
710A4075o966k4092K2325P212j8346r556L8802k0797k0922K3071J4295k4539j1579
$$ plain form
723 -17017 19935 3134 -8777 1426 13049 -8121 -6226 19502 -5667 -10705 4222 17252
735 17252 -14155 -7417 15112 -783 -7709 -391 12415 -10991 2244 8042 -4026 -3879 7437
748 7437 9205 -14636 6125 9248 1015 -5708 6484 6336 -6546 10617 -128 -2435 -243 12225
762 12225 -6062 -9547 12495 -386 -8452 -5207 11951 -11220 -7471 7077 -6383 -10960 109
775 109 8587 -22723 -5315 10485 -5599 -18863 1225 11262 -19687 -2417 7569 -3585 -14599
788 -14599 10066 6967 -19199 4956 12848 -4304 -16493 18438 8502 -16573 3385 13419 -1805
801 -1805 -13056 18173 164 -13666 5135 12839 -10838 -15644 18551 -3593 -16503 -2510 11721
814 11721 -13697 -14486 10576 -7583 -12143 -2768 6859 -18236 -6218 11045 -8584 -12285 1607
$$ packed form
723a7017L6952j6801j1911J0203J1623k1170J895K5728k5169n038J4927J3030
735A7252l1407O738K2529j5895o926P318J2806k3406J3235N798j2068J47J1316
748G437J768k3841K0761L123q233o723J2192j48j2882J7163j0745k307K192J2468
762A2225j8287l485K2042j2881q066L245J7158k3171L749J4548j3460m577J1069
775A09Q478l1310J7408J5800j6084j3264K0088J0037l0949J7270R986j1154j1014
788a4599K4665l099k6166K4155P892j7152j2189L4931r936k5075J9958J0034j5224
801a805j1251L1229j8009j3830J8801P704k3677m806L4195k2144j2910J3993J4231
814A1721k5418p89K5062j8159m560R375R627k5095J2018J7263j9629l701J3892
$$ plain form
827 1607 11326 -14172 -205 8380 -1563 -3977 7203 8592 -10426 10230 8680 -1371 -2987 13493
841 13493 7260 -9981 9512 7133 617 -4656 11069 -780 -6860 8431 336 -6656 -5853 11526
855 11526 -8930 -9367 3838 -863 -9856 -6048 7409 -13375 -4555 3064 -3539 -12262 2015 9245
869 9245 -15533 -1246 8392 2453 -12387 7870 10454 -9591 4337 10748 2975 -9065 16557
882 16557 8749 -8684 6224 15214 1862 -9804 17828 6292 -6130 3524 12362 -2221 -6679
895 -6679 15930 -1689 -7210 3271 12288 -9442 -6881 13803 -3155 -7975 753 10122 -12038
908 -12038 -2499 9440 -5335 -6567 3672 8381 -14276 1863 9233 -2868 -7738 5380 7796
921 7796 -11038 4862 4526 -1883 -5224 8874 2379 -9859 7596 3813 -2705 -5885 10505 -1328
$$ packed form
827A607R719k5498J3967Q585r943k414J1180J389j9018K0656j550j0051j616J6480
841A3493o233j7241J9493k379o516n273J5725j1849o080J5291q095o992Q03J7379
855A1526k0456m37J3205m701q993L808J3457k0784Q820P619o603q723J4277P230
869I245k4778J4287R638n939j4840K0257K584k0045J3928O411p773j2040K5622
882A6557p808j7433J4908Q990j3352j1666K7632j1536j2422R654Q838j4583m458
895f679K2609j7619n521J0481R017k1730K561K0684j6958m820Q728R369k2160
908a2038R539J1939j4775j232J0239M709k2657J6139P370j2101m870J3118K416
921G796j8834J5900l36o409l341J4098o495j2238J7455l783o518l180J6390j1833
$$ plain form
935 -1328 -7317 5884 1630 -3407 -3679 9883 -7744 -4968 6431 980 -8325 -2866 10593 -10070
949 -10070 -3916 3644 1101 -10190 -288 7739 -11613 -1895 3812 594 -12495 4766 6575 -11006
963 -11006 -1553 5625 1546 -11653 8576 3449 -8418 1756 8145 -803 -10242 13147 2297
976 2297 -7085 1405 11492 -3050 -8186 13331 427 -5573 896 10906 -7723 -5066 11716
989 11716 -2807 -7986 47 10148 -11709 -4670 6611 -4292 -8423 -807 5117 -13921 -997
1002 -997 3416 -5248 -8515 3587 3473 -13326 3280 4357 -2342 -6134 8625 2856 -7615 8391
1016 8391 5604 -851 -2718 14134 1421 -4245 9521 6788 -857 -1534 13920 -2274 -2220 6667
1030 6667 4267 -4663 -802 10257 -8303 -3277 3641 1930 -10310 -1557 6248 -10250 -3356 1533
$$ packed form
935a328n989J3201m254n037k72J3562j7627K776J1399n451r305N459J3459k0663
949a0070O154P560k543j1291R902Q027j9352R718N707l218j3089J7261J809j7581
963a1006R453P178m079j3199K0229n127j1867J0174O389q948r439K3389j0850
976B297r382Q490J0087j4542n136K1517j2904o000O469J0010j8629K657J6782
989A1716j4523n179Q033J0101k1857P039J1281j0903m131P616N924j9038J2924
1002i97M413q664l267J2102j14j6799J6606J077o699l792J4759n769j0471J6006
1016H391k787o455j867J6852j2713n666J3766k733p645o77J5454j6194N4Q887
1030F667k400q930L861J1059j8560N026O918j711j2240Q753P805j6498O894M889
$$ plain form
1044 1533 225 -11895 2832 4161 -9397 -1035 5242 2149 -10148 9077 6478 -4225 1758
1057 1758 10311 4987 -4396 13815 5976 -157 4547 13310 1984 -3037 13816 3555 -1736 1544
1071 1544 10708 -4515 -4160 7832 -2951 -6324 -1566 4907 -13489 -5070 3207 -7866 -11314 -2582
1085 -2582 2082 -15943 -3487 770 -6979 -10218 2218 1858 -13422 2347 4030 -2605 -6249 9710
1099 9710 3899 -6653 7409 7106 1324 -1840 13474 2030 -2458 9500 6760 -1486 -1606 12791
1113 12791 -3090 -3571 4907 3420 -7445 -3432 7582 -9062 -5717 408 -693 -12631 -3264 3815
1127 3815 -11588 -6894 -399 -50 -13247 -349 2306 -8251 -3311 2827 1198 -9618 5845 3061
1141 3061 -3998 62 7042 1913 -5775 9231 2660 -1618 626 7895 -1201 -3879 8633 -801
$$ packed form
1044A533j308j2120J4727J329j3558Q362O277l093j2297J9225k599j0703N983
1057A758Q553n324r383J8211p839o133M704Q763j1326n021J6853j0261n291L280
1071A544R164j5223L55J1992j0783l373M758O473j8396Q419Q277j1073l448Q732
1085b582M664j8025J2456M257p749l239J2436l60j5280J5769J683o635l644J5959
1099I710n811j0552J4062l03n782l164J5314j1444m488J1958k740q246j20J4397
1113A2791j5881m81Q478j487j0865M013J1014j6644L345O125j101j1938R367P079
1127C815j5403M694O495L49j3197J2898K655j0557M940O138j629j0816J5463k784
1141C061p059M060O980n129p688J5006o571m278K244P269r096k678J2512r434
$$ plain form
1155 -801 -3874 -1041 7150 -6409 -5108 4546 -3510 -6195 -2653 4428 -10334 -3632 2769 -4792 -7191
1170 -7191 -127 3735 -10947 133 3574 -1971 -5685 4656 4206 -7181 5300 5087 -419 -3101
1184 -3101 10308 3297 -5421 7593 6628 -664 -3095 12306 680 -4627 5718 5387 -3388 -3484 10695
1199 10695 -4245 -4988 3610 4302 -7362 -3901 8067 -5692 -4219 2418 3530 -8005 342 6828
1213 6828 -5442 -1413 4194 4379 -7494 4977 6801 -3063 -105 6362 4804 -5458 7488 4200
1227 4200 -1912 842 7111 1530 -5999 7321 1732 -2731 -1938 5681 -2266 -5575 4428 -1677 -3518
1242 -3518 -2488 4051 -6443 -3544 3756 -2606 -4422 -1318 4781 -6945 -391 3505 -1299 -2874
1256 -2874 3063 5474 -6242 3984 5466 1017 -2782 7326 5895 -5084 5162 5928 1738 -3384
$$ packed form
1155h01l073K833Q191j3559J301R654q056k685L542P081j4762O702O401p561k399
1170g191P064L862j4682J1080L441n545l714J0341m50j1387J2481k13n506k682
1184c101J3409p011q718J3014r65p292k431J5401j1626n307J0345l31q775r6J4179
1199A0695j4940p43Q598O92j1664L461J1968j3759J473O637J112j1535Q347O486
1213F828j2270M029N607J85j1873J2471J824r864K958O467j558j0262J2946l288
1227D200o112K754O269n581p529J3320n589m463P93P619p947l309J0003o105j841
1242c518J030O539j0494K899P300o362j816L104O099j1726O554L896m804j575
1256b874N937K411j1716J0226J482m449l799J0108j431j0979J0246P66m190n122
$$ plain form
1270 -3384 8357 2625 -4778 4676 4596 -1872 -5263 8331 -1100 -6043 1761 3108 -4790 -6018 6544
1285 6544 -4765 -5518 502 2040 -7620 -3454 6412 -6017 -4811 1654 4121 -7940 -1060 5825
1299 5825 -3860 -2330 2740 4087 -7011 2938 4872 -2763 -1622 4421 3950 -6581 4400 3051
1313 3051 -1657 -2025 3941 735 -5447 4482 -528 -2877 -2593 4254 -2908 -5205 3316 -2173 -3099 -2445
1329 -2445 3552 -5416 -2494 3010 -2752 -3656 -14 4400 -6839 -42 3836 -469 -3818 1891 4368
1344 4368 -5261 2697 2990 -276 -2997 4963 3507 -5470 3883 3939 195 -3880 6790 1816 -4782
1359 -4782 2866 2984 -1099 -4040 7170 -1663 -5166 2442 3594 -4303 -5342 6731 -3028 -4949 -59
1374 -59 3370 -5832 -3780 5439 -4330 -4245 394 3454 -7807 -1598 4827 -3414 -4041 976 4216 -6355
$$ packed form
1270c384J1741n732p403R454q0o468l391J3594r431m943P804J347p898j228J2562
1285F544j1309p53O020J538r660M166R866j2429J206O465K467j2061O880O885
1299E825r685J530N070J347j1098R949J934p635J141O043m71j0531J0981j349
1313C051m708l68N966l206o182R929n010k349K84O847p162k297Q521n489r26O54
1329b445N997q968K922N504n762r04L642M414j1239O797L878m305l349N709K477
1344D368r629P958K93l266k721P960j456q977R353N6l744m075J0670m974o598
1359d782P648J18m083k941J1210q833l503P608J152p897j039J2073r759j921M890
1374e9L429r202K052R219r769Q5M639L060j1261O209O425q241o27N017L240j0571
$$ plain form
1390 -6355 1045 3129 -2172 -1822 3495 2853 -5949 3929 3356 -1220 -1801 5062 2321 -3917 4711 2076
1406 2076 -46 -648 5464 -817 -2290 5177 821 -1966 -1540 5610 -3062 -2418 2282 -617 -2770 -981
1422 -981 3286 -6054 -478 1607 -1953 -4734 896 2894 -6717 137 1906 -438 -4402 2929 1915
1437 1915 -4885 2628 3333 -657 -4021 6663 2394 -3418 2656 4629 651 -3438 6811 958 -1783
1452 -1783 2026 3998 -1560 -2634 6220 -1821 -3645 -239 3829 -4300 -4238 3016 -3330 -3751 -1997 1518
1468 1518 -6588 -2202 1815 -4441 -4290 -299 2220 -6883 -510 2353 -1393 -3125 1462 3239 -3792
1483 -3792 3742 2666 407 -365 5798 2892 -2028 5269 3449 1827 271 5825 969 -440 4429
1498 4429 715 -456 101 4759 -4024 -1901 2812 -569 -4235 -1979 2775 -6099 -1679 72 -2385
$$ packed form
1390f355P400K084n301L50N317o42q802R878n73m576n81O863k741o238Q628k635
1406B076k122o02O112o281j473P467m356k787M26P150q672O44M700k899k153J789
1422i81M267r340N576K085l560k781N630J998r611O854J769k344l964P331j014
1437A915o800P513P05l990l364J0684m269n812O074J973l978m089J0249n853k741
1452a783L809J972n558j074Q854q041j824L406M068q129O2P254o346m21J754L515
1468A518q106M386M017o256J51L991K519r103O373K863l746j732M587J777p031
1483c792P534j076k259p72O163k906m920P297j820j622j556N554m856j409M869
1498D429l714j171N57M658q783K123M713l381l666K256M754q874M420J751k457
$$ plain form
1513 -2385 -5566 151 1451 -7345 -1076 1433 -1243 -5757 2361 2300 -4277 1087 2628 747 -2833
1528 -2833 5763 1613 -2208 3453 4636 333 -2598 7220 1480 -1587 1929 4460 -936 -1971 5680
1543 5680 -1530 -2179 684 2974 -4427 -2841 3970 -2631 -4109 -1249 2787 -5215 -2358 1217 -2408
1558 -2408 -2374 -113 1917 -5084 878 2667 -542 -2175 2840 3555 -3014 3167 2668 1491 -214 4501
1574 4501 1811 -1340 5368 2415 -224 -941 5910 346 -2300 3064 1466 -1085 -1762 3832 -3153
1589 -3153 -1685 1983 -446 -3824 -1198 3722 -4910 -2417 1089 534 -4159 -227 2194 -4552 137
1604 137 1348 -106 -4100 3430 2677 -4019 550 3499 1252 -4095 4232 2075 -2040 1094 2891
1619 2891 -319 -3140 5050 -85 -2958 268 3943 -1678 -3871 3663 -752 -1725 -913 2152 -2972
$$ packed form
1513b385l181N717J300q796O269K509k676m514Q118o1o577N364J541j881l580
1528b833Q596m150l821N661J183m303k931R818n740l067L516K531n396j035P651
1543E680p210o49K863K290p401J586O811o601j478K860M036q002K857L575l625
1558b408L4K261K030p001N962J789l209j633N015P15o569O181m99j177j705M715
1574D501k690l151O708k953k639p17O851n564k646N364j598k551o77N594o985
1589c153J468L668k429l378K626M920q632K493L506n55m693L932K421o746M689
1604A37J211j454l994P530p53o696M569K949k247n347Q327k157m115L134J797
1619B891l210k821Q190n135k873L226L675n621k193P534m415r73Q12L065n124
$$ plain form
1634 -2972 -1526 3023 -2392 -2004 420 2723 -4187 -457 2823 -692 -1517 475 2641 -3156 2309
1649 2309 1715 -707 -1033 2998 2161 -3818 2363 1930 62 -2479 2677 1111 -2532 1802 211 -438
1665 -438 -1703 2907 -2189 -2923 1720 219 -2723 -2977 3040 -2650 -2213 302 -338 -2728 -601 2423
1681 2423 -4234 -759 1721 577 -4156 796 3722 -3093 -649 1414 1661 -3153 2436 1773 -2584
1696 -2584 828 2608 309 -3969 3730 1630 -2418 -228 2501 236 -3080 3227 -487 -1644 141
1711 141 2262 -2466 -2660 3926 -1117 -2520 -889 3452 -2609 -1715 2163 -1165 -1231 233 2466 -3942
1727 -3942 424 2693 -1253 -1822 1152 3109 -3326 1170 1613 313 -987 1848 1007 -2594 2757 813
1743 813 -1178 -1131 3704 476 -2667 2012 1009 -646 -1848 2884 -1617 -1364 1780 -167 -2462 -1298
$$ packed form
1634b972J446M549n415L88K424K303o910L730L280l515q25J992K166n797N465
1649B309n94k422l26M031q37n979O181m33j868k541N156j566l643M334j591o49
1665d38j265M610n096p34M643j501k942k54O017n690M37K515o40k390K127L024
1681B423o657L475K480j144m733M952K926o815K444K063K47m814N589o63m357
1696b584L412J780k299m278P699k100m048K190K729k265l316O307l714j157J785
1711A41K121m728j94O586n043j403J631M341o061Q94L878l328o6J464K233o408
1727c942M366K269l946n69K974J957o435M496M43j300j300K835q41l601N351j944
1743H13j991M7M835l228l143M679j003j655j202M732m501K53L144j947k295J164
$$ plain form
1759 -1298 3733 -3294 -2332 924 975 -2706 -1754 2505 -2796 -780 211 422 -3305 922 2621 -2939
1775 -2939 -473 1933 1805 -3147 1790 2552 -1004 604 1738 1449 -1760 3854 1510 -1226 1124 4019
1791 4019 991 -3063 3837 1400 -319 -625 2811 -402 -1495 2674 -619 -1434 -240 2914 -2704
1806 -2704 -2024 2253 -414 -2431 -1361 1943 -2638 -343 273 -1293 -1362 664 1357 -3743 995 1434
1822 1434 -90 -1947 1590 1656 -1941 1977 818 606 -505 3192 135 -1365 2759 1632 -386 -1782
1838 -1782 3439 -181 -1389 1053 359 -438 -929 2178 -2514 -789 1033 -45 -2924 -876 2757 -2868
1854 -2868 -1233 -212 836 -2745 78 938 -2180 416 1164 646 -3277 1978 2150 -1306 -653 2071
1870 2071 2194 -2083 2230 916 121 -33 1944 496 -1705 3092 -87 -928 -877 2453 -713 -2156
$$ packed form
1759a298N031p027R62L256N1l681R52M259n301K016R91K11l727M227J699n560
1775b939K466K406j28m952M937P62l556J608J134k89l209N614k344k736K350K895
1791D019l028m054O900k437j719l06L436l213j093M169l293q15J194L154n618
1806b704O80M277k667k017J070L304m581K295O16j566o9K026O93n100M738M39
1822A434j524j857L537O6l597L918j159k12j111L697l057j500M124j127k018j396
1838a782N221l620j208K442o94p97m91L107m692J725J822j078k879K048L633n625
1854b868J635J021J048l581K823Q60l118K596P48n18l923N255J72l456O53K724
1870B071J23m277M313j314p95j54J977j448k201M797l179q41N1L330l166j443
$$ plain form
1886 -2156 1129 -736 -577 -1119 1263 -2650 -872 1272 -1620 -2063 -639 1964 -3457 -899 752 -270
1902 -270 -1756 -415 978 -2494 1291 785 -833 -1675 2132 1122 -2958 1382 1126 127 -1659 1780
1918 1780 -366 -1546 1167 88 -1195 -1115 2875 -2117 -2425 1275 1031 -1975 -2211 2554 -1702 -692
1934 -692 560 561 -1808 105 2851 -2385 -615 1534 2273 -2451 718 2895 -688 -49 1269 1986 -1514
1951 -1514 1962 1218 -892 331 2148 925 -3143 1625 877 -704 -1359 938 -144 -2288 1330 -1040
1967 -1040 -1173 -1405 1371 -2065 -2380 1287 -414 -1637 -1860 2199 -1347 -989 489 -124 -227 -67 2288
1984 2288 -2010 913 1831 557 -926 1076 2720 -1414 1122 1380 1136 -739 1721 679 -1985 1716
2000 1716 1242 -165 -2100 2395 409 -2258 271 752 -115 -1912 1836 -1266 -1137 547 794 -1551
$$ packed form
1886b156L285j865J59n42K382l913J778K144k892m43J424K603n421K558J651j022
1902b70j486J341J393l472L785n06j618q42L807j010m080M340k56r99j786L439
1918A780k146j180K713j079j283Q0L990m992l08L700k44l006k36M765m256J010
1934f92J252Jk369J913K746n236J770K149P39m724L169K177l583O39J318P17l500
1951a514L476p44k110J223J817j223m068M768p48j581o55K297j082k144L618k370
1967a040j33k32K776l436l15L667j701j223k23M059l546L58J478o13j03J60K355
1984B288m298K923R18j274j483K002J644m134K536K58k44j875K460j042k664L701
2000A716m74j407j935M495j986k667K529M81q67j797L748l102J29J684K47k345
$$ plain form
2016 -1551 -1684 2768 -1268 -1174 235 2041 -1250 -496 2141 -721 569 913 1546 -1811 1613 2371 -827
2033 -827 -328 1232 2176 -1785 1146 1378 -237 -276 661 508 -1904 1707 -329 -1157 -1212 1399 -137 -2564
2051 -2564 651 -291 -361 -1372 466 -1510 -1163 830 -1512 -844 -660 1649 -1931 -683 967 -125
2067 -125 -731 -450 1581 -1735 945 587 57 -865 1294 1473 -2321 642 1060 605 -1716 1044 993 -995
2085 -995 790 137 304 -1378 2306 -441 -1614 1058 1175 -557 -2204 2132 -101 -652 -121 756 -775
2102 -775 -843 2079 -1756 -1009 555 1119 -2040 -804 2200 -1239 -919 -182 1655 -1888 287 625 -1442
2119 -1442 -437 409 832 -2823 1362 1114 -728 -1043 454 599 -1901 1059 -363 -483 -401 1422 -624
2136 -624 -1620 2044 -1 -695 -893 2194 -946 -962 1225 -197 -412 -309 1756 -2061 -204 1378 -362
$$ packed form
2016a551j33M452m036R4J409J806l291P54K637k862J290L44O33l357L424P58l198
2033h27M99J560R44l961K931K32j615l9R37j53k412L611k036q28n5K611j536k427
2051b564L215r42p0j011J838j976L47J993k342O68J84K309l580J248J650j092
2067a25o06K81K031l316K680l58n30r22K159J79l794K963M18m55k321K760n1j988
2085i95J785o53J67j682L684k747j173K672J17j732j647M336k233n51N31Q77j531
2102g75o8K922l835P47J564N64l159J236L004l439L20P37J837l543K175L38k067
2119a442J005Q46M23l655M185k48j842l15J497J45k500K960j422j20Q2J823k046
2136f24r96L664k045o94j98L087l140j6K187j422k15J03K065l817J857J582j740
$$ plain form
2153 -362 -1284 -121 1924 -1797 67 361 276 -1085 545 919 -1726 1014 468 -133 -1563 1823 1265
2170 1265 -1671 585 1036 776 -1494 1971 127 -546 858 857 -384 -1027 2323 -447 -1136 -79 1686
2187 1686 -566 -1462 1294 -719 -47 -414 792 -1787 -217 1450 -1367 -1037 -228 1361 -2084 -214
2203 -214 910 -424 -639 213 886 -1617 958 490 -852 -545 1352 912 -2032 1442 776 206 -997
$$ packed form
2153c62r22J163K045l721J864K94q5j361J630L74k645K740n46o01j430L386n58
2170A265k936K256M51k60k270L465j844o73J404jj241o43L350k770o89J057J765
2187A686k252q96K756k013O72l67J206k579J570J667k817L30Q09J589l445J870
2203b14J124j334k15Q52O73k503K575m68j342L07J897m40k944L474o66n70j203
$$ [...]
8191a86
##END NTUPLES=NMR FID
##END=
