##TITLE=1H_EC-2760(2)
 CDCl3, 8 sc, 
 16.9.2019
##JCAMPDX= 6.0         $$ Bruker NMR JCAMP-DX V2.0
##DATA TYPE= NMR FID
##DATA CLASS= NTUPLES
##ORIGIN= UXNMR, Bruker Analytische Messtechnik GmbH
##OWNER= root
$$ XWIN-NMR		Version 3.5
$$ Mon Sep 16 14:00:12 2019 Russian Standard Time (UT+4h)  she@DPX200
##.OBSERVE FREQUENCY= 200.13155
##.OBSERVE NUCLEUS= ^1H
##.DELAY= (6, 6)
##.ACQUISITION MODE= SIMULTANEOUS
##.ACQUISITION SCHEME= undefined
##.AVERAGES= 8
##.DIGITISER RES= 18
##SPECTROMETER/DATA SYSTEM= spect
##.PULSE SEQUENCE= zg30
##.SOLVENT NAME= CDCl3
##.SHIFT REFERENCE= (INTERNAL, CDCl3, 0, 15.7039)
##AUDIT TRAIL= $$ (NUMBER, WHEN, WHO, WHERE, WHAT)
$$ ##TITLE= Audit trail, XWIN-NMR		Version 3.5
$$ ##JCAMPDX= 5.01
$$ ##ORIGIN= Bruker BioSpin GmbH
$$ ##OWNER= she
$$ F:/spectra/data/she/nmr/H-F/1/audita.txt
$$ ##AUDIT TRAIL=  $$ (NUMBER, WHEN, WHO, WHERE, WHAT)
(   1,<2019-09-16 13:58:49.95 +0400>,<she>,<DPX200>,
      <created by zg, POWCHK disabled, PULCHK disabled
       configuration hash MD5:
       00 E9 B6 7A A2 85 ED C7 34 08 36 98 17 FE 4E 26
       data hash MD5: 16K
       C8 42 EA 32 29 EE A4 8B 6A 84 DA BC 1C C2 2E 30>)
$$ ##END=
$$ 
$$ hash MD5
$$ 56 17 6D 74 22 6A ED 25 0B 0E EB A5 98 13 4E 56
##$RELAX= 
##$RELAX= 
##$RELAX= 
##$RELAX= 
##$RELAX= 
##$RELAX= 
$$ Bruker specific parameters
$$ --------------------------
##$DU= <F:/spectra>
##$EXPNO= 1
##$NAME= <H-F>
##$PROCNO= 1
##$TYPE= <nmr>
##$USER= <she>
##$AMP= (0..31)
100 100 100 100 100 100 100 100 100 100 100 100 100 100 100 100 100 100 
100 100 100 100 100 100 100 100 100 100 100 100 100 100 
##$AQSEQ= 0
##$AQ_mod= 1
##$AUNM= <au_zg>
##$AUTOPOS= <>
##$BF1= 200.13
##$BF2= 200.13
##$BF3= 200.13
##$BF4= 200.13
##$BF5= 200.13
##$BF6= 200.13
##$BF7= 200.13
##$BF8= 200.13
##$BYTORDA= 1
##$CFDGTYP= 0
##$CFRGTYP= 5
##$CHEMSTR= <none>
##$CNST= (0..31)
1 1 145 1 1 1 1 1 1 1 1 1 1 1 1 1 1 1 1 1 1 1 1 1 1 1 1 1 1 1 1 1 
##$CPDPRG= <>
##$CPDPRG1= <>
##$CPDPRG2= <>
##$CPDPRG3= <>
##$CPDPRG4= <mlev>
##$CPDPRG5= <mlev>
##$CPDPRG6= <mlev>
##$CPDPRG7= <mlev>
##$CPDPRG8= <mlev>
##$CPDPRGB= <>
##$CPDPRGT= <>
##$D= (0..31)
0 1.2 0 0 0 0 0 0 0 0 0 0.03 0 0 0 0 0 0 0 0 0 0 0 0 0 0 0 0 0 0 0 0 
##$DATE= 1568627929
##$DBL= (0..7)
120 120 120 120 120 120 120 120 
##$DBP= (0..7)
150 150 150 150 150 150 150 150 
##$DBP07= 0
##$DBPNAM0= <>
##$DBPNAM1= <>
##$DBPNAM2= <>
##$DBPNAM3= <>
##$DBPNAM4= <>
##$DBPNAM5= <>
##$DBPNAM6= <>
##$DBPNAM7= <>
##$DBPOAL= (0..7)
0.5 0.5 0.5 0.5 0.5 0.5 0.5 0.5 
##$DBPOFFS= (0..7)
0 0 0 0 0 0 0 0 
##$DE= 6
##$DECBNUC= <off>
##$DECIM= 24
##$DECNUC= <off>
##$DECSTAT= 4
##$DIGMOD= 1
##$DIGTYP= 9
##$DL= (0..7)
0 120 120 120 120 120 120 120 
##$DP= (0..7)
150 150 150 150 150 150 150 150 
##$DP07= 0
##$DPNAME0= <>
##$DPNAME1= <>
##$DPNAME2= <>
##$DPNAME3= <>
##$DPNAME4= <>
##$DPNAME5= <>
##$DPNAME6= <>
##$DPNAME7= <>
##$DPOAL= (0..7)
0.5 0.5 0.5 0.5 0.5 0.5 0.5 0.5 
##$DPOFFS= (0..7)
0 0 0 0 0 0 0 0 
##$DQDMODE= 0
##$DR= 18
##$DS= 0
##$DSLIST= <SSSSSSSSSSSSSSS>
##$DSPFIRM= 0
$$ [...]
##$SUBNAM2= <"">
##$SUBNAM3= <"">
##$SUBNAM4= <"">
##$SUBNAM5= <"">
##$SUBNAM6= <"">
##$SUBNAM7= <"">
##$SUBNAM8= <"">
##$SUBNAM9= <"">
##$SW= 24.9336996594482
##$SWIBOX= (0..15)
0 0 2 0 0 0 0 0 0 0 0 0 0 0 0 0 
##$SW_h= 4990.01996007984
##$TD= 16384
##$TD0= 1
##$TE= 0
##$TE2= 300
##$TE3= 300
##$TEG= 300
##$TL= (0..7)
0 120 120 120 120 120 120 120 
##$TP= (0..7)
150 150 150 150 150 150 150 150 
##$TP07= 0
##$TPNAME0= <>
##$TPNAME1= <>
##$TPNAME2= <>
##$TPNAME3= <>
##$TPNAME4= <>
##$TPNAME5= <>
##$TPNAME6= <>
##$TPNAME7= <>
##$TPOAL= (0..7)
0.5 0.5 0.5 0.5 0.5 0.5 0.5 0.5 
##$TPOFFS= (0..7)
0 0 0 0 0 0 0 0 
##$TUNHIN= 0
##$TUNHOUT= 0
##$TUNXOUT= 0
##$USERA1= <user>
##$USERA2= <user>
##$USERA3= <user>
##$USERA4= <user>
##$USERA5= <user>
##$V9= 5
##$VALIST= <valist>
##$VCLIST= <CCCCCCCCCCCCCCC>
##$VD= 0
##$VDLIST= <DDDDDDDDDDDDDDD>
##$VPLIST= <PPPPPPPPPPPPPPP>
##$VTLIST= <TTTTTTTTTTTTTTT>
##$WBST= 1024
##$WBSW= 4
##$XGAIN= (0..3)
0 0 0 0 
##$XL= 0
##$YL= 0
##$YMAX_a= 41319
##$YMIN_a= -42530
##$ZGOPTNS= <>
##$ZL1= 120
##$ZL2= 120
##$ZL3= 120
##$ZL4= 120
##$ABSF1= 10
##$ABSF2= 0
##$ABSG= 5
##$ABSL= 3
##$ALPHA= 0
##$AQORDER= 0
##$ASSFAC= 0
##$ASSFACI= 0
##$ASSFACX= 0
##$ASSWID= 0
##$AUNMP= <proc_1d>
##$AZFE= 0.1
##$AZFW= 0.1
##$BCFW= 1
##$BC_mod= 2
##$BYTORDP= 1
##$COROFFS= 0
##$CY= 11.3945322036743
##$DATMOD= 1
##$DC= 2
##$DFILT= <>
##$DTYPP= 0
##$F1P= 20.1720416913024
##$F2P= 0.152960286110954
##$FCOR= 0.5
##$FTSIZE= 0
##$FT_mod= 4
##$GAMMA= 1
##$GB= 0.15
##$INTBC= 1
##$INTSCL= 1
##$ISEN= 128
##$LB= 0.24
##$LEV0= 0
##$LPBIN= 0
##$MAXI= 10000
##$MC2= 0
##$MEAN= 0
##$ME_mod= 0
##$MI= 1.114404
##$NCOEF= 0
##$NC_proc= 0
##$NLEV= 6
##$NOISF1= 3.799351
##$NOISF2= 2.8
##$NSP= 1
##$NTH_PI= 0
##$NZP= 0
##$OFFSET= 15.70392
##$PC= 1
##$PHC0= -9297.768
##$PHC1= 21.00096
##$PH_mod= 1
##$PKNL= yes
##$PPARMOD= 0
##$PSCAL= 0
##$PSIGN= 0
##$REVERSE= no
##$SF= 200.130013532006
##$SI= 16384
##$SIGF1= 3
##$SIGF2= 2
##$SINO= 400
##$SIOLD= 16384
##$SREGLST= <1H.CDCl3>
##$SSB= 0
##$STSI= 0
##$STSR= 0
##$SW_p= 3612.71676300578
##$SYMM= 0
##$S_DEV= 0
##$TDeff= 0
##$TDoff= 0
##$TI= <>
##$TILT= no
##$TM1= 0
##$TM2= 0
##$TOPLEV= 0
##$USERP1= <user>
##$USERP2= <user>
##$USERP3= <user>
##$USERP4= <user>
##$USERP5= <user>
##$WDW= 1
##$XDIM= 8192
##$YMAX_p= 0
##$YMIN_p= 0
$$ End of Bruker specific parameters
$$ ---------------------------------
##NTUPLES= NMR FID
##VAR_NAME=  TIME,          FID/REAL,        FID/IMAG
##SYMBOL=    X,             R,               I
##VAR_TYPE=  INDEPENDENT,   DEPENDENT,       DEPENDENT
##VAR_FORM=  AFFN,          ASDF,            ASDF
##VAR_DIM=   8192,          8192,            8192
##UNITS=     SECONDS,       ARBITRARY UNITS, ARBITRARY UNITS
##FACTOR=    0.0002004,     1,               1
##FIRST=     0,             0,               0
##LAST=      1.6414764,     0,               0
##MIN=       0,             -42530,          0
##MAX=       1.6414764,     41319,           0
$$ Real data points
##PAGE= N=1
##DATA TABLE= (X++(R..R)), XYDATA
$$ [...]
230d929K183Q311m281p186N857N651o975l856P587K119p772n35P574q06o896K160
246a794N932l437m854M213L275m777j505M918j25m151K030L280l351k091L977
261A540M66m393P67M122j932l589K993L195l381k312L833J449m203p35L975n17
277A278l899J478L403k158k109L167J079l458J63L174j658l051K305K224k935
292i97j353L438R35l273k78L249j52l072M45K649r87k316J340J762j513r18J628
309E87P4j487O32Q52j409l91J721j39j438J012J565j111j167J215P49j468q06
326a009J142M36j208k58J273M5j121L68J054o44n82J088K01j246L43J194q78j123
344i25J019O87j274o08J051M42q73l93Q85P38n00o25O17O23p63p51M11L75l57
$$ plain form
230 -4929 -2746 5565 1284 -5902 -45 5606 -1369 -5225 2362 4481 -3291 -3826 3748 2942 -3954 -1794
246 -1794 4138 701 -4153 60 3335 -1442 -2947 1971 1846 -2305 -275 3005 -346 -2437 1540
261 1540 2006 -2387 -1620 2502 570 -3019 -26 3169 -212 -2524 1309 2758 -1445 -2180 1795 1278
277 1278 -2621 -1143 2260 102 -2007 1160 2239 -1219 -1056 2118 460 -2591 -286 1938 -997
292 -997 -2350 1088 2023 -1250 -1528 1721 1569 -1503 -1058 1591 604 -1712 -372 1390 -123 -1041 587
309 587 661 -826 -194 658 -751 -1142 579 440 -998 14 1579 468 -699 516 1265 -203 -1009
326 -1009 133 569 -639 -897 376 421 -700 -332 722 78 -504 584 785 -461 -118 1076 198 -925
344 -925 94 781 -493 -1101 -50 392 -481 -874 11 749 249 -376 241 864 101 -650 -239 136 -221
363b21k35J67M13M07k72n12M63N32q13o33P07L02p64j50O25J98j76kJ54K91L0
384E11m80j16L65k00n54J09L22q0k4R6J6K02P6l07jL70j45k75J80O9j91J46p6
407A3l94K52M39n19l87O65K56o64j33O20J96l55j88L49L81l87n61L48M16o00l69
428f22O24J83m76J76M64j69m5L05j33k49J83q8m16k9J68q2j42J24L25J96k01q0
450A6M58M3o50QM99m43n65N30K43o61J66P55l74n10O98L52q02j98Q04J12q31j05
472d55Q74O2r99l4J093j56j126M31J051o88p53R23L55j001R1Q68n44o24Q04L45
492E17r09L0J065j78r77M10R39o83j115P49R91j158r39J535P92j694k39J976j82
511I30j903O66J604j204j276J418P02j575k86J568j38j505M97J417q18j317J150
$$ plain form
363 -221 -456 -289 124 531 259 -253 210 742 -71 -704 3 305 -459 -609 16 214 38 36 190 481 511
384 511 31 -85 280 80 -474 -365 -43 -123 -147 -51 -35 167 243 -64 -65 305 160 -115 65 134 -57 89 13
407 13 -381 -129 310 -209 -596 69 325 -339 -472 148 344 -11 -199 150 531 144 -417 -69 347 -253 -622
428 -622 2 185 -291 -115 349 180 135 440 307 58 241 153 -263 -292 -124 -206 -348 -224 101 297 96 16
450 16 474 517 -133 -125 374 -69 -634 -104 139 -522 -356 399 25 -485 213 565 -237 -435 369 481 -350 -455
472 -455 419 481 -518 -552 541 385 -741 -310 741 53 -700 223 578 -423 -332 536 -8 -632 172 517
492 517 -392 -362 703 525 -452 -42 897 214 -901 -152 839 -319 -1258 277 1069 -625 -864 1112 930
511 930 -973 -307 1297 93 -1183 235 937 -638 -924 644 506 -999 -502 915 97 -1220 -70
528g0J172j422q32J835N25j955J05J942p72j800J200J193j731o14J902%j789P26
546c85J658j128j233J535Q78j783m80J953j06k170N89K124j244j994J932J634
562A780k525r70K980J76l077P60K894j597k447K238J723k777r69K989K13k992
578a601N95K963j312k709J967K239k698j728L171Q90l488J43L602j133l115K229
594A5K472l031j530L408K82l655Q00L371j798k758K812K147l380j154L917N6m293
611b319J033M192k425l921L648L245m736k045N627P24n919P91N771k401n249L599
627c85M191m674k873N319J546n510l3N446j393n010K645M223l847l165M715J782
643B977n226j61N328j394m798K986L852m181k588M861R16n135O37M810k068l990
$$ plain form
528 -70 1102 -320 -1152 683 1208 -747 -642 1300 528 -1272 -72 1121 -610 -1224 678 678 -1111 -385
546 -385 1273 145 -1088 447 1325 -458 -938 1015 909 -1261 -672 1452 208 -1786 146 1780
562 1780 -745 -1715 1265 1441 -1636 -876 2018 421 -2026 212 1935 -842 -1811 1178 1391 -1601
578 -1601 -1006 1957 645 -2064 -97 2142 -556 -2284 887 1777 -1711 -1568 2034 901 -2214 15
594 15 2487 -544 -2074 1334 1616 -2039 -1239 2132 334 -2424 388 2535 -845 -1999 1918 1974 -2319
611 -2319 -1286 2906 481 -3440 208 3453 -1283 -3328 2299 3023 -2896 -2105 3666 1265 -3984 -385
627 -385 3806 -868 -3741 1578 3124 -2386 -2419 3027 1634 -3376 -731 3492 -355 -3520 1195 2977
643 2977 -2249 -2410 2918 1524 -3274 -288 3564 -617 -3205 1656 2572 -2563 -1926 2884 816 -3174
659c174L324K953m138j533M672M6m808J503M456l141l776M491K572n573r55O316
675C235q33o301K789N745m622m619O022K923p101j026P485j039p346L057O711
690E080m782n574O332M111p454k388Q107L61q290J670P903l632o848N359N363
705E318o564l475P149J379p144N75O450k293n252L645L796m406j992M837K56m647
721b368J453L985l118l078M298J579n289J09N712j923n454L858M743n402l393
736d288O668J637p353K55P394k247o993L984O015n476m712O604L144p325j379
751d072P578m63p385K324O719l947n501N374L930o251k025O557J7o321J736N424
767C694l379m167M438K587n002p93N246p28m802K368M100l683l078M626J604n360
$$ plain form
659 -3174 150 3103 -1035 -2568 2104 2150 -2658 -1155 3301 160 -3616 875 3447 -2126 -3081 3235
675 3235 2402 -3899 -1110 4635 13 -4606 1416 4339 -2762 -3788 3697 2658 -4688 -1631 5080
690 5080 298 -5276 1056 5167 -2287 -4675 3432 3793 -4497 -2827 5076 1444 -5404 -45 5318
705 5318 -1246 -4721 2428 3807 -3337 -2762 3688 1395 -3857 -212 3584 -822 -2814 2023 2279 -2368
721 -2368 -915 3070 -48 -3126 1172 2751 -2538 -2429 3283 1360 -4094 -236 4507 -895 -4288
736 -4288 2380 4017 -3336 -3081 4313 2066 -4927 -943 5072 -404 -5116 1488 4632 -2693 -4072
751 -4072 3506 3043 -4342 -2018 4701 754 -4747 627 4557 -1694 -3719 2838 2855 -3466 -1730 3694
767 3694 315 -3852 586 3173 -1829 -2622 2624 1896 -2906 -538 3562 -121 -3199 1427 3031 -2329
783b329j34N476j603n136L262M295m558k929N605J304o088M30N983k168n430L651
799c69M479m761l212N612J741o015l29N984j295n703K696M959l991l827N115K546
815C630n633q33N886p35n555K205M707l531l674M208K346m730r97M719k39m324
831b550J443L799k294k871L100J890l519p29L637n94l523J749K814k863j948L649
847A190P74l985N24M004j655l590K674K912l404k056L832J073l992q1L892q82
863A230l563J771K963k654k205L226J172l635QL743j119l356K262K788l054j928
879b351L548R29l778jL647q50l343J618K837k146k204K563J458k822o75K876k45
896A061k711J132K311j872j628K524Q07k805N7K794r36k574J557K047k043j495
$$ plain form
783 -2329 -2463 3013 1410 -3726 -464 3831 -727 -3656 1949 3253 -2835 -2405 3578 1410 -4020 -369
799 -369 4110 -651 -3863 1749 3490 -2525 -2854 3130 1835 -3868 -1172 3787 -204 -4031 1084 3630
815 3630 -2003 -2836 3050 2315 -3240 -1035 3672 141 -3533 675 3021 -1709 -2706 2013 1774 -2550
831 -2550 -1107 2692 398 -2473 627 2517 -1002 -1731 1906 1312 -2211 -462 2352 -511 -2459 1190
847 1190 1964 -2021 -1497 2507 852 -2738 -64 2848 -556 -2612 1220 2293 -1699 -1780 2112 1230
863 1230 -2333 -562 2401 -253 -2458 768 1940 -1695 -1687 2056 937 -2419 -157 2631 -423 -2351
879 -2351 1197 2126 -1652 -1653 1994 1144 -2199 -581 2256 110 -2094 469 1927 -895 -1570 1306 1061
896 1061 -1650 -518 1793 -79 -1707 817 1624 -1181 -1124 1670 734 -1840 -283 1764 -279 -1774
912a774K282Q87k302k69K248k83j983Q29J666j374j201J759N52k054J62K140q53
929D32j941J573J567k067j055K336L97k428J55K236n96j933R72J622j167j156
945a053J324P43j389k87J338k48j217P21R66j160n51J523N9j681M32J585r26j400
963a221J238J057j361o69J426L38j285n1J102k30r77M23P36o63n09Q60K41j010
981e55J44J083m85j010Q46Q22j059n26J179K25j119%R14k11p63K33N22k10k99
1000b69K80K64j38n6J83j13k16K07J6n43L4O33k35o52N49P00o13m82P54K60p79
1021b16j43O17n2n03J56L85j39k57J80J75k61k49K24J47l74k8M87L3l68J90L94
1042C98k44k54J43K8j71qm2l9K52M9k94J09M16j69m41J55L46k06l72J47M59qm37
$$ plain form
912 -1774 508 1395 -907 -1176 1072 789 -1194 -365 1301 -73 -1274 485 1037 -1017 -855 1285 432
929 432 -1509 64 1631 -436 -1491 845 1242 -1186 -1031 1205 609 -1324 -352 1270 103 -1053
945 -1053 271 1014 -375 -662 676 428 -789 -68 898 -262 -813 710 769 -912 -480 1105 179 -1221
963 -1221 17 1074 -287 -956 470 808 -477 -528 574 344 -633 -210 526 -137 -646 214 455 -555
981 -555 -411 672 187 -823 23 845 -214 -740 439 664 -455 -455 459 248 -515 -282 240 30 -269
1000 -269 11 275 137 81 264 151 -65 142 158 -385 -351 282 47 -605 -56 644 31 -451 303 563 -216
1021 -216 -359 258 206 -297 -141 244 105 -152 28 203 -58 -307 -83 64 -310 -338 149 182 -186 4 398
1042 398 154 -100 43 71 -100 -108 -150 -189 63 112 -182 -73 343 174 -267 -112 234 28 -344 -197 262 254 -183
1065a83J06N97j21o28J46N16l51m89K45K70k44j10J39Q0O9Nr7Q5J88p1j64R1N9
1088A38j07p6p4k1K8q9o4J43Q1p1J67J74j70QL09j95m22K46K56m98k45N04J84
1111B06m39k5M81J34l62j49L53J42m47k17L97J11l71j1L40k7j09J00q9p2K44p9
1133A11m28K01M77l23m46M08M12m30l59L86L25l71l45L27L21l51k65M41J55m06
1153a60N8L65k47k61L70L1n19J40N00k91m06M41M04m08k70M34K67m17l18L34K52
1174B99m50k63M39K00l66J5L77m2j70J62o7k59J41J05m36o6M92k6m05J81M94j02
1196B53l55J03L56j50m10O5K91k04l15K46J79l11O2L97k24k72N14J99o18%O96
1217E02j98p46K47O32m25o55M21N84l93m83N66N09n14l64O13J38o84L8N31l70
$$ plain form
1065 -183 -77 520 399 -229 -83 433 82 -407 -162 108 -136 -246 -107 -27 42 47 -50 35 223 152 -12 79 138
1088 138 31 -45 -119 -140 -112 -201 -265 -122 -41 -112 55 229 59 67 376 181 -241 5 261 -237 -482 22 206
1111 206 -233 -258 223 357 -5 -154 199 341 -106 -323 74 185 -186 -197 143 116 7 107 18 -54 190 111
1133 111 -317 -116 361 38 -408 0 412 -18 -377 9 334 -37 -382 -55 266 -85 -350 91 246 -160
1153 -160 -102 263 16 -245 125 156 -363 -223 277 -14 -420 21 425 17 -253 181 448 31 -287 47 299
1174 299 -151 -414 25 225 -141 -126 251 209 39 201 134 -125 16 121 -315 -381 111 85 -320 -139 355 253
1196 253 -102 1 357 207 -203 -138 153 -51 -366 -120 59 -252 -190 207 -17 -289 225 424 -194 -194 502
1217 502 304 -442 -195 437 12 -643 -222 362 -31 -514 52 561 47 -317 296 434 -250 -212 319 -51
1237e1l73O25J39p01K53P99n56p57P42N66j033m97J124L28j173p4J326j4j264
1256e91K90J192o61j163Q39Q08j135m46J355Q5j249M41J167p99r71J002N65j203
1274d74l06J220K0j072L41J026m89q28P10N07r58k62J008k06j035O87R51j049
1292b09o01J479K03j702K49J703p69j620J172J358j439j016J596O45j671k76J614
1309G16j32j442N37J238q59q36J195L25j417J62J384q46j280J366R61j751l92
1326a071K095q8k051O54J867j183j647J486J173j768p03J978K51j951L38J911
1342A291q76j745J351J312j826q39K135K65k155M19K100r74j746J372J226j742
1358d32p64J755J60j687L90J542p60j135J217Q11j518l77J682k46j859P27J723
$$ plain form
1237 -51 -424 201 340 -361 -108 691 135 -622 120 686 -347 -844 280 608 -565 -639 687 673 -591
1256 -591 -301 891 230 -933 -94 714 -421 -867 488 573 -676 -235 932 133 -838 164 729 -474
1274 -474 -780 440 460 -612 -271 755 266 -562 148 655 -303 -565 443 237 -798 -111 840 -209
1292 -209 -810 669 872 -830 -581 1122 353 -1267 -95 1263 -176 -1192 404 1049 -622 -898 716
1309 716 584 -858 -321 917 58 -778 417 742 -675 -513 871 25 -1255 111 1072 -679 -1071
1326 -1071 1024 936 -1115 -461 1406 223 -1424 62 1235 -533 -1236 742 993 -958 -620 1291
1342 1291 415 -1330 21 1333 -493 -1332 803 1068 -1087 -668 1432 458 -1288 84 1310 -432
1358 -432 -1196 559 719 -968 -578 964 204 -931 286 1097 -421 -798 884 638 -1221 -494 1229
1375A229j308j466J839J091k074m81K275n4k208O07J882j130j535J369J010j602
1391e56m87J701K1j535N31J459r55j169J348P31j737k82J829l25j840R23J638
1408A295j384j174J803O70j952n2J905n49j753J006J412j455r94J748N37j950
1424h87k1K053m99k016J035J808j522j466J929R64k195l88K220k19k055Q08J730
1441A279j209j226J531P31j647k44J624l04j555O98J320j099j025J478O56j646
1457f38j71J785l35j707Q46J469j296j068J617N41j768j2J674n61j543R32J193
1474I58j257p95J583M94j583M2J728m74j671Q03J356j354j184J553O91j760j06
1491i76J853l14j558R13J298j286q79J473L15j605R0J538n11j354R16J158j196
$$ plain form
1375 1229 -79 -1545 294 1385 -689 -1170 1105 1051 -1157 -550 1332 202 -1333 36 1046 -556
1391 -556 -1043 658 679 -856 -325 1134 179 -990 358 1089 -648 -930 899 574 -1266 -343 1295
1408 1295 -89 -1263 540 1210 -742 -794 1111 562 -1191 -185 1227 -228 -1222 526 1063 -887
1424 -887 -908 1145 646 -1370 -335 1473 -49 -1515 414 1378 -817 -1205 1015 796 -1259 -451 1279
1441 1279 70 -1156 375 1106 -541 -785 839 535 -1020 -322 998 -101 -1126 352 1008 -638
1457 -638 -809 976 641 -1066 -220 1249 -47 -1115 502 1043 -725 -737 937 376 -1167 -235 958
1474 958 -299 -1094 489 983 -600 -558 1170 696 -975 -172 1184 -170 -1354 199 890 -870 -976
1491 -976 877 563 -995 -82 1216 -70 -949 524 839 -766 -676 862 351 -1003 -87 1071 -125
1508a25q60J417M55j599n2J614l90j508Q88J278j238q52J508L55j609J41J527
1525I50o00j302R96R99j286o76J377K35j513J05J460m52j299Q78J198j071q06
1542h07J359M24j536l8J398n33j334Q93R94j151n72J430K06j393K22J291n67j166
1560h80Q18R20j025o50J213L50j240l6J250l80j184O81R36j005n76J228K36j227
1578e71K51J192n92j014Q23O75j086m32J125J08j090J92J087l51r37O13P73q30
1596f4n87R18K62j063N4J009l74q50P13O43q81l18J007Mr97K57Q62n19p17O45
1616DN38p36l25Q34J47q51R7Q47l34p81N45O10p84m24R23J25r70K00R43m18p57
1637e67O27N84p52l97P74J60p73l0P21j05o59K44N88l77m51M85K95n72p5N77j53
$$ plain form
1508 -125 -985 432 887 -712 -764 850 460 -1048 -160 1118 -120 -972 536 891 -718 -577 950
1525 950 350 -952 44 1043 -243 -919 458 693 -820 -715 745 293 -1006 -128 1070 -1 -807
1542 -807 552 976 -560 -598 800 267 -1067 -174 820 -331 -903 527 733 -660 -438 853 286 -880
1560 -880 -62 858 -167 -817 396 746 -494 -530 720 340 -844 -163 773 -232 -808 420 656 -571
1578 -571 -320 872 280 -734 89 764 -322 -754 371 479 -611 -419 668 317 -620 -7 766 -64
1596 -64 -651 267 529 -534 -480 529 155 -695 18 661 -220 -538 469 473 -524 -267 595 76 -641 4
1616 4 542 -194 -519 315 462 -389 -292 555 221 -560 -15 595 -189 -613 310 435 -535 -335 608 190 -567
1637 -567 60 644 -108 -505 269 429 -344 -374 347 242 -417 -173 415 38 -413 72 367 -205 -280 297 144
1658A44n04L65L67n33j54O05n4n94K37N00l69m17M41L10n03k02N32J15n45NN93
1679C39j26n57K89M94m39l90N22J60n61J8N37j73m11L37K86l91j31L76k4l92O6
1700a71L41j36l21K74L13k71k29L87J45m62q1M55j45m91K43L99l76k07M64J21
1720B52m15L3L85j33l03J41K17j53j73J80J56j82j11J87K1k34J0K10j48j41K40
1741C9O5k10R4K56j96j43K49J1l07L0K21j20k11J53J89j34j47J41J63j30j54J64
1763B3J45j93p8K18Lk10P2J10j32o3J50n4j13J33O7j38K9J36p1j10P0P0o6o4M7
1788a9Q9l1o3O6R6j17j03J06K1j81J2J32o6l5J52L3q9Q6P3j04n1M7n1p1J6l0J2
1815g0L3j3rR7%n9N0M9p8MM9o2k3O5l4m4O0Qm5K3qm1N4L1j16N0J39r7r4J43P2
$$ plain form
1658 144 -360 5 372 -161 -315 290 236 -358 -121 379 10 -407 34 344 -159 -361 171 286 -259 -254 339
1679 339 213 -344 -55 439 0 -390 132 292 -269 -251 286 113 -298 39 325 -66 -197 179 155 -237 -171
1700 -171 170 34 -287 -13 300 29 -200 187 332 -130 -211 244 99 -392 -149 250 -126 -333 131 252
1720 252 -163 -130 255 122 -181 -40 177 24 -149 31 187 5 -106 81 102 -132 -122 88 -60 -201 39
1741 39 104 -106 -12 244 48 -95 154 165 -142 -112 109 -11 -222 -69 120 -14 -161 -20 143 13 -141 23
1763 23 168 -25 -103 115 118 -92 -20 90 -42 -105 45 -9 -122 11 78 -60 -31 105 34 -76 -6 64 -2 -66 -19
1788 -19 70 39 -24 42 138 21 -82 24 45 -136 -124 8 -58 -93 59 92 3 89 162 58 7 54 3 -68 -52 -82 -70
1815 -70 -37 -50 -59 38 38 -21 29 78 0 4 53 -9 -32 33 -1 -45 15 23 -22 1 -7 -48 6 37 -79 -29 110 13 -81 62 134
1846A34j66k3J32Kj15j8P1K7q4q1J16J04j30p6J72P4j84j0J27l3q7JM3MJ4o0J
1873d5J02Nj11N1Q2p6m0J8j1rL0n9J0J01lj22R8J09j31p3J40Oj32j5J08Jp1k7
1901f4J26M8j37l5K03k1k46N6K17j52k09J79J62j91p1K07N9j22l0P1M4p5j07J8
1925g0J07n2j28N2J17J2p0oR9R1j41j39J85J36k75j69L56P7l62JL69n8l29J30
1949f7K45j44j99J42J56j46j26J66Q6j30l9J79k3j92J06J21k00r2K66p1k48J83
1971b7K21k60q2L13J2l38J07L05k22k62K48K20l32k02L86J60m28q7N16Mn53J40
1993a61N21k67m56L50L29m06j78M13N4l71R5K62j65j69K00O7k30QK51r2k56J94
2015gK77l04k10M09J12m74j8N02j47m99K77M29m07k76M67J60m73K1M34j43l89
$$ plain form
1846 134 -32 -55 77 79 -36 -54 17 44 -40 -121 -5 99 -31 -107 65 139 -45 -55 72 39 -48 -47 -4 0 14 -46 -45
1873 -45 57 62 -49 2 84 8 -32 -14 -25 -34 -4 -63 -53 48 45 -77 21 130 -1 -74 66 72 -60 -75 33 34 -37 -64
1901 -64 62 110 -27 -62 141 120 -126 -70 147 -5 -214 -35 127 -64 -135 72 131 9 -21 50 94 19 -88 -70
1925 -70 37 -15 -143 -91 26 38 -32 -38 61 152 11 -128 57 193 -82 -251 105 182 -180 -179 190 132 -197 -67
1949 -67 178 34 -165 -23 133 -13 -139 27 113 -17 -56 123 100 -92 14 135 -65 -157 109 38 -210 -27
1971 -27 194 -66 -148 165 177 -161 -54 251 29 -233 15 235 -97 -299 87 247 -181 -268 248 252 -301 -161
1993 -161 360 93 -363 -13 316 -90 -268 145 199 -172 -77 185 20 -149 51 118 -112 -104 147 55 -201 -7
2015 -7 270 -34 -244 165 277 -197 -215 287 140 -359 -82 347 -60 -336 131 291 -182 -161 273 130 -259
2036b59K37K89l37k21L90J04m23pM77j03m55K60M02l78k97M84J02n29O2M94k42
2057E0m19M04K92m88j28N64l0n65J82N14l00m71L98M21m83l22N97J84o34n6O40
2078C50j56n94L15M50m53k67N20J01n27J10M72k56l90L80K67m66j78N27L5n45
2098c05Q2N34j90n02L42M13m65k77N54J01n98J17N79l22m69M84L29n73j64O25
2118B95j5o29J45N74k58n34L87M43m58l46N58K09n62o5N65j26n17K87L71m26j73
2139b75M72qm64K07M17l68k83M58J58n37o1N39r3n60K13N48l49m47M72L77n76
2160a60k00O68J4o75J94O17m01n35N24L48o33j78O68M6o24J42N80k33m78L30L90
2181D04m32k75M56J27n00M0M71k05m10L65K85m97j19N47o9n47K55N09m08l83N12
$$ plain form
2036 -259 -22 267 -70 -291 99 203 -220 -227 250 147 -308 -48 354 -24 -321 163 265 -264 -202 292 50
2057 50 -369 35 327 -161 -289 275 245 -320 -138 376 76 -395 3 424 -59 -381 216 400 -234 -290 350
2078 350 194 -400 -85 365 -88 -355 165 266 -261 -151 321 65 -325 55 322 -144 -322 205 240 -305
2098 -305 -223 311 121 -381 -39 374 -91 -368 186 287 -311 -194 385 63 -406 78 407 -166 -330 295
2118 295 280 -349 -204 370 112 -422 -35 408 -50 -396 162 371 -191 -256 309 183 -334 -47 324 -102 -275
2139 -275 197 189 -275 -68 349 -19 -302 156 314 -223 -284 255 162 -398 -185 363 14 -433 39 416 -160
2160 -160 -360 308 322 -353 -159 458 57 -478 46 394 -239 -417 251 297 -327 -185 395 162 -316 14 404
2181 404 -28 -303 153 280 -220 -180 291 86 -324 41 326 -171 -290 257 188 -359 -104 405 -3 -386 126
2202A26K65n49j49N53Kn53J01M93k11m45L41L36m15k26M84L2m94J46M67k88l40
2223c24M54K30m97o1M97r6m98J72L75l11k96L48K21l66m3M28j7l96J65L62k89
2244E8l39M00J79n04n8N39j10n27K55M51l69l42M34K29m43j03M60J3m11P7L62
2265B51j80l27K29K39l27j46L85M2m04J07M07k23l36L25K25l89j13L80J7l34R0
2286h2K77j09k26J48J31j92o2J98l1k11J26K19j94j54K88R7l45m5M01q4m02J89
2308f3L45k50k81L07J76l24j08L02Pk81M8K45q9k05J84J90k24j28K73J4l29M1
2330a50L13j47k94K44K45k73j24L13M3k83L0K39r5j87R6J43j31r2J56N5j82K3
2352e8K15r0k17J73J79k54j36K97N5l12M1K82j08k21J47J64j87p2J62K3j42J6
$$ plain form
2202 126 391 -158 -307 246 248 -305 -204 289 78 -367 -26 310 -105 -331 153 185 -309 -163 304 16 -324
2223 -324 130 360 -137 -198 299 203 -295 -123 252 -59 -355 -7 214 -152 -195 233 216 -180 -15 347 58
2244 58 -281 119 298 -206 -264 275 165 -362 -107 344 -25 -367 67 296 -147 -250 210 223 -188 -111 251
2265 251 71 -256 -27 212 -115 -261 124 166 -238 -131 276 53 -283 42 267 -122 -235 145 162 -172 -82
2286 -82 195 86 -140 8 139 -53 -115 83 52 -159 -33 186 -8 -162 126 223 -122 -167 234 150 -252 -63
2308 -63 282 32 -249 58 234 -90 -198 104 111 -170 -122 123 34 -171 13 203 -21 -149 124 138 -191 -150
2330 -150 163 16 -278 -34 211 -62 -186 127 170 -113 -83 156 61 -126 -30 113 -18 -110 46 101 -81 -58
2352 -58 157 67 -150 23 202 -52 -188 109 164 -148 -107 175 67 -154 -7 157 -30 -102 60 83 -59 -43
2374d3J31q9j01J27P6j68m3K16k2k63Q2K58j64k28K32J89k51j07K82K2k45L7J89
2397A17q1j50J06Q9j12n4J30K0j18K1J46o7j50J31J35j90p3K01J3k08L1J55q4
2420Hj18J04O8q6J6Q0m0l4M9Pj00nO0l8p2K6J20j9j17R4J27j13j06J25M7j58j7
2447i2J37m5j10J10M4n2j2N3ro7NL5j3k9K3P1mn7N1N9o0p2N3K1n8pM1OjNj9LK4
2480C4n8m4N4J7o0L5P9j6m4O6J5n7j3mn9j2Rj6lL1J8J9lKM1J9m2qQ0m7m5N0np2
2514c9J3N2r2k2Q6Kq2Q7R4m9m4Q5K0o3o7K7J6n7l4L5O9m0j5Q0kn1L2j1o5QM9p0
2546d8m3J13J6r5N6R2o8n6M7K4p4l2L6K6m0j0L8K6k6oO4j8m0N0L2q1pR1l4q8N2
2577cN1q7k6P9j0j9K5K5rL0kl5PJ6l3k4JJJ5k3k3M2L4m8j4P9J3q6J9M3j7m6mk
$$ plain form
2374 -43 88 -1 -102 25 101 -67 -110 106 84 -179 -97 161 -3 -231 1 190 -61 -168 114 136 -109 -72 117
2397 117 36 -114 -8 81 -31 -85 45 65 -53 -32 114 47 -103 28 163 -27 -100 101 114 -94 -63 92 8
2420 8 -110 -6 62 -24 -8 72 32 -2 47 54 -46 -51 9 -29 -101 -75 45 26 -91 3 130 17 -89 36 83 -75 -92
2447 -92 45 0 -110 0 44 -8 -20 33 24 -43 -38 -3 -16 -45 -22 49 45 -12 39 98 38 -34 19 40 -18 -25 16 22 21 26 7 10 34
2480 34 -24 -68 -14 3 -57 -22 57 41 -3 63 78 21 8 4 -55 -67 -58 -74 -77 -46 -28 -9 -12 -10 31 50 8 0 80 33 -12 38 33 -39
2514 -39 -26 26 -66 -88 -2 0 -82 5 99 50 6 91 111 48 -19 8 24 -33 -67 -32 37 -3 -18 62 60 9 41 30 -35 -27 22 -48
2546 -48 -91 22 38 -57 -1 91 23 -33 14 38 -36 -68 -32 -6 -46 -56 -18 8 -18 -24 40 22 -18 32 64 -17 -24 67 33 -55 -3
2577 -3 48 -39 -65 14 4 -15 10 35 26 56 54 19 26 42 9 -15 -14 -13 2 -21 -44 -2 32 -16 -30 49 62 -24 -5 38 21 -25 -29 -31
2611c1K4J0o1NR4j9r7P1J01r0p5R0M7r0m9P3J2n8k0P1J9n0%R0j2p0O9M6j13pJ05
2642H5n3j02O2N3r1k5J09j0o2N9M8l1l9L3j4n3jK0Qn0L6O4k8o0J04K3j27k4J30
2671F4n7j43P0J33j05o1J53K3j05K7P0n1q4O0K2n5k1P2L4q4J6J03m3j24O8J19
2697A01j17r3J73N9j76NJ88o8j63J12P6j24q1J33L9j14QJ22kj24K8J04o8j30J03
2722iR0j37n2J72Kj49M0J33j09r0R8N4j10J6J26l3p8N7N3p9o5P0L2j22jJ33K7
2749F9j38P0J63j10j37J46O1k03k3J81l2j62P7J68j20o8J08O9j41n1J13K1j30
2772f9J5J32k8j10Q3R7j50o8J39j6j53O8J42j22q0J78M3j67K2J48p8j38R0J00
2796G8j17q7J41R7j55l9J74J6k00M3J90j01j75J72J01k02l3J96k2j67P2J55j18
$$ plain form
2611 -31 -7 3 -58 -53 41 22 -75 -4 97 7 -68 22 69 -21 -70 3 15 -43 -63 8 27 -23 -23 67 55 -15 54 100 -13 -20 85
2642 85 32 -70 -8 45 -46 -71 38 28 -34 25 73 42 3 36 22 -31 -32 -12 -4 -54 -18 46 18 -42 62 85 -42 -66 64
2671 64 7 -136 -66 67 -38 -99 54 77 -28 -1 69 18 -66 -6 16 -39 -60 12 46 -38 -22 81 38 -86 -18 101
2697 101 -16 -109 64 123 -53 -48 140 72 -91 21 97 -27 -108 25 64 -50 -42 80 78 -46 -18 86 18 -112 -9
2722 -9 81 -56 -108 64 66 -83 -43 90 -19 -109 -11 43 -67 -51 75 42 -36 21 74 -5 -70 0 32 -90 -91 42 69
2749 69 -69 1 164 54 -83 63 124 -79 -102 79 47 -115 -38 130 10 -58 50 119 -22 -73 40 61 -69
2772 -69 -54 78 50 -60 23 120 -30 -98 41 25 -128 -60 82 -40 -120 58 101 -66 -44 104 26 -112 -22 78
2796 78 -39 -126 15 112 -43 -82 92 108 -92 -49 141 40 -135 37 138 -64 -97 99 77 -90 -18 137 19
2819A9j09J32N5j49jJ13k4j35M9J43r2j14J47R2j56o0J97j1k16O5J82j34j51J57
2843aR3j82j9J78oj43N5J18o9q5P5N8j09m2J19J3j49M3J52r3j13J57Q1j65k5J99
2869A40n9j81J00J19j31j17J55O0j38j2J44j1j25L6J33o3j30R4J08j53o7J50J1
2892F3j66L7J52q4j27J38O9j32qJ46l0j09O4O9q5o5P5L7j14k0J35Jj30M1J71j04
2918B4j26J47P7j76o5J93j3j66O2J51p4r9Q8O7j00l3P9np3QQ1m8o0Q8N7j21j1
2945d8J43qj70M9J70j17j35J35P8j54n7J40Nj16K8J03k3o1N6O4n7m8N5J6r3j5
2971f0Q7l4j05J00P2q6l0J32j7j15M9P7n1q0R6Qn2MM4rn2K1L4m6m0O7L4r0J5J12
3001H5k1j05M5J18j18q4J12M0j36MJ00k3o8L9Q5o9m8N6K6p0j8O7J3p2J0R5k5q5
$$ plain form
2819 19 -90 42 97 -52 -53 60 36 -99 -50 93 1 -113 34 126 -30 -90 107 96 -120 -55 127 -7 -158 -1
2843 -1 92 -90 -109 69 63 -80 -25 93 24 -61 14 72 -37 -79 40 53 -96 -53 99 6 -107 50 131 -34 -59 140
2869 140 81 -100 0 119 -12 -129 26 86 -52 -64 80 69 -56 -20 113 50 -80 14 122 -31 -98 52 63
2892 63 -103 -66 86 2 -125 13 82 -50 -58 88 58 -51 13 82 -3 -68 7 44 -70 -90 45 46 -84 -43 128 24
2918 24 -102 45 122 -54 -119 74 61 -105 -43 108 34 -65 23 90 -10 -43 36 31 -42 -34 47 -1 -61 27 84 -37 -48
2945 -48 95 87 -83 -34 136 19 -116 19 97 -57 -114 26 31 -85 -57 46 23 -38 18 82 25 -23 32 48 -45 -60
2971 -60 27 -7 -112 -12 60 -26 -56 76 59 -56 -7 70 19 -61 35 43 -9 -5 39 30 -22 -1 33 -13 -53 14 48 -42 -27 85
3001 85 64 -41 4 122 4 -80 32 72 -64 -60 40 17 -51 -12 73 4 -44 12 38 -32 -50 17 30 -42 -32 63 38 -47
3029d7N6O4p8l3P3j8p7L6N8m2l4O8Kl6L1J9l6j7L8jm5jL9Lp3K8O4k5p3O8O1q8
3061a6k3Q4Nq7K2N1o1l1O8J1o1K2L5j9j2K3Kk6kJ4Pk9nN4kn4L0N3n4n8R6J6j08
3094e5K1P8k5o3M9K4j8j3OK0ll7J0K2j2k0j1L0J4pj4KK6J3n1k7P7j5r2L6Q3n2
3126do1N7O1n3k7N1K5m4m4J4L4k8l6K7L9j0k0K8J1k7RJ0l4L4Ll5KL6j8k1L3Ql5
3159a5RK3k7k3L8J0k7kK8K5l1k3L8L0n2l7O5K0r4j4R2j3p1J1O7k2k4K6kK3j5m5
3191c2K9L8k6m0ML2j4qj9L6K7l6m1N7N6q7k8P5J1o5J3N0k2rmPNj2k8RJ9j6NJ2
3225bkRK4k6jL1On2J3M6m6n8N1K2l9MJ9Nj0J6mj2PJ9j7k5KL4j0m2J3M6k5m5M2
3260gM2n4k6N3J9n2K0K2j1qJ2Pj9K9j6k3J1MLl3PJ8J5l6j3P0om5J5N7l2n2M1J8
$$ plain form
3029 -47 9 73 -5 -38 35 17 -60 -24 34 -8 -42 26 28 -8 23 42 6 -11 27 26 -19 -20 19 22 -51 -23 41 16 -57 11 72 -16
3061 -16 -39 45 50 -37 -15 36 -25 -56 12 23 -38 -16 19 0 -12 11 13 -13 -15 -1 6 -23 -28 26 24 -30 0 53 -1 -59 37 53 -55
3094 -55 -34 44 19 -44 5 29 11 -2 4 24 21 -16 -6 16 4 -16 -27 3 17 10 -4 -2 24 37 -14 -41 36 21 -71 -35 48 -4
3126 -4 -65 -8 53 0 -27 24 49 5 -39 -25 9 -19 -55 -28 11 1 -19 9 20 -7 2 12 -22 12 15 -20 -18 18 0 -21 12 20 -15
3159 -15 -6 17 -10 -33 5 15 -12 -14 14 39 8 -15 23 53 1 -36 29 49 -45 -59 33 20 -51 -40 27 5 -19 7 5 28 13 -32
3191 -32 -3 35 9 -31 -27 5 -9 -17 -36 0 27 -9 -50 7 63 -24 -52 23 34 -31 -18 32 10 1 -3 4 9 -3 -31 -22 -3 -19 -14 -2
3225 -2 -4 5 29 3 2 33 39 -13 0 46 0 -58 -7 15 -24 -20 -1 4 -6 10 6 -6 1 20 3 -22 -20 14 4 -38 -25 21 -4 -49 -7
3260 -7 35 -19 -45 8 27 -25 -5 17 6 -2 10 17 -2 27 11 -12 -1 3 6 -27 -20 -2 13 -23 -36 34 28 -17 -2 55 23 -29 12 30
3294C0m6j4L1J3k9J6K0j0MprJ3pLJ0k4j9L1Pm6J7N7l7k5L1Om4PK9k1oK1KoOJ9
3330B3j8lLOok0OJ3j7lL4J5n6K0M5k8n1N2K5m9j2M6j5m3M2J4k0pJ4J1j7j1K6J4
3364C3m2j2M9j7l1JN3l0l7N0rm1K0L1k9k4N1Kn1J1M1rl3J1K7qm6J6M4k6m6M7N1
3397D7m8l0O3ln2J6M2l6j7M0j9l5K8K5k2j1J8J5k3k3KK8j8j7M5Mm0jK7pk0K7j5
3430a0l4M3K9m7j9O4J0o2kN4j5l8jM1Pn2MN7j4n9K6N9n0l1M3K0m3K6L0l5rM6k5
3463A3m4L0L1l8j6L3K2j8j7J8J9k8rK1jm3NN1l6k1L7Pm7L0L7m8m5N4K1n3JM9M
3496A9m0ML9jm0%L7on4L4J8l5j4M9Jl9L6L7n3j2M3nm3K8K7k2k9K6J0j7l1K2J1
3529@OkLK4j7J2Ok9oJ4j3k9J7M2n0k3N7J3n1j5P4j7m1OM3k4k7NM9l4k4K1L4l9
$$ plain form
3294 30 -16 -30 1 14 -15 1 21 11 15 8 -1 12 5 8 18 -6 -25 6 13 -33 -16 41 4 -21 10 16 -28 -21 8 -13 -19 2 4 -2 4 23
3330 23 5 2 5 11 5 -15 -9 4 -13 -16 18 33 -23 -3 42 14 -37 15 40 -9 -21 25 10 -33 9 23 3 -4 10 21 4 -7 19 33
3364 33 -9 -21 28 11 -20 -19 34 4 -33 17 8 -33 -13 18 -11 -35 16 18 -33 -22 19 10 -23 -12 15 7 -39 -23 21 -5 -51 -4 47
3397 47 -1 -31 32 29 -23 -7 35 -1 -18 22 3 -32 -4 21 -1 -12 6 21 -2 -25 -23 5 -13 -30 15 19 -21 -22 5 -2 -22 5 -10
3430 -10 -44 -1 28 -19 -38 26 36 -26 -28 26 11 -27 -28 13 20 -32 -28 29 15 -44 -18 41 -9 -40 3 23 -20 6 36 1 -8 38 13
3463 13 -31 -1 30 -8 -24 9 31 13 -4 14 33 5 -4 17 16 -27 -22 29 -7 -28 9 16 -31 -1 36 -12 -57 -3 18 -35 -34 15 19
3496 19 -21 -17 22 21 -19 -19 18 12 -42 -8 10 -25 -39 10 11 -28 8 45 -8 -20 23 18 -25 3 30 8 -21 5 15 -2 -33 -11 0
3529 0 6 4 7 31 14 26 32 3 -3 11 -2 -31 -14 28 -22 -45 12 25 -26 -41 33 16 -25 -19 24 0 -27 -22 27 -7 -31 -10 24 -15
3563a5j7N1Nm3J0N3k8l3L0Pk9LK1mj8jJ7JJjLJ0k7J2jk0QJ5k5j1M9lm2PO1k1m3
3600a8K1K7l6j9K2J0k1j5J8J4j5j0L2J3m1KJ5j9mK8k0k1K9K6n0J9M7j2m6J3M7
3631C6j7m8L5J9k4j6J8J6k4qL2J3n1K0M3k1m0M7K3o3j2M5k2n5L5J9k4j2M4kj1
3662eK5j0Pk2J2pj4NJ0Pn0K1M6l5l2L9L6o0qO4Jo6K3O2n2k5K1Rj4j4K1LlmJ6R
3698A6j2OKj6rK3lk3K7K3k7j4M9rn1J6J8m5rL0Nl2K2K3j7JMJ2l0oJ9J1l3lN0K
3734B0n6K3N4m9m0M2J2m4J8M3j7pJ6K5l2jMj6ljQj4LK3J7k5k1M9Lm5LM0k3l8L4
3769EK7m3j8M3Nk9QpJ2rqJ0lLl%JqKQqj1J5j1%L2j7j5K8J2l7%K9mk5K0J9j4oQ
3809A1J5j0oLjmj4J3J0l8J7L7j2m4L1Rj9rK6oj6PJ1j2Okj5J9Kj0j3J1olnOKJ0
$$ plain form
3563 -15 -32 19 24 -19 -9 44 16 -17 13 20 -9 -6 15 11 -7 -8 9 10 11 10 13 23 -4 8 7 -13 -5 10 -15 -26 23 20 -22 -15 46 25 -18
3600 -18 3 30 -6 -25 -3 7 -14 -29 -11 3 -12 -22 10 23 -18 -16 -1 -20 -24 4 -16 -37 -8 18 -32 -13 34 22 -24 -11 36
3631 36 19 -29 6 25 1 -15 3 19 -5 -13 19 32 -19 1 44 23 -17 30 53 -10 -22 23 1 -54 -19 0 -24 -36 8 6 -5
3662 -5 20 10 17 -5 7 0 -14 -9 1 8 -42 -21 25 -10 -42 -3 33 -27 -35 29 30 -36 -13 49 -3 -28 -7 2 -12 -26 -5 -2 -5 -9 7 16
3698 16 4 10 12 -4 -13 10 7 -16 11 34 7 -7 42 33 -18 -2 16 -29 -38 -8 -3 -35 -13 10 -7 -6 -2 10 -20 -26 -7 4 -29 -32 18 20
3734 20 -36 -13 41 -8 -48 -6 6 -38 -20 23 6 -1 15 40 8 7 11 -5 -8 -9 -1 -15 -12 11 28 3 -18 31 34 -11 -8 32 9 -29 5
3769 5 32 -11 -29 14 19 -10 -2 -9 3 -6 -14 -4 -7 -4 -7 -7 -6 -14 -12 -4 -12 -23 -8 -19 -19 13 -4 -19 9 21 -16 -16 13 9 -16 4 23 9 3 11
3809 11 26 16 10 13 12 8 -6 7 17 -21 -4 33 21 -23 8 17 -2 -11 15 9 -7 0 11 -1 5 3 -12 7 9 -1 -14 -3 -9 -12 -17 -11 -9 1
3847Aj5JM2on0J4L6k9l6K3J8j0k0L1K5pk4J1K2j7j9J4K0k9KJ2NlRr%MLk6oL3k3
3884cj1J4J3k1mJ3rlQNm%j4J6jk5J4J3j5j7K9Mm3QN4k5j3L7K0k9j6ONl0j1K3O
3921fmj7M3J1l0K2K0l3lK1kk6OJ9j8%MJ0k9J2J3l3K1Mj2J0LmJ8Kk8J0Jk5J2qP
3958imK7j6j3K2K1l5k8L5Ok2PJ9Lj8NL1k1moK0j1k0lJ5Lk1K1PJlJ0k3NK2qJMJ5
3997C5l2pJLlj3J0PLj1JK2Pk8NnnmqlPQj5RK5j6j9K1J0j8lKJ7j4mMK4mj3mK6j5
4039Cj3K3Lnj4J7Jj7KmjJQoNrPJ4j9J2KJ0l0oL2k4j3KK6j3qJ7onJ2noPj2j0PJ3
4081bk1%PJ4loJ7Mlk3OJ6Mm0K7RrMlJ5jJ5kl7K9nj8J0Nj2MjJ4j6mrROk1pK8%k0
4124b0LK3j6jNpj8J2K2k8jK3%k1J8K1k0rj1K7pk1mL1kj7J4L4l3j2K6Kk6RPPj0
$$ plain form
3847 1 -14 -13 29 23 -27 -13 23 -6 -42 -19 -1 -11 -31 0 25 18 -6 5 27 10 -9 5 25 -4 -2 10 15 12 21 12 12 16 19 -7 -13 20 -3
3884 -3 -14 0 13 -8 -12 1 -8 -11 -3 2 -2 -2 -16 0 -1 -26 -12 1 -14 -31 -2 2 -41 -33 21 -4 -17 20 40 11 -5 1 6 -24 -35 -12 -6
3921 -6 -10 -27 16 27 -3 19 39 6 3 24 22 -4 2 21 3 3 7 17 -12 0 13 -20 1 5 -7 3 6 2 20 22 -6 4 5 -20 -8 -16 -9
3958 -9 -13 14 -2 -15 7 28 -7 -35 0 6 -16 -9 10 13 -5 0 31 10 6 0 20 9 -11 -14 1 4 -17 4 11 12 9 19 -4 1 23 15 16 20 35
3997 35 3 -4 -3 0 -3 -16 -6 1 4 -7 -6 16 23 -5 0 -5 -10 -14 -22 -25 -18 -10 -25 -16 9 -7 -26 -5 5 -13 -16 -14 3 -11 -15 -11 13 9 -4 -8 18 3
4039 3 -10 13 16 11 -3 14 15 -2 0 -4 -5 -4 4 -2 3 -6 1 15 -4 8 10 20 -10 -16 16 -8 -21 -19 7 -6 -14 3 -3 -8 4 -1 -7 0 -12 -22 -15 -2
4081 -2 -23 -23 -16 -2 -5 -11 6 10 7 -16 -10 6 10 -30 -3 6 -3 1 -2 13 12 27 25 -12 17 12 -6 4 9 -3 1 0 14 -2 -6 -15 -6 0 -21 -28 0 0 -20
4124 -20 -17 6 -10 -11 -6 -13 -31 -19 3 -25 -26 -3 -3 -24 -6 15 -5 -14 -25 2 -5 -26 -30 1 -1 -18 -4 30 -3 -15 11 13 -13 -4 3 10 0
4161@KJ6Jqj2J1o%oQknJ7Mk2oK6j7pj1pJ1J4k5KK4jl3PK7mk6J7K3k5jJ7Qj7nJ5
4202DLj1j2J9Mk2qK8Jk1J3L1l3PnKj2J3J0lnqJ6JjkLj0NmrLRMj6PJ8j0k6J6J1
4243A0k0mJ4orMmljkLJ9j%LLj7RJj2PJ0j1j7K3Pj1J2J0okJ1j5nJ1ro%J3rjJPJ7
4287B4k3LPrk0J4J9nl9L5J0k9J0J2mj4J0kj9J5Oj1j6J4QpkJ3kj6kK2Rj9j4K4J0
4324A2l6J7K6j4lMJj1ONmN%NoRJMj1nJ2rj2rK9j3j6J9Nk0OJ5k4j0L2j8j7J0J1
4363dj2KK8Mrk3J7lomRjj8PK3ll0QK3j3qK3J3k0J6jj7lNRj5MLMJmMPj0nJ5j2%
4406DJ0pj7LJ7j2JJ0J2l6J3J3j8j2OJ2Ok3J4L%k4J9K9l0jKOj6oK9rRqqjJ7J3k5
4445emJ8J6j5qJ3Jk1J4JJ9l2lJ7kj5J4KloJ0j5%J3Nk3LK5j5k7J9Poj7LK7j2pJ
$$ plain form
4161 0 2 18 19 11 -1 10 4 4 -2 6 4 -1 16 20 -2 -8 18 1 -6 -17 -24 -13 1 -24 -22 2 1 -32 -25 2 -2 -28 -11 12 -13 -14 3 11 -6 -11 4
4202 4 7 -4 -16 3 7 -15 -23 5 6 -15 -2 29 -4 3 -2 0 -12 1 11 8 3 -5 11 12 11 9 12 2 7 3 -6 -3 6 10 -6 1 19 9 -17 -1 10
4243 10 -10 -14 0 -6 -15 -11 -15 -18 -19 -21 -18 1 0 0 3 6 -11 -2 -1 -13 -6 4 -7 -24 -1 6 -5 7 17 11 9 20 5 0 11 2 -4 -4 9 0 -1 0 7 24
4287 24 1 4 11 2 -18 -4 15 10 -29 6 16 -13 -3 9 5 -9 1 -1 -20 -5 1 -10 -26 -12 -4 -11 -13 0 -2 -18 -20 2 11 -8 -22 2 12
4324 12 -24 -7 19 5 2 6 7 -4 2 7 3 8 8 13 7 16 17 21 10 5 17 8 -4 -13 16 3 -13 6 11 -9 -3 12 -12 -22 10 -8 -25 -15 -4
4363 -4 -16 -14 14 18 9 -14 3 0 -6 -10 -1 -2 -20 -13 10 7 -23 -15 8 -5 -13 10 23 3 19 18 1 -2 3 12 -3 1 4 8 9 5 9 16 6 1 16 4 4
4406 4 14 7 -10 -7 10 -2 -1 9 21 -15 -2 11 -7 -19 -13 -1 5 -18 -4 -1 -1 -25 -6 23 -7 -8 -6 0 -16 -22 7 -2 7 -1 -9 -10 7 20 -5
4445 -5 -9 9 25 10 2 15 16 -5 9 10 29 -3 -6 11 9 -6 8 10 7 1 11 -4 -4 9 14 -9 -6 19 4 -23 -4 3 -3 -20 -17 10 -2 -9 -8
4484hRj1kJ2j0j0K3mj6J4J5pj1J9kj3kJ6J3j9j5K3kj0mJ1J1j5oORj4k0K9Lk5K1
4521Hj1kJ6nj9K1jjj9J9j0jj2J2J0j3j%J5j2mJ1j4JLjJKJ0k1qK8Qj9k0L0Nj3P
4560@MQoJmK1j4oJ2Oj5pM%Rj5RnjknJ4%j3jJ9l1OJ6mj1QLpOjKMj2nK8j5oj2K6
4605Hkk2J2K2j9kQKjk4K5Kj0j4J5J2j3JPJ8k8kK3Qk5PQKrrJ1Lj0rJ8Rk2mLPj6
4646a0pJ7LlrlJ6qMQJ0j5j9J7oj4J2K%nJ1jO%JJkj1J1j0Jj0K1J0j9OOk2KK1oj8
4688a2K1Nj0mOQJ1k1nOJj2OJ5j8%J3j2Qj1KOj7J0nm%N%nQJj1KnMJ5j3LMOrJ3K
4732GJklj5J0K1qj6J8lk5NK7j8NojJ2nj1J5jNj6J9J1k8JJjJjlNPj3J0j0QOj5J8
4774A2j5%pNj9J9lJlQPpj7QJ8j2j9J6K0j9%K4Pl0RRLj4lJ5Jkk3K2Kj5jJ1jj3l
$$ plain form
4484 -8 1 -10 -12 0 -10 -20 3 -1 -17 -3 12 5 -6 13 11 -2 -4 12 25 6 -9 14 12 2 -2 9 20 5 -1 5 14 0 -20 9 12 -13 8
4521 8 -3 -5 11 6 -13 8 7 6 -13 6 -4 -5 -17 -5 5 -8 -9 -9 6 -6 -10 1 -13 -12 -9 -10 -9 -7 3 -18 -26 2 10 -9 -29 1 6 -7 0
4560 0 4 12 6 7 3 24 10 4 16 22 7 0 4 4 13 -2 7 2 1 -1 -6 8 8 -5 -6 13 -18 -12 4 0 -11 -3 0 -7 -1 -2 0 4 -8 -13 15 0 -6 -18 8
4605 8 6 -16 -4 18 -1 -3 5 7 6 -18 7 9 -1 -15 0 12 -1 0 7 25 -3 -5 18 26 1 8 16 18 9 0 11 14 4 -5 13 22 0 -4 -1 6 -10
4646 -10 -17 0 3 0 -9 -12 4 -4 0 8 18 3 -16 1 -5 -19 -7 -5 -5 -10 1 0 6 6 7 8 6 -5 6 -4 -3 -13 8 18 -1 5 11 -11 -9 12 6 -12
4688 -12 9 14 4 0 6 14 25 4 -1 5 6 -6 0 15 -3 -3 10 -2 6 -5 -3 3 -14 -4 -9 -13 -13 -8 -8 -13 -5 -4 -15 -13 -18 -14 1 -12 -9 -5 1 -8 5 7
4732 7 8 6 3 -12 -2 19 11 -5 13 10 -15 -10 17 -1 4 -2 -3 9 4 -7 8 7 12 -4 15 26 -2 -1 0 -1 0 -1 -4 1 8 -5 5 -5 3 9 -6 12
4774 12 -3 -3 -10 -5 -24 -5 -8 -7 -10 -2 5 -2 -19 -11 7 -5 -24 -8 12 -7 -7 17 24 -6 3 12 15 1 -2 13 14 12 -11 11 13 -2 -3 8 7 -6 -9
4815iJ5j%mQnpJ6lMk0j7K7%ojKNk6K3jJnoJ5Rj7MLLj6PJ2pj2J1Jj3J4j2J1MkL
4859HJ2j9qJ9lJ7j8Pjj0LJ0o%Kk3L1qj3%LMj6KK2j7moK2j7%lMqPPnJ1lrJ0j5J3
4902BJJoK%JPMj0j5Pj3KJ7NoQRmj5J1%rJ4rpPL%oJ1j3J0Lj1J4j1j6J6Nro%Pqj0
4948a7J9j2%kOJqJ2LmoKQqj8K5nqpL7lj4jJ6j5ONqjLjJnJOlKkqJ2j2K4j2rJ0o
4994DlkK1pj5LQnj6K4rorJ1j8J0JnjNklMNMQppJ7k3j0J6JmlJ8kpJ8qjKJ5nj3O
5040A0rkOljnJ0jnOnJ2j0nJ7j3koQp%LNm%oJ0llp%mLRJk2MK1j1m%J2nOj1LMJ2
5088Hrj1J2KLjQrNP%mjjkoKRNj7nQJ2k9J3%qoK0Jj1Mj0OjqnJ5Nj1J9lj4NlJ1p
5135bJ3j6jLknJ1PnlkJ1pKjoRJj4%J5nJ2Kj3LK1rk0jJ6j6QPMj3Nj0OqM%j0J0j3
$$ plain form
4815 -9 6 5 5 1 9 4 -3 13 10 14 -6 -23 4 4 -2 -3 -1 4 -22 1 0 1 -4 -10 5 14 -3 1 4 7 -9 -2 10 3 -9 2 3 -10 4 -8 3 7 5 8
4859 8 20 1 -7 12 9 26 8 15 14 4 7 17 11 11 13 -10 21 13 0 0 3 7 -9 -7 15 -2 -6 -12 10 -7 -7 -10 -6 -14 -7 0 -5 6 3 -6 4 -11 2
4902 2 3 4 -2 0 0 1 8 12 2 -13 -6 -19 -17 0 5 -1 7 16 12 -3 8 8 -1 13 4 -3 4 7 7 1 12 -1 9 12 1 15 4 -12 4 9 0 -6 -6 1 -7 -17
4948 -17 2 -10 -10 -12 -6 -5 -13 -1 2 -2 -8 -6 2 -6 -24 1 -4 -12 -19 18 15 1 0 16 1 7 12 4 3 6 5 6 1 2 8 5 7 5 -3 9 -3 21 9 0 10 4
4994 4 1 -1 20 13 -2 1 9 4 -12 12 3 -3 -12 -1 -19 -9 -8 -13 -14 -9 -11 -14 -10 -5 -1 7 0 -7 10 -13 -23 -7 -6 -10 -13 5 3 -4 14 6 5 7 22 17 4 10
5040 10 1 -1 5 2 1 -4 6 5 0 6 1 13 3 -2 15 2 0 -6 2 -5 -5 -2 3 -1 -1 -7 3 0 -3 -10 -10 -14 -11 -2 -1 -23 -19 2 -9 -13 -13 -1 -6 0 -11 -8 -4 8
5088 8 -1 -12 0 2 5 4 12 3 8 15 15 11 10 9 7 1 3 12 17 0 -5 3 15 -14 -1 -1 -9 -15 5 6 -5 -1 -11 -5 -6 -14 -19 -4 1 -10 9 6 -8 -3 -6 5 -2
5135 -2 11 -5 -6 -3 -5 -10 1 8 3 0 -2 9 2 4 3 -3 6 7 -7 -7 8 3 15 17 4 7 28 19 -1 -2 14 -2 6 13 17 4 9 -1 5 -3 1 1 -9 1 -12
5180a2J6Lj8Onj0J0npROJ0pJ1Qk1qJ9qoJ3jrNJ0oJJqLOj7J7JLnMj0RmoPj0Pmm
5226fJ0Lj0Q%j0J1njkNOk2Qj7J9q%lNJ1j4J2mJj9J1J8j5LMKKKlmRKj7K4j3%J0
5269A3kkJoj0K5j0qLj0QQjkmkOnlj3J2oP%j6K3Lj7J6nj0J1qPk1J8nj2PJ5j0qJ1
5312bLJ3k6PmK3j1nJ5pk0K8j4J2J1j4nMJ4j0lJ4lpOjnj2kK%qJ3KRj2jjrOmRj4
5355iJ2Kj2KJ5j2j0lJ9Lj8pJ6Qj0KJ1Lj6JLKj2RkRmNkjJ6rrJ2j0kO%NkLJnokj
5401ANrOpNjJ%%QmoNJknqJLLpkLQmNJ0qjpJ0J4j6LpJ5Kj9KJ6pj3J4NJj3kMJoO
5452DRJj9K4mLm%%j1OqkPkrmjRjjj2J4lj3jJ2KnqjJ2j4OmK3pKQMjqPlJpj2K0p
5501BLonJ9%oj1J7loPKn%j3MKQnroNPLjj1J1jMk0J3j1J2JoJ0j0lMlmJ1l%qJ1O
$$ plain form
5180 -12 4 7 -11 -5 -10 -20 -10 -15 -22 -13 -7 3 -4 7 15 -6 -14 5 -3 -9 4 3 -6 -1 9 3 4 5 -3 0 6 -11 6 7 10 5 9 -1 8 4 -2 5 -5 2 -2 -6
5226 -6 4 7 -3 5 5 -5 6 1 0 -2 3 9 -13 -5 -22 -3 -11 -11 -14 -9 2 -12 0 -4 -3 -22 -11 7 -8 -5 -1 1 3 5 2 -2 7 9 -8 16 3 3 13
5269 13 11 9 10 4 -6 19 9 1 4 -6 2 10 9 7 3 1 7 2 -1 -14 -2 -8 -1 -1 -17 6 9 -8 8 3 -7 4 -4 3 -18 0 -5 -17 -10 5 -5 -13 -2
5312 -2 1 14 -12 -5 -9 14 3 -2 13 6 -14 14 0 12 23 9 4 8 22 12 9 23 20 13 19 18 13 1 -1 1 1 -7 6 8 17 5 4 3 -6 0 -4 5 -9
5355 -9 3 5 -7 -5 10 -2 -12 -15 4 7 -11 -18 -2 6 -4 -2 9 12 -4 -3 0 2 -10 -1 -3 6 2 7 5 4 20 11 2 14 4 2 8 8 13 11 14 15 10 4 2 1
5401 1 6 -3 3 -4 1 0 1 1 1 9 5 -1 4 5 3 -2 -10 -9 -6 -3 -10 -12 -9 -1 -5 0 10 2 1 -6 4 18 2 5 -2 13 15 -4 -2 14 7 -6 8 13 14 1 -1 3 4 -2 4
5452 4 13 14 -5 19 15 18 14 14 14 3 9 1 -1 6 4 -5 -9 -10 -1 -2 -3 -15 -1 -4 -17 -18 -6 -4 -9 -17 -18 -6 -20 -14 -18 5 -2 0 8 12 11 3 10 7 8 1 -11 9 2
5501 2 5 -1 -6 13 13 7 -4 13 10 4 11 13 8 8 -5 -1 1 9 4 -5 -11 -6 1 4 3 -8 3 2 6 -14 -1 -12 0 1 -5 5 -5 -8 -4 -7 -11 0 -3 -3 -11 0 6
5548Fj5RNrNmJ8rJ0lj1J2J%%NKrj5J5oRkj6J1kj0Rlj0OJ0j5PQk0LMmqMJ5qrPR
5594BrQoqOKoNJ1nj9K1j1JJ6pNJ3j4j2jK0j4J3mPj5LOmRQj2J9k2lJ4j0loJ5J0
5636B3k4J2kj7J5nmqJ2joQrnLnJ9j4pQjQjj1O%mK2j3j1J9lJLMnqPJ1mmkMj2QM
5682A1%onNj6QJ2Rj5Rj0N%%%nkJ5j0JrJrjMJ5j0kJ2j6J8k7J1Lj2mORnLJ7j0lJ4
5726A1nJqNJKpRJJ0j4%M%Nj2J2j3RnpORk6RQpJ1JlqNMmKJj0qJ0nkkRkmONkqoM
5777hJ2j0kRlm%K%MoK%K5qj1J3knqJJ6j0j2J1jMnnJ9k1qQJ4j6J2j1klJpJ4j4P
5821hmK5j5jjJOlmj7J4KmJ6j1LQj0plJ5Jj1NKNj1J3mqJ2JJRqmOlo%RLjlqnMPj1
5870cLJ5j5J0j0pnmJ0MkPj0pJ9k6J4MLj0J5knOljjJ4j2pLj0K7nkrJ2%qPjj6LN
$$ plain form
5548 6 -9 0 5 -4 1 -3 15 6 16 13 2 14 15 15 15 20 22 13 -2 13 7 16 14 -2 9 7 -3 6 3 -7 -1 9 -6 1 9 -11 -8 -4 -8 -16 -12 3 -5 -14 -7 2
5594 2 -7 1 -5 -13 -7 -5 -11 -6 5 0 -19 2 -9 -8 8 1 6 19 5 -7 -8 12 -2 11 7 14 -1 2 8 4 13 21 9 28 6 3 17 7 4 -2 13 23
5636 23 -1 11 9 -8 7 2 -2 -10 2 1 -5 3 -6 -11 -8 -13 6 -8 -15 -7 -8 0 -1 -12 -6 -6 -10 12 -1 -12 7 4 5 8 12 7 -1 6 17 13 9 7 11 -1 7 11
5682 11 11 5 0 5 -11 -3 9 18 3 12 2 7 7 7 7 2 0 15 5 6 -3 -2 -11 -12 -8 7 -3 -5 7 -9 9 -18 -7 -4 -16 -20 -14 -5 -10 -7 10 0 -3 11
5726 11 6 7 -1 4 5 7 0 9 10 20 6 6 10 10 15 3 15 2 11 6 -1 5 14 -12 -3 5 -2 9 10 7 -1 4 8 4 6 7 -3 -11 -1 -6 -8 -10 -1 -3 -7 -1 4 2 -6 -12 -8
5777 -8 4 -6 -8 1 -2 -6 -6 -4 -4 0 -6 -4 -4 21 13 2 15 13 8 0 1 17 7 -5 6 5 9 4 -1 18 -3 -11 -3 11 -5 7 -4 -6 -9 -8 -15 -1 -15 -8
5821 -8 -12 13 -2 -3 -4 -3 3 0 -4 -21 -7 -5 -9 7 -4 -1 7 -3 -10 -13 2 3 -8 -3 -1 4 -7 6 2 -6 6 7 8 17 9 5 11 8 2 2 11 14 13 10 2 -3 1 8 -3
5870 -3 0 15 0 10 0 -7 -12 -16 -6 -2 -4 3 -7 -14 5 -21 -7 -3 0 -10 5 3 -2 4 1 0 -1 13 1 -6 -3 -13 14 9 7 -2 10 10 2 9 8 -8 -5 0
5914@J7j9kJ6KLj0Qj0Rj1RPj0kmknJ1j2NRj0j2J2kj2J0Mkj5KJ3rRj2jJ1mRrjJ5
5957Ej1mK4k6J5OrkJ0lJMqJ4lJQk0OKm%kJPj1kLJKj%Jjj5J5kJ3roNj7MJ8pqmJ6
6005GmrKKpJ1jJ0j3j0J0Mj0LNkj1K1kLlPjlj3J2JKlj0J5lj0OPj1jKJ0j2m%JNn
6050bkPlj0J3JNj7KJ0rqPkk%RqOpQLlpJ4jnLLqqJ8KnNj3ONKj8K3K%JJj4QJ1j5
6099HqRLj1LKkj2J8nqJLnjJ0lj9PRMrj4J4%J1j2J1%qRnJ3Kj6J3j1LLLj1%rQPj2
6145gJ3lokJ0lJ1KopJ0qJ8j2MjpKj6J9ljrnJ5j3PpnKNJ7j9Rqj0Pj9RmJ3KjJ0m
6190aJ1nloOokJ2P%j1NmRj%mJMrRqjJ3k2RKKnmJ2lj7J0J0j4P%mjJlOQNj7pKnJ
6240a1jJ3joM%j5J2j2OQnNK3k1lJ0Lj9L5j2j9PJ1qLM%pPJpK0k6RkmKPoj0KJ5j4
$$ plain form
5914 0 17 -2 -4 12 14 17 7 15 5 14 3 12 19 9 7 3 1 -4 7 -5 0 9 -1 -13 -1 -3 -15 -5 -1 -3 -18 -16 -3 -12 -3 -15 -16 -5 -9 0 -9 -10 5
5957 5 -6 -10 14 -12 3 9 0 -2 8 5 6 10 2 16 13 14 22 2 8 10 6 6 4 5 12 1 -1 2 3 5 4 4 5 4 -11 4 2 15 6 0 5 -12 -8 10 3 -5 -9 7
6005 7 3 -6 -4 -2 -9 2 1 11 -2 -12 -2 2 -8 -5 0 -2 -13 8 6 9 6 13 12 9 -4 8 9 11 8 -2 13 10 0 6 13 2 1 3 13 1 -3 -3 -2 3 -2
6050 -2 -4 3 0 -10 3 4 9 -8 -6 4 -5 -13 -6 -8 -10 -10 -1 -9 -3 -10 -2 1 -2 -9 5 4 -1 2 5 -3 -11 7 9 4 9 -4 2 7 9 -9 14 16 16 17 18 4 12 23 8
6099 8 0 9 12 1 4 6 4 -8 10 5 -3 -2 1 -4 -5 5 2 -17 -10 -1 3 -6 -20 -6 -6 5 -7 4 4 -4 5 0 13 15 -1 12 1 4 7 10 -1 -1 -10 -2 5 -7
6145 -7 6 3 -3 -5 5 2 13 15 9 2 12 4 22 10 14 13 6 8 -8 11 8 7 -2 -7 8 -5 2 -5 -10 -8 -3 14 -5 4 -4 -14 -7 -26 -17 -21 -8 -6 -7 3 -1
6190 -1 10 5 2 -4 2 -4 -6 6 13 13 2 7 3 12 11 11 7 8 12 3 12 4 3 16 -6 3 5 7 2 -2 10 7 -10 0 10 -4 3 3 -1 -2 -1 -4 2 10 15 -2 -9 -7 -12 -11
6240 -11 -12 1 0 -6 -2 -2 -17 -5 -17 -11 -3 -8 -3 20 -1 -4 6 9 -10 25 13 -6 1 12 4 7 11 11 4 11 12 5 25 -1 8 6 2 4 11 5 -5 -3 12 -2
6284bmKJ0qJ0%j1MLkj6J4jrJ1JjmmJ1jj2ORroj0K7j1j1L5j5mnJ0J1k0J2j4J2j
6325GNPlQj5Rj8J1mJoPJ1k1mkJ4lnMpmJ8j8j2RMkJ7rRj0pJ3Lnj9K7jj1MmOrlK1
6371A3j3mJ4q%Qq%mRMNj0qJJJ0Qqj0J7%qj2KJ1pj5J6PLj0kj1jNrNqJ3lJLOknN
6418Aj0N%nJ1j3OJ2k0RNoNmLrPJ0rPJkJ0j2nJ4lj6J1J3j9J0LLj1jJ4j4Oj4K2j1
6460Dj8nJ8J0k9KJ3lM%jmLmJ4k0J9k3JOJJMjnLJ0l%kJ2j7J8j3%J8j5J2J%nJ%J
6504HJlkJj3JJNkNj2K1rrO%j1OnNLnljRpJN%%nPkrlJ4mPoj2J3jrJ2kOJ1j1%MO
6555A2j4RkJ9k4R%j9J2PKkJ5j0nnj0jMkoJ5j1N%LmrM%p%J5kmj3PJ0rj%%LkKOQ
6602EMkpjlMLjqMJMOj1RkM%moKPj5JJ9lqJOlj0MQj4j1MJ9j1rJ8lj7kRLlk3K6n
$$ plain form
6284 -2 -6 -4 6 -2 8 8 -3 1 4 2 -14 0 -1 -10 1 2 1 -3 -7 4 3 -9 -3 6 -3 -9 -19 8 -3 -14 21 6 2 -3 7 18 -2 10 -4 8 7
6325 7 12 19 16 24 9 18 0 11 7 8 2 9 20 -1 -5 -7 7 4 -1 3 -4 -8 10 -8 -20 -11 -7 -9 8 -1 8 -2 -9 4 7 2 -17 10 9 -2 2 -2 4 -5 -8 13
6371 13 0 -4 10 2 2 10 2 2 -2 7 11 16 6 -2 -1 0 10 18 10 0 17 17 9 -3 -1 10 3 -12 4 11 14 4 2 -9 -10 -5 -14 -9 -17 -4 -7 -6 -3 3 1 -4 1
6418 1 -9 -4 -4 -9 2 -11 -5 7 -13 -4 1 -5 0 -4 -1 -10 -3 7 -2 5 6 4 14 2 -3 11 8 -8 3 16 -3 7 10 13 2 1 15 1 7 -7 15 4
6460 4 -14 -19 -1 9 -20 -18 -5 -8 -4 -4 -5 -9 -6 -10 4 -16 3 -20 -19 -13 -12 -11 -7 -8 -13 -10 0 -3 -3 -5 7 -10 8 -5 -5 13 -2 10 11 11 6 7 7 8
6504 8 9 6 4 5 -8 -7 -6 -1 -3 2 -10 11 2 -7 -1 -1 -12 -6 -11 -6 -3 -8 -11 -12 -3 -10 -9 -4 -4 -4 -9 -2 -4 -13 -16 -2 -6 1 -5 -17 -4 -5 -14 -2 -4 2 13 2 2 6 12
6555 12 -2 7 5 24 0 9 9 -10 2 9 11 9 24 14 9 4 -6 -7 -3 -5 -11 4 -7 -2 -2 1 -3 -12 -8 -8 -15 -15 0 -2 -6 -19 -12 -2 -11 -12 -12 -12 -9 -11 -9 -3 5
6602 5 9 7 0 -1 -4 0 3 2 -6 -2 -1 3 9 -2 7 5 9 9 5 -1 1 8 -7 -6 13 10 2 3 9 6 -4 0 8 -6 -17 -13 6 -5 -14 4 1 -16 -18 -9 -6 -9 -32 -6 -11
6651a1k%K2nj4J6mqjNQj0kJ2Lk0J4QlokMLNrkmPJ0j1jj%rJ1NqNJLj1rJ0jpPl%
6699eJ%qN%jJ0j1LoLLoOllkJ2jj5J6nqJ3oQl%J6k1J5MLj1Rj0oLJ3nj5%J3Mj9J1
6745ALpj6J3JMoJ9j3%LMj5PMj0oNJ0pjqJ7j1J0rOj3Oj4K3j7J8j3J1NQj3nK2j9
6786cJ3k2K1kMrjOOrJ1lnrJ7Nk2KJ3j0nnLLKqLQj3%MJnjKKnPpJ2rMmLJ7j3MMo
6835ArQj2J0%PqJ8lj6MJ1poNj0J4j0K2k8RLLLplMKnJ2Lj2KMj3O%j0lKJJJlj%q
6882a8%OPjPj2PJ2qLjLjKmLJ3k6J6Ok4lK2pkOkLQj5J2j6J2KpKJlJj2PQj0LJmO
6929Co%Q%j1mnJ1Qj2%LKj0oROqQoQrQ%Jj8K1J0lrJ5j9J0QRj5OJmLmQj3J2j3Km
6976ALKJ2k1pOlM%PknJ4pj6NNOj4%R%j9PLJ2j3KNpONoOJlMpPnKMpLQqPj2J6jo
$$ plain form
6651 -11 -13 -13 9 4 -10 6 2 -6 -7 -2 6 -4 -6 6 9 -11 3 11 8 2 0 4 7 12 3 1 -3 4 14 3 2 1 1 -8 3 8 0 5 6 9 -2 -11 -1 -2 -9 -2 -5 -5
6699 -5 -4 -4 -12 -7 -7 -8 2 -9 -6 -12 -9 -6 -12 -6 -9 -12 -14 -2 -3 -18 -2 -7 -15 -2 -8 0 -3 -3 13 -8 7 11 14 3 12 2 -4 -1 12 7 -8 -8 5 9 -10 1
6745 1 4 -3 -19 -6 -5 -1 -7 12 -1 -1 2 6 -9 -2 2 -8 -14 -9 1 -6 -7 -15 2 -9 1 -8 -2 -15 -9 -23 0 -17 1 -12 -1 4 12 -1 -6 16 -3
6786 -3 10 -12 9 7 11 2 1 7 13 4 15 12 7 -2 15 20 -2 0 13 3 -2 -7 -4 -1 1 -7 -4 4 -9 -9 -5 -4 -9 -10 -8 -6 -11 -4 -11 1 -8 -4 -8 -5 12 -1 3 7 1
6835 1 -8 0 -12 -2 -2 5 -3 15 12 -4 0 11 4 -2 3 -7 7 -3 19 -9 0 3 6 9 2 -1 3 5 0 12 15 3 5 9 -4 2 2 -8 -11 -9 -8 -7 -6 -9 -10 -10 -18
6882 -18 -18 -12 -5 -6 1 -11 -4 8 0 3 2 5 4 6 2 5 18 -8 8 14 -10 -13 9 2 0 6 4 7 15 0 12 -4 8 10 3 5 6 3 4 -8 -1 7 -3 0 1 -3 3
6929 3 -3 -3 5 5 -6 -10 -15 -4 4 -8 -8 -5 -3 -13 -19 -10 -4 -12 -4 -10 -2 -11 -3 -3 -2 -20 1 11 8 -1 14 -5 5 13 22 7 13 14 10 13 9 17 4 16 3 5 1
6976 1 4 6 18 -3 -10 -4 -7 -3 -3 4 2 -3 11 4 -12 -7 -2 4 -10 -10 -1 -1 -20 -13 -10 2 -11 -9 -4 -11 -5 0 -6 0 1 -2 2 -5 2 -3 -1 3 -4 -1 7 -1 6 -6 10 9 3
7027CJ1r%%PkOj8kJ5qmjNKpOj3qJ5o%PpplKPjJ2Rj3loJ0lLj2J2%j2%J5Lj1JJ2
7074Gj6LP%%lJJMQj0nNpPJJJQj2oJ6p%lonJ0JlpJ2j3LoRj0PMj6RnOmMLNNMmj3
7125iNmJ3Mj4LJ1oMonMLlRPpj1J2oRj2Oj1J5Nj4mJ2k%okoM%Pj9J7npJ1okQj6N
7172iJ1qj4J4pNkOJj3NK1j4j3J9Pm%qJ6npjJ6j4lJ0%oJMLnMj4jNLloj1K4mqMj0
7218a1LJ5rONpkkj5PJ1lnmM%J1%j2pK4qj7MNjJ7j4J2j1jJ1J5rj3J0j0J8j4KJ9
7259B4k3qJ7rJ5j7L%PlmNrP%pMJjolJj4J2J8kpkKnQj0PKj2QqLJ3pJnOMroJ3mq
7308hPjKmRnLkRJj5OOLjKPnoMNj1kJ6j3J0rkKj3J1rrJ2nPj1NMJ3k5lJ7j0LJ3Q
7355A6rlJ3k6J4Nk6K2mLmmQjj8K2j2MQ%pkQjnnJ1Nj1J0klmqJ8j5MlJ1kqjQJj1
$$ plain form
7027 3 14 5 5 5 12 10 16 -2 -4 11 3 -1 -2 3 5 -2 4 -9 -17 -2 -8 -8 -1 -8 -15 -18 -16 -9 -10 2 11 -2 -5 -11 -1 -4 -1 -13 -1 -1 -13 -13 2 5 -6 -5 7
7074 7 -9 -6 1 1 1 -2 -1 0 4 12 2 -3 2 -5 2 3 4 5 13 1 -5 11 4 4 1 -5 -10 0 1 -2 -9 3 -10 -7 -13 -4 -14 -7 -3 -19 -10 -15 -9 -13 -9 -6 -1 4 8 4 -9
7125 -9 -4 -8 5 9 -5 -2 9 3 7 1 -4 0 3 0 9 16 9 -2 10 4 13 1 7 -4 11 16 2 -2 10 8 8 2 0 -6 -2 -2 5 -14 3 -2 -9 2 -4 -6 2 -14 -9
7172 -9 2 -6 -20 -6 -13 -8 -10 -4 -3 -16 -11 10 -4 -17 2 9 5 5 -3 13 8 1 0 16 2 -1 9 9 3 4 8 11 6 10 -4 -5 0 3 0 -6 -17 7 3 -5 -1 -11
7218 -11 -8 7 -2 4 9 2 0 -2 -17 -10 1 -2 -7 -11 -7 -7 4 4 -8 -15 9 1 -16 -12 -7 -8 9 -5 7 -4 -5 6 21 12 -1 9 -1 17 3 5 24
7259 24 1 -7 10 1 16 -1 2 2 9 6 2 7 -2 5 5 -2 2 3 2 -4 -7 -6 -20 -8 10 8 1 -1 1 -4 4 -6 1 3 -9 -1 -9 -6 7 0 1 -4 2 6 -3 -9 4 0 -8
7308 -8 -1 -2 0 -4 5 0 3 1 10 11 -4 2 8 11 10 12 19 14 8 12 17 6 4 20 7 17 8 6 8 -5 6 -3 -12 0 -5 2 -9 -4 0 13 -12 -15 2 -8 -5 8 16
7355 16 7 4 17 -9 5 10 -16 6 2 5 1 -3 5 4 -14 8 -4 0 8 8 1 -1 7 6 1 -4 7 12 1 11 9 6 2 -6 12 -3 1 -2 9 7 -1 -2 6 7 -4
7400dLnoLmj5J0RpkQJJjkKJ0j4J8rJ1lRJj2QoJ2nLj9PJ0Rj8J2j3NpJ3j9lRNl%
7446BQkQrj3QQj2%Rj2J3qqqJ7mlj3J6j4K3k0%NnQnNLqPNpOLj2QnMK%KJ2lq%Ql
7495HJ0qPj1Rj6J1qrK0k0%OKoJ1jj5J8j6L%mOKOj9KO%JjloK6j7MJ5j8MPLj3KQ
7540FpkOkLPqj%KOj1J1lrOQj7J3njnQj0J4JqqmPpJ0lj0J3JroPKjplKJ7mOmpkJ7
7591Iqk1PJ4J1j0Kj4K0qOj2ORk2QOj1jJ5j5J3NJj2j1J6mPpJ0oNj2K%J0roKqNJ1
7634CpmJ%kkRpJKkQkMopRLKorJ8MrmJ4qkOJLq%RnlLRj2%JmNj3Qj1J0%rR%Nj5M
7688fPMnnJ3qj1lJ8q%q%PpQrMp%%J3%%jpJ2pPMJqQnkQmNoQpPmmjLlJJ1j7lJ2O
7741A1j5j1J9kj9QOlqK6j4JJrJ1rOnPj1NL%kKOr%J4k0KQkmJ7rjJjRkOpJ5j5kO
$$ plain form
7400 -4 -1 -6 -12 -9 -13 -28 -18 -9 -16 -18 -10 -9 -8 -9 -11 -9 1 -13 5 -4 7 4 13 14 2 10 4 16 11 14 -5 2 12 21 3 15 2 7 0 13 -6 -9 0 5 2 2
7446 2 10 8 16 7 -6 2 10 -2 -2 7 -5 8 0 -8 -16 1 -3 -6 -19 -3 -17 6 -14 -14 -9 -14 -6 -11 -6 -3 -11 -4 1 -6 0 3 -9 -1 -6 -2 0 0 2 14 11 3 3 11 8
7495 8 18 10 17 6 15 -1 10 2 -7 13 -7 -7 -1 1 -5 6 5 -10 8 -8 -5 -5 -9 -3 -1 5 -14 -12 -6 -6 -5 -6 -9 -15 11 -6 -2 13 -5 -1 6 9 -4 -2 6
7540 6 -1 -3 3 1 4 11 3 2 2 4 10 -1 10 7 -2 4 12 -5 8 3 2 -3 5 -5 9 10 2 -6 -10 -3 -10 0 -3 -13 0 1 -8 -14 -7 -5 -6 -13 -16 -14 3 -1 5 1 -6 -8 9
7591 9 1 -20 -13 1 12 2 4 -10 10 2 8 -4 2 11 -11 -3 3 -8 -9 6 -9 4 9 10 -2 -13 3 -1 6 -1 9 3 8 -4 -2 -2 8 -1 -7 -5 -13 -8 3
7634 3 -4 -8 -7 -7 -9 -11 -2 -9 -8 -6 -8 0 -2 2 -4 -11 -2 1 3 -3 -12 6 10 1 -3 11 3 1 7 8 11 3 3 12 7 4 7 16 4 4 5 1 6 -7 1 -10 0 0 -9 0 0 5 -10 -6
7688 -6 1 5 0 -5 8 0 -11 -14 4 -4 -4 -12 -12 -5 -12 -4 -13 -9 -16 -16 -16 -3 -3 -3 -4 -11 1 -6 1 5 6 -2 6 1 -1 7 3 8 2 10 3 10 6 2 1 4 1 2 13 -4 -7 5 11
7741 11 -4 -15 4 2 -17 -9 -3 -6 -14 12 -2 -1 0 -9 2 -7 -1 -6 1 -10 -5 -2 -2 -4 -2 4 -5 -5 9 -11 -9 -1 -3 -7 10 1 0 1 0 9 7 13 6 21 6 4 10
7788A0RJpnlJ0ojoNQj2Rj1J2pqJ4qj1jLMj1J1jj1QLJ1j1%JNmKpJ5o%KLmKMj5L
7835aJ4j1%KpJ2ok%rK3r%Rj0J0rQlnpJ1Qpj1LnLjKjQrjj4jRjKJ2orPPmlj2J3o
7884g%OQj0PjNjpJ6j0MlJ2j4Qj3J6qj0OPpJKolLmPMr%j0PJ1JoQk%okRKj5NkNn
7934apNkj0J2OpMqJ4qOqPoLLO%%JnNpRJ%q%NjmPpjoJ2nj3J5kj0%LmJ4j6R%lKj0
7986a0jMJ0npJ4k%lnPJj3jNPmmRnnJ0NopJ3rmoJ1NJ0j8J6j1JN%J0j0l%NoNnJM
8034HmpMJPj3lRLj6QjpQj0J4pnjOmpJ5Nj0J4pj3J1J1jmqLlKLLlj4J7jmOjJ1o%
8082IqJ3mkJoJ3pNj0Lkj5QqQLrKr%J1Mj8POrQjqJ3%j0%Q%LoRJlJ2j0qJ8l%nQq
8132DkOmjjKJK%qNJNnMqkKJ7j9LLLlmKlKj1P%j1J5Nk1J2qKlJ2rOlnJmN%J2Ljr
$$ plain form
7788 10 19 20 13 8 5 15 9 8 2 7 15 3 12 1 13 6 -2 12 4 -7 -8 -5 -1 -12 -1 -2 -13 -5 -2 9 -2 -2 -1 4 0 2 -5 10 4 4 6 9 5 7 11 -4 -1
7835 -1 13 2 2 4 -3 9 3 1 1 -8 15 6 6 15 5 15 6 14 11 6 -1 10 18 11 0 3 -2 1 0 2 1 9 0 -1 -15 -16 -7 -8 -6 6 0 -9 -2 5 1 -2 -14 -1 -7
7884 -7 -7 -1 7 -3 4 3 8 7 0 16 6 10 7 19 5 13 0 16 8 -2 4 11 4 5 7 1 -2 1 -3 4 8 -1 -1 -11 -4 7 8 2 10 8 8 2 0 9 11 -4 1 -1 4 -1
7934 -1 -8 -3 -5 -15 -3 3 -4 0 -8 6 -2 4 -4 3 -3 0 3 9 9 9 10 5 10 3 12 13 13 5 5 10 9 5 12 5 4 -2 10 5 -8 7 5 -5 -5 -2 -6 8 -8 1 1 -2 0 -10
7986 -10 -11 -7 3 -2 -9 5 3 3 0 -5 2 3 -10 -11 -6 1 -3 -7 2 -3 -8 2 7 1 -6 7 -2 -6 -12 -1 4 14 -4 12 1 2 7 7 17 7 4 4 9 3 8 3 4 8
8034 8 4 -3 1 2 9 -4 -7 2 5 -11 -3 -4 -11 -3 -13 1 -6 -11 -12 -6 -10 -17 -2 3 -7 7 0 -13 -2 9 8 4 -4 -1 -4 -2 1 4 1 -13 4 3 -1 5 4 15 9 9
8082 9 1 14 10 8 9 3 16 9 14 4 7 5 -10 -2 -10 -2 1 -8 -6 -15 -15 -4 0 -18 -11 -5 -14 -6 -7 -15 -2 -2 -12 -12 -4 -4 -1 -7 2 3 0 12 2 -6 12 9 9 4 12 4
8132 4 2 8 4 3 2 4 5 7 7 -1 4 5 10 5 9 1 -1 1 18 -1 2 5 8 5 1 3 0 2 -9 -2 -2 -13 2 7 -14 -2 -10 -8 -11 1 -8 -2 -5 -10 -9 -13 -8 -8 4 7 6 -3
8184coRJ6mrJM
$$ plain form
8184 -3 -9 0 16 12 3 4 8
8191H
$$ Imaginary data points
##PAGE= N=2
##DATA TABLE= (X++(I..I)), XYDATA
0@%%%%%%%%%%%%jRj6J6j6J6j7K5l2L2m0M8n3O1p2Q1q9J04j18J31j46J65j85K02
36A05k26K52k76L07l42L80m20M64n15N72o35P05p86Q81r90J120j280J476j726
55i34K062k534L251m489P191k2440J8171M1041n6257j8507N1770J5134n3529j908
69b1978M5392m921m2321J2498L1730j5854k4369J9744J4553j8370o655J7498j030
82E917j2121O235O165j1407N56J2383p067j1356J4399Q416j8991l441K2584l109
96I163k4468Q775K3509j4971k0540K0508J6552k4953j1364K7760N317k8991J315
109a2388K8656p724k6328J3927K2606j8837j7473K2006J1127k3375m324K2754
121A0627k577k0850Q134J7111j2572j2183J5940P052j7580j491J8091l658j7303
$$ plain form
0 0 0 0 0 0 0 0 0 0 0 0 0 0 -1 8 -8 8 -8 8 -9 16 -16 16 -24 24 -29 32 -40 41 -48 56 -62 69 -77 88 -97 105
36 105 -121 131 -145 162 -180 200 -220 244 -271 301 -334 371 -415 466 -524 596 -684 792 -934
55 -934 1128 -1406 1845 -2644 4547 -17893 278 41319 -14938 -33445 18325 33459 -20070 -21978
69 -21978 23414 18493 -23828 -11330 20400 4546 -19823 -79 14474 -3896 -10551 6947 5917
82 5917 -6204 31 6196 -5211 -4655 7728 661 -10695 3704 12120 -6871 -10312 12272 9163
96 9163 -15305 -6530 16979 2008 -18532 1976 18528 -6425 -17789 9971 15288 -13703 -12388
109 -12388 16268 8544 -17784 -3857 18749 -88 -17561 4445 15572 -7803 -12127 10627
121 10627 8050 -12800 -4666 12445 -127 -12310 3630 10682 -6898 -8389 9702 6044 -11259
134a1259Q231J5257j1954j1896J4956P860j7008l845J7024o09j5776M632J3362
147H975p523r575R773N818j0365j879R578k052q156N032N562p844k961R541P7
162D001r970L592J0163o781r070R836O991j2592m506J3891Q22j4589K988J4214
176H990o462j2583R825J0539j1901p494J3524M311j4558j474J4398j577j3971
189h433M015J2641o138j0530Q233Q401r232n613R519K730r049j91P392k246n485
204c986L829L340m357p87M340j420l641L297K408m900j141N780m49o180K286O317
220D736m066n877N850M895p361l375Q301J197q857J085Q674l252p794N139O473
235E768o457m760P337K977p716j308P728j54p283J464O437k837n429L891M134
$$ plain form
134 -11259 -3028 12229 275 -11621 3335 11195 -5813 -9658 7366 6757 -9019 -4387 8975
147 8975 1452 -8123 1650 7468 -2897 -4776 4802 2750 -5406 -374 5188 -2656 -5617 3924 4001
162 4001 -5969 -2377 7786 1005 -8065 1771 8762 -3830 -8336 5555 6377 -8212 -5224 8990
176 8990 2528 -10055 -230 10309 -1592 -9086 4438 8749 -5809 -7283 7115 5538 -8433
189 -8433 -4418 8223 2085 -8445 -212 8189 -1043 -6656 2863 5593 -3456 -3647 3745 1499 -3986
204 -3986 -157 3183 -1174 -1961 2379 959 -2682 615 3023 -1877 -3018 2762 2313 -3867 -1581 4736
220 4736 670 -5207 643 5538 -1823 -5198 3103 4300 -4557 -3472 5202 1950 -5844 -705 5768
235 5768 -689 -5449 1888 4865 -2851 -4159 3569 3415 -3868 -2404 4033 1196 -4233 -342 3792
250C792m498k364M963P13m615J082L700k809k797L697J267m213K01M349j318l847
266b697K538L421l231k829L573J822m113j137M115J46l914J099L790j790k792
281a999K662J542l431n65L287r60l147K061K737k567j711L272J176l394o20L229
297A572Ll226K58K870p13k493J203K090j429j369J602M70j620K81J218j013n67
314h63J668K10j554O03J503j177j480J078Q62j410p88J305O64j117k94J306K07
331G23j166J61J133m98q67Q45L66j234J7J204o67j210R40R16j160n95J250N80
349G38r09l48R41N94o95p61M83N48p45p52O09O08l37k41L37L56J36l47n29K93
369b1M64o78o26P88N02o94j52P67K08l61j04J19J04j27m71j54L85l7m50K01N00
$$ plain form
250 3792 -706 -3070 1893 2606 -2009 -927 2773 -36 -2833 864 2131 -2082 -1881 2468 1150 -2697
266 -2697 -159 3262 31 -2798 775 2597 -1516 -2653 1462 1608 -2306 -1207 2583 793 -1999
281 -1999 663 2205 -1226 -1791 1496 536 -2611 -550 2187 -380 -2091 1181 2357 -1037 -1657 1572
297 1572 1575 -1651 -1393 1477 764 -1729 -526 1564 135 -1234 368 838 -782 -501 717 -296 -863
314 -863 805 1015 -539 64 1567 390 -1090 -12 850 -560 -1348 -43 621 -496 -790 516 723
331 723 -443 -282 851 353 -514 331 697 -537 -520 684 17 -1193 -253 663 -497 -1092 158 738
349 738 -171 -519 422 1016 321 -440 43 591 -154 -906 -297 311 -26 -267 70 426 562 215 -314 -21
369 -21 443 -235 -861 -73 429 -265 -417 350 558 197 93 212 316 189 -282 -436 -51 -88 -538 -337 163
390A63m6j27J27K8N9Kk86o6L21p3l71J65J73k27M9O3k88J70M57l72l98O07L70
413E00o52j64O58J80n05k08L13K52l82n20L28N05m43l77O90L25n33L4N11k11k90
434A1J97j14l60J12M2l28N5L69J6r3J76K65N4k52j83K45K1o27p5N73k35n52N49
457a34M84n73kP64k58o42N29M21p93k82Q03J27q34r2Q50O9r22o6J057j2j107K80
479c33J119n65r20Q21N47r94j35R73l15p59P14N03q75j28R91j48j048K50R08n73
499C3j045P00J084r07r33J387R39j613n34J841mk031M16J758j001j454J340J006
517I82j505m74J596P5j510L29J483o37j354R82J292j285j020J676O55j945k71
534i31J942m79j925J006J521j469q78J895L37j852L94J748r37j475J312J040j703
$$ plain form
390 163 117 -10 117 145 204 206 -80 -146 175 102 -269 -104 69 -158 -109 -46 -334 -164 293 -79 -477 130 500
413 500 -152 -316 342 522 17 -191 122 374 -8 -528 -200 305 -138 -515 175 500 -33 1 512 301 11
434 11 208 94 -266 -154 -112 -440 -385 -16 0 -93 83 348 402 150 -33 212 233 -394 -469 104 -131 -683 -134
457 -134 350 -223 -225 539 281 -361 168 589 -204 -486 317 444 -390 -482 368 437 -485 -551 506 494 -613 -333
479 -333 786 221 -699 122 669 -325 -460 513 198 -561 153 656 -219 -347 644 496 -552 -302 606 33
499 33 -1012 -312 772 -135 -1068 319 1258 -355 -889 952 948 -1083 -667 1091 90 -1364 -24 982
517 982 -523 -997 599 674 -836 -507 976 339 -1015 -33 1259 -26 -1046 630 1285 -660 -931
534 -931 1011 532 -1393 -387 1134 -335 -1213 682 1019 -833 -439 1309 372 -1103 209 1249 -454
551d54p16J860J58k062L19K191q84k087J624J856k224j334K782N99l072K84L012
568A852j207k739J935K115k528j349K932O22l015K05K973r72k879J630K482k348
584b91j984K975J363l333l46L609o41l401J672K788k693k061L238R09l558K90
600a464L594j270l068K345K483l143j719L647N65m167M58M277j706m083L066L669
616C484m202k664N197J417n845j3N901j661n562L022M795m149l525N068K237n474
632a974p92N516p13n268K014M670l292l700M329K526n007r71N350o11n147K190
648h80M364l669l262M563J766n052j09N060j349m451K768L494l784k274M426P91
664B402m820P11M669k332m162L855L245n052j790O014P8o377J773O085l767n280
$$ plain form
551 -454 -1170 690 848 -1214 -895 1296 412 -1675 -51 1805 -419 -1753 1029 1628 -1444 -1160 1852
568 1852 645 -2094 -159 1956 -572 -1921 1011 1633 -1382 -1177 1796 824 -2055 -425 2057 -291
584 -291 -2275 700 2063 -1270 -1616 1993 1352 -2049 -377 2411 -282 -2343 895 1804 -1754 -1464
600 -1464 2130 860 -2208 137 2620 -523 -2242 1405 1970 -2197 -1739 2538 832 -3251 -185 3484
616 3484 -718 -3382 1815 3232 -2613 -2626 3275 1614 -3948 -926 3869 -280 -3805 1263 3500 -1974
632 -1974 -2766 2750 2037 -3231 -1217 3453 161 -3539 790 3316 -1691 -2662 2688 2077 -3070 -880
648 -880 3484 -185 -3447 1116 2882 -2170 -2279 2781 1432 -3019 -251 3243 -541 -2815 1611 2402
664 2402 -2418 -1707 2962 630 -3532 323 3568 -1484 -3274 2740 2818 -3559 -1786 4299 532 -4748
680d748N377L813o630j981P383J5p453K075P110l957o188N575M877o955l290P844
696B867J390q264O66Q198k667p436M529O167o039m489O946K441p244l54O873j444
712B140n909L052M580m087k939M660J116m833N58M340k334l601L759K395m812
727a915p32N598r64n658K919N167m687m137O068K529p104p29P442j263p259L151
743a574O574m760n389O088L947o990k267P517M68p534J419P114l153o173M704
758iM740n882l034O445J021o526Q72N943k592m789L994L432m748j669N191J3n078
775b676J537M464l106l671M152K347n049q60N491p20n336K482M805l961l664N142
791A377K127n930m55O102j322n765K956N017m275l870N228K471n887j046O063
$$ plain form
680 -4748 629 4442 -2188 -4169 3214 3229 -4224 -2149 4961 1004 -5184 391 5268 -1687 -4977 2867
696 2867 4257 -4007 -3341 4857 2190 -5246 -717 5450 -589 -5078 1868 4309 -2935 -3289 3584 2140
712 2140 -3769 -717 3863 -224 -3163 1497 2613 -2220 -1662 2678 344 -3257 502 2897 -1915
727 -1915 -2647 2951 1987 -3671 -752 4415 -272 -4409 1659 4188 -2916 -3645 3797 2534 -4725 -1574
743 -1574 5000 240 -5149 939 4886 -2104 -4371 3146 3614 -3920 -2501 4613 1460 -4713 -9
758 -9 4731 -1151 -4185 2260 3281 -3245 -2373 3570 978 -3811 183 3615 -1133 -2802 2389 2402 -2676
775 -2676 -1139 3325 219 -3452 700 3047 -2002 -2862 2629 1909 -3427 -945 3860 -101 -3765 1377
791 1377 3504 -2426 -2881 3221 1899 -3866 -910 4107 -168 -4038 1190 3661 -2226 -3272 2791
806B791m95n880K057N417l347m394M627L218n423j714N789j6n812J470N149k934
822E03m243L931L044m498j620M781M08m527Q71M106j901l354K694K372l391j351
838b175L607L2l648J187L222k318k400L318J400l839j23M059j100l853K185L279
854B833l089k505L655J568l959n72L955l96l777J336L288k223k611K980J731l449
870a235n49L741n42l581J685L098k694k410L330J417l713m55L757m52l504J249
886h58L108j890k540K374J819k721j071K893K06k816P03K557j518j984K210J218
902A690k710l93K817n31k710J255K337j809j776K217J228k315n68K298j7k148
918a135N64J832j112j469J593Q98j924j90K133n04k074J240J770j884j329K233
$$ plain form
806 2791 2296 -3584 -1527 3890 543 -3851 776 3994 -1429 -3143 2646 2630 -3182 -1712 3437 503
822 503 -3740 191 3235 -1263 -2883 1898 2306 -2221 -1350 2756 855 -2499 195 2567 -824 -2175
838 -2175 1432 1464 -2184 -997 2225 -93 -2493 825 2225 -1614 -1737 2322 1222 -2631 -446 2833
854 2833 -256 -2761 894 2462 -1497 -2069 1886 1490 -2287 -951 2337 114 -2497 483 2214 -1235
870 -1235 -1784 1957 1415 -2166 -481 2617 -77 -2487 843 2260 -1453 -1908 1849 1397 -2107 -858
886 -858 2250 360 -2180 194 2013 -708 -1779 1114 1320 -1496 -793 1764 246 -1738 472 1690
902 1690 -1020 -1413 1404 873 -1837 -582 1755 -54 -1830 387 1615 -700 -1268 1030 1013 -1135
918 -1135 -571 1261 149 -1320 273 1171 -753 -943 1190 686 -1388 -148 1622 -262 -1591 642
934F42P13k396j03K372l63k106Q14J792j085j399J230R38j355n39J376L0j307
951g46M83J127r56p81J359K94j622J72J646o73j515J112J268j317q55J389N00
968H85j376k06J200j19j045L50Q66n30o25P82L98r39n5J056l09j051O74R18r73
987i9o74J133L44j173r9J021j29q36K58O64k01l88K50K84k05j93J10p5k28J44
1007i2J04l75K3O44q2o44M11P20o06o17O77L44q05k15P12M3n55J33M25j50l21
1028b26J39K08k24k22K57K26k85m6M69O1m44Q0L61k57l61J80J24j79QQ1NK00O5
1051B20k80J9L40j61m49J66L79j67l27J88M21n2m43M4M80j34o68J10N42k70m94
1072e36L06M14k27j51K23J31k0j9r1J4J35r8k16O1R9j37p7J7L6O3J5rJ48J12p4
$$ plain form
934 642 1355 -1041 -1144 1228 865 -1241 -427 1365 280 -1119 111 1049 -306 -845 531 561 -746
951 -746 -263 864 -92 -873 486 780 -842 -670 976 303 -1212 -100 1168 -149 -1004 385 885
968 885 -491 -697 503 384 -661 -311 555 25 -600 182 580 -359 -414 642 333 -718 -44 874 -99
987 -99 -773 360 704 -469 -568 453 324 -512 -254 410 209 -179 71 355 150 -43 67 -8 -236 -92
1007 -92 12 -363 -340 304 222 -422 -11 709 103 -514 163 507 -298 -513 199 242 -313 -180 245 95 -226
1028 -226 -87 121 -103 -325 -68 158 -127 -173 296 357 -87 -7 354 97 -264 -84 40 -139 -131 -50 -45 155 220
1051 220 -60 -41 299 138 -311 -145 234 67 -260 -72 349 297 -146 -102 378 244 -424 -314 228 -42 -536
1072 -536 -230 184 -43 -194 29 160 140 121 30 44 179 81 -135 -74 25 -112 -189 -172 -136 -73 -58 -67 81 193 119
1097A19N3J19k05j16K07j50l96J94L42l46k40N51K55m68p9M66P5m64j55L35J17
1118B14m14j76M39J76l82k6L61j7k33N8Kj08J62j4l40J51M69k72m68L96M36m39
1140b5l84M12L36l90l23L55L40l31k89M04K32m29p6L79j48l45L02J58m33N3N25
1161C23j89m52L92M28m51l40M01K34m33l22L67K81l88k31M63K72l77j08L81l6
1181B15l21O6K9k46R4J81k65l5M88N2m13J31M60j74m47P8L05j66m01R2L56j16
1203c7l05K67K88k59l0L79j25l40L67K27o04j09O52j50p63K16O90l22o22M55O59
1224E34l80n22M94N14n60m82N45K30o89o1O15j91m37N21K74o72M7P53m22q26O48
1245f7O67r11n11J117M44j120j99J254K3j326J22J205m85j201P59R94r51o05J299
$$ plain form
1097 119 172 291 86 -30 177 27 -369 -175 167 -179 -419 132 387 -81 -160 306 381 -83 -238 97 214
1118 214 -200 -376 63 239 -143 -169 192 175 -58 0 2 -106 56 42 -298 -147 322 50 -418 -22 414 -25
1140 -25 -409 3 339 -51 -374 -19 321 -10 -299 105 337 -92 -168 211 63 -282 20 178 -255 -202 323
1161 323 134 -318 74 502 51 -289 112 346 -87 -409 -42 239 -149 -380 83 355 -22 -130 251 215
1181 215 -106 -40 -11 -257 -163 18 -247 -282 206 258 -155 -24 436 262 -185 -107 198 32 -369 -277 79 -37
1203 -37 -342 -75 213 -46 -76 303 178 -162 205 432 -172 -281 371 221 -542 -326 364 42 -580 -125 534
1224 534 154 -368 126 640 80 -402 143 373 -316 -377 238 47 -390 131 405 -267 -220 533 111 -715 -67
1245 -67 600 -311 -822 295 739 -381 -580 674 697 -629 -507 698 213 -988 -229 765 -186 -791 508
1264E08K88j321J72J212o55j119Q96P93j131m20J266J77j141J65J054m29r72N89
1282f8O43q59l98J018N5r97M47J022q52q07J260M15j642%J726n02j700R77J520
1301A258j316j207J546Q28j656m63J669Q9j526L45J355p04j073J005N84j337j01
1318g04J427m80j353J154J181j572o66J941J52k115L41J970r48j789J345J440
1334A324j630r22J909M91j974K7J938o40j867J119J553j589j082K006N81k158
1350i14P6K123p31j962J173J489j606r77J768M90j718J65J659n85j354R83R75
1367A054j425o28J599M7j779N00J831r92j580J603J292j956p99K184J99k286L22
1384h14K036q85j734J283J305j498p13J679K86j641K54J507p64j373J144R45j572
$$ plain form
1264 508 796 -525 -353 859 204 -915 -19 774 -357 -777 489 666 -475 -310 744 315 -657 -68
1282 -68 575 -284 -682 336 391 -606 -159 863 11 -796 464 879 -763 -763 963 461 -1239 -262 1258
1301 1258 -58 -1265 281 1109 -547 -1010 659 748 -778 -433 922 218 -855 150 734 -603 -704
1318 -704 723 243 -1110 44 1225 -347 -1013 928 1080 -1035 -694 1276 328 -1461 -116 1324
1334 1324 -306 -1228 681 1172 -802 -775 1163 523 -1344 -225 1328 -261 -1343 663 1244 -914
1350 -914 -838 1285 554 -1408 -235 1254 -352 -1329 439 929 -789 -624 1035 450 -904 79 1054
1367 1054 -371 -999 600 647 -1132 -632 1199 207 -1373 230 1522 -434 -1233 951 1150 -1136 -814
1384 -814 1222 337 -1397 -114 1191 -307 -1020 659 945 -696 -442 1065 301 -1072 72 1017 -555
1401e55n35J828j3j842O65J766j145j433J621R17j907l89J946k70j869Q03J589
1418A177j231j192J603P86j853k88J994k14k047P63J945j297j668J743J234k081
1434f26o84K224Q9k145N50J928j018j508J372R65j620m96J636l4j590N15J447
1451A005q91j155J314Q47j572m29J730r2j777N92J591j094j286J459Q14j713l11
1468i68J740k67j622P74J410j076r54J453O57j612k39J636l02j767N99J508j098
1485a28j272J490R97j626l52J866j08j715O20J408j154j114J351O07j545j02J588
1502H11k98j437P31J262j078j020J308O41j513k36J622j62j552O65J385j089j069
1519a029J378O05j584j19J605l91j453Q05J163j179q47J362M42j446n5J540k38
$$ plain form
1401 -555 -1090 738 725 -1117 -452 1314 169 -1264 357 1274 -633 -1022 924 654 -1215 -412 1177
1418 1177 -54 -1246 357 1143 -710 -998 996 782 -1265 -502 1443 146 -1522 221 1455 -626
1434 -626 -1310 914 1003 -1142 -592 1336 318 -1190 182 1147 -473 -969 667 633 -957 -442 1005
1451 1005 114 -1041 273 1120 -452 -881 849 757 -1020 -428 1163 69 -1217 242 1056 -657 -968
1468 -968 772 505 -1117 -343 1067 -9 -963 490 1147 -465 -704 932 630 -1137 -538 970 -128
1485 -128 -1400 90 1087 -539 -891 975 867 -848 -228 1180 26 -1088 263 870 -675 -777 811
1502 811 513 -924 -193 1069 -9 -1029 279 920 -593 -829 793 631 -921 -256 1129 40 -1029
1519 -1029 349 954 -630 -749 856 465 -988 -183 980 -199 -1046 316 758 -688 -743 797 559
1536E59j369O68J261r84j031J193O08j510k73J483k46j366P41J224j006p77J325
1553E00L94j443kJ355m21j275P17J062r27p85J115N11j240k20J254j79j230N24
1571b90J083q23p39J140M16j236j3J201m43j141P05Q41r72n42J132L01j090M4
1589d26J110k60j040M57Q51p52p14R00M24r93j05J075j93r38N59P72q12n03R49
1608C61J47j014J34R22l83p89N93O42p20m14Q05K46q58l3Q40k27q25M38P00o77
1628a12n17Q87K79r63N9R60l13q59N31O70p27m96P76K57p75o9P43m7o70J92O24
1649D30l15n25M31L85n40j90N85l5n57K74M44m72k65N86L9o15J54N57l22m65M19
1670CL67m70k51N28J67n27n9N77o4n81J81N14l56m45M67K74n42o5N73j03m75K69
$$ plain form
1536 559 -810 -142 1119 135 -896 297 905 -605 -878 605 359 -1007 -266 958 -48 -825 500
1553 500 894 -549 -551 804 383 -892 -175 887 -40 -825 290 801 -439 -659 595 416 -814 -290
1571 -290 793 -30 -769 371 787 -449 -462 739 296 -845 -140 701 -271 -813 319 620 -470 -426
1589 -426 684 424 -616 -159 692 -60 -774 126 550 -443 -548 527 334 -604 -45 727 -85 -588 361
1608 361 508 -506 -372 550 167 -622 -29 613 -107 -521 284 530 -328 -361 479 252 -573 -135 565 -112
1628 -112 -629 258 537 -426 -367 593 280 -579 -48 622 -105 -601 175 432 -343 -412 331 284 -386 -194 430
1649 430 115 -410 21 406 -134 -324 261 226 -331 -57 387 -85 -350 236 275 -340 -186 371 49 -416 3
1670 3 370 -100 -351 177 344 -183 -242 335 271 -310 -129 385 29 -416 51 325 -217 -282 291 188 -287 -18
1692a8L41l93k25L85O7m05N6L94r2l21K10L20k56k92L25J66m52j27M58k7m80K23
1714a43M54k96k87M38J87m67n2L97j01l38J33K55j45j89J67J46j75j31J68M9k19
1735a49J4K28n5j53J96J18k22J6K27j68k08K01P7l16J1K89r8k07J52K14j32j46
1757a11J22J63j42j63J55J24j76j11K16J9k12K6J60j08r6J77Oj13J00Q0j36j8
1779c8J39o0j35Q4P9p8l8O2P5m6p8M1O5q5j23J01O0j34MJ65j5n9J17M7j36K3N9
1806I6j34p3O5j0o3M5K9K4M2KqN2J1p2J9M4q2k8O6n0l7Q1rn2L1L5m8K1J6m5N0
1837A8M5q6J9J15p6j12J28P4j69m4J57j7j24oP9L4p2m7R4J10j12j12J58P7j85
1862e4m8J54j1j18J4O4J0J0l4j1Q8Rj23K5Q8o9o9M4K4j0K5opR4rj22N8R7j15r0
$$ plain form
1692 -18 323 -70 -295 90 157 -248 -192 202 110 -211 -1 319 63 -229 96 262 -190 -317 141 114 -366 -143
1714 -143 311 15 -272 166 353 -114 -166 231 130 -208 -75 180 35 -154 13 159 -16 -147 21 70 -149
1735 -149 -135 93 38 -115 81 199 -23 -7 220 52 -156 45 122 -194 -183 106 8 -199 -47 167 35 -111
1757 -111 11 174 32 -131 24 148 -28 -139 77 96 -116 -90 70 -38 -134 43 49 -64 36 116 -20 -38
1779 -38 101 41 -94 -10 69 -9 -47 15 90 44 -34 7 72 -13 -136 -35 25 -109 -105 60 45 -14 103 150 14 37 96
1806 96 -38 -111 -46 -56 -119 -74 -45 -21 21 23 15 67 78 6 25 69 -13 -41 25 -25 -62 19 10 -42 -11 24 -24 -3 13 -32 18
1837 18 63 -23 -4 111 35 -77 51 125 -44 -88 69 52 -72 -78 1 35 -37 -84 10 120 8 -104 54 131 -54
1862 -54 -102 52 41 -77 -63 1 11 21 -13 -24 64 73 -50 -25 63 -6 -75 -31 -7 -17 8 2 -5 89 80 -42 16 113 -2 -92
1892i2J11L3j18rJ19J7p5j9R8M1j36n3J59Qk27K8K19q5k17J84J96j93j00J97N9
1917A45j65n4Q8K6r7p3M6J21l5j01O6J53l2q0kO5M7j21j44J45J52k30j51L18J27
1942B14l47m1L67k1l58R2K82j26k50J52J92j32j35J43J22j60p6J65j1j97N9J77
1964A11j81j09K53J5k41J13K65k28j64L10M1l57O8K90j53k98K29K54k86k07L60
1985H5J90m13j10M75M6n39N9N44k10m79L02L92l66k74M35J13l92ML28j43k06J76
2007A7J18k30lK37n4k54J59K54k53k41L48J66m47p5N00n7n31K23M89l51l52M40
2029A03K19m70p4M60r9m15J78L37k93k50L80J68l97n2M56l6m74J73M28l29l63
2050c50M35K16n21k7N36j62m62L59L53m69j99N44K1n71R8N54k31n09L43M59m46
$$ plain form
1892 -92 19 52 -66 -75 44 61 -14 -33 65 106 -30 -83 76 84 -143 -115 104 19 -198 -14 182 -11 -111 86 145
1917 145 -20 -74 14 40 -57 -130 -84 37 2 -99 -33 120 88 8 6 71 118 -3 -147 -2 150 -80 -231 87 214
1942 214 -133 -174 193 172 -186 -94 188 62 -188 -36 156 24 -111 32 154 -6 -82 83 72 -125 -66 111
1964 111 -70 -179 74 89 -152 -39 226 -2 -166 144 185 -172 -104 186 33 -265 -36 218 -68 -275 85
1985 85 275 -138 -248 227 273 -266 -207 337 127 -352 -50 342 -24 -298 137 250 -142 -138 190 47 -159 17
2007 17 135 -95 -98 139 85 -169 -10 244 -9 -250 98 264 -183 -258 242 185 -346 -123 366 15 -337 103
2029 103 322 -148 -222 238 139 -276 -98 239 -54 -304 76 244 -153 -205 251 215 -259 -86 342 13 -350
2050 -350 85 301 -220 -247 289 127 -335 24 377 -92 -291 253 274 -297 -199 355 124 -385 -42 417 -29
2071b9l61N34K62o33j30O40n7o35K55N29l74l71M96K04n47J4N00j74m56L26L26
2092C19m34k18M91J15n21K5N27j31n17K71M53m10l48N17K03n88J5O00k15n22L87
2113A9M14n59k43O03P4o31P4O15k22n50L29N03m20l88M86K96n70j44N73n3n52
2134c46K18M40l51k73M71Q4m84J28M37k95l70M16K34n28r6N49k3n58J69N57k67
2155A12m99M17M24n26k95O09J15o88O1O57k84n86M47M65n70k59O64J15o44O6O02
2176D03k12n28K82M29l91l48M42K10m91m0M96j16m46K78L69m50j92N21K6n52J79
2197a31N29l30m57M61L30n52k13N55P0n62L7N69j69m70K80M00l84k82M54J30m78
2218b13N3M93j95m39L88K86m89j74M95j8n19J34M41k22l42L53K75l41j29M03K0
$$ plain form
2071 -29 -390 144 406 -227 -357 283 226 -409 -154 375 1 -370 126 330 -217 -203 297 123 -333 -7 319
2092 319 -115 -333 158 273 -248 -223 304 173 -344 -73 380 -30 -378 139 342 -246 -231 369 154 -368 19
2113 19 433 -126 -369 234 308 -323 -249 366 144 -406 -77 426 6 -382 104 400 -170 -314 259 206 -346
2134 -346 -128 312 -39 -312 159 243 -241 -113 324 29 -341 75 309 -219 -315 234 211 -347 -178 379 112
2155 112 -387 30 454 -72 -367 242 357 -331 -270 387 103 -483 -36 429 -141 -400 264 379 -265 -199 403
2176 403 191 -337 -55 374 -17 -365 77 287 -204 -244 252 136 -310 -32 337 -113 -305 216 242 -310 -131
2197 -131 398 68 -389 72 402 -150 -363 192 262 -300 -263 306 137 -333 -53 347 -37 -319 135 265 -213
2218 -213 -160 333 138 -301 87 373 -116 -290 205 187 -332 -198 243 21 -321 32 307 -34 -163 240 260
2239B60m30P3L65k38l71L51K61m59j25N37l2n36J92N08l26l98M35K75m45j64M61
2260A94N6m50K4L92j37l50K00K85k71j94L66J11l88L4L96j59l64K51K84l59j55
2281b34L72P4l60M8L05j22k46J47J58j81j07K05L2j96O7K17j54j90K36J31l29
2302a27q7M01l5m06J33L91k21l36K91K26l26j50L24O5k80K1K69n4k21J10J92j82
2324bj76K38O6l12K4L33r8k92K08K75k78j68K98Q5l03j9K68p4k04Q9J57j20r9
2347a04J45P5j79j8K19q2k06J31J92k24j49K81Q1l12%L21r1k50J25J96j53j24
2369a26J59M8j55J1J25m5j07R0Q7j38o7K00%k31N1K73j07k59K16J98k48j42K79
2392A12N4k72KK16p5j60R9J18r2p9J16N5j32qJ43l2j69Q8J50j52j07J72O4k17
$$ plain form
2239 260 -170 -97 268 30 -341 10 271 -188 -313 224 192 -344 -152 356 30 -368 67 342 -103 -267 194
2260 194 250 -200 -176 216 79 -271 -71 214 -57 -251 115 226 -162 -128 268 109 -255 -4 280 -79 -234
2281 -234 138 212 -148 -100 205 83 -163 -16 142 -39 -146 59 91 -105 -38 179 25 -165 71 202 -127
2302 -127 -214 187 152 -254 -121 270 49 -287 4 230 -96 -246 78 143 -137 -116 153 99 -122 -12 180 -2
2324 -2 -178 60 126 -186 -162 171 73 -219 -11 264 -14 -182 116 201 -102 -121 147 73 -131 -42 115 -5 -104
2347 -104 41 116 -63 -81 138 56 -150 -19 173 -51 -200 81 162 -150 -150 171 80 -170 -45 151 -2 -126
2369 -126 33 81 -74 -63 62 17 -90 0 87 -51 -118 82 82 -149 -98 175 68 -191 25 223 -25 -167 112
2392 112 166 -106 -104 112 37 -123 -24 94 2 -77 39 94 -38 -46 97 65 -104 -16 134 -18 -125 47 111 -106
2416a06LJ98p3j47J18R2q9k7P9k0o5L0nn1j3O2J9p3M8R5nj00M3J20j22j37J39
2443A3N4j52k3J67nj09O6P9p9m2O0oo6QN9j6k9M2N9k8n6jO8o2o7L6O3n6k0P4j2
2474A9j2j4mj3J9l7k3P6J9l9NJ01m6o7L9lo5l4K4k3mM7J1OL5K6Rrk2K9jl9j7O0
2508E3l6p2L9K3p3PN7l1l5J13L1q7M7R9o0r5M8K7r7m7L4K3qk5O4N3k2l5M7j2o1
2539c1kJ6l5pO3m4j5R8K5r1J5R5p4r0O1M3o5l6O0M0l5oL9K4l1qL6qp3N0K8o2m0
2572f0J03k4j02N8O6o8k5Q5J1n7M0J4k1Ojm9J3J3l9j9K9J1K%j6L4L1m2l4P4Kp3
2604c8JM0nn4K3%L9Mn3J9Q5j6r4N3Q8p4j08Q6N8q5m9Q7K8o3j1O7K7n4kO1j2o9
2636b1L1N4j06k4R2k3j03N9R7q8k5R4K7r7K3N6m3n1L0J1n0OM0QrKP1k7p7O0L2
$$ plain form
2416 -106 -103 95 22 -125 -7 85 -4 -31 48 28 -37 -7 -12 -63 -76 -14 5 -68 -20 75 70 -30 13 133 11 -126 13
2443 13 67 -85 -108 59 54 -55 11 90 11 -31 29 23 -43 -35 24 8 -21 21 80 52 -4 -5 63 1 -66 -30 33 -23 -43 31 19
2474 19 7 -7 -11 -24 -5 -42 -65 11 30 -9 -4 97 51 -16 23 20 -45 -79 -55 -78 -82 -35 -24 -18 17 43 52 43 21 50 49 10 -7 53
2508 53 17 -55 -16 7 -66 -59 -2 -33 -68 45 76 -11 36 135 75 -20 28 55 -42 -89 -55 -32 -40 -65 -1 52 30 -5 42 30 -31
2539 -31 -33 -17 -52 -59 4 -40 -55 43 68 -23 -8 87 13 -77 -16 27 -38 -74 -14 26 -9 -15 24 48 17 9 45 37 -36 14 42 -20 -60
2572 -60 43 19 -83 -25 41 -27 -52 33 44 -13 27 41 20 26 25 -24 -11 2 -37 -56 -27 -16 -14 -14 -30 4 35 -7 -41 33 35 -38
2604 -38 -37 3 -2 -56 -33 -33 6 10 -43 -24 61 45 -49 4 92 18 -90 -4 54 -31 -80 7 35 -28 -39 28 55 1 -1 60 48 -21
2636 -21 10 64 -42 -66 26 3 -100 -41 56 -32 -57 37 64 -33 -10 46 3 -48 -18 -7 -57 -51 -11 -3 -12 -10 61 34 -43 17 49
2667D9j14l9J27Qj29N5J47p3r2J26M4j23k5R1m8q3N5N8m7j7N7L9q2j7Q9j3j23
2694h0M5J21r2r2J50P1j78k6J76n8j68Q9J10j17o2J32M6j05k5J32qj23PJ22o3
2719Dj23Q0J19j21o1J58L1j68K6J38o8j26J28O9j14nJ15k5j09N3N3p5o7Q2L8q1
2745d9j8J51Mj25K1J55j08j37R3J15j84n8K01Lj78R5J42r5j20J03P5j34n6J09
2769EM4j16QJ36k6j25M9J06j20r5J50K5j46M7J76q9j08J53N6j88j8J68n8j50P3
2794d3J29r9q5J25R9j45o4J83Lj84LJ82n8j95J38J43j74p5K08kj95N3J64j00j23
2819a12J19O2j41k8J49j5j24L2J39o4j17J12J08j49q4J79J9k11M5J86j07j56J51
2842gJ29j75m9J90Nj54L2J18o7j04O6J03j15n3J22K5j25K4J40p0j34J43Q9j75
$$ plain form
2667 49 -65 -104 23 31 -98 -43 104 31 -61 65 109 -14 -39 52 4 -79 -24 34 -13 -30 27 66 -16 -33 56 43 -80
2694 -80 -35 86 -6 -98 52 123 -55 -81 95 37 -131 -42 68 -49 -111 21 67 -38 -63 69 61 -62 -55 67 4
2719 4 -119 -39 80 -41 -102 56 87 -81 -55 83 15 -111 17 86 -28 -33 82 57 -52 1 54 -21 -88 -6 32 -49
2745 -49 -67 84 88 -37 -16 139 31 -106 -13 102 -82 -140 61 64 -114 -19 123 28 -92 11 86 -48 -104 5
2769 5 49 -67 -59 77 51 -74 -25 81 -39 -134 16 41 -105 -58 118 29 -79 74 130 -58 -76 92 34 -116 -43
2794 -43 86 -13 -98 27 126 -19 -83 100 103 -81 -78 104 46 -149 -11 132 -42 -117 91 89 -106 -53 111 11 -112
2819 -112 7 69 -72 -100 49 34 -90 -58 81 17 -100 12 120 -29 -113 66 85 -126 -81 105 -2 -158 -7
2842 -7 122 -53 -102 88 93 -61 -29 89 22 -82 -16 87 -28 -81 41 66 -59 -35 105 35 -99 44 133 -42
2866d2m7J90l5j90N8J57j06j21J39Q5j44pJ36J3j43J9J05m7j26P2J22j41o5J32
2890A4N8j71J7J80p3j35J35Q9j26l0J30k1j25M0O8o7p7Q7M4p2l7J29J9j21L4J42
2916A31p8j50J02J06j64p4J89K7j76M8J53p5j29R1O3q7m7P7J5o3nQ9k1o8O7N4
2942G5r0m6J39qj71M7J47r2j48J43R7j44n9J47L0j24K8J13k5p7K8N9p0o1M9L6
2968B3r1PR0qq6P4R0r9n0J23Lj25K2J03p8n0O0M0o7j0O6l5n1K2M2m4k5N5M3o9
2998b5KR4nj25K9J11j06j00J16O9j24j1J34nr8L6P1o0p0P0K6o1l9Q8L1p4JR2k7
3027D0r1M9O2q0m5R1Rr4L0Q4n2l8O3Kl0NM1n5k3M5on0J4M8j2m0JO1Jq1M3Q0p8
3060fn6Q4K3j04kP9l2l4N4L2o4J8M8k8l7K1K3l2j0J7J1k0MK8Rm7J0O6n5n8P1J9
$$ plain form
2866 -42 -89 101 66 -124 -66 91 -15 -136 3 88 -56 -63 73 86 -57 -38 67 20 -106 -34 88 -53 -118 14
2890 14 72 -99 -82 98 25 -110 25 114 -12 -42 88 67 -58 -18 50 -17 -94 -7 37 -35 -72 57 76 -45 -11 131
2916 131 53 -97 5 111 -53 -127 62 89 -87 -39 114 39 -90 1 64 -23 -70 7 22 -41 -46 43 22 -46 21 75
2942 75 -15 -61 78 70 -101 -54 93 1 -147 -4 93 -51 -110 37 67 -57 -29 84 59 -18 10 69 -1 -62 -13 23
2968 23 -68 -61 29 21 -65 9 99 0 -50 73 76 -49 -27 76 -2 -52 8 48 -19 -29 37 2 -49 -27 15 -29 -54 1 44 -25
2998 -25 -23 71 66 -59 -30 81 -25 -125 -9 60 -64 -75 59 54 -44 -8 63 3 -67 3 29 -32 -71 17 48 -26 -25 67 40
3027 40 -51 -2 60 -20 -65 26 35 -59 -29 55 3 -35 28 30 0 5 46 -9 -32 13 7 -43 -29 19 7 -33 -32 29 30 -51 -8 72 -6
3060 -6 -62 22 45 -59 -61 18 -14 -48 6 38 -26 -8 40 12 -25 -4 19 -13 -23 -6 5 -15 -11 17 26 -21 -11 55 0 -58 13 32
3092C2p2oR7l0o1K8N8k8m0K1K7l6kJRJ7l9PK2jj2J1k2L1kl0l1O8J0r0K9R4m7p6
3126f3O2P7o7m8L7L6m8l7M0K5k4k1J2P0l7k3L6jk4jKj3NK2k2nK8pk6K3J3m3QM1
3160B7k7k9N0J1k0k3K7J2j9l8K4L0m5l9N8K8o2m9J16Jq0K4N8j4l3KL2lk6k4QM0
3192A7k7k4J3L4rk3jK4L1l7l8N3M0o7l4Q6J5q6MO3qn4PK1pok0J5K1j0RQJ6j0L
3227A9pk0K3j0l6j3N9k2n5L7N0m5NM3j7j2J0J1l1K4qkj1NPjk8J3L6j2n4L9N0n9
3261a2l0O5K2o7OM6j6k4J8Nk5J9qk4QJ1rj2J7QK7l0pL5J8p0J6N9m8n1M0M0n6j1
3295d0M3Nj6QJ0lljmMj4RJ0j1rK4jk8QM1l7l4M8jm0J5L1nj9L1ll0K6kj3j1J2P
3333Gpj4J0J9k5j7L7K1m0%L9k4m5L1M7n2k1N1ol8L1J7j8nJ4J5j6k3OJ9j6l6N1
$$ plain form
3092 32 -40 -46 51 21 -40 -12 46 18 -22 -1 26 -10 -12 -11 -2 15 -24 -17 5 4 -8 3 -19 12 10 -20 -51 17 27 -63 -34 60 13 -63
3126 -63 -1 76 9 -39 -2 34 -14 -51 -11 14 -10 -31 -19 51 14 -9 27 26 2 1 3 -10 -5 17 -5 -10 18 11 -15 8 21 -22 -14 27
3160 27 0 -29 21 32 12 -11 16 28 9 -29 -5 25 -20 -59 -1 27 -35 -84 32 33 -47 -23 35 21 -12 -10 22 19 -7 -31 -23 17
3192 17 -10 -34 -21 13 4 -19 -20 4 35 -2 -40 13 53 -14 -48 38 53 -33 -29 34 26 -28 -21 0 -7 -13 -33 -18 3 -7 2 10 26 16 19
3227 19 12 -8 15 5 -31 -44 15 -7 -62 -25 25 -20 -15 28 11 -1 9 20 -11 13 5 3 -8 -3 4 3 -25 -12 24 12 -42 -3 47 -12
3261 -12 -42 23 45 -22 -16 30 14 -10 8 13 -12 7 -1 -25 -17 -6 -15 -27 -10 -2 25 -5 -12 23 41 -29 -13 46 -2 -53 -13 27 -29 -40
3295 -40 3 8 -8 0 10 7 4 3 -1 3 -11 -2 8 -3 -12 12 11 -17 -9 32 -5 -39 9 8 -32 -17 14 9 -10 21 18 -12 14 12 -1 -12 0 7
3333 7 0 -14 -4 15 -10 -27 10 31 -9 -9 30 6 -39 -8 39 -13 -34 17 11 -27 4 21 3 -2 12 27 11 -12 -6 13 -3 -39 12
3366A2J7m7RL8k8k6L7J7n3LM1j7l0M0J7m5%M8k2m4K3K6om7K5M3j2m9L9L6l8l2
3398b5M9Pn7RL9l7l1N6j1j5PL1l0qQK4j7qMJ6%l6RM1m0j5M2k6kK7%m9L1M7m5k4
3434b9N5J6p2JP1k3m5%N7jn4OP1j2q1K4M8l9l3O2J7l2k2M5k3l5L7%m7K6M0j9l9
3467c0M7K9m0k1K1K1m6k8L5K6m1KM9mn1M4J0n5J5M5l9l9M9L4m8j6O8No0J0M0j3
3499A9l7j6N1j1l3K3K7j7k6L8%l8J7M0m0j6M1Qn5J4L7l0k7K4J5j4j8J8J9Mj8K8
3531B7kk8Rmj5j7K5mk3K3M4m5k4O5J3p0J0N0l1l2J9M4k4l4J0L5k1l0L0L1l2k8
3563b9M3K9n5JL1j7l2M4jk7jK5Rl1J5Qmpj3QOj0RNk8%L0j6l3M2K1n6J7O8l6m8
3599c3K1L8m0k9K9K7j4j3ML8k6k3K8Qj3k0J9J0k7J8Lj6K3L3l4l6N8rn0J3M2m3
$$ plain form
3366 12 29 -18 -9 29 1 -25 12 29 -24 -21 20 3 -27 13 30 -15 -15 33 11 -33 -10 16 10 -37 -12 31 19 -30 9 45 7 -25
3398 -25 24 31 -26 -17 22 -15 -46 10 -1 -16 -9 22 -8 -16 -8 16 -1 -9 -5 11 11 -25 -16 25 -15 -30 12 -14 -16 11 11 -38 -7 40 -5 -29
3434 -29 26 42 -30 -29 42 19 -26 -26 31 30 -24 -18 53 41 -40 -16 32 -7 -40 22 39 7 -15 30 7 -28 9 9 -38 -12 28 9 -30
3467 -30 17 46 6 -15 6 27 -19 -47 -12 14 -27 -25 24 20 -31 13 23 -32 -17 28 -11 -50 -1 33 -15 -31 37 42 -18 -8 32 19
3499 19 -18 -34 17 6 -27 -4 23 6 -20 18 18 -20 -3 37 -3 -19 22 30 -25 -11 26 -4 -31 -7 8 -6 -24 -6 13 17 -1 27
3531 27 25 -3 6 2 -13 -30 -5 -9 -32 -9 35 -10 -34 31 44 -26 -16 34 3 -29 -10 34 10 -24 -14 21 0 -30 0 31 -1 -29
3563 -29 14 43 -12 -11 20 3 -29 15 14 -13 -14 11 20 -11 4 12 8 1 -12 -4 2 -8 1 6 -22 -22 8 -8 -41 1 22 -34 -17 51 15 -33
3599 -33 -12 26 -14 -43 -14 13 -1 -14 -10 28 2 -21 7 15 2 -18 1 11 -16 2 5 -11 12 45 11 -25 33 24 -26 -13 29 -14
3631a4k1L1K8k2l5K0L6k2j0J6K4l8%L1lm7K5K1m3j4L8Kn2K6N9l8k2M7Nl1RJ2j9
3664apkNk1J2J5Nj8KM4l2l6M9L1n4k3P7j4n3KN7k9m6L2K5l3j3L0J4j4LLJ4k6l
3699eRk4mK8lk2K0L9k1l5L3j2l8J1J3j3j0K9Qk6K1K3j9oJK3l1j2K8J4l2j5M7M
3733B3m4J3M4l7k6L3J9l4j1N2qk9J2J4k2j9J5j2J1J1KJj2J8J6k4j2J1Rm1j1L9
3765Anm7L4M0l8k6N2Jl4KK3nj4kJ7Omj5NJ3j6jPjRPj1pL8j8k8J6J9k7j3L4Rm5
3803b4K5J9j2j5RJ4j8j6J9J0j1pPJ7l5KK7%l8J8L1k9lJ4Mk0J0Kj2MMpMJ0j5J1
3839amRj4R%J8Pk7kL1pn4J9M0k1l9L1K1kj8K0J5nl3QJ0j7k0J2L1k7j3K5Qj4kj
3876gnKNlj2J3j3NNJ4k0jJ3jj9K0kLj7NJ2Nj1LJ1k2jK3Jk0K3L4j7l7K3J4l2l2
$$ plain form
3631 -14 -35 -4 24 2 -33 -13 23 1 -9 7 31 -7 -7 24 21 -26 -1 20 -23 -37 1 3 -49 -23 36 -2 -24 23 28 -3 6 18 -1
3664 -1 -8 -10 -5 -26 -14 1 6 -12 -10 34 2 -34 15 46 -8 -31 46 32 -21 -19 38 9 -37 -5 20 -13 -26 4 18 4 7 10 24 -2 -5
3699 -5 4 -20 -24 4 1 -21 -1 38 17 -18 15 3 -35 -24 -11 -24 -34 -5 3 -23 -2 21 2 -4 -3 20 -11 -23 5 19 -13 -28 19 23
3733 23 -21 -8 36 -1 -27 6 25 -9 -20 32 24 -5 7 21 -1 -20 -5 -17 -6 5 7 8 -4 14 30 6 -6 5 14 -27 -38 1
3765 1 -4 -51 -17 23 -15 -41 11 12 -22 -20 3 -2 -16 -18 -1 5 1 -14 -9 4 -12 -13 -6 -7 2 9 -2 -9 29 11 -17 -1 18 -9 -22 12 21 -24
3803 -24 1 20 8 -7 2 16 -2 -18 1 11 0 -7 0 17 -18 -16 11 11 -27 -9 22 -7 -10 4 8 -12 -2 0 -12 -8 -4 -11 -7 3 -12 -1
3839 -1 -5 4 -10 -1 -1 17 24 -3 -5 26 19 -35 -16 24 3 -36 -5 16 14 -4 16 31 26 -7 1 11 -6 -26 -14 17 -10 -23 2 10 -4 -6 -7
3876 -7 -12 -10 -5 -8 -20 -7 -20 -15 -10 4 -16 -17 -4 -5 -24 -4 -6 -3 -20 -15 -3 2 -9 -6 5 -17 -18 5 6 -14 9 43 26 -11 12 26 -6 -38
3914c8L2J5j5j4K0K2j4nJ4J5k9KJ1pk0LK0k6mL1qj8J4J2l2%K0lPmJ8nk0J1Qnk5
3951a7NKJkJ9j3MJ6kj7J0Lmk2K1J8j5kK7j0j4nJ4j5qj0OQj7J3K5rj4K3Pk1j0K1
3989A6j1k2L0j8j2JK8k9%Qj2NJ1jK1mj8J0J6rm1J0J7k6J1Q%J5J0rjK6k0k1J1J6
4025A6pk2K8Mk2MqK5j8Mj0K4J0m2K0Rk4nK1LqnMk0J6J0j0JnJ1lPrRj6rKK0ml0
4065b9J3K7j4kJ6Kj1nnMJ1mjlK9k6%J4J3j8pLLJ1l1nK7Ql4PK1Nk3K9j6ojOj5%
4105gJ7j9qQLpJ0%NppRrOpJ3J7j7j1K3lk3K4j2k1J7J2omJ4K0l3PJ2rpmJ7Ol4M
4146a1M4pk0%L0l4j5J9Rj2KMnnLQnmrJRrPQj3MRpmqJ4j5oNKPJ1orK5Jm2JM0k2
4191ek1J9K1k3pPK9%l2NK2j6k0K3J4j8lK8mk8K9mj3j5J0Oj3NQmkLoMMj5RJ3k0
$$ plain form
3914 -38 -6 9 -6 -20 0 22 8 3 17 32 3 5 16 9 -11 -8 12 -14 -18 13 5 -13 1 13 -19 -19 1 -2 5 1 19 14 -6 5 13 8 -17
3951 -17 -12 -10 -9 -11 8 -5 -1 15 13 -4 6 9 5 -17 4 22 7 5 32 22 8 3 17 2 -6 -16 -10 -2 -19 -6 19 10 -4 19 26 5 -5 16
3989 16 5 -17 13 -5 -17 -16 12 -17 -17 -9 -21 -16 -5 -6 15 11 -7 3 19 10 -31 -21 -4 -30 -19 -11 -11 4 14 5 4 30 10 -11 0 16
4025 16 9 -13 15 19 -3 1 -7 18 0 4 -6 18 28 -14 6 15 -9 -14 7 10 2 -3 1 -19 -3 7 -3 -2 -7 4 1 8 -1 8 -8 -17 -15 5 1 -29
4065 -29 -16 11 -3 -5 11 13 2 -3 -8 -4 7 3 2 -1 28 2 2 16 29 11 4 7 10 21 -10 -15 12 20 -14 -7 14 19 -4 25 9 3 2 8 -7 -7
4105 -7 10 -9 -17 -9 -6 -13 -3 -3 2 -5 -12 -3 -12 -6 -13 0 17 0 -11 12 9 -14 10 -2 -23 -6 6 0 -4 10 30 -3 4 16 7 0 -4 13 19 -15 -11
4146 -11 33 26 6 6 36 2 -13 6 15 3 5 9 4 -1 2 10 5 1 -8 -7 2 -7 0 8 -5 -1 8 1 -3 -11 3 -12 -18 -13 -11 -4 7 1 -8 17 18 -24 -23 17 -5
4191 -5 -26 -7 14 -9 -16 -9 20 20 -12 -7 15 -1 -21 2 16 -2 -5 23 19 -9 20 16 3 -12 -2 4 -9 -4 4 0 -2 1 -5 -1 3 -12 -3 10 -10
4230a0J2krK9j6j5jK1qk4PJ5j1KJ9j1jJ3nkLJJK6k1j5J7Oj5oQoj2J7rj1K2J6j5
4269A0rK5rj6Rj1%Nj1J2pLoMMNnj1rK8mk1j2L1nk4K1K1k6%K6qokJ0k2mK6rqJ0
4310EQmrJ0Nnj4J8J7k4j8L1jk2OJ8j4oNJ1j6PnRjj1kQ%nLj6KJ9nj3JJ2mj7OPl
4353gjQLk1J8njJ4Nk1OJ8Lj8lJ3Pj7j3J1K4l3pL5mj8J5K2nl0J7Jj4J2Jk0j0J7
4391BJmLKPj4KKQj0j7J5nqJ3Mj5QRpmR%k8J1J7Kk2J5J6j3j2J5J5j7rMK3qk7K4
4432GJ2lj7K2j3j6J6Nj5J5Qj4oK0qj6J4%Jpj2J0Mj4KK2qj0J5Lj3j2K2j3nQKk1
4470a5jL6k4onJ2OoMMjj1J1J1j2KlNpJ2j0jKJ3j2k1L3Rk0qJ7%j8qK8j4j0RoJ1
4510Fon%Lj4QLlpJ6%lkRj1KJ8j7k0K8okrJ2%j1J5kkLj0J2Kj0KQj0j0K2pkJJ5j6
$$ plain form
4230 -10 2 0 -9 20 4 -11 -12 9 1 -23 -16 -1 -12 -10 9 -2 -3 10 5 3 6 7 8 34 13 -2 15 21 6 0 8 2 -10 7 -2 -13 9 25 10
4269 10 1 26 17 1 10 -1 -1 4 -7 5 -2 1 -5 -1 3 8 3 -8 -17 11 7 -14 -26 5 0 -24 -3 18 -8 -8 18 10 4 2 12 -10 -14 12 3 -5 5
4310 5 13 9 0 10 15 10 -4 14 31 7 -11 20 19 -3 3 21 7 1 6 17 1 8 3 12 11 0 -2 6 6 1 4 -12 -10 9 4 -9 -8 4 0 -17 -11 -4 -7
4353 -7 -8 0 3 -18 0 -5 -6 8 13 -8 -2 16 19 1 -2 11 18 1 -12 -1 23 -10 -17 18 14 -4 11 33 28 -2 15 16 2 14 15 -5 -15 2
4391 2 3 -1 2 4 11 -3 -1 1 9 -1 -18 -3 -8 -16 -3 1 -14 -6 3 -4 -8 1 1 -27 -16 1 3 -19 -4 12 -1 -13 2 17 0 -9 -5 18 10 -17 7
4432 7 19 16 -1 21 8 -8 8 13 -2 13 21 7 1 21 13 -3 11 11 12 5 -7 3 7 -7 -5 17 9 -1 14 17 4 -8 14 1 -4 4 6 -15
4470 -15 -16 20 -4 -10 -15 -3 3 -3 1 5 4 -7 4 15 3 5 2 7 0 12 2 1 3 16 4 -17 16 25 5 -3 14 14 -4 -12 16 2 -8 1 -5 6
4510 6 0 -5 -5 -2 -16 -8 -5 -8 -15 1 1 -2 -4 5 -6 -4 14 -3 -23 5 -1 -3 -12 0 0 -11 4 2 0 3 -7 5 7 -3 -1 7 -3 -13 9 2 0 1 16 0
4554@j0J8J2k4KRj1K5j6oJ2j0j7J2PnmjKmMqJ9pOo%kNj7J0Qj4JQj2MNNjlnJ2j4
4598a1KRNj2rK4nj6J6J3j0pJ7Mj9oNLj1oJ6J6j0j2K6kj9lOPk2MK7k6MOj0R%rq
4639a4J5opK2Lk0J1Kmj4QOp%nJ7nlj6J9pqJ8J4k1JJ4Njnj2J0Lj0mNKlJ2j2ljJ6
4682A5j9j1J2K5k8JJ0Kj4J8j6JMmnL%j2K4nj7J1J1j1P%pJNmlNMj5j0K8kk1J1L
4722cJJ0plOPj6MNNjj1LRNk7%J8J1k4kJ4j5MJ2kmmLM%Kj1QLk5MJ2Pj2MkkQOlJ2
4769A3j5lLJ%MmMj0MJ6j9J1LrOoM%jlMNonJ0K0l2jJ5Jk2PQQj4nJ1Jrj1RJ9j8m
4814a0MJj%J4k3J3Oj1J%mLKpj3L6mpjJ3j1nOJ4kqLmj0LjJ0oM%QrqJ6oj0LKnJ8
4860A4pj2OJ3j4j0QJ3k2R%pkqJ1Mjj4NOrnK3Jj9J1%nJ1PJ2k0lMOjLj0J2j9Rok
$$ plain form
4554 0 -10 8 20 -4 -2 7 -4 21 5 -1 11 1 -16 -4 3 -2 -6 -7 -5 -9 -5 -13 6 -1 5 -1 -1 -3 2 -15 -5 3 -11 -10 -2 -14 -10 -5 0 -1 -4 -9 3 -11
4598 -11 -9 0 5 -7 -16 8 3 -13 3 16 6 -1 16 20 1 -5 0 3 -8 -14 2 18 8 -4 22 20 1 -2 4 11 -11 -7 20 -6 -2 4 -6 3 3 -6 -14
4639 -14 1 -5 -12 10 13 -7 4 6 2 -12 -4 2 -5 -5 -10 7 2 -1 -17 2 -5 -13 5 19 -2 -1 13 18 17 12 0 10 13 3 -1 4 6 3 15 3 0 -1 15
4682 15 -4 -15 -3 22 -6 -5 5 7 -7 11 -5 -4 0 -4 -9 -6 -6 -18 6 1 -16 -5 6 -5 2 2 -5 -4 1 -3 -6 -1 3 -12 -22 6 4 -17 -6 -3
4722 -3 -2 8 1 -2 4 11 -5 -1 4 9 8 -3 0 9 14 -13 -13 5 16 -8 -10 4 -11 -7 5 3 -1 -5 -2 2 2 4 -7 1 4 -21 -17 -5 2 -10 -6 -8 -10 -2 4 1 13
4769 13 -2 -5 -2 -1 -1 3 -1 3 -7 -3 13 -6 5 8 -1 5 -1 3 3 2 -1 3 8 2 -3 7 27 -5 -6 9 10 -12 -5 3 11 -3 -8 3 4 -5 -16 -7 12 -6 -10
4814 -10 -6 -5 -6 -6 8 -15 -2 4 -7 -6 -6 -10 -7 -5 -12 -25 11 7 0 -1 12 1 -4 2 16 14 6 9 5 -5 -2 -3 7 1 5 5 13 4 -4 12 6 -4 -1 1 -4 14
4860 14 7 -5 1 14 0 -10 -2 11 -11 -2 -2 -9 -11 -19 -8 -4 -5 -19 -14 -8 -17 -22 1 2 -17 -6 -6 -11 0 7 19 -1 -4 0 6 5 8 -2 10 -9 0 -6 -8
4903hJ3jNj4KRj9LK1rjmJ7j9R%LqRpLq%J2j2J3j6QQrPj3j0J8JpjJ0kk0J8jj3J0
4947cJ3qqJJ9j5jrK3prNPj3j9L1J1j6PJ4qj8J2Lj1%JjlMOr%KmjJ4j7KjKJ4poQ
4992Elj6J2JMj7K5kj3JLLj4PMj%jOoR%k%l%J1k4jK4mj9K3j0mMONj4J1jj3PRmr
5038aOojj0QJ1nOkj1Mjj%rMJKlJ1qKMKKj4J5JlrJ2j0klJ0Lj8J2QKj0J3Nj1Lnj8
5085a4PMLrJMOOQk5J1kjnjJ3j0%j3OJ0klrJ4j9J9jlj0J1J1j4KNlmjMojkJ8Nj5
5130eJ0%j0nNPqQqMMJ2J0k0jJ1j2%qRkNkpLkrK5j8qJ3j0olK6j1Kj1Oj3J0Pj2L
5174a1NQroKK3j5jj3J4Rj6L%OkJ3jpPrjJ2pKnJlNJ1k1RmmJ1koJPnj3J4jJnRj5
5221iJ2%j0J1rOj6MMLkJ6rj1KJ5pj2J0mOjJJK%j1J5qpK1j0MqP%JqQ%pojJ2%p%
$$ plain form
4903 -8 5 4 9 -5 -3 6 -13 -10 11 2 1 -3 14 -5 4 4 7 -1 8 1 4 -4 -4 8 -4 9 -7 1 9 0 7 -6 -16 2 3 -4 -5 5 3 -17 1 0 -13 -3
4947 -3 10 2 -6 -5 14 -1 -2 -11 12 5 -4 1 8 -5 -24 7 18 2 9 23 15 -3 9 12 1 1 2 1 -2 2 8 -1 -1 1 -3 -4 10 -7 -5 -6 -4 10 3 -3 5
4992 5 2 -14 -2 -1 3 -14 11 9 -4 -3 0 3 -11 -4 0 -1 -1 -2 4 -2 7 7 5 5 2 2 13 -11 -12 12 8 -11 12 2 -2 2 8 13 -1 10 9 -4 3 12 8 -1
5038 -1 5 -1 -2 -12 -4 7 2 8 6 -5 -1 -2 -3 -3 -12 -8 -7 -5 -8 3 -5 -3 1 3 5 -9 6 7 4 -5 7 -3 -5 -8 2 5 -13 -1 7 9 -1 12 17 6 9 4 -14
5085 -14 -7 -3 0 -9 -8 -4 2 8 16 -9 2 0 -1 -6 -7 6 -4 -4 -17 -11 -1 -3 -6 -15 -1 -20 -1 -2 -5 -15 -4 7 -7 -5 0 -3 -7 -8 -4 -10 -11 -13 5 10 -5
5130 -5 5 5 -5 -10 -5 2 -6 2 -6 -2 2 14 24 4 3 14 2 2 -6 3 1 6 4 -3 0 -2 -11 14 -4 -12 1 -9 -15 -18 8 -3 -1 -12 -6 -19 -9 -2 -14 -11
5174 -11 -6 2 -7 -13 -11 12 -3 -4 -17 -3 6 -10 -7 -7 -1 -3 10 9 2 9 0 -1 11 4 6 1 2 -1 4 15 -6 3 -1 -5 6 4 -2 -1 6 1 -12 2 1 2 -3 6 -9
5221 -9 3 3 -7 4 -5 1 -15 -11 -7 -4 -6 10 1 -10 -8 7 0 -12 -2 -6 0 -1 0 1 3 3 -8 7 -1 -8 13 3 7 -1 6 6 7 -1 7 7 0 -6 -7 5 5 -2 -2
5268bRpJQj4jO%oJljOKmnJrJ8Mn%Oj9MJ3q%RmlJMopJ1KmJ2qMKj0LljJ0rOpJ2J0
5320A9j9LJ1j0%LJ2l0J1OKj8PJpOjj1J3oM%jJJNj5QRj9KNLqMNPj6J2lLj0R%%k
5366dMJ2j3pRJ2j9KNLkJ3mpPjoj0Q%nqJ9k%Lj0nNKnj6lmL1o%qJ3kmonJ3mnKQj1
5415a1rJ2KKLJjqJ3Pj9PJQJrJ2mjlnJ1qkJ8Nk1NNj0kOj2LJ4o%nkKNj2lJ2j1Nl
5462gNj0kJ7krMOj%oQmRj9RJ7l1J4LQk2J8j4J6pNKkpmPKJj7J5mPrOJLNrj2J9l
5509FrMMj4LrMPlj1PPPj9PMmmJ5j6MJ2j8J0JRKPoo%j%kJ5orK1j2rJ0oJ1jj5mM
5556cPmPNkj2NNrjLLPj7PmLjMPj5O%kkNpJ7j5Rpj1J3knJ1kOj3JQqMoKRk%J3j0
5606Gj0Pj6J1MmJ3rnJ1j5J0J0j0PrJj0KkMJJmJ4j5jjJ2j2%J%JJJkMJ0j2pJOJ3
$$ plain form
5268 -2 7 0 1 9 -5 -6 0 0 -6 -5 -8 -9 -3 -1 -5 -10 -9 -18 0 4 -1 -1 5 -14 -10 3 -5 -5 4 0 -3 -2 2 -4 -11 0 2 -2 10 2 6 8 -2 1 -2 -3 7 -2 4 -3 9 19
5320 19 0 3 14 4 4 7 19 -11 0 6 8 -10 -3 -2 -9 -3 -4 -15 -2 -8 -4 -4 -5 -4 -3 2 -13 -5 4 -15 -13 -8 -5 -13 -9 -4 3 -13 -1 -4 -1 -11 -2 -2 -2 -4
5366 -4 0 12 -1 -8 1 13 -6 -4 1 4 2 15 11 4 11 10 4 -6 2 2 -3 -11 8 6 6 9 -1 -6 -1 1 -4 -20 -23 -27 4 -2 -2 -10 3 1 -3 -9 -14 -1 -5 -10 -8 0 -11
5415 -11 -20 -8 -6 -4 -1 0 -1 -9 4 11 -8 -1 0 8 9 0 12 8 7 4 -1 10 2 0 18 23 2 7 12 2 0 6 -6 -3 11 5 5 0 -2 0 5 -7 -10 2 -9 -4 -7
5462 -7 -2 -12 -14 3 1 -8 -4 2 1 1 -5 3 -1 8 -11 -2 15 -16 -2 1 9 -13 5 -9 7 0 5 7 5 -2 -6 1 3 4 -13 2 -2 5 -4 2 3 6 11 2 -10 9 6
5509 6 -3 1 5 -9 -6 -15 -11 -4 -7 -18 -11 -4 3 -16 -9 -5 -9 -13 2 -14 -10 2 -16 -6 -5 4 6 13 7 1 1 0 0 -2 13 7 -2 19 7 -2 8 2 13 12 -3 -7 -3
5556 -3 4 0 7 12 10 -2 3 8 -1 -2 1 4 11 -6 1 -3 0 -1 3 10 -5 1 1 -1 -3 2 -5 12 -3 6 -1 -12 1 -1 -6 5 3 9 -4 -3 5 -3 1 -5 -3 6 4 4 17 7
5606 7 -3 4 -12 -1 3 -1 12 3 -2 9 -6 4 14 4 11 2 3 -7 -5 -7 -3 -2 -1 -5 9 -6 -7 -8 4 -8 -8 -7 -7 -6 -5 -4 -6 -2 8 -4 -11 -10 -4 9
5650Ilj1PoK2j1KJoNj0LOmKKkp%jJ2j2K2j6oPj1OPj1nQLrJ0KJj1PrLONj7K6j0
5696Fj7lJ3orRmQNrJLjmJ1lRmoKpNJ1j5RlqJJ8j1%%JjrQnJ0JpmKQqnJ2nJ1j2j3
5746a5J4NmJ0j7jmJ2nOp%lNRrJkJOPj5NqOjNKpQr%pK3lMnloKj0LJ0LrpJ1Oj8P
5796djNLojj0J0rjOkPJKmj3RlkLOLokJ%M%oJ6j6%NJ0qRqJMj6J6%mNOj5J0j0J0
5845EqMJ0mnrJ1qJ0j6NJ3qj2mQJ5j1kP%pnLJ6j4qJ2nJ4k0Pj1OJ3nmMLj0RLnJM
5890BQrnJ5mrMQqK%LlnKOj1lJ5Oj3%J4j8j1RLj4PPqJ4%j7J%lMOlPJj1PPpMj1J0
5939aqNM%KnJ3j3KNJKkqKPj0JRrNMOj5J4mj3NKj2J1j0MQmjj2J0j1LJ7j4OkLNj5
5986a3J3qj0NQpJ2poKJ2kj0mPQq%J4qjKpJ4oJ0jooJ4NqQj6Mj5K4lj3J0jpJ0j0
$$ plain form
5650 9 6 -5 2 -4 18 7 9 10 4 9 -1 2 8 4 6 8 6 -1 -1 -2 10 -2 20 4 -2 5 -6 0 7 -4 -9 -1 2 -7 3 5 6 -5 2 -7 -4 2 7 -10 16 6
5696 6 -11 -14 -1 -7 -16 -7 -11 -3 2 -7 -6 -3 -4 -8 3 0 9 5 -1 1 -6 -1 10 -5 4 1 -7 -6 12 1 1 1 2 1 -8 0 -5 5 6 -1 -5 -3 5 -3 -8 4 -1 10 -2 -15
5746 -15 -1 4 0 10 -7 -8 -12 0 -5 1 -6 -6 -9 -4 5 -4 -3 -5 -4 2 9 -6 -1 -9 -3 -4 1 3 -4 4 -5 -5 -12 11 8 12 7 4 -2 0 -10 -7 3 6 -3 -10 1 7 -11 -4
5796 -4 -5 0 3 -3 -4 -14 -4 -13 -14 -8 -10 -3 -2 0 -4 -17 -8 -11 -13 -10 -4 -1 -7 -9 -8 -8 -4 -4 -10 6 -10 -10 -5 5 -3 6 -2 -1 3 -13 3 3 -1 4 10 -5 5 -5 5
5845 5 -3 1 11 7 2 -7 4 -4 6 -10 -5 8 0 -12 -16 -8 7 -4 -6 1 1 -6 -11 -8 8 -6 -14 -2 -7 7 -13 -6 -17 -11 2 -3 -7 -3 0 -10 -1 2 -3 -2 2
5890 2 10 1 -4 11 7 -2 2 10 2 4 4 7 4 -1 1 7 -4 -7 8 14 1 1 15 -3 -14 -5 -2 -16 -9 -2 -10 4 4 -13 -12 -12 -15 -11 -5 -8 -1 0 -11 -4 3 -4 0 -11 -1
5939 -1 -9 -4 0 0 2 -3 10 -3 -1 4 5 7 5 -3 -1 6 -4 -3 6 -3 2 6 12 -3 11 7 -6 -1 1 -11 0 -10 -6 2 -2 -3 -15 -5 -16 -13 4 -10 -4 -6 -3 2 -13
5986 -13 0 -8 -18 -13 -5 -12 0 -7 -13 -11 1 -1 -11 -15 -8 0 -8 -8 6 -2 -3 -1 -8 6 0 10 9 3 -3 11 16 8 16 0 4 -11 13 10 -3 7 6 -1 9 -1
6030aNlQoNmllnPlJllkJ2j1jJ0orJ3mj4K5Lj9LKoKPkOrkKQLj3L0j6JnOj0JKpJ1
6080CPlj5NJ3j1kJ7j3mJ3j6Pjm%pkoK3nj2LnPk0K2ooLJ0j2KQlo%OPqJPJKNkQq
6128CkloQMmLRqLLkj1MNj4ROkJ%mkjolqMJ3qRJnmRmoKj0J1Plj2K0nj2J7j3J0j9
6178a6J2J4k4J3oJ1Oj9J3OrjOkj2J6pPj0QmljlMlk%mMQj2Rj8RLKKLpQlJoJknl
6226a6J1NkmqJ6l%%oJ7j5pjJ4k%J7j4MMlMpj2K4krJMlj0J6mj9J5PqJ3j2%kl%Q
6271HqomJkj1J5Mj3N%NonK3j5RrnoK0j4PPnjnJ3k%Qmj5QRNnrNJPj4LJ0rK0j8j1
6319iKlOr%NM%LNNj8j5OJ4rK1pqmPMrmj5J8%PJ3k4JJ1LmMlpPmJ1j2OKPj3kJ7q
6367Bj4J7J1pjkNqNrQjj0J3j7J2L%mMqk3QQJ9k0KJOj0PllRJj1mJ5pKKnJ6j2jJ
$$ plain form
6030 -1 4 1 9 3 8 4 1 -2 -7 0 -3 -2 -5 -8 -10 2 -9 -10 0 -6 -15 -2 -6 -20 5 8 -11 -8 -6 -12 -10 -3 -5 1 -8 -10 -8 0 3 -10 20 4 5 0 6 -4 -3 -1 -8 3
6080 3 10 7 -8 -3 10 -1 -3 14 1 -3 10 -6 1 0 -4 -4 -11 -13 -19 4 -1 -13 -10 -15 -8 -28 -6 -12 -18 -15 -5 -17 -15 -7 -10 -16 -16 -10 -3 -11 -10 -3 -2 0 5 3 11 3
6128 3 1 -2 -8 0 4 0 3 12 4 7 10 8 -3 1 6 -8 1 7 5 6 6 2 0 -1 -7 -10 -18 -14 -1 -9 0 1 -4 -8 1 -3 -9 -7 -17 -6 1 -2 -14 6 1 -11 6 -7 3 -16
6178 -16 -4 10 -14 -1 -7 4 10 -9 4 10 1 0 6 4 -8 8 1 8 -2 6 2 -1 -2 -5 -1 -4 -6 -6 -10 -6 2 -10 -1 -19 -10 -7 -5 -3 0 -7 1 -2 -1 -7 -6 -8 -13 -16
6226 -16 -5 0 -2 -6 -14 2 -1 -1 -1 -7 10 -5 -12 -13 1 -1 -1 16 2 6 10 7 11 4 -8 16 14 5 6 10 7 -3 13 9 -10 5 12 4 17 5 5 3 0 0 8
6271 8 0 -6 -10 -9 -11 -22 -7 -3 -16 -11 -11 -6 -12 -17 6 -9 0 -9 -14 -20 0 -14 -7 0 -5 -6 -11 2 0 0 8 4 -11 -3 6 11 6 -3 2 3 10 -4 -1 9 0 20 2 -9
6319 -9 -7 -10 -4 -13 -13 -8 -4 -4 -1 4 9 -9 -24 -18 -4 -13 8 1 -7 -11 -4 0 -9 -13 -28 -10 -10 -3 10 -14 -13 -2 1 -3 1 -2 -9 -2 -6 5 -7 -1 1 8 -5 -7 10 2
6367 2 -12 5 16 9 8 6 11 3 8 -1 7 6 -4 9 -8 4 7 7 3 7 -1 -24 -16 -8 11 -9 -7 -6 0 -10 -3 -6 -9 0 1 -10 -14 1 -6 -4 -2 -7 9 -3 -4 -3
6413cLrRKKJ6j0J0j2qORj7MKjoJ5nj0LPKRj6J1j5LlQj7nJ5J2j5qK7qrj2PLmlJ3
6458Bj7PnJ2Oqj1J0rJJ0J3qj0LMKJj0PJ2%oPoj3NJ1%j4nJ1opPnJ2%Pj9J7j1LN
6502ErmkkNOPj8J5klj1J3rJ1qJ2j0rRNoLlJ2Kq%NLkrQj0MRjj0J2JJq%KRk2J1r
6550eJ0Lj1MNo%kj2J2J0jmmLJj5J0qJ0moOjlKMnNPlj1J5%j3rJ9j1pQPnMjJJ3j0
6597BNPqKj0Rj5OJ1Jj2J7rj6J2PmMmKpRj0nLnkJ4kKnpoJ0llMMj1J4mMr%lKJNm
6646gKMJ5j0NJmRk2J2%jkNRqj5J6J0j9KNJj3J2j0%J6j3JmjqNQlMj8MNRrjMOj9
6692a7J4jj4PJ0MpMkoRmKLj2J8lpmPQkmJ4Jj8RKj1J0kjoK3k3mJ6pj3J1mljLJ1
6737A0k4OoJ6loKQnJ0mopJJ9j4lPjj0jJ6j0lJ2L%jmLJ0j6J1koPLlj1QJ0j8J4r
$$ plain form
6413 -3 0 -9 0 2 4 20 10 20 8 0 6 15 -2 2 4 3 -3 12 7 -3 0 7 9 18 2 13 -2 1 -2 6 -11 -16 -1 11 -4 -12 15 7 -2 -14 -7 -4 -8 -11 2
6458 2 -15 -8 -13 -1 5 -3 -14 -4 -13 -12 -2 11 3 -7 -4 0 2 3 -7 0 12 12 6 13 7 -6 -1 10 10 -4 -9 2 -4 -11 -4 -9 3 3 10 -9 8 -3 0 5
6502 5 -4 -8 -10 -12 -7 -1 6 -12 3 1 -2 -13 0 -9 2 -6 6 -4 -13 -4 1 -5 -2 -5 7 9 1 1 6 9 7 -2 6 -4 0 9 8 -2 10 11 12 4 4 6 15 -7 4 -5
6550 -5 5 8 -3 1 6 0 0 -2 -14 -2 8 7 3 -1 2 3 -12 -2 -10 0 -4 -10 -4 -5 -8 -6 -2 -7 -2 5 2 -9 6 6 -7 -16 3 -8 -15 -7 0 -5 -1 -2 -1 12 2
6597 2 7 14 6 8 -2 7 -8 -2 9 10 -2 15 6 -10 2 9 5 9 5 7 0 9 -1 -6 -3 -8 -10 4 2 4 -1 -8 -14 -4 -7 -10 -6 -2 -13 1 -3 1 -8 -8 -11 -9 -8 -3 -7
6646 -7 -5 -1 14 4 9 10 6 15 -7 5 5 4 2 7 16 8 -7 9 19 0 2 7 8 -5 7 -3 -3 13 0 1 -3 -4 -12 -7 1 -2 2 -16 -12 -7 2 -7 -8 -4 2 -17
6692 -17 -3 -4 -18 -11 -1 3 -4 0 -2 -8 1 -3 -1 2 -10 8 5 -2 -6 1 9 7 3 17 18 0 9 11 0 10 8 7 1 24 1 -3 13 6 -7 4 0 -3 -4 -1 10
6737 10 -14 -8 -14 2 -1 -7 -5 3 -2 8 4 -2 -9 -8 11 -3 -6 1 0 -10 -11 5 -5 -8 4 7 7 6 2 5 15 -1 10 8 2 9 12 9 -2 6 16 -2 12 3
6781CmLlLqJ6j1KQOj3nmj3J2J0j2K0j8jKkmlJ%lJ7krQJOj6NkPlkMmnKRK%MlkJ0
6831IpLMoLPpPpkjkoJ3npRqJ4j3J0%lmmLrMnLQk4J8kl%JJ3pqJ0q%PJm%kKJ6j3
6882brJ0J5pj5POkRj3NLnjjJLKMok0K2kollJ1j6J8okj1M%JNj4J8j1PnkO%Qj1J0
6929BmNk5J9jlRlJ0j5RnRnQoMljJ6j0j2J7pkj0J2qjNOj3J6Mk0Pj2J2%Jj0mJ3J
6973EnkpJ7nj3mQJ3l2J7J2j1mQllNlNjOk1OJPPj2RP%j2PJ9rj8J5J5k3lOJ4j9Q
7017GMmpoJ1oJ%OJojnoLkJ4j8PN%oJ1j3pK3j5J1k1J3jJNJ2j8MkLLOj0pK2j8J9
7062A3j5rJ5Rk0J0JMLqQj2KK%lkJ1Jnnmj2JJ3noNLKrpJ2MnJ4j3j1PJJ5j9J2jM
7107Aj6QLLnRoMmKK%NkPojJ3mj5J6%j6QjrNJ0oj0QklOj6PJ1jj1RmLkJoJ5%j0k
$$ plain form
6781 3 -1 2 -1 2 -6 10 -1 1 9 15 2 -3 -7 -20 -8 2 -10 10 -8 -9 -7 -9 -13 -16 -15 -15 -18 -1 -3 -12 -4 -3 3 -13 -8 -10 -3 -6 -8 -4 -8 -13 -11 -2 0 0 4 1 -1 9
6831 9 2 5 9 3 6 13 6 13 6 4 3 1 -5 8 3 -4 5 -3 11 -2 8 8 5 1 -3 0 -9 -5 -10 -7 1 -23 -5 -7 -10 -10 -9 4 -3 -11 -1 -9 -9 -2 -1 -5 -5 -7 -5 11 -2
6882 -2 -11 -1 14 7 -8 -1 5 3 12 -1 4 7 2 1 0 1 4 6 10 4 -16 6 4 -2 -5 -8 3 -13 5 -1 -3 -14 -10 -10 -9 -4 -18 0 -11 -4 -9 -11 -5 -5 3 -8 2
6929 2 -2 3 -22 -3 -4 -7 2 -1 9 -6 3 -2 7 2 10 4 8 5 4 20 10 -2 15 8 6 -4 8 0 -1 4 10 -3 13 17 -3 4 -8 4 4 5 -5 -9 4 5
6973 5 0 -2 -9 8 3 -10 -14 -6 7 -25 -8 4 -7 -11 -3 -6 -9 -4 -7 -2 -3 3 -18 -12 -11 -4 3 -9 0 7 7 -5 2 21 12 -6 9 24 1 -2 4 18 -1 7
7017 7 11 7 0 -6 5 -1 0 0 6 7 1 0 -5 -11 -8 -10 4 -14 -7 -2 -2 -8 3 -10 -17 6 -9 2 -19 -6 -7 -6 -1 11 -7 -3 -5 -2 1 7 -3 -10 12 -6 13
7062 13 -2 -11 4 13 -7 3 4 8 11 3 11 -1 1 3 3 0 -2 9 10 5 0 -4 -16 -15 -2 -7 -13 -8 -5 -3 -12 -19 -7 -3 -8 6 -7 -18 -11 -10 5 -14 -2 -3 1
7107 1 -15 -7 -4 -1 -6 3 -3 1 -3 -1 1 1 6 4 11 5 4 17 13 -2 14 14 -2 6 5 -4 1 11 5 -5 3 1 -2 4 -12 -5 6 5 -6 3 -1 2 0 1 -5 10 10 0 -2
7156bLkj0J5j5OLj1K0j3JMj0J5j5J3oJ%QjQKj3LpJ3%RrJrM%KKmnJpnJ3LMrjqL
7204eOnOmj5J8k3PPJ1KqNj1J6Kj3JpJ4Kj2jNJ5j0qMPlJ5k0Mjj%qQLJOpOlJj0J2
7251IjJnqRj0PpkJ4ljmm%Mj1MNmMj1Q%mmMNOj0JJ1qMjKmPLmpPj2MJ8qkJOjj1R
7303Fj3J4JKLOk0klJ0Mj2Rj0nMPj3QNk%Kj0J5j4KQlkQJnK%rlJ1nM%Op%P%mKJJ
7353GPpkmpJ0j4K2k1J9j2KQmJ1j3NKQk0J1j3JJ6m%j9J0NKoj6J9rj9J4QjrJ0jj5
7395a9QJ1kj0J7Jj3NlL%NOj4NNOj7jPJKpKMMjMj7RJ5j5%%pJ5rKrPnJ0jj2j3K1
7441@jmMJlNnjqKJ1j0M%jPJ6j8J0JMj2KmKlOOkJNj1%KPj4QJljRoKoLLJ1j6nJ1
7491A0rOkj2kJ3j2NLnLlklRPJj0NoQj1mJ0Qj2lQMqKJ4Rj0KokoPMj4J6j3RJpNK
$$ plain form
7156 -2 1 -1 -11 4 -11 -5 -2 -13 7 -6 -5 -1 -11 4 -11 2 -4 -3 -3 5 4 12 14 1 4 -3 10 10 19 10 11 2 6 6 8 10 6 1 2 -5 -10 3 6 10 1 0 -8 -5
7204 -5 1 -4 2 -2 -17 1 -22 -15 -8 3 5 -3 2 -9 7 9 -4 -3 -10 4 6 -6 -7 -2 13 3 -5 -1 6 3 18 -2 2 1 0 0 -8 0 3 4 10 3 9 6 7 -3 9
7251 9 8 9 4 -4 5 -5 2 -5 -7 7 4 3 -1 -5 -5 -1 -12 -8 -3 -7 -3 -14 -6 -6 -10 -14 -10 -5 1 -9 -8 3 -5 -1 -2 0 -4 3 6 2 -5 2 -10 -6 12 4 2 3 9 8 -3 6
7303 6 -7 7 8 10 13 19 -1 -3 -6 4 8 -4 5 -5 -10 -6 1 -12 -4 1 -1 -1 1 -9 6 -8 -6 2 -1 -3 5 6 1 3 3 -6 -9 2 -3 1 1 7 0 0 7 7 3 5 6 7
7353 7 14 7 5 1 -6 4 -10 12 -9 10 -2 0 8 4 15 2 7 9 17 -3 8 -5 -4 12 8 8 -11 -1 4 6 0 -16 3 -6 -25 -11 -3 -4 -13 -3 -4 -19
7395 -19 -11 0 -2 -12 5 6 -7 -2 -5 -2 -2 3 9 -5 0 5 11 -6 -7 0 1 3 -4 -2 2 6 5 9 -8 1 16 1 1 1 -6 9 0 2 -7 0 -5 5 4 -8 -21 0
7441 0 -1 -5 -1 0 -3 2 -3 -4 -12 -10 1 -9 -5 -5 -6 1 17 -1 9 10 14 2 4 0 2 -1 5 11 9 10 15 4 4 6 13 -1 7 8 5 4 13 7 9 3 6 9 20 4 -1 10
7491 10 1 7 5 -7 -9 4 -8 -3 0 -5 -2 -5 -7 -10 -1 6 7 -3 2 -4 4 -7 -11 -1 7 -5 -8 0 4 -4 -2 12 21 11 13 7 5 -1 6 10 -4 12 -1 8 9 2 7 9
7539IKnqJ6mppJ2qQJkj%qJ5k5LRmJ1j1MkrMqJ7jkj2K2k0J0kONmJljj1J7LnMnK
7587FjqJ2jKj0J3pjoK0k6J7omjLjjPJj4lJ0pNj3J0pJJ3j4KPlMj4J1mkN%Rk0PO
7633cPj4kK0rj2K2Oj1%jOpJ5j6J2j5J0Pj7QJ%qKJ0okpJ1jj0J3j2mJ6r%pK1rqj0
7676a3J2jrOMloJ3rkqOOJkNojMj4K6j3MOj2%LJNRmj0LoJ1oLJ2kmOmmlMkpK%kK
7727AKPk2J8%pJ0j7NOqJ1j1j1J0%LolJ3lrJ1rJ3pqPMRpJ4pKJjj3%KJ3mk%kNRl
7774A6j7J1Kk5K3Pj3Qj8jLPjlNj9J6Lj2J1%j4J6KJrj1R%jQ%qMLJj5RP%j0J3Lj5
7818dlNJjJ8pj1KjJ6mnplJ4KQkj5nRLqkMo%oJ7j4LJmJmmnJ0PrPJokJ3qJ0j5O%
7868cJ3opKLlRNop%lRJKl%Mq%LKk%PRj5nkNlLlNnl%Mj3J4qj1RKkLLJ0j3lJ0o%
$$ plain form
7539 9 11 6 -2 14 10 3 -4 8 0 8 9 7 6 6 -2 13 -12 -9 0 -4 7 -4 0 -2 -11 -7 -15 2 1 -1 -13 9 -11 -1 -3 3 8 4 5 2 1 -10 7 10 5 9 4 6
7587 6 5 -3 9 8 10 0 13 6 5 -1 19 -7 10 4 0 -1 2 1 0 7 8 -6 -9 1 -6 -1 -14 -4 -11 -10 3 -11 -9 -2 -5 -1 -15 -4 -8 -10 -5 -5 4 -16 -9 -3
7633 -3 4 -10 -12 8 -1 -13 9 15 4 4 3 9 2 17 1 13 -2 8 15 -2 6 7 7 -1 1 11 5 3 -4 7 6 -4 9 -3 -7 9 0 0 -7 14 5 -3 -13
7676 -13 -1 -2 -11 -5 -1 -4 -10 3 -6 -8 -16 -10 -4 -3 -5 0 -6 -7 -3 -17 9 -4 0 6 -6 -6 -3 -2 3 12 8 -2 1 -5 6 0 3 15 13 9 15 11 7 4 8 6 -1 1 1 -1 1
7727 1 3 10 -12 6 6 -1 9 -8 -3 3 -5 6 -5 -16 -6 -6 -3 -9 -12 1 -2 -11 0 -9 4 -3 -11 -4 0 9 2 16 9 11 12 11 -2 -2 0 13 9 7 7 5 10 19 16
7774 16 -1 10 12 -13 10 17 4 12 -6 -7 -4 3 2 -1 4 -15 1 4 -8 3 3 -11 5 7 8 -1 -12 -3 -3 -4 4 4 -4 0 3 4 -11 -2 5 5 -5 8 11 -4
7818 -4 -7 -2 -1 -2 16 9 -2 0 -1 15 11 6 -1 -4 10 12 20 18 3 -2 7 10 2 0 4 -2 -2 -8 9 -5 -2 -1 -5 -4 -8 -12 -17 -7 0 -9 -2 -1 -7 -9 4 -4 6 -9 -3 -3
7868 -3 10 4 -3 -1 2 -1 8 13 7 0 0 -3 6 7 9 6 6 10 2 2 5 7 5 5 12 21 6 1 -1 4 1 4 1 6 1 -2 -2 2 -11 3 -5 -16 -7 -5 -7 -4 -1 9 -4 -7 3 -3 -3
7921cKMRj7Pj0OpLJ6j9J1J1jj1J9k2Q%qJ7j1kOJ5j1j4J9j3RmLnlMklJ3k0J0qJ1
7963IOj4JJQj2mKMnJ0rkLoKlLj0J1QrKl%J0rJ2q%kJJ0oQPnnlNNj7J2NlJ%k3J4
8012BNNkmnoQq%PQpmJ5omNj3KJpJ3rL%jnkLMj3J0KJ4Lj7J1JkPj1Mj4J2PkoJ3j
8061A6Mj2PjjrL%kJ6k1MLMrLRojpJ2k5RJ0qnJ3j9NJ5j6J4j6ON%oPj6J4nPpR%J
$$ plain form
7921 -3 -1 3 12 -5 2 -8 -2 -9 -6 10 -9 2 13 12 1 20 -2 6 6 -2 15 4 2 8 23 12 -2 17 4 13 9 12 7 4 8 6 3 16 -4 6 -2 9
7963 9 15 1 2 3 11 -1 -5 -3 1 -4 6 -3 -5 -2 -8 -6 -9 -6 -16 -5 3 -6 -4 -7 -7 3 -6 6 -2 -2 -4 -3 7 1 9 16 11 6 3 8 13 -4 8 13 10 11 11 -12 2
8012 2 7 12 10 6 1 -5 3 -5 -5 2 10 3 -1 14 8 4 9 -4 -2 -1 -8 5 -4 -1 -1 -2 -7 -9 -6 -2 -15 -5 -3 11 14 -3 8 9 7 14 3 7 -7 5 12 10 4 17 16
8061 16 20 8 15 14 13 4 7 7 5 21 0 4 7 11 2 5 14 8 7 0 12 -13 -4 6 -2 -7 6 -13 -8 7 -9 5 -11 -5 0 0 -6 1 -15 -1 -6 1 -6 3 3 4
$$ [...]
8191A3
##END NTUPLES=NMR FID
##END=
