##TITLE=1H_EC-2760(1)
 CDCl3, 8 sc, 
 16.9.2019
##JCAMPDX= 6.0         $$ Bruker NMR JCAMP-DX V2.0
##DATA TYPE= NMR FID
##DATA CLASS= NTUPLES
##ORIGIN= UXNMR, Bruker Analytische Messtechnik GmbH
##OWNER= root
$$ XWIN-NMR		Version 3.5
$$ Mon Sep 16 14:11:12 2019 Russian Standard Time (UT+4h)  she@DPX200
##.OBSERVE FREQUENCY= 200.13155
##.OBSERVE NUCLEUS= ^1H
##.DELAY= (6, 6)
##.ACQUISITION MODE= SIMULTANEOUS
##.ACQUISITION SCHEME= undefined
##.AVERAGES= 8
##.DIGITISER RES= 18
##SPECTROMETER/DATA SYSTEM= spect
##.PULSE SEQUENCE= zg30
##.SOLVENT NAME= CDCl3
##.SHIFT REFERENCE= (INTERNAL, CDCl3, 0, 15.7039)
##AUDIT TRAIL= $$ (NUMBER, WHEN, WHO, WHERE, WHAT)
$$ ##TITLE= Audit trail, XWIN-NMR		Version 3.5
$$ ##JCAMPDX= 5.01
$$ ##ORIGIN= Bruker BioSpin GmbH
$$ ##OWNER= she
$$ F:/spectra/data/she/nmr/H-F/1/audita.txt
$$ ##AUDIT TRAIL=  $$ (NUMBER, WHEN, WHO, WHERE, WHAT)
(   1,<2019-09-16 14:10:04.39 +0400>,<she>,<DPX200>,
      <created by zg, POWCHK disabled, PULCHK disabled
       configuration hash MD5:
       00 E9 B6 7A A2 85 ED C7 34 08 36 98 17 FE 4E 26
       data hash MD5: 16K
       5A 42 60 1B 20 40 4B 17 54 2A 33 7D F2 32 32 1E>)
$$ ##END=
$$ 
$$ hash MD5
$$ 3A C7 A8 68 40 45 F8 45 EB 38 C3 E1 7C CB 6D 95
##$RELAX= 
##$RELAX= 
##$RELAX= 
##$RELAX= 
##$RELAX= 
##$RELAX= 
$$ Bruker specific parameters
$$ --------------------------
##$DU= <F:/spectra>
##$EXPNO= 1
##$NAME= <H-F>
##$PROCNO= 1
##$TYPE= <nmr>
##$USER= <she>
##$AMP= (0..31)
100 100 100 100 100 100 100 100 100 100 100 100 100 100 100 100 100 100 
100 100 100 100 100 100 100 100 100 100 100 100 100 100 
##$AQSEQ= 0
##$AQ_mod= 1
##$AUNM= <au_zg>
##$AUTOPOS= <>
##$BF1= 200.13
##$BF2= 200.13
##$BF3= 200.13
##$BF4= 200.13
##$BF5= 200.13
##$BF6= 200.13
##$BF7= 200.13
##$BF8= 200.13
##$BYTORDA= 1
##$CFDGTYP= 0
##$CFRGTYP= 5
##$CHEMSTR= <none>
##$CNST= (0..31)
1 1 145 1 1 1 1 1 1 1 1 1 1 1 1 1 1 1 1 1 1 1 1 1 1 1 1 1 1 1 1 1 
##$CPDPRG= <>
##$CPDPRG1= <>
##$CPDPRG2= <>
##$CPDPRG3= <>
##$CPDPRG4= <mlev>
##$CPDPRG5= <mlev>
##$CPDPRG6= <mlev>
##$CPDPRG7= <mlev>
##$CPDPRG8= <mlev>
##$CPDPRGB= <>
##$CPDPRGT= <>
##$D= (0..31)
0 1.2 0 0 0 0 0 0 0 0 0 0.03 0 0 0 0 0 0 0 0 0 0 0 0 0 0 0 0 0 0 0 0 
##$DATE= 1568628603
##$DBL= (0..7)
120 120 120 120 120 120 120 120 
##$DBP= (0..7)
150 150 150 150 150 150 150 150 
##$DBP07= 0
##$DBPNAM0= <>
##$DBPNAM1= <>
##$DBPNAM2= <>
##$DBPNAM3= <>
##$DBPNAM4= <>
##$DBPNAM5= <>
##$DBPNAM6= <>
##$DBPNAM7= <>
##$DBPOAL= (0..7)
0.5 0.5 0.5 0.5 0.5 0.5 0.5 0.5 
##$DBPOFFS= (0..7)
0 0 0 0 0 0 0 0 
##$DE= 6
##$DECBNUC= <off>
##$DECIM= 24
##$DECNUC= <off>
##$DECSTAT= 4
##$DIGMOD= 1
##$DIGTYP= 9
##$DL= (0..7)
0 120 120 120 120 120 120 120 
##$DP= (0..7)
150 150 150 150 150 150 150 150 
##$DP07= 0
##$DPNAME0= <>
##$DPNAME1= <>
##$DPNAME2= <>
##$DPNAME3= <>
##$DPNAME4= <>
##$DPNAME5= <>
##$DPNAME6= <>
##$DPNAME7= <>
##$DPOAL= (0..7)
0.5 0.5 0.5 0.5 0.5 0.5 0.5 0.5 
##$DPOFFS= (0..7)
0 0 0 0 0 0 0 0 
##$DQDMODE= 0
##$DR= 18
##$DS= 0
##$DSLIST= <SSSSSSSSSSSSSSS>
##$DSPFIRM= 0
$$ [...]
##$SUBNAM2= <"">
##$SUBNAM3= <"">
##$SUBNAM4= <"">
##$SUBNAM5= <"">
##$SUBNAM6= <"">
##$SUBNAM7= <"">
##$SUBNAM8= <"">
##$SUBNAM9= <"">
##$SW= 24.9336996594482
##$SWIBOX= (0..15)
0 0 2 0 0 0 0 0 0 0 0 0 0 0 0 0 
##$SW_h= 4990.01996007984
##$TD= 16384
##$TD0= 1
##$TE= 0
##$TE2= 300
##$TE3= 300
##$TEG= 300
##$TL= (0..7)
0 120 120 120 120 120 120 120 
##$TP= (0..7)
150 150 150 150 150 150 150 150 
##$TP07= 0
##$TPNAME0= <>
##$TPNAME1= <>
##$TPNAME2= <>
##$TPNAME3= <>
##$TPNAME4= <>
##$TPNAME5= <>
##$TPNAME6= <>
##$TPNAME7= <>
##$TPOAL= (0..7)
0.5 0.5 0.5 0.5 0.5 0.5 0.5 0.5 
##$TPOFFS= (0..7)
0 0 0 0 0 0 0 0 
##$TUNHIN= 0
##$TUNHOUT= 0
##$TUNXOUT= 0
##$USERA1= <user>
##$USERA2= <user>
##$USERA3= <user>
##$USERA4= <user>
##$USERA5= <user>
##$V9= 5
##$VALIST= <valist>
##$VCLIST= <CCCCCCCCCCCCCCC>
##$VD= 0
##$VDLIST= <DDDDDDDDDDDDDDD>
##$VPLIST= <PPPPPPPPPPPPPPP>
##$VTLIST= <TTTTTTTTTTTTTTT>
##$WBST= 1024
##$WBSW= 4
##$XGAIN= (0..3)
0 0 0 0 
##$XL= 0
##$YL= 0
##$YMAX_a= 444500
##$YMIN_a= -371300
##$ZGOPTNS= <>
##$ZL1= 120
##$ZL2= 120
##$ZL3= 120
##$ZL4= 120
##$ABSF1= 10
##$ABSF2= 0
##$ABSG= 5
##$ABSL= 3
##$ALPHA= 0
##$AQORDER= 0
##$ASSFAC= 0
##$ASSFACI= 0
##$ASSFACX= 0
##$ASSWID= 0
##$AUNMP= <proc_1d>
##$AZFE= 0.1
##$AZFW= 0.1
##$BCFW= 1
##$BC_mod= 2
##$BYTORDP= 1
##$COROFFS= 0
##$CY= 11.3945322036743
##$DATMOD= 1
##$DC= 2
##$DFILT= <>
##$DTYPP= 0
##$F1P= 20.1720416913024
##$F2P= 0.152960286110954
##$FCOR= 0.5
##$FTSIZE= 0
##$FT_mod= 4
##$GAMMA= 1
##$GB= 0.15
##$INTBC= 1
##$INTSCL= 1
##$ISEN= 128
##$LB= 0.24
##$LEV0= 0
##$LPBIN= 0
##$MAXI= 10000
##$MC2= 0
##$MEAN= 0
##$ME_mod= 0
##$MI= 1.114404
##$NCOEF= 0
##$NC_proc= 0
##$NLEV= 6
##$NOISF1= 3.799351
##$NOISF2= 2.8
##$NSP= 1
##$NTH_PI= 0
##$NZP= 0
##$OFFSET= 15.70392
##$PC= 1
##$PHC0= -9380.388
##$PHC1= 24.20096
##$PH_mod= 1
##$PKNL= yes
##$PPARMOD= 0
##$PSCAL= 0
##$PSIGN= 0
##$REVERSE= no
##$SF= 200.130013532006
##$SI= 16384
##$SIGF1= 3
##$SIGF2= 2
##$SINO= 400
##$SIOLD= 16384
##$SREGLST= <1H.CDCl3>
##$SSB= 0
##$STSI= 0
##$STSR= 0
##$SW_p= 3612.71676300578
##$SYMM= 0
##$S_DEV= 0
##$TDeff= 0
##$TDoff= 0
##$TI= <>
##$TILT= no
##$TM1= 0
##$TM2= 0
##$TOPLEV= 0
##$USERP1= <user>
##$USERP2= <user>
##$USERP3= <user>
##$USERP4= <user>
##$USERP5= <user>
##$WDW= 1
##$XDIM= 8192
##$YMAX_p= 0
##$YMIN_p= 0
$$ End of Bruker specific parameters
$$ ---------------------------------
##NTUPLES= NMR FID
##VAR_NAME=  TIME,          FID/REAL,        FID/IMAG
##SYMBOL=    X,             R,               I
##VAR_TYPE=  INDEPENDENT,   DEPENDENT,       DEPENDENT
##VAR_FORM=  AFFN,          ASDF,            ASDF
##VAR_DIM=   8192,          8192,            8192
##UNITS=     SECONDS,       ARBITRARY UNITS, ARBITRARY UNITS
##FACTOR=    0.0002004,     1,               1
##FIRST=     0,             0,               0
##LAST=      1.6414764,     0,               0
##MIN=       0,             -371300,         0
##MAX=       1.6414764,     444500,          0
$$ Real data points
##PAGE= N=1
##DATA TABLE= (X++(R..R)), XYDATA
0@%%%%qJ6j6J6k4M0m8N6p2Q9j07J30j61J94k29K69l14L70m34M99n72O58p52Q56
28D56r72J100j242J396j566J754j958K184k433K703l000L327l689M084m517N003
44B630n544O144o820P588q467R482j0668J2080j3797J5937j8680K2345k7536L5494
58B0188m9340Q0087k57811J14661N22455n02740k84349M74733K54296n09580j14402
69b51802M38902L3286m27244N4485L31559r9392k62224J58708J68446j65348r7526
80a18150J68710K1518j20068M0173O8659j06667j0949J26590m9183j25774J24476
91A9335J07880j71776o3662K16132J274k50321M3471K46119j02236k18755J67090
102e449J90829k16253j47332K48696R0337k71292k9151K74215l6506k59061J05393
$$ plain form
0 0 0 0 0 0 -8 8 -8 8 -16 24 -24 32 -40 49 -58 72 -89 105 -124 145 -169 201 -233 266 -306 352 -400 456
28 456 -516 584 -658 738 -828 926 -1032 1152 -1281 1422 -1578 1749 -1940 2144 -2373 2630
44 2630 -2914 3230 -3590 3998 -4469 5013 -5655 6425 -7372 8565 -10115 12230 -15306 20188
58 20188 -29152 50935 -206876 -92215 430240 -72500 -356849 117884 372180 -137400 -251802
69 -251802 187100 220386 -206858 -152373 179186 79794 -182430 -23722 144724 -20624 -118150
80 -118150 50560 72078 -47990 -7817 60842 -45825 -56774 69816 20633 -105141 19335
91 19335 127215 -44561 -108223 107909 109183 -141138 -97667 148452 46216 -172539 -5449
102 -5449 185380 -30873 -178205 70491 160828 -110464 -139615 134600 98094 -160967 -55574
113e5574K36180j58025j95580J93271J37953k12384p0697K15013Q7k08402N4064
124f4094J78690j00232j34472J38865Q8318j59083l3292J72266j6624j72647N8489
135d3816J54365r7220j22257J32763Q5040j58867m8189J64504N897j55892L4377
146d9295J34839o6345j00216R3846O7074j03361l1365R7437p188q4414L9684O0758
158E1454p1225l9611Q9295J2889r4514K4128R8947n6560r1293Q8759P4603j17644
170c0772n3864J31168J8372j39456K0625J39741n5943j28351Q8067J11123j08915
181h205q1721J27084N1549j39492k4553J40465m709j38331K7055J25255m8454
192B5943j03563P1431Q3274q3321n7345Q7220K9379q2663l395O7420k1918m9804
$$ plain form
113 -55574 180606 22581 -172999 20272 158225 -54159 -124856 90157 90244 -118158 -64094
124 -64094 114596 14364 -120108 18757 107075 -52008 -85300 86966 70342 -102305 -43816
135 -43816 110549 13329 -108928 23835 108875 -49992 -98181 66323 72220 -83672 -49295
146 -49295 85544 19199 -81017 12829 79903 -23458 -54823 42614 35426 -48988 -9304 51454
158 51454 -19771 -59382 29913 42802 -51712 -27584 71363 14803 -76490 12269 86872 -30772
170 -30772 -84636 46532 64904 -74552 -53927 85814 29871 -98480 -10413 100710 -8205
181 -8205 -89926 37158 88707 -50785 -75338 65127 60418 -77913 -50858 74397 25943
192 25943 -77620 -6189 77085 -6236 -63581 23639 53018 -29645 -33040 34380 12462 -37342
204c7342L8510K9702m4282o135M3494j5962l6288L5373K5533n1511j4043O0379
216B7428j152o4041K0360O5702l9138o2082N6655N2518p1887l7680Q0341J5464
228D2488q5479Q530Q4997k9772p6427M8277O2660o1692m5764O9904K7255p4409
240b9432r984P5507l640p0696J7118O1569l1186n1747M1746L8308m7844k0863
252c1144N1917N276m7236J2368L7911k9452k8651L7293J3937m1753K62M2014j1503
265A1239l6315K3711L1960l0717k5874L4012J5971l8874q725L8671j816l6822
277b3579J3809L5494j9949k5169K7997J2710l4830l236L2178j1503l0501K1693
289d886K6195k5240j5261L2042R686l3154m910L0892j547l0625M415K6750q487
$$ plain form
204 -37342 1168 30870 -13412 -19547 23947 7985 -28303 7070 32603 -18908 -32951 27428
216 27428 26276 -37765 -17405 48297 9159 -52923 3732 56250 -15637 -53317 27024 42488
228 42488 -42991 -34461 50536 20764 -55663 -7386 55274 -6418 -52182 17722 44977 -29432
240 -29432 -39416 36091 32451 -38245 -21127 40442 9256 -42491 -745 37563 -10281 -31144
252 -31144 20773 26049 -21187 -8819 29092 -360 -29011 8282 22219 -19534 -19272 22742 11239
265 11239 -25076 -1365 30595 -122 -25996 8016 23987 -14887 -23612 15059 13243 -23579
277 -23579 -9770 25724 5775 -19394 8603 21313 -13517 -16753 15425 3922 -26579 -4886
289 -4886 21309 -3931 -19192 12850 22536 -10618 -15528 15364 13817 -16808 -12393 14357 5870
302E870k2458J3357J8219j5527j1496J6160K704j5681M527J1623j0509m487J6798
315I100J314j4758O488J3332j2287j3783J0361O658j4094o244J3650N884j0641
328e020j070J3251O96j2005K472J0679o325q385Q790L138j1798N83J0827o632
342g99j0315R149P360j0538m268J1558M206q404k168Q942M708o995o096N269L938
357E547q305o189O210M893l587r69M150K952L04l325m116K648K635o664l486P751
373D49K929o003O30O493k62l144M74R09j16j250l591r19K699j354l345K929M059
390A587r54j26K191k63p23k0k199o66K075q77j678J551k32j824J636o08m017K806
408b341N343m227l190P504L143p468j749O641J082n655k043M265K590m921m852
$$ plain form
302 5870 -16588 -3231 14988 -539 -12035 4125 6829 -8852 -4325 7298 -3211 -7698 9100
315 9100 10414 -4344 2144 15476 3189 -10594 -233 6425 -7669 -13913 -263 5621 -5020
328 -5020 -6090 7161 7857 -4148 -1676 9003 2678 -5707 3083 6221 -5577 -4994 5833 -799
342 -799 -11114 -1965 5395 -5143 -9411 2147 6353 -2051 -4219 4723 9431 2436 -3660 1609 5547
357 5547 -2758 -8947 -2737 2156 -1431 -2400 1750 4702 5006 1681 -2435 213 2848 -3816 -7302 449
373 449 3378 -2625 -1995 4498 4236 1092 1566 2475 2359 1109 -2482 -3401 -702 -2056 -5401 -2472 1587
390 1587 633 507 2698 2435 1712 1692 -507 -1173 902 25 -1653 -102 -334 -2158 -522 -1130 -5147 -2341
408 -2341 3002 -1225 -4415 3089 6232 -1236 -2985 3656 4738 -917 -2960 1305 3895 -1026 -5878
423e878M664M368n610k505P922K642n262R58M271l004l213J218j372k529J468
438a862K86j950J613K957p55q85J966K088j18k564o69K856j593o529Q35N311l753
455b766m323P146M004o044P75O962l564n844N227L093p131j367P508Q8p813j70
471d219P610r03q808J754J0338k456r822N570R401q212p249R913L154j0826J093
486c662R940m901p329Q086M567q996r32R677j855j0120K605Q133o098r088Q078
501a895R117r634o047J4625N074j6318j177J6997n080j8166Q692J4659j3600j0838
515a3591J6261O037j6600m19J6763l332j5066P309J3865j0318j1840J3632J0288
528A2989j6003o535J8845J814k1085J968J8654r280j6639J4353J2056j6647l857
$$ plain form
423 -5878 -1214 3154 -2456 -4961 2961 5603 341 1299 5570 2566 -647 571 -801 -3330 -1862
438 -1862 -1576 -3526 -1913 1044 289 -596 1370 3458 3340 776 107 2963 1370 -5159 -4324 987 -2766
455 -2766 -7089 57 4061 -1983 -1208 5754 2190 -3654 1573 4666 -2465 -3832 3676 3764 -4049 -4219
471 -4219 3391 2488 -6320 -4566 5772 3316 -6506 -936 8465 253 -6996 2917 6071 -4755 -3662
486 -3662 6278 1377 -5952 2134 6701 -2295 -3227 6450 4595 -5525 -2920 5213 -885 -9973 -1895
501 -1895 7222 -2412 -8459 6166 11240 -5078 -6255 10742 5662 -12504 -3812 10847 -2753 -13591
515 -13591 2670 8707 -7893 -8312 8451 5119 -9947 -2638 11227 909 -10931 2701 12989
528 12989 -3014 -9549 9296 11110 -9975 -8007 10647 1367 -15272 -919 11137 -5510 -9367
541i367J9527j647j7821Q173J4756j3496j1066J6218N744j9314k078J9595l726
554E498j9920R881J9763j5194j6567K1786J1934k7157n255L0195k996l0158J2341
567e849K7414k0774k2517K5907J3938k9860n360L1706k406l0065J0874K7757j8388
580B377k4466K4011J8650k9615j1320L4156L452l5056O862L3937j6658k8698K5430
593C062J9666l2771r707L5067k573l4407J4494L0932k2945k2505L1586J3864l7104
606a3341m750L8187q026l9349J9275L6457l0866k9799M3050K1328n1134q531N6512
619B9013o514n7912K1199N2994l6150m4787M7248L2627n3648j7052N7811K481
631B7310n6820J1674N1673k5539m4484L6195L3931m4596k0416N0724O482n1925
$$ plain form
541 -9367 10160 8513 -9308 -1135 13621 125 -10941 5277 11021 -8293 -10371 9224 5498
554 5498 -14422 -4541 15222 28 -16539 5247 17181 -9976 -15231 14964 11968 -18190 -5849
567 -5849 21565 791 -21726 4181 18119 -11741 -17101 14605 12199 -17866 -6992 20765 2377
580 2377 -22089 1922 20572 -9043 -20363 13793 17245 -17811 -10949 22988 6330 -22368 3062
593 3062 22728 -10043 -19750 15317 12744 -21663 -7169 23763 818 -21687 9899 23763 -13341
606 -13341 -18091 20096 12070 -27279 -8004 28453 -2413 -32212 10838 32166 -18968 -27499 29013
619 29013 22499 -35413 -14214 38780 2630 -42157 5091 37718 -15930 -32982 24829 27310
631 27310 -29510 -17836 33837 8298 -36186 9 33940 -10656 -31072 19652 26134 -25791
643b5791R204M8603k4240m0588L6851K7426m6773j2626N0406l700m8431J9783
655i876M2734l1835l1625M1861J8402m7577m749M7918j0807m5425K5291L8403
667C2715l8507k7510M9752J3950n6382L200N8428k1711n5021L9182M4962n4881
679a1823l0667O4959J1823o9820R013O9315k8553o2405M6968N1855o1433l7287
691d8055P1757J9359p8464l89Q0012j8950p6272L7702O7225n4061n2801O6765
703A3828L4790p4171j4686P4876n259o9193K3374N8212l7011m2440M6437K5508
715C4265m9815q172M7083r709m1693K3813L0586l6434j7239M5574K211m8567J6172
728a1925M8399l3251m1432M9191K9509o1836j3956O8062n804o9895K4584O4800
$$ plain form
643 -25791 -16587 32016 7776 -32812 4039 31465 -15308 -27934 22472 18772 -29659 -9876
655 -9876 32858 1023 -30602 11259 29661 -17916 -22665 25253 14446 -30979 -5688 32715
667 32715 -5792 -33302 16450 30400 -25982 -22782 35646 13935 -41086 -1904 43058 -11823
679 -11823 -42490 22469 34292 -35528 -26515 42800 14247 -48158 -1190 50665 -10768 -48055
691 -48055 23702 43061 -35403 -35792 44220 25270 -51002 -13300 53925 -136 -52937 13828
703 13828 48618 -25553 -40239 34637 29378 -39815 -16441 41771 4760 -37680 8757 34265
715 34265 -15550 -23722 23361 13652 -28041 -4228 26358 -10076 -27315 18259 20470 -28097 -11925
728 -11925 36474 3223 -38209 10982 40491 -21345 -35301 32761 26957 -42938 -18354 46446
740D6446m2515n4877N7312M1536o7073k4833P3512P475p4608J0645P1958k7406
752A7572o4394M2649N2335n5426l7054O3274J8352o6861M98O3818j8911n5226
764c9374L4327M2302m4524k5293N1116R019n0218Q105M5706k3334l7716L4389
776D505K4860m4591j2427M8620k997m9415J9059M6175l2792l6507M6552K4388
788C5430n5126q696N8612r326n7556K5821N0413m0553l9496N1845K5756n8518
800b1394j0829O0360n206n9037J9689N3776l2436m4447M4444L4095n1633j8907
812c1525N7131L294n8215J1693N2861k7618m5550L8115L2689m6009j8268M9781
824A8379M803m7500R307M3403j9490l4905K8429K5386l4390j5327L6416L192l7227
$$ plain form
740 46446 3931 -50946 6366 47902 -19171 -44004 29508 36983 -37625 -26980 44978 17572
752 17572 -46822 -4173 48162 -7264 -44318 18956 37308 -29553 -29055 34763 15852 -39374
764 -39374 -5047 37255 -7269 -32562 18554 27573 -22645 -14540 31166 7832 -29884 4505
776 4505 29365 -15226 -27653 20967 17970 -31445 -12386 33789 997 -35510 11042 35430
788 35430 -19696 -28392 30220 20894 -36662 -10841 39572 -981 -40477 11368 37124 -21394
800 -21394 -32223 28137 22931 -36106 -16417 37359 4923 -39524 4920 39015 -12618 -31525
812 -31525 25606 28900 -29315 -17622 35239 7621 -37929 186 32875 -13134 -31402 18379
824 18379 23182 -24318 -15011 28392 8902 -26003 2426 27812 -6578 -21905 14511 17703 -19524
837a9524P248L2797j8532k6256K8010J6993l3902m480L7289p495l5298K0169L0092
850B7111l0436k2557L6647J2244m0511j979M0343p985l7372J7013L2458k4750
862B26k5775L0313J7089l3949o680L6265l650l4519J5047L0550k4607k3195L1626
875H741J2973l6335k589L6617q062l4208J6823K9217k3206k1911K8253J4486l0838
888a0039p239L0833n99k9661Q092K6460j4937k0364K1328J3256k5623n057K6697
901A3147m639k5664J3167K1399k0253j5540K4560Q855k5798j289K5408m496k2445
914a3588R796J8637j4329j4671J6611Q780j8544k183J9636m293j8330J1326J5542
927A4390j7164j0599K1272L628k3629K979K3347r444k0524J4399J6756j6810j1180
$$ plain form
837 -19524 -12276 20521 1989 -24267 3743 20736 -13166 -17646 19643 12148 -23150 -2981 27111
850 27111 -3325 -25882 10765 23009 -17502 -19481 20862 12877 -24495 -7482 24976 226
862 226 -25549 4764 21853 -12096 -18776 17489 13839 -20680 -5633 24917 310 -22885 8741
875 8741 21714 -14621 -17210 19407 11345 -22863 -6040 23177 -29 -21940 6313 20799 -10039
888 -10039 -17278 13555 12956 -16705 -8613 17847 2910 -17454 3874 17130 -8493 -13550 13147
901 13147 8508 -17156 -3989 17410 -2843 -18383 6177 15032 -10766 -12055 13353 8857 -13588
914 -13588 -3792 14845 516 -14155 2456 11236 -7308 -9491 10145 5852 -12478 -1152 14390
927 14390 -2774 -13373 7899 11527 -12102 -9123 14224 4780 -15744 -1345 15411 -1399 -12579
940a2579J8762O597j9147k716J7120j765j5475N267J2646q510q432J1912L942
953G622j3793R55J3495p043j2008J1925R028j5198m578J6923M59j6218L489J4040
967I098o771j1599Q199Q384r409n553R903K917r380Q20J0064l666r334O621P290
982G584r827m763J1513J158j2123K444J1309n393r370O713O378o898l201P049
996B573J961m948m20L535o57k824L29K53k350K00K771j705k565M830L806n734
1012i45j793Q479L3r990R82Q190m342p584N411N659n413k775N719J573m954q25
1028b575L364m33l305J088M040o07l045K419L418l209k950K938N56m017k67K456
1044a29o81k79J403n16N02K903j465l440K435K461m650k493M852K135m129j217
$$ plain form
940 -12579 6183 12780 -6367 -9083 8037 6272 -9203 -3936 8710 200 -8232 3680 7622
953 7622 -6171 -5216 8279 1236 -10772 1153 10181 -5017 -9595 7328 7787 -8431 -4942 9098
967 9098 2327 -9272 -1073 7311 -2098 -7651 2252 5169 -4211 -3391 6673 3007 -6327 294 7584
982 7584 -2243 -7006 4507 5665 -6458 -4014 7295 1902 -7468 -755 5623 -1275 -4476 2573
996 2573 4534 -414 -834 2701 2044 -780 -451 -198 -2548 -2348 423 -1282 -3847 983 4789 -945
1012 -945 -2738 5741 5774 -4216 -3234 4956 614 -6970 -1559 4100 -1313 -4088 1631 3204 -1750 -2575
1028 -2575 789 356 -2949 -1861 2179 1572 -1473 946 4364 1155 -1795 1143 1699 -2318 -2585 -129
1044 -129 -810 -1089 314 -202 300 3203 1738 -1702 733 3194 -1456 -3949 903 3038 -1091 -2308
1060b308M908K101m544l213M083K240o218l247O176K258n976k45O432L65l864
1075a052J129K689p29j266n48m50P55j19k288m34J936m15j453O00J155L52J41
1092CL44R24J311q60p77J434p02l229P38J693l693j595M775R40m372J931N710
1109D575j800m259K476L288l135m035J638L101k058l554K357M240k150l064L272
1124H92K181l171r79J841j067r29J691j283j981L530J736m675o13N582l64n615
1140c224Q01N235p85m865Q44M865o24m956J120M833k278m148L158K641m364m70
1156b217M514j460l698M047K753m772j049N186m59n547O10M415j431m517J285
1171b340M725q65m297J977M889k097m108K649K293l855j744K475p88j456K372
$$ plain form
1060 -2308 2600 4701 157 -3056 1027 3267 -2951 -6198 -22 2236 -3740 -3985 2447 2812 -1052
1075 -1052 77 2766 2037 771 223 -227 528 409 -1879 -2313 -377 -792 -2245 -1645 -490 -138 3
1092 3 347 1271 2582 1722 945 2379 1677 -1552 -814 879 -2814 -4409 366 1306 -3066 -1135 4575
1109 4575 2775 -1484 992 4280 1145 -2890 -1252 1849 -209 -3763 -1406 2834 684 -2380 892
1124 892 3073 -98 -1077 764 -303 -1232 459 -824 -2805 725 2461 -2214 -2827 2755 2391 -3224
1140 -3224 -2423 2812 2027 -2838 -1994 2871 2247 -2709 -1589 3244 966 -3182 -24 2617 -1747 -2217
1156 -2217 2297 837 -2861 1186 3939 -833 -1882 3304 2845 -2702 -2092 2323 892 -3625 -2340
1171 -2340 2385 1520 -2777 -800 4089 1992 -2116 533 2826 -1029 -2773 -298 -1086 -2542 -170
1186a70N96j965K653K898l069k056L474N38m704j461L170M00l454n04L757J195
1202A298l068N81M028r06k914K713J765m337l58M610k727n266M162L982o134l159
1218e730P013K384o512n72P601J072o697j96O680j119p674Q78O068l440n342M975
1234f11L919n129j38N943k635m820M971K257q112m56Q908k037q989N204R852o312
1250A815q631Q166P720j0658p719J1037M918j2972k038J4454j73j3037N139J2061
1264A0082q637r591J0499M777j2879j203J2800k024j0733O003R504p674p058Q601
1278B467L687j0195j823R547j411q678N272Q029p445m517J0675O79j2760L395
1292c078J1774r228j0852J3438P871j6268l071J8359j059j8387N094J6869q945
$$ plain form
1186 -170 426 -1539 1114 4012 943 -1113 2361 2899 -1805 -3266 -96 304 -3150 -3654 103 1298
1202 1298 -1770 -1189 2839 1933 -981 1732 3497 -840 -1198 3412 685 -4581 -419 3563 -2571 -5730
1218 -5730 1283 3667 -2845 -3417 4184 5256 -1441 -1637 5043 3924 -3750 -2872 3196 -244 -5586 -611
1234 -611 3308 -1821 -1959 3984 1349 -3471 1500 3757 -4355 -4811 4097 2060 -6929 -1725 8127 1815
1250 1815 -6816 1350 9070 -1588 -9307 1730 6648 -6324 -8362 6092 5919 -7118 -1979 10082
1264 10082 1445 -8146 2353 7130 -5749 -6952 5848 3824 -6909 -906 8598 924 -6134 2467
1278 2467 6154 -4041 -5864 3683 2272 -6406 -1134 6895 -550 -5067 5608 6287 -6473 -3078
1292 -3078 8696 -532 -11384 2054 9925 -6343 -9414 8945 7886 -10501 -5407 11462 2517
1305B517j4793J1730J2074j3441p960J4770L718j5524P07J4007o262j1906J1023
1318F60Q071j4122j814J7394l645j6952R729J4442j5621j1675J8354N892k0637
1331i924n47K1418l819j9181R579J7168j3835j3868J6682Q742k0104l662K1372
1344A0021j999k0658Q749J8921j4454j4947J8313Q876k1428l061K1276l088j9109
1357a2588R036J6413j2024j1273J4897O127j6372j545J5173m552j4887R307J2217
1370I929j3469p728J8170L645j9873K636K0856q921j9810J3887J5617j8757j1308
1383a5126K0940N492k1214P84K0542n044j6889R830J3448j3211r458J4804L615
1396H513j6836R73J6238o561j4382J2253J1899j5950o453J9327Q18k0362N232
$$ plain form
1305 2517 -12276 -546 11528 -1913 -9873 4897 8615 -6909 -6202 7805 1543 -10363 660
1318 660 8731 -5391 -7205 10189 6544 -10408 -679 13763 -1858 -13533 4821 10713 -9924
1331 -9924 -10471 10947 7128 -12053 -2474 14694 859 -13009 3673 12415 -7689 -11351 10021
1344 10021 8022 -12636 -3887 15034 580 -14367 3946 12822 -8606 -11667 9609 6521 -12588
1357 -12588 -3552 12861 837 -10436 4461 10588 -5784 -7329 7844 3292 -11595 -2288 9929
1370 9929 -3540 -11268 6902 10547 -9326 -6690 14166 5245 -14565 -678 14939 -3818 -15126
1383 -15126 5814 11306 -9908 -9124 11418 6374 -10515 -685 12763 -448 -9906 4898 8513
1396 8513 -8323 -7350 8888 2327 -12055 198 12097 -3853 -10306 9021 9839 -10523 -5291
1409e291J8334j1718j5459J5683J0408j8841m548K0156q77j9287O758J7698j1636
1422A380j4709J6014J0808j9610o225K2131L35k3080N441K2297j1500j9389J6763
1435F56J5092j9929q831K1774K579k1480L094J8605q908j5559J2315J1103j4565
1448d054n672J6818J564j6328L666J5548q653j3871J2338R771j6447n453J8131
1461G358j06j8296N794J6542j0869j2702J4740Q295j6561k483J7756k079j6190
1474h801P084J3880j1877j1962J3763O911j7549l603J8761p16j7812P537J8445
1487A4061j0653j4317J5407R437j8710n128J8080j984j8084O878J5531j0747j0890
1500a1119J4577O997j5830k282J6098k443j5943O298J4104r960j1098J3920P711
$$ plain form
1409 -5291 13043 1325 -14134 1549 11957 -6884 -11432 8724 7847 -11440 -4682 13016 1380
1422 1380 -13329 2685 13493 -6117 -12342 9789 10124 -12956 -7515 14782 3282 -16107 656
1435 656 15748 -4181 -13012 8762 11341 -10139 -7045 11560 2652 -12907 -592 10511 -4054
1448 -4054 -9726 7092 8656 -7672 -4006 11542 2889 -10982 1356 11127 -5320 -10773 7358
1461 7358 7252 -11044 -5250 11292 423 -12279 2461 10756 -5805 -8288 9468 7389 -8801
1474 -8801 -1717 12163 286 -11676 2087 8998 -8551 -12154 6607 5891 -11921 -4384 14061
1487 14061 3408 -10909 4498 13935 -4775 -9903 8177 6193 -11891 -5013 10518 -229 -11119
1500 -11119 3458 10455 -5375 -7657 8441 5998 -9945 -3647 10457 497 -10601 3319 11030
1513A1030j6067l056J7026k585j7027P183J4179j1988j0388J5594N578j6854m02
1526g777J6557m696j5238Q916J2789j1791q820J4980O131j5760j922J5875l128
1539F116j6637O135J3631j1061j1039J4405P344j4954q49J6609l349j4524Q033
1552a40J1311j2426q429J3601L499j4746O16J4816l762j3197P251J1115j0131
1565f22q772J2216N160j3701r51J4748k821j3181P372J0637j1310p739J2912K581
1579F529j4332J488J3587n204j1017R172R104j0594n966J1690K656j2859l68J1898
1593E784l141j1188O152J0096q052o701J0508L697j1425J41J0832m398r676P315
1607e6O673r447l345J0526K02j0143L012R401n025p806O803N837q614m038R325
$$ plain form
1513 11030 -5037 -8093 8933 6348 -10679 -3496 10683 -1305 -11693 3901 9479 -7375 -7777
1526 -7777 8780 4084 -11154 -2238 10551 -1240 -10060 4920 11051 -4709 -6631 9244 6116
1539 6116 -10521 -4386 9245 -1816 -12855 1550 8894 -6060 -6909 9700 6351 -8173 -140
1552 -140 11171 -1255 -9684 3917 7416 -7330 -6714 8102 4340 -8857 -1606 9509 -622
1565 -622 -9394 2822 7982 -5719 -6670 8078 5257 -7924 -552 10085 -1225 -8964 3948 6529
1579 6529 -7803 -6315 7272 2068 -8949 223 9327 -1267 -7233 4457 7113 -5746 -6114 5784
1593 5784 2643 -8545 -2393 7703 -349 -7050 3458 7155 -4270 -4129 6703 2305 -7371 -56
1607 -56 6617 -2830 -6175 4351 4553 -5590 -2578 6823 1798 -6008 795 6632 -1982 -6020 3305
1622C305J400j0155J305J0241l987r031P118P379r370m686J0802J451j1360J548
1636d040J0160m608q507O288O549p264m234P994K602p764p59P376j066o927K546
1651a654N992m242m272N590J995o327M62O024l030m861N286L173o533p83P005
1666C825j428o623L131N725m198m604N151L680n691k706O113J337o595k55O733
1681C595j706o385L437N280m722l488O019J348n853O89M865k690m013L493K383
1696B252l945o64M482N7l802R97L646k267m034K510L073m058k472N259J802n408
1712b572O89O009j838n130L445L660m845k660M501P00m362L25L744n56k962J177
1728f75K487j310k277J370J849j749r16K706M14k284R12J743k235j518K270o72
$$ plain form
1622 3305 4705 -5450 -4145 6096 2109 -6922 196 7575 -1795 -6481 4321 5772 -5588 -4040
1636 -4040 6120 1512 -6995 -707 5842 -1422 -5656 2338 4940 -2824 -3583 3793 2727 -4200 -1654
1651 -1654 4338 96 -4176 1414 3409 -2918 -2456 3568 538 -4323 963 4136 -2397 -3180 3825
1666 3825 2397 -4226 -1095 4630 432 -4172 979 4659 -1032 -3738 2375 3712 -2883 -3138 3595
1681 3595 1889 -4496 -1059 4221 -501 -3989 2030 3378 -2475 -1786 3079 389 -3624 -131 2252
1696 2252 -1693 -2357 2125 2182 -1620 -623 3023 756 -3278 -768 2305 -1753 -4225 1034 2836 -2572
1712 -2572 -1883 4126 2288 -2842 603 4263 -582 -3242 1259 1959 -2403 -2078 1666 1110 -1852 -675
1728 -675 1812 502 -1775 -405 1444 -305 -1221 1485 1899 -385 527 2270 35 -1483 787 115
1744A15k788J536K134k270p57L330J92k789R24K702j329k368J113J780j424j900
1760a799J369J916j765j783K268J125k636l44K458n83j781J869J222j706J59J648
1776A637j111j271J266K73j645J36J298k41o52L32N69k46r42k7R30k79j316Q57
1794d32J379r59l64J854Q5j541O56N77j803m78R44j041j103J243Q94n92L02J106
1812G27K74j39l06o5L30l77j363L11J021j071o34J232J95j115N21J000n31k67
1830b57M90l4M4R2l52M47N44j016m63J539k36j989P54J589j535j028J682P11j401
1849d19l32J087M18n68o57N55J083r23j456J242J255j736j175J687N84j199j03
1866f57P76J77L7n88m68J018N41j754k97J769j13j395M68J107k32m73L8K51P29
$$ plain form
1744 115 -2673 -1137 997 -1273 -2030 1300 1492 -1297 -373 2329 1000 -1368 -255 1525 101 -1799
1760 -1799 -430 1486 -279 -2062 206 1331 -1305 -1649 809 226 -1555 314 1536 -170 -11 1637
1776 1637 526 -745 521 794 -851 -715 583 342 -310 22 591 345 -597 -624 306 27 -1289 -432
1794 -432 947 -12 -376 1478 1563 22 678 1255 -548 -1026 -82 -1123 -2226 -983 -89 -681 -379 727
1812 727 1001 862 556 491 821 444 -919 -608 413 -658 -1292 -60 135 -980 -459 541 10 -257
1830 -257 233 199 243 335 -17 430 974 -42 -505 1034 798 -1191 -437 1152 -383 -1411 271 982 -419
1849 -419 -751 336 754 186 -471 84 1167 244 -1212 30 1285 -451 -1626 61 645 -554 -657
1866 -657 119 296 333 -255 -723 295 836 -918 -1215 554 441 -954 -486 621 389 -84 -46 205 934
1885I34m43j495P16J406j295j486J839J151j740o21J803N82j458o57J148R05j555
1902b66j342J899J264k589q06L217L00l061P45K998j473k418J496J397j688j438
1918a765R78R71m62j024N26J740j4j558N11J603m11j681m6Q44K97j186j339J329
1936f87K181j846k190L095K501l663j765M155Q80m393k01L963n23l363Q58L073
1952B075r38k563Q70K217j362k076J590J446k008n10K233n40j583J864R15k565
1968i35N04K719j918k564K854J298l886l98L969o97l740J758L695k368l183L331
1984D39L006m053k679M846J783n748r04O375p79o357K319N766l569m311M435K795
2000C364m615j060M119m22l308J387K460j980j240K510K66k864N76K967j653l271
$$ plain form
1885 934 491 -1004 -288 1118 -177 -1663 176 1327 -413 -1034 769 1351 -107 -764 384 1289 -266
1902 -266 -1608 291 1555 -1034 -1840 1377 1677 -1384 -639 2359 886 -1532 -36 1361 -327 -1765
1918 -1765 -787 184 -278 -1302 -776 964 950 -608 -97 1506 1095 -586 -632 212 509 -677 -2016 -687
1936 -687 1494 -352 -2542 553 3054 -609 -2374 1781 2661 -1732 -1933 2030 1507 -1856 -998 2075
1952 2075 1137 -1426 -556 1661 299 -1777 -187 1259 -749 -1259 974 434 -1149 715 1630 -935
1968 -935 -431 2288 370 -2194 660 1958 -1928 -2326 1643 946 -2794 -1036 2659 291 -2892 439
1984 439 3445 -608 -3287 1559 3342 -2406 -3310 3065 2286 -4071 -1752 4014 445 -3866 569 3364
2000 3364 -1251 -2311 1808 1386 -1922 -535 1925 -55 -1295 1215 1481 -1383 -807 2160 507 -2764
2016b764K963K863m453j934N560P31o168J204O219k818n496M396L771n488k321
2031c735N460M20n306J282M644k289l676L694K876m269j813N020L42n776J025
2046b101N585k966n130M644L993n841j650O716m49o465K761N352m659l938N841
2061A693J984o415k30O704j434o486L073N892m525n155N734M057p087k610P996
2076C191N29p951J849P521l774o085N563L928o772j601O499p98o041K707N018
2091C783m203l704N331K341o016p34O501p80o569K587O233m359n363N969L608
2106D625p209j262P675j244p291L561O158n647m406O980K394p526j76P659j494
2121B797p112L144O440m652n542N666M169o902k580P406M03p185J918O567l879
$$ plain form
2016 -2764 199 3062 -1391 -3325 2235 2966 -3202 -1998 4221 1403 -4093 303 4074 -1414 -3735
2031 -3735 1725 2145 -3161 -1879 2765 476 -3200 494 3370 -899 -2712 2308 2650 -3126 -2101
2046 -2101 3484 518 -4612 32 4025 -1816 -3466 3250 2801 -3664 -903 4449 -210 -4148 1693
2061 1693 3677 -2738 -2968 3736 2302 -4184 -1111 4781 256 -4899 835 4892 -2195 -4805 3191
2076 3191 3720 -4231 -2382 5139 1365 -4720 843 4771 -2001 -3602 2897 2099 -3942 -1235 3783
2091 3783 -420 -4124 1207 3548 -2468 -3202 3299 2519 -4050 -1463 4770 411 -4952 1017 4625
2106 4625 -2584 -3846 3829 2585 -4706 -1145 5013 -634 -5040 1940 4334 -3192 -3368 4291 2797
2121 2797 -4315 -1171 5269 617 -4925 741 4910 -1992 -4572 2834 3237 -3948 -2030 4537 658
2136F58m711N441K428o375q6O077k665n361M475L998n719k080O856O14p092J235
2152b307P171k863o998M515N864o475m737P673K532q686J2Q893k246p998N148
2167e02O783o836m377Q128K155q703j78Q036k192p556L488O426m910m837O156
2182A081L532o642j473P168p94o878K871N848n106m044O647J834p333P42P202
2197D655l324o577N036M793o445l287P284J585p285L45P399j749o696L336N781
2212D851m887m506O133K547o818j91O880k203o322M168M470o250k884P073P87
2227B848o855J880O858k717n234M418M046n407l133N254Q61o263K37N887k169
2242E11n182M382M392n336k291O748L83p167J868O602l959n616N405L938o439
$$ plain form
2136 658 -4053 1388 3816 -2559 -2645 3432 767 -4594 -119 3879 -1840 -3920 2936 3550 -3542 -2307
2152 -2307 4864 2001 -4997 -482 5382 -1093 -5830 1843 4375 -4311 -4299 4594 2348 -5650 -502
2167 -502 6281 -555 -4932 3196 5351 -3352 -3530 4506 2314 -5242 -1754 4672 -238 -5075 1081
2182 1081 4613 -2029 -3502 3666 2872 -4006 -1135 4713 -393 -4437 2210 4044 -3289 -2547 4655
2197 4655 1331 -5246 -210 4583 -1862 -5149 2135 3720 -3565 -3220 4179 2430 -4266 -930 4851
2212 4851 -36 -4542 1591 4138 -2680 -2871 4009 1806 -4516 -348 4122 -2128 -5012 2061 2848
2227 2848 -4007 -2127 4731 2014 -3220 1198 5244 -163 -3296 1958 2819 -3444 -3207 2680 511
2242 511 -4671 -289 4103 -1233 -3524 3224 3607 -3560 -1692 4910 951 -4665 740 4678 -1761
2257a761k331O493N01o587N88O104j895n254L442M696m113l222N225J753n986
2272b347k52N925k055n369L672M283m797k600N461J064n305L39M653j771l793
2287b892K312K806k515j619L148Q61l053M92K888j889k993K807J919m195p83N093
2303B387n39n205K269N014l681m177M576K932n076j601N203N64m863M31M445j393
2319A286m033J895L174k955k535L625J623l991J11M510j135m018K681L252m044
2334e54k388M084R33m297J65L953q68k983J670K411j880j753K152J057k586k75
2350a159K584o59k742J710K451k704j701L722O66m064M44L990j631l558K440K588
2366B377k881j564K910O37k702N6K312o20j995J193J626j817j147K501N82l066
$$ plain form
2257 -1761 -4092 2401 2902 -3685 -3097 3007 1112 -4142 -700 3996 -117 -3339 1886 3639 -2347
2272 -2347 -2599 3326 1271 -4098 -426 3857 -940 -3540 1921 2985 -2320 -1981 2672 901 -2892
2287 -2892 -580 2226 -289 -1908 1240 2101 -952 -460 2428 539 -2454 353 2272 -1923 -2706 2387
2303 2387 1848 -3357 -1088 3926 245 -3932 644 3576 -1500 -3101 2102 2666 -2197 -1766 2679 1286
2319 1286 -2747 -852 2322 -633 -3168 457 2080 -1911 -1800 2710 1575 -2443 238 3490 -554
2334 -554 -2942 1142 2075 -2222 -2057 1896 1028 -1955 -285 2126 246 -1507 645 1702 -884 -1159
2350 -1159 1425 766 -1976 -266 2185 -519 -2220 1502 2168 -1896 -1452 2538 907 -2651 -211 2377
2366 2377 -504 -2068 842 1479 -1223 -1167 1145 525 -1470 -277 1349 -468 -1615 886 1468 -1598
2382a598O28L277j670l069K656K425l702j631L846N19l714N71L429j077k424J692
2398A58J800j852j288J821M76j894p0J972o65j972J331J832j996j390K729N15
2414A507k924M30K781j142k177J728J403j914o72J449k81j347K99Q19l59p6Q36
2431C60L52o77K33R40o84j523N90J117j588j137K152R55k228K29K588o11j992
2448i24J204J082j685q56J401R7j139N27J124k61n51L39O64o51j173L88Q33p83
2466c64p87J281P93j021k36J014j67p75qJ50P3K90k28k01J092Q8j392J15J088
2485H05j036j535Q47O94q88j24J250N82k15K16M72P4l73n66k4j47p54L3M08m34
2505g15j56Q33qo61O37O23p91J50J163m25n52J116J06j501P5Q37j054j227P52
$$ plain form
2382 -1598 -970 2307 637 -2432 224 2649 -1053 -2684 1162 1681 -2033 -1462 1967 890 -1534 158
2398 158 1958 106 -1182 639 1115 -779 -849 1123 458 -1514 -183 1649 -347 -1737 992 1507
2414 1507 -1417 -987 1794 652 -1525 203 1606 -308 -980 469 188 -1159 -860 -41 -400 -476 360
2431 360 712 35 268 1208 524 -999 -409 708 -880 -2017 135 1090 -1138 -909 1679 1068 -924
2448 -924 280 1362 -323 -1179 222 319 -820 -293 831 570 19 358 1022 371 -802 -414 419 -364
2466 -364 -1151 130 923 -98 -334 680 513 -262 -270 -120 -47 243 15 -186 906 994 -398 -283 805
2485 805 -231 -1766 -919 -225 -1113 -1237 13 595 380 596 1068 1142 769 203 179 32 -722 -689 -281 -715
2505 -715 -871 -38 -46 -707 -70 553 -238 -88 1075 650 98 1214 1320 -181 -106 731 -323 -1550 -798
2524g98P81p88l15J186J025n08o72Q57O80j341r51R46R9j435J53J363k71l98J018
2543F31J65o87L70l5j086k7P16q56o14J185P44q64P3J058K41p78k28O06J42j057
2563c01l67J017j29j266N77J042j018n31J404K10j234O46J228p94o24R01J09q49
2581B1j52R1l21j61k12q8N59K60k81L44N65j26j95O5j84j6J11o90l53Q68j62r76
2603a033M61R60l58m97N96L41K8j82m31K91N73r18j068J153Q21j615m20J972J42
2622H16j537L65J562l11j118L62Q03m29j108K24Q80o19j012R85P13j301k6J643
2640H92m30j282J262J013j570l09J567n04j663N90P85j093m23R53M48n62K41P47
2658F62j8p61N0O24q03r57J009N37j374J83J992m40j699J558J484k160j043K054
$$ plain form
2524 -798 -17 -805 -1120 66 1091 583 -89 768 1448 107 -844 102 201 -1234 -1081 282 11 -387 631
2543 631 796 109 479 444 -642 -669 47 -809 -1423 -238 506 -358 -285 773 1014 236 8 614 756 -301
2563 -301 -668 349 220 -1046 -469 573 -445 -976 428 638 -596 50 1278 484 -140 761 870 21
2581 21 -131 -40 -361 -522 -734 -822 -263 -3 -284 60 625 499 304 369 185 169 280 -410 -763 105 -57 -1033
2603 -1033 -572 388 30 -467 129 470 498 316 -115 176 749 -169 -1237 -84 737 -878 -1298 674 816
2622 816 -721 -356 1206 895 -223 139 942 513 -595 -371 509 -110 -1122 -137 576 -725 -751 892
2640 892 462 -820 442 1455 -115 -424 1143 639 -1024 -434 351 -742 -1165 -212 236 -326 -85 662
2658 662 644 -117 -67 557 -246 -1203 -194 343 -1031 -848 1144 704 -995 563 2047 -113 -1156 898
2676H98k12k347O13J844q56j171J523J118j290m77J253J94j742o6J604m20j769
2693a303J195J786j835j276K315L67k860L13K707j286k062K108J579k069o74K243
2709A248J02k277J40J699q11j834R20J709j107j248J967J161k182n20K399m77
2725H89k643J209K028j782j280K501N86k266J30J819r94j697J216R49j135m23
2741h93J682N72j450q9J754o10k260P54J760k007j550K639J100k716L39L191q48
2758A368k698J546J739k514j408K208O48k176R2K327k27j956O25J886j296j983
2774a819J664J350k140n49K809p2k583J390K113k342j564K435L51k852M76K668
2790A335j071j836J879J679j963j053K029N38k506l99K547m02k688J256K816j914
$$ plain form
2676 898 686 -1661 -1048 796 -60 -1231 292 1410 120 -357 896 1090 -652 -718 886 466 -1303
2693 -1303 -108 1678 -157 -1433 882 1249 -1611 -1298 1409 123 -1939 169 1748 -321 -995 1248
2709 1248 1350 -927 -787 912 101 -1733 -813 896 -211 -1459 508 1669 -513 -1033 1366 889
2725 889 -1754 -545 1483 -299 -1579 922 1508 -758 -628 1191 197 -1500 -284 665 -470 -893
2741 -893 789 1361 -89 -178 1576 966 -1294 -540 1220 -787 -2337 302 1402 -1314 -975 2216 1368
2758 1368 -1330 216 1955 -559 -1967 241 889 -1287 -1195 1132 905 -1051 -426 1460 164 -1819
2774 -1819 -155 1195 -945 -1494 1315 1243 -1340 50 2163 -179 -1743 692 1043 -1809 -1333 1335
2790 1335 264 -1572 307 1986 23 -1030 999 1537 -969 -1368 1179 777 -1911 -655 2161 247
2806B47k212K854J312l297m70L255q88k998J723K269k382j360K731O42k634K54
2822i54K481o17k273J021K080j695k027K222J300k925o19L369l82l299J636L139
2838B457k353k107L170J127l265k70K861p92k603J076J916j473j347J774J059
2853A230j746l28K152j80k096R56J880j998j530K542N02l244M18L185j491k612
2869b360K579K323k830j231L112M28l194q7K621q28k650R88K311j375j835K067
2885C9J630k245o73K678q3k727J075K234j931j666K410N29k721L41K228j102j909
2902a893J736J300j605o17K154M06k028K18K120r08k387J061K046k084j827K905
2918E97J238l094l2L391q99l084J514K219k256j529K249P64j922p9J948o7j548
$$ plain form
2806 247 -1965 889 2201 -1096 -1566 1689 801 -2197 -474 1795 -587 -1947 784 1426 -1208 -954
2822 -954 1527 910 -1363 -342 1738 43 -1984 238 1538 -1387 -2006 1363 981 -2318 -682 2457
2838 2457 104 -2003 1167 2294 -971 -1241 1620 828 -1775 -699 1217 -256 -1603 171 1230
2853 1230 -516 -844 1308 1128 -968 -12 1868 -130 -1660 882 1384 -1860 -1442 1743 252 -2360
2869 -2360 219 2542 -288 -1519 1593 2021 -1173 -1260 1361 533 -2117 -1129 1182 -193 -2028 39
2885 39 1669 -576 -1249 1429 1346 -1381 -306 1928 -3 -1669 741 1270 -1451 -1110 1118 16 -1893
2902 -1893 -157 1143 -462 -1079 1075 1481 -547 -329 1791 883 -1504 -443 1603 -481 -2308 597
2918 597 1835 -1259 -1291 2100 1201 -1883 -369 1850 -406 -1935 314 1078 -844 -923 1025 958 -590
2935e90N68J250j093j166J203N25j902q1K098p11k168J826K004k333j166L011
2951A275N05k989N00K843j063k359J199J511j753j411J407Q60j480m60J934M59
2967I78j519M37J864q53j529J357P66k147m18J843o04j831J227J435j449m28J601
2984G30L2j352J71R20n46o55P23N41o37j41R87j26j354K72J225j128j509J754
3002i3J125k125l59K812j17k517R66K170j584j762J596R78j782n09J760L69j333
3019d05k5J448j22j645K74J316r95j162J296R75j429j08J687m11j255Q31O88j233
3037b75r0R18n44q52Q04K56r05J93Q83k80p07O09Q20o22q97P49R33j160j006J417
3057B44N72j726l34J879k07j590R33J346j034o12J143q7r19K75M82o20j98O24
$$ plain form
2935 -590 -22 1228 135 -1031 172 697 -1205 -1286 812 101 -2067 -241 1763 -570 -1736 1275
2951 1275 1780 -1209 -709 2134 1071 -1288 -89 1422 -331 -1742 -335 525 -955 -1415 519 978
2967 978 -541 -104 1760 907 -622 735 1501 -646 -1064 779 175 -1656 -429 1006 -443 -871 730
2984 730 762 -590 -419 501 -45 -700 23 564 -73 -214 773 647 -707 -435 790 -338 -1847 -93
3002 -93 1032 -1093 -1452 1360 1243 -1274 -308 1862 278 -1484 112 1090 -692 -1201 559 928 -405
3019 -405 -430 1018 896 -749 -475 841 -154 -1316 -20 955 -474 -582 1105 694 -561 270 958 -275
3037 -275 -365 553 9 -843 -39 217 -688 -495 388 108 -599 10 830 208 -689 60 993 -167 -1173 244
3057 244 816 -910 -1244 635 428 -1162 -229 1117 83 -529 614 527 -392 -117 365 -255 -453 171
3075A71L4m64J39N35m6o82K98P96n78r33Q88P17j428l07J672nj744P26J449j074
3095A64j093J158M95j164k45Q82O4n42n2L42K38k60k01K99K30m06p1J62j79J18
3115f1J46n77K08J048n32j045J074J003j577p89J628K96j773J0J532j53j078K91
3133c49J121op86j05Q53k4r82r0O43l22n85M26K69m06M40K32m68J86O10n87l41
3154b71P20p3q58L57P45o55m21O52J55o93j74N58J6o46JP45J48q94J22J351l85
3175E00j314Q73J234j310q93J286N16j344k79R33n0o38j5L19K91k0k16J90M71
3194E34k9k67qn8K06Jo53j50Q75j20j212M05J256p36j139J031O72r10l25Q72J18
3215C63l98J27J77N9J2j62j45m0j00k22l7l23J54O24m53m70J080P10j163k33J458
$$ plain form
3075 171 205 -259 -120 415 369 -313 -15 781 203 -730 158 875 -553 -860 812 807 -937 -211 1238 164
3095 164 -929 229 724 -440 -685 197 261 -281 -333 9 247 -13 -214 85 315 -91 -162 0 -179 -61
3115 -61 85 -492 -284 764 232 -813 261 1264 -313 -1102 526 822 -951 -941 591 438 -640 -349
3133 -349 772 766 -20 -125 728 704 -278 -368 275 -47 -632 -206 63 -343 97 329 -139 47 657 70 -271
3154 -271 449 376 -482 -125 620 -35 -456 196 351 -342 -516 42 58 -588 -587 158 306 -588 -466 885 500
3175 500 -814 59 1293 -17 -910 376 892 -452 -731 202 152 -486 -501 -182 109 89 -127 63 534
3194 534 505 238 230 172 378 379 -274 -424 451 331 -881 -476 780 44 -1095 -64 608 -302 -627 245 363
3215 363 -35 92 269 328 340 178 33 -7 -107 -329 -366 -689 -535 89 -364 -834 246 956 -207 -440 1018
3236A018j53j340L52R58p34p07N39K39n08r8L87rr8J98J99q6k91L87L18n89k97
3257c15R53M9j256L45J165q83j042J054M51j119m6R99k94n50N02K35m24rM87N1
3277C53l37%M75k32p03N5Q80o78r62R09J003j214m68J490K34j237K04J060l83
3296D49p64L67K09l20j38K8LO6Q5L2N1k5J19K62m32k90P19R6j065K64J073o01
3318A88q90R59N42j084j43R07k70o43K62L46l92j68K74K87k09k28N03J91o49j53
3338c70Q25k45r95N50Q15q40m65J048K23j079K62R84o04o04P48K34q20P1N12j26
3358A24m42J32N97j43n71L74O57o19o52Q69M30j168j19J204l15j156P98P23r85
3377b62l50R47j1r08L69O28m85m22N17M71m60l84N66N08q10n39R28J13j262J15
$$ plain form
3236 1018 865 -475 -123 835 101 -606 -67 172 -336 -434 -47 -56 -154 44 243 157 -134 253 571 -18 -315
3257 -315 638 687 -569 -224 941 58 -984 70 521 -598 -644 355 61 -489 13 248 -176 -185 302 353
3277 353 16 16 491 259 -444 -389 491 -187 -1149 -240 763 -451 -919 571 805 -432 -228 832 449
3296 449 -315 52 261 -59 -197 -169 -166 -100 -15 17 68 43 162 424 -8 -298 421 517 -548 -284 789 188
3318 188 -702 257 799 -285 -428 479 209 -434 -172 174 -218 -386 -112 175 -34 -262 241 432 -217 -370
3338 -370 455 210 -785 -235 580 -260 -725 323 546 -533 -271 713 109 -495 253 487 -333 -262 250 124
3358 124 -318 -186 411 268 -303 71 728 109 -543 326 756 -412 -531 673 358 -798 0 723 -262
3377 -262 -612 335 324 -584 -215 413 -72 -494 23 494 34 -350 216 724 -86 -625 303 416 -846 -731
3397g31J202n64p76J008N53r50Q5Q67n03m67M79J34n75m8N24j22m17P0M72k1n43
3418c23J82O50l77p35O81N94q93j64J120l67q98O88M92j040j98J074k78j005O13
3437a84Q66o45o27P36N93q15p18Q39O80j110n07J282L36j372N1J363n69j094R02
3456GN51j048pR67l56o13Q41L25p82k09P78m6r78r2R00M2r11K79J220k38j243
3477f13P09R83j147p01J083J45j191M84P80n96l01Q69j41p79M39M49o53m99P04
3496B4K88o14k67Q72M03q74k22J136r7j337K75J103q32r84J225M29j225J37J113
3515E53m27q56P70O17o75k69P08J99n80k22M05J19o13k92N40J20o41K40N43k45
3535fMM69j34k99O37m5j072K35Q97q67q98J060O81j052m18J131L06r59k64J000
$$ plain form
3397 -731 471 -93 -869 139 692 -258 -173 694 191 -276 203 337 -238 -286 238 116 -301 -231 241 220 -323
3418 -323 -141 509 132 -603 78 672 -221 -385 735 368 -530 158 650 -390 -588 486 208 -797 -184
3437 -184 682 37 -590 146 739 -76 -794 45 725 -385 -892 390 726 -646 -595 768 199 -895 7
3456 7 558 -490 -497 470 114 -499 342 667 -115 -324 454 408 -570 -662 238 280 -631 -352 868 630 -613
3477 -613 96 1079 -68 -769 314 459 -732 -248 532 -64 -365 504 363 -416 23 472 -181 -680 24
3496 24 312 -302 -569 303 706 -168 -390 746 649 -688 -413 690 -142 -1126 99 528 -697 -560 553
3515 553 126 -730 40 657 -18 -287 421 620 40 -182 223 342 -271 -563 -23 97 -544 -304 239 -6
3535 -6 -2 467 333 34 671 626 -446 -211 686 -181 -1079 -19 662 -390 -808 323 629 -330 -594 406
3555D06M00j151k94J167J89j442J6J314m74j094Q61P52r08k53R62j18o71L57M28
3574D47m34k57K63J08k54j01K19M3j58p9N07j2m54L72M28p83j35Q13l74r01O04
3595a38P95j121l52J222J70j125K40J073j94q09K42N73l05q94L9Q43k72o65N45
3614a33P07n50k13O87k01o01L90Q5q62L30O98o59n02J008M51r87R2J062j56r16
3634b70J31P63l15p82J93P76m64p88O11O51r53m29J252n9r27Q60R23q61m62J113
3654I63j43j239J02O49o76o31N54L69l42j2O12K65m26M5N25k51o86L46M34r75
3674e17j37J214k97j139O79J091j102r27J452K39j357J79J372k67r29M61P34m76
3692B73p39L68M41l82l95N35L18n53L4P39m24o26O01N1r98J09J011m92n27J078
$$ plain form
3555 406 806 -345 -639 528 717 -725 -709 605 131 -963 -102 650 -258 -511 451 333 -338 19 447
3574 447 13 -244 19 127 -127 -228 -9 34 -124 -203 304 292 -162 210 638 -145 -280 533 159 -742 -138
3595 -138 657 -464 -816 406 576 -549 -309 764 570 -239 3 576 271 -623 -584 259 -13 -678 -133
3614 -133 574 24 -189 498 297 -304 86 171 -691 -361 337 -322 -824 184 635 -352 -260 802 646 -270
3634 -270 -139 624 309 -473 -280 496 32 -756 -145 506 -447 -876 376 317 -610 250 1173 312 -150 963
3654 963 820 -419 -317 332 -344 -975 -421 -52 -394 -406 206 471 45 90 615 364 -322 24 458 -517
3674 -517 -654 560 263 -876 -197 894 -208 -1135 317 556 -801 -622 750 483 -446 15 749 273
3692 273 -466 -98 343 -39 -434 101 419 -134 -100 639 215 -411 190 241 -757 -648 363 -129 -656 422
3712D22M98p68N1P20n48p93K77J2n75j8N02J58l33L17O59j74p19L75O65p85p63
3733h20J060M75j244n1J438l95j324P76Q34j038o42R16K80o64K41O16j8l15K06
3752C31J19k96l91K31M9o11O8Q39l08n91Q23P93j111m04J176j18j341L83J026
3771F67p02o86P73M94o40j71M75J0m60j4K38J09k01n9L79J1l99K94L6n10J97M09
3793B50n05l52R55R9r44L04R07n67p05P09L33o75k21N69J2l87j4M07J63m54m4
3814a60N95j50o70M18N24p75k31Q10o7q13M00N57n59k61N64J30n65K23K59j67
3834F2j72J09k1j6j12J06J97j81r7K69po63K02O59m49n83R36N01r95m7R24j28
3856D94r74J61N09j58n05Q4M76J88l84m6O64L3o98J83L13m34l76L99p5q3M04Q2
$$ plain form
3712 422 920 152 203 923 375 -418 -141 -129 -704 -722 -220 -62 -395 -78 581 407 -312 63 728 -57 -820
3733 -820 240 715 -529 -580 858 463 -861 -85 749 -289 -931 -15 265 -399 -158 458 440 125 331
3752 331 450 154 -237 -6 43 -568 -500 339 31 -560 263 1056 -55 -459 717 599 -742 -359 667
3771 667 -35 -721 52 546 -94 -265 210 220 -240 -254 -16 93 -108 -167 212 223 -176 118 154 -356 -159 250
3793 250 -255 -607 348 447 -497 -193 714 147 -558 151 484 -191 -412 157 169 -218 -232 175 338 -116 -160
3814 -160 435 285 -385 33 557 -218 -449 361 294 -519 -119 438 -121 -382 182 312 -253 -30 229 62
3834 62 -110 -1 -22 -38 -150 -44 153 -28 -125 144 137 -526 -324 335 -114 -697 239 740 -255 -302 622 494
3856 494 -480 -319 190 32 -473 -389 87 275 -109 -155 509 542 -156 27 340 -94 -470 -71 -146 -229 175 257
3878B57k61L34K75n86k57M82k17n29J62L79j26j43J05K27K2j73n8K91j11k51L16
3899A38J93m09P1M72n06n26N32R0r84J13R95k58n79Q26Q42n23l82N95J74p62n45
3920d33K87K15o23m17P97M39o86K14R23k96o81O06K66q28k4O42l54l20M49J75
3940C51m13m5J82j91j53j02O7K16o7K2L77O4k89J30J59m32j47L95l34l26P30K14
3962D08o97K69P44n57p25N22K97p69l17O96K87l17o7O21M68n05k77N99P9j038
3982b79j93P78m39p15N20M96m47l2M65q8j23L01L4j47J78J26k77P3n3k43j50j27
4004c42j11l3K00k12L06M02q6k3N00j99l70J83ko43R2M23l79l38P16K25m75R3
4026g3N33n3m47q7K17J26m55k19N51K72o77j8Q51j64p42M26M16l39l17L89K1k04
$$ plain form
3878 257 -4 330 605 19 -238 244 27 -502 -340 39 -87 -230 -125 102 124 -49 -107 184 73 -178 138
3899 138 331 -78 -7 465 -41 -567 -35 55 -929 -816 179 -79 -658 168 1010 487 105 700 874 112 -433
3920 -433 -146 69 -554 -971 -174 265 -421 -207 716 420 -261 345 611 -217 -241 401 47 -273 176 351
3940 351 -62 -107 75 -116 -269 -371 -304 -88 -155 -133 244 308 19 149 308 -124 -271 124 -210 -536 194 408
3962 408 -289 -20 724 167 -558 -36 261 -508 -825 -129 158 -159 -226 395 863 358 81 680 759 -279
3982 -279 -472 306 -133 -848 -328 168 -279 -311 154 66 -57 244 278 131 309 435 158 231 178 -65 -215 -342
4004 -342 -453 -486 -286 -498 -192 210 124 101 601 402 32 215 213 -430 -338 85 -294 -632 84 309 -166 -73
4026 -73 460 407 -40 -127 90 216 -239 -458 93 365 -312 -330 521 357 -385 41 457 118 -199 190 211 7
4048GP2q5j86J77l3k18N1K51o6LN9j8L10m6n20K20M26m24n53N32K22n92O4N47
4072B00k20q6K42K6q5R5j1k41K3N3j07k06J77kK53k3k03L58M05n37k01N55j21
4095C44o32L9M06l89j45L21J6N1K60r5j43K83M2m27j09K76n2k96k2L31J95j72
4117H2m25L35M39o47m21O86J64o37J70O53j75l04L07K0l61J5J17l09q6K33M4n9
4139a59J29L54K6j46k54L88J1p37r3Q08k25o49M94P07o50l15O06Mn66P9K70q5
4161cq2Q5J78Q9j26j43J74n6m64N3L67l00k15M49J21j70J35K33j46L4j12m89J28
4184b60L55m68j78Q42P9p13R2P92k82p25K05N30j45n51K23O84o9p18K99P60n68
4205A84p03O11K89o86k27P65o1m49L38M10m03r1J89j32j68N4Kk5J53n3R6J20n8
$$ plain form
4048 7 79 -6 -192 -15 -48 -266 -215 36 -30 -27 32 14 324 278 -242 -22 404 -20 -573 -41 181 -411 -347 200
4072 200 -20 -106 136 162 77 172 161 -80 -57 -4 -111 -317 -140 -142 111 88 -115 243 648 111 -90 465 344
4095 344 -288 -249 157 -232 -377 -56 -40 11 271 176 33 316 358 -69 -178 98 46 -250 -272 59 254 82
4117 82 -343 -8 431 -216 -637 49 213 -424 -254 399 224 -80 227 247 -114 -99 18 -291 -377 -144 -100 -159
4139 -159 -30 324 350 204 -50 338 349 -388 -481 327 102 -547 -53 654 4 -311 295 299 -267 -188 82 -3
4161 -3 -85 0 178 267 141 -2 172 116 -348 -295 72 -228 -443 6 127 -43 92 325 179 213 101 -388 -260
4184 -260 95 -373 -551 291 370 -343 -251 541 259 -466 -261 269 124 -427 -204 480 411 -307 -8 752 184
4205 184 -519 92 381 -305 -532 233 172 -277 61 471 68 -23 166 34 -134 -80 -78 -103 50 -3 93 213 155
4228A55j22P9k07j95K13j20l21M69K43m78J24P64l97n42N04L48o11l17N45Jm04
4249b69r2L44J95l30j18K56L08l91p0M75O4m10K37K07l55q5J90l50j72M09j92
4270a49k93M07L43l97k2N03n6k77M7R5k18j72Q5j8j26n0K51K54k39k07N53K1p48
4293d13J61P29n36o26O89M22p75j25P36q6m92K18L41j67q4Q5R1j54j81J76N4j75
4315a12p4N16j63m75M14L74o96k35Q41n7q17K87P20m20m27M73J45l50o7K79r3
4336F3j59J8M0Q3j73M5K40j44l05L40O8m84O2N49l21l66N71K24l89P8L83m39k26
4359b42L94j92m82K67L73l93j40M67K61l46r4L43M00n88m10Q24K70r56k83J030
4379E03k32j039M08P52n79l50O14K60l60K5M17j15j40m8L2j30k47O5J24j25k14
$$ plain form
4228 155 33 112 -95 -290 -77 -197 -518 -49 194 -284 -160 604 207 -335 169 517 -94 -411 134 135 -269
4249 -269 -361 -17 178 -152 -270 -14 294 -97 -167 308 372 -38 199 406 51 -34 156 -194 -366 43 -149
4270 -149 -442 -35 308 -89 -111 392 336 59 106 201 -17 -189 -104 -122 -248 -298 -47 207 -32 -239 314 335 -413
4293 -413 -252 477 -59 -685 4 426 -349 -474 262 176 -316 -98 243 76 -8 77 168 14 -167 9 63 -112
4315 -112 -186 330 167 -308 106 480 -216 -451 390 333 -484 -197 523 103 -324 149 294 -56 -123 156 63
4336 63 -96 -78 -38 45 -128 -83 157 13 -292 48 116 -368 -306 243 -78 -444 127 351 -38 40 423 -16 -242
4359 -242 152 -40 -522 -255 118 -275 -415 52 313 -33 -127 216 616 28 -382 442 712 -244 -527 503
4379 503 271 -768 -360 392 -187 -537 77 337 -23 2 419 304 164 116 148 18 -229 -164 -40 -165 -379
4400c79L84J03l22P8N36l56m63N47J05o30J26O22l98k62O08K24o48J9M51k11m97
4421c63M3M19r1m82K20O67j19o25L39P20o44m45O70M6o04R6M80l63j44L02r1k21
4443a90K31Q3k85qL56p1k78J57K39L6l33j11M00k2n37oN57k91m42N12K27o08K39
4466a45M54m10k53N97N3n95K43N09m08l29K28K97k61l29J43M60j70m35K59N74
4486D82m51l60N82J43n47K00K54m79N2K74j72l94N30J94n33R8M91j21l68jK65
4507A39N3l14k44M07J61m79j8N57q6m49K91J81m13R0J89k55j24M94j54m37M74
4528F3L30m34j85L60J00l06j11R1K15j15l69K93L03k29k22M93J08m88K24J98m43
4549a24K2L41k83l06N14J80n08n6N78r7m17j9L70O0l16l14L95K62n35j84O36K7
$$ plain form
4400 -379 5 108 -214 -136 400 44 -419 128 233 -397 -271 351 -47 -309 299 523 -125 -106 345 134 -363
4421 -363 -320 99 8 -474 -254 413 294 -331 8 728 84 -361 309 355 -249 -153 327 -36 -180 122 31 -190
4443 -190 41 124 -161 -169 187 116 -162 -5 234 270 -63 -174 226 204 -333 -339 218 -73 -515 -3 224 -384 -145
4466 -145 309 -101 -354 243 296 -299 -56 453 45 -284 -56 241 -20 -349 -206 254 84 -351 -92 482
4486 482 31 -329 253 396 -151 49 303 -176 -124 150 -22 -416 114 308 -225 -127 364 243 -125 -126 139
4507 139 192 -122 -366 41 202 -277 -295 262 176 -273 18 199 -214 -124 65 -190 -314 180 26 -411 63
4528 63 393 -41 -226 134 234 -72 -183 -92 123 8 -361 -68 235 6 -216 277 385 -103 121 319 -124
4549 -124 -102 239 -44 -350 164 344 -164 -220 358 261 -156 -175 195 255 -61 -375 20 282 -253 -437 199 226
4571B26n34K00M75l25j47J54j14p4J59j09k29M04Q8m27P1M32k12k23J70J58r7
4592D6j88j0K45J01l37O2N22k39n14N05L00q00q1O67j88p09M70N55l70l08L88
4613A17K76k85k61K71L19l30m75K70N06n50n02O61K38o19l3O51j12l64J31K40
4633A49jo8j79J22L39l97m11L95L32n42n1M52l6l86Q3K65o8j81L2K04K19k16j62
4656a06M72J28n71n8O96k85o76L26K81m42k28L30J73o1j04K17K72j13k67K42K00
4677D26m36j71M38p5n71J64N36n10k44M43j3m03J14L84p0l2J03M7P0o1j83J95
4699A51L5l30n5K07j97j03K45k0j54L33J13l10K00K13l75j29L76J08m38J59L00
4720C29j25k05Ol8M9o9j32L0K54j64k0K55j10q5J79nl83L18J29l94k5M44j35l76
$$ plain form
4571 226 -308 -108 367 42 -105 49 -65 -139 20 -89 -318 86 174 -253 -182 250 38 -185 -15 143 46
4592 46 -142 -152 93 194 -143 -81 441 202 -312 193 493 -307 -388 279 91 -618 -148 407 37 -271 117
4613 117 393 108 -153 118 437 107 -368 -98 408 -142 -644 17 255 -364 -397 254 142 -222 -91 149
4633 149 148 80 -99 23 362 -35 -446 -51 281 -261 -312 140 104 -282 -199 66 -2 -183 -151 53 272 56 -106
4656 -106 366 494 -77 -135 561 276 -400 -74 207 -235 -463 -133 40 -21 -125 92 364 251 -16 226 426
4677 426 -10 -181 257 182 -389 -225 311 -199 -443 0 -13 -416 -302 82 12 -20 83 130 200 139 -44 151
4699 151 186 -144 -199 8 -189 -292 -47 -67 -221 112 225 -85 115 328 -47 -176 200 308 -130 29 329
4720 329 204 -1 5 -33 16 -53 -185 -155 99 -65 -85 170 60 -25 154 149 -234 84 213 -181 -206 238 103 -273
4744b73J85J42j90j15R2MO0L3k01K57K67k08q9K76J2k85N4j9r6j6n8j30K60J87
4768A49l48MN50j70l57L15J76k96j29K17p3j94J52L3k4K3MJ1N2j61QL21j90m05
4792c32L93K36n21k10O81q4m48P6M08k9l21k5K59J02k82j99L91K75n79m1N20j55
4814A15m36J47K89j31j42J47QJ19O4k55Q6L36k66l19L75J50m74n8L80q8k14K00
4836C3J86j89p1J03jJ46l30l7L85n2m21L12K94m88n9L88j37m66K61K92k59%J51
4859D1pl4J16j43j6J14o6j73L4J16o8J01l9R5K16k45l03L30J95o00q9O54J7o10
4883c64L61N23m07l12L57K8l07o4J73J05j52M0J24J31j03j53K53j83k15J10J01
4904D6l05M5M40j04k87M61J8m98nL29k54k87K26J63j29R2K03L2O1L8k36k9j01
$$ plain form
4744 -273 -88 54 -136 -251 -159 -155 -95 -62 -263 -6 261 53 -36 240 252 -33 21 2 -94 -110 -168 -298 -38 149
4768 149 -199 -195 355 185 -172 143 319 23 -106 111 38 -156 -4 29 5 28 32 43 95 -66 -58 263 73 -332
4792 -332 61 297 -224 -434 247 163 -285 -209 199 170 -151 -176 83 185 -97 -296 95 370 -209 -250 270 115
4814 115 -321 -174 115 -16 -158 -11 -3 116 180 -75 11 347 81 -238 137 287 -187 -245 135 47 -167 33
4836 33 219 30 -41 62 61 207 -123 -160 225 173 -248 64 358 -130 -189 199 62 -404 -143 149 -110 -110 41
4859 41 34 0 116 -27 -43 71 5 -168 -134 -18 -86 15 -24 71 287 42 -261 69 264 -336 -425 229 246 -364
4883 -364 -3 520 113 -199 158 186 -121 -185 -12 93 -59 -19 105 236 133 -20 233 50 -165 -55 46
4904 46 -259 -214 226 122 -165 296 314 -184 -189 140 -114 -401 -175 -12 -141 -49 154 186 247 285 49 20 -81
4927h1j38m7O8l0J33R0j80K53K56l38j62N15k9o36K41O30n28m22N63K23n74j82
4949c75M55J13n60L2M47J35l03m6O08m0n82Q6M39m96l88L77J68m79J47M55j48
4970D5j82L16k8l37K12Q0k44j45K48J09k05N0J95N0j28j06K09l7m30J16M67l72
4992a17l13M76L02n71K4N29k78l87L91K31l66K5L24n5k71R7J18j48j16j1J00j70
5014a86j41L70P2k79J31N20k63m43M26K73o60j59N67k06n79K73L93k46j80L72
5034E5K37k67N0J11K6k14p8J39n6l28L5L41j39j49L10J67l67K22L71l97k19M81
5056C31j39n24K12K37k97j25K95J48k92L6K81J52l58n8L66Q3m31j57N73j81n80
5077d28J85M32m30l09N87J42k75O6K35j03Ok8r1MM4k24rK25Qj03J53j8j0J36j33
$$ plain form
4927 -81 -219 -266 -198 -228 -95 -5 -185 68 324 -14 -176 339 310 -326 -85 545 17 -405 158 381 -193 -375
4949 -375 80 193 -367 -335 112 247 -56 -102 506 466 -116 -30 409 -87 -475 -98 70 -409 -262 193 45
4970 45 -137 179 151 -186 26 106 -138 -283 -35 74 -131 -81 114 164 36 -70 139 102 -328 -212 255 -117
4992 -117 -430 46 348 -223 -199 330 52 -335 56 287 -79 -54 270 215 -56 41 159 11 -105 -116 -16 -186
5014 -186 -327 43 115 -164 -33 487 224 -219 207 480 -180 -339 228 22 -557 -284 109 -137 -317 55
5034 55 292 25 75 186 212 -2 -80 59 3 -325 -290 51 -88 -237 73 240 -127 95 466 69 -150 331
5056 331 192 -332 -120 117 -180 -305 -10 138 -154 -118 163 315 -43 -101 265 348 -83 -240 333 152 -428
5077 -428 -243 189 -241 -550 37 179 -96 -30 205 102 108 80 -11 -7 37 -187 -196 29 37 -66 87 69 59 195 62
5102F2j53Q4r6j97K94J60k42l0M94j19l95K91J93l94l11L78J83l40k1K51J38k61
5124c1j57J86J93l80k39N08J12m77K61M95k31k47K53j1l09j09j5j02j08K16nJ38
5146e9J72P6L0N2j11o1j4j79j58K73j12j17J96K67m29J19K88k33k38L06J29l69
5168a72J80K41j6k50O5J05p3j58j62K02K9k27oM19J8k62K44J40l86j58K46j50
5190a31j46K16J5k1J81J26j76kQ4j23k17R8N4q2J6o6K54Q1j01q4K41L4l80L4K12
5215A17l37J9K27m3n8K57J9k42J08J39l00n7J41L0j25J05J03k6N4j18J4J06r4
5238C9k42J96R5k96J41K22j61j80K79J03k48o6L05j53j95J20J08l1j92K2J74L1
5260G1l21J12L60k00l65L88L09m34m1L56n4l17Q4J20k00K4J12L6j04J5j1J73J8
$$ plain form
5102 62 -91 -7 -103 -300 -6 154 -88 -118 376 257 -138 153 346 -48 -359 19 202 -138 -159 92 230 -31
5124 -31 -188 -2 191 -189 -428 80 192 -285 -24 471 240 -7 246 235 -74 -183 -198 -300 -408 -192 -197 -59
5146 -59 113 189 219 271 160 99 85 -94 -252 21 -91 -208 -12 255 -174 -55 233 0 -238 68 197 -172
5168 -172 8 249 233 -17 48 153 80 -78 -240 -38 -9 -236 -242 177 195 -67 177 317 -69 -227 19 -131
5190 -131 -277 -61 -46 -67 114 240 64 62 146 23 -194 -96 -42 -124 -108 -174 80 161 60 -24 217 251 -129 -95 117
5215 117 -220 -201 26 -17 -75 182 201 -41 67 206 -94 -151 -10 20 -105 0 103 77 131 13 27 133 39
5238 39 -203 -7 88 -208 -67 155 -6 -186 93 196 -52 -118 187 34 -161 -41 67 36 -156 -134 40 71
5260 71 -250 -138 222 22 -343 45 354 -80 -121 235 181 -136 -52 68 -132 -108 4 40 -64 -49 -60 113 131
5283A31k39K23J20l25j3L57j58l48J91J48k19l7J82kN0Q5o3q0K06q9l24O5J84
5306D5k47j03K70J25j04m9M7K47l6k62P2L13k48l79L65J52l43p2L58j35k74J66
5328i2J11j74L8K35j27N4K41K9n5j25l2k1j61j52O4J37j75o6L87P7k33K87J24
5351C71l35j10K91k36m33M45K22l62n8M82Q7m43m3K55R8m01k12L86J95m60o1O32
5373C10po51K28N35l16l01K43J19j97Q0Mm4J04j18j73J07N3k06O2J66O8nK24P
5397B92m2Q6j65r8n9j33j69L1J1j07K51K49j34r3L94M5m47J26K31k69k42J76O0
5420fn5QmP6J7j44j82K50Kr8R7J50j10J72Q7k69LJ61k14k58K20K95l86n6L69J13
5446B38k32l8J65jj43k35J43J96k15r8L20K44l27M6K62k78j82J36l5k51J63Q0
$$ plain form
5283 131 -108 115 235 -90 -103 254 96 -252 -61 87 -132 -169 13 11 61 146 83 3 209 120 -204 -139 45
5306 45 -202 -305 -35 90 -14 -63 -16 231 195 -67 5 318 70 -309 56 208 -135 -207 151 16 -258 -92
5328 -92 19 -155 -117 118 -9 45 286 315 260 135 103 82 -79 -231 -167 -30 -205 -271 116 193 -40 247 371
5351 371 36 -74 217 -19 -452 -7 215 -147 -205 277 364 -79 -122 133 231 -170 -382 4 199 -261 -322 310
5373 310 303 -348 -120 415 99 -202 41 160 -37 43 47 3 107 -11 -184 -77 -24 -230 -168 -2 66 61 285 292
5397 292 250 336 171 73 14 -119 -288 -257 -246 -353 -102 147 13 -80 314 359 -88 38 269 0 -242 -66 -6
5420 -6 -61 -53 -57 19 36 -108 -290 -40 -38 -136 -39 111 1 173 260 -9 -6 155 -59 -317 -97 198 -188 -244 125 238
5446 238 6 -32 133 132 -11 -246 -103 93 -122 -220 100 344 17 63 325 47 -135 1 -34 -285 -122 -42
5468d2j02JJ43p2J45J0j14JJ63n4j90K39P9l28L3K06q8k07J00L7j0M6j47J27K33
5493B09q6j34K12J19l98M3J60k24o5J79p2j13K57L5j95O7K25j09j12N1M2l3q5
5516b7r8K8K27l59mL86Qm13K55K40k64j24K23J1k28O8R9n7n6J02j30Q9RJ1Q8l0
5542E4j54Q5J01j12j28K44P3k62J38J03j41m5O7r4O6J34j92m7L67n8k87N1K91
5565B54k71j27J23O6Qj45%J55M4j68NK19r3l22K21J63l26J34J62n9k34L27Q0m04
5589a88J41J74j64k10J36J26p4J3J12J15L0k46k0J13q3j32J31J2r1J31J32j57
5611AJ8K30k03k90L18J65m09j10M33N6k73M3J86Q2j76k09J82J53l38j45L48k0
5633D2k49P3L17j54n5J21k1j44J39K3j54P6N4o0l3R8j28j07J56r8l2R5J0j0J02
$$ plain form
5468 -42 -144 -143 0 -72 73 83 -31 -30 133 79 -111 128 207 -121 -88 118 30 -177 -77 -40 -50 -4 -151 -24 209
5493 209 123 -11 201 320 -78 -35 125 -99 -164 15 -57 -170 87 122 -73 -6 219 110 -2 49 91 58 -27
5516 -27 -125 -97 130 -229 -233 153 161 -252 3 243 -21 -145 78 89 -139 -71 28 -29 -85 17 -113 -24 -15 -4 84 54
5542 54 -100 -15 86 -26 -154 90 163 -99 39 142 1 -44 23 -71 -5 129 -63 -110 257 199 -88 -37 254
5565 254 -17 -144 -21 45 53 -92 -92 63 107 -61 -56 163 70 -252 -31 132 -194 -60 102 43 -191 136 216 -188
5589 -188 -47 127 -37 -247 -111 15 -59 -46 66 181 211 -35 -55 58 -25 -157 -26 -14 -105 26 158 1
5611 1 19 249 46 -244 74 239 -170 -280 153 209 -64 -21 165 247 71 -138 44 197 -141 -286 62 42
5633 42 -207 -134 183 29 -26 95 74 -70 69 92 -62 14 68 8 -25 73 -55 -162 -6 -104 -136 -41 -31 -41 61
5658F1M2j1J08r5j39J69L2l97J30L36k63l40L33K46l06r8L58M3k79O5J25M9j17
5681E2p3J14J02j91j02J39o0k03J73N8j76Q0J75m5j90L84p7k84J40J84k36j59
5703a95J74M2j64R6K2m5L8l0jR3m9r6J39l2q9R4J91k43k7L95j60l46K65J64k61
5728b5j91K13L0o0L0l0K4J16k7j24J74j1r8O6qj03L5k9j43M4J96k43k9L57m0l36
5754b12J67K32j61j29J84k7j41P8K5p4N4r6J6J79k0j14J04K8j00L4J44k60j1K73
5778A73j71j85K36R3k39M6J60j49k7J76r3j09K15J2j21p4J60N2j71l5L5J58j52
5801a0j68J05K40k13k07L04J82l19r7L22n3j24K5J4Oj7j40lK31j20k26K49K28
5824B09l06QK23j09j60J54P4o3J9lp2J65j32r0J13L1j94O4J90k29p9K60K8j76
$$ plain form
5658 61 103 92 200 105 -34 135 167 -230 -100 236 -27 -367 -34 212 -94 -192 166 209 -70 -5 120 169 52
5681 52 -21 93 195 4 -98 41 -19 -222 -49 9 -167 -87 88 43 -147 237 160 -124 16 200 -36 -195
5703 -195 -21 21 -143 -47 -25 -70 -32 -62 -63 30 -19 -115 24 -8 -97 -3 188 -55 -82 313 153 -193 72 236 -25
5728 -25 -216 -3 27 -33 -3 -33 -9 107 80 -44 130 119 21 87 79 -24 11 -18 -161 -117 79 -164 -193 164 124 -212
5754 -212 -45 187 26 -103 81 54 -87 -9 16 -58 -4 -100 -84 95 75 -39 65 93 -7 27 171 -89 -100 173
5778 173 2 -183 53 146 -93 -47 113 -36 -63 113 20 -89 126 138 17 -57 103 155 -16 -51 -16 142 -10
5801 -10 -178 -73 167 -46 -253 51 233 -86 -183 139 86 -38 -13 1 7 -10 -150 -153 78 -42 -268 -19 209
5824 209 -97 -89 134 25 -135 19 93 30 49 46 -26 139 7 -83 30 61 -133 -69 121 -108 -187 73 101 -75
5848g5J23P9o5m7J21o1o5O8r6j01J05%j65R3Q0j67R7J8j0J36Jj87J30J51j31j40
5874a08R8M6r6L3mj0l3J13j47k5K87o9k62J94J13k29J4J56N6p9n5P1K5j9j74J35
5900C1J36k13j28K65nj54P4J46j73r8L08l8l07K48Q0k72LR5Jo6m6R4R6j49KM7
5926b3J17j99K7J97n9j71J14Q0k68M6K71j39j84K25J10k14RJ64j20J3m2K3J46
5949A23j14q7J33J06k45P6J43n6k04J60Q8k04R5J28r7J9J37j36j59J76K3j94J6
5972g3J39j90O9N6Rm4L5Nk5L3L9j33L0qk5J16n6j33J62O5k88O3L40j58k81K20
5998c3K69l34j05L70ok59K2K56o6j86l4J91R8l17J4M32j75m60L31K87l49k09M18
6021A55L7l69L5L45j59j82P7J66rj11k8P5O5j15j42J40Q4k82J02R2KKK0m1N6O9
$$ plain form
5848 -75 48 127 62 15 136 75 10 78 -18 -119 -14 -14 -179 -86 -6 -173 -76 -58 -68 68 69 -118 12 163 32 -108
5874 -108 -10 36 -60 -27 -31 -41 -74 39 -108 -133 154 85 -177 17 130 -99 -85 71 127 48 -7 64 89 70 -104 31
5900 31 167 -46 -174 91 86 -68 6 152 -21 -119 189 151 -156 92 172 -100 -97 -2 -1 -67 -113 -19 77 -72 -70 -23
5926 -23 94 -105 -78 119 60 -111 3 83 -185 -139 132 -7 -191 34 144 -70 -61 103 -17 -4 -46 -23 123
5949 123 9 -78 55 161 -84 -8 135 79 -125 35 123 -81 14 142 45 64 201 65 -94 82 105 -89 -73
5972 -73 66 -124 -55 1 10 -34 1 6 -19 14 53 -80 -50 -58 -83 33 -23 -156 6 71 -217 -154 186 28 -253 -33
5998 -33 236 -98 -203 167 161 -98 -76 180 114 -72 -106 85 183 -134 -120 312 137 -323 8 295 -54 -263 155
6021 155 192 -177 -142 203 44 -138 -61 105 96 -15 -43 32 97 -18 -160 -20 64 -218 -116 -24 -22 -20 0 -41 15 84
6047H4k56%K30p4k74L05J74k62l2K16L3k28R8O3l7o1L5q7O2l2r9K09Mj63L4J76
6073A18j10l0J22Mj5J29j19j22J18J6k33j50K90j39j86K22J35j09j4K22O8p6j10
6096C1N1M7q1k70J72J31k09j12L58k3l23J75J97j82o1J81m5o0M3N1O3Lj25n2J44
6121A04j20k14J77J11j65J6K43l6j18N9Ml0Q1j23o6J18L0j49R3K15j93j42J89
6144H4j3k42K6J80k03j5J11pO9R0P1j12J11j57K9kNj25J51m3j33Q0J43j91j04
6169a97K19n1j07J24O3k6kJ74j40M4M6o5j31Ll8L5o8%P9J74k9p0J74qk52nJ83
6196A29k57r0K63j7k11J59K44k43l1J28j6j45L6N5m4%k6l0J17q3MJ19o2j82K10
6221B7O4j79p5L47k10j58J92K4j27R7J21j58p1J63l3n6P1L0o3o3J06j2m8n9N7
$$ plain form
6047 84 -172 -172 58 -16 -290 15 189 -73 -105 111 144 -84 14 77 40 -21 14 -73 -11 -43 -142 67 71 -92 -58 118
6073 118 8 -22 100 104 89 218 99 -23 95 111 -122 -272 18 -121 -307 -85 50 -59 -73 149 217 141 31
6096 31 82 129 48 -222 -50 81 -128 -240 118 95 -228 -53 144 -38 -99 82 37 -23 20 71 134 137 12 -40 104
6121 104 -16 -230 -53 58 -107 -91 152 116 -2 57 61 31 112 -11 -77 41 71 -78 15 230 37 -105 84
6144 84 71 -171 -145 35 -168 -183 -72 -79 -10 80 151 39 150 -7 22 20 25 -100 51 8 -125 -45 98 -93 -197
6169 -197 22 -29 -136 -12 51 25 23 197 57 101 147 82 -49 -46 -84 -49 -117 -117 -38 136 107 37 211 203 -49 -54 129
6196 129 -128 -218 45 28 -183 -24 220 -23 -54 74 58 -87 -51 4 -40 -40 -66 -96 21 -62 -58 61 -1 -183 27
6221 27 91 -88 -163 184 -26 -184 8 32 -95 2 123 -35 -106 57 24 -32 39 69 6 -57 49 37 -11 -70 -13
6246a3M6n1j25K42Ok39L7K80j04l35K82K18l43j15M02r9l33J85K11k05j07J63
6268CJ31j16j31J14J81k00j64K50M4l32L7M64k02l40L31J00k90kJ61n7j73K17
6290B6qn2J20Kj25M9Q2n7j21R5N9pk21J44K27k6l04J01L44l37l25L62J71m42l8
6315b81M34pl18J65J69r0j68J64j9p0j21M1J24nj27J32J0j19K8J46j82j47L21
6338H0l1k14K00K17k30j04L12o6l23J15J26k04j43K13O2r2R9R6L0o4j08K73r0
6361A54l11J02K61k02l08L63K16l83j23L46K6k95L0J74j8j8J4K7O7n4j38P5q9
6384h4j07L4L1LJ16J69j71N0J41p4k78Q9J07j38j75L74j9j17J88M7j6j08Q1k13
6408g0L2l4l1n1J00KJ11J1k3k1K23j59j80J19J31k89mJ98p0j28R3P0j36J1R1r8
$$ plain form
6246 -13 33 -18 -143 99 105 -134 -97 183 79 -256 26 244 -99 -214 188 89 -244 -59 152 -53 -160 3
6268 3 134 18 -113 1 182 -18 -182 68 112 -220 -183 281 79 -261 70 170 -120 -122 39 -18 -191 26
6290 26 18 -34 86 88 -37 12 94 37 -84 11 70 63 -158 -14 213 187 -117 -16 328 -9 -334 28 199 -243 -281
6315 -281 153 146 -172 -7 162 72 -96 68 49 -21 -142 -101 23 18 -109 23 33 -86 -58 88 -94 -241 80
6338 80 49 -165 35 252 22 -82 230 164 -159 -44 82 -122 -265 -52 10 -82 17 113 143 79 -29 244 154
6361 154 -157 -55 206 4 -304 59 275 -108 -231 115 141 -154 -124 50 32 14 28 55 122 68 -70 5 -84
6384 -84 -191 -157 -126 -123 -7 162 -9 41 182 108 -170 -81 26 -112 -287 87 68 -49 139 186 170 62 143 -70
6408 -70 -38 -72 -103 -154 -54 -52 59 70 47 26 249 90 -90 29 160 -129 -133 65 -5 -133 -40 30 -106 -95 -4 -102
6434a02k2Q5N8nM0j2R8Ok22Q7J64k82k59L79N2l38P2L42q4j33J19J21q9p6ln9
6460f3J08j01p7J36O0p4k0J27q5PJ51q9j16J59n0j36M7Q4q5q6J50p9q1J55rk8
6486EO2K8p6K6M5j06KJ4j14oR3j14O2J27j7q7J42R4j62m9J25n2j73L3J0l2N1M8
6514b1p7Q0Q4j7J7M1j11K9jj37L0M5J8k12K64J17j76L2K14Ok23J23oj54pj9p2
6541a33L0O2lJ3J00q0L4o0l9O4J05j69n3L47n4l08J82J84l19j62J44N5q2K2J52
6566C2J37j21L7jJ49k15j34J56K2k91J13K56j75j27K87Q7k91L4J67j11j20J12
6588CM5q8N0j5L0J84k05r0P9L3j18L9Q2n2Q6O0j62R2J15k07j21J96N9l44R9K56
6614A06m6j16J11J08o1q3ro1l3qp6R2J23j1j1O0j2N9J7k85R9J51j89k01K84J80
$$ plain form
6434 -102 -124 -39 19 14 54 42 140 146 -76 11 175 -107 -366 13 65 -273 -201 141 57 -76 43 164 75 -1 -4 -63
6460 -63 45 -56 -133 3 63 -11 -31 96 11 18 169 80 -36 123 73 -63 -16 68 -17 -103 47 -32 -113 42 33 5
6486 5 67 95 19 45 90 -16 -14 0 -114 -120 -27 -141 -79 48 31 -56 86 180 18 -31 94 42 -131 -98 -88 -120 -69 -21
6514 -21 -98 -18 66 49 66 107 -4 25 24 -113 -83 -38 -20 -232 32 149 -27 5 219 225 2 125 119 -35 -42 -61 -133
6541 -133 -103 -41 -44 -31 69 -11 23 -37 -76 -12 93 -76 -129 218 164 -144 38 222 -97 -259 -115 -60 -142 -120 32
6566 32 169 48 85 84 233 18 -116 40 62 -229 -116 140 -35 -162 125 212 -79 -45 122 11 -109 3
6588 3 48 -40 10 -5 25 209 4 -86 -7 26 -92 -53 29 -23 63 123 -39 53 168 -39 -160 36 95 -249 -150 106
6614 106 60 -56 55 163 102 19 10 -51 -84 -92 -168 -76 47 36 25 85 73 132 149 -136 -37 114 -75 -276 8 188
6640A88l06j4M17m2m27J40L14k51k13R3K03j21j40J77J91k16j54K26J49l98k5
6661b09L59r1k87K13K89j81k48K03R4j61r4j2J11k2p7PJ47L1j22Q5Mj7pj4l5J4
6687b0J45j81N9K05n8l29K27J12k58j20K29J92k87M2Q8L0o8K1k1L8k2j20J2N2
6711c2m4K6O0n6lJ45o8r0J59l1r9L7O1j39k5J52j06j01K41N1k15l3K01L0j16m9
6737d4Q4M4j65o1K23O8k96K5K43lk48Q3K72j90j28J78M7j51L5N1r5O5n4l5LL4
6763a5K3j5J7k7J07Rj47N5P7r7j54K17Rj69J05N7j09j1J38Qj32P9L1j82L2R4q1
6790h1J3J02p2O7L3k9oP7m5r2R6L1j53Q1ol3J5j6rlJ39j58j45K89J15k93N4K68
6818B39r8j58J0N4lj78j04J15J06J4p2J11R7j03R1M9j24o4R0k05p2K22M5k69K04
$$ plain form
6640 188 -118 -132 285 243 -184 -44 270 19 -194 -101 102 -19 -159 18 209 -7 -161 65 214 -184 -209
6661 -209 150 59 -228 -15 274 93 -155 48 142 -19 -113 -125 -14 -36 -113 -106 41 72 -50 35 39 22 15 1 -34 -20
6687 -20 125 -56 3 208 150 -179 48 160 -98 -218 11 203 -84 -42 46 76 8 29 8 46 24 -96 -84 -32
6711 -32 -76 -50 10 -46 -49 96 28 -62 97 66 -33 4 65 -74 -99 53 -53 -154 87 138 -77 -110 91 121 5 -44
6737 -44 40 84 -81 -142 81 149 -147 -122 121 118 -130 -47 225 35 -93 85 132 -19 16 67 -28 37 -17 -52 -49 -15
6763 -15 8 -7 10 -17 90 99 -48 7 84 -13 -167 50 59 -110 -5 52 -57 -68 70 78 -54 25 56 -126 -94 0 -81
6790 -81 -68 34 -38 29 62 33 27 104 59 -33 63 94 -59 22 16 -17 -2 -18 -27 -30 109 -49 -194 95 210 -83 -29 239
6818 239 141 -17 -7 47 44 -134 -238 -123 -17 -3 -75 36 133 30 121 170 46 -18 72 -133 -205 17 62 -207 -3
6843cQ1r7p9J57j6j49O5J3L3M0rj6R1K0j30K4O7j85M9L7m0jJ04r9q6J99k7j50
6871a07Q0Q3r3p5J62j7m4O0J10r8k9mp7o4J0O5Op5NJ56J9j28N1K70j65k15K20
6898A06O6k54r2K74p3j75J35O1p8l0J3O0%N9j1n0j2P9J7o0j05J12M3j24L7Q6m7
6925C7k15J71J78j46r1K10q7j70Q0J57j69lJ41p8k6q1R6J7q3PQ3j7n6M1J31j11
6951A6j34J66j2j87J38J53j43j30K12M2k12M4K25j95r6J22Q5j60m5J28M8m0o0
6974c5M8M5q1m0J55n6j99J85J14k11l5K16p4k37K48R2j93n0K88j46j10j5J39l7
6998A1j22P6M7j9o6Q0J21j57n9K34r1j84Q2K33j81k42L43M8l28ML60o3j60mO2
7023B5O1j07p6Q4J31j30o4J43q0J1K5K3o0R1K5k05M2K24j85j47K10J33k54rJ93
$$ plain form
6843 -3 78 -19 -98 59 43 -106 -41 -28 5 45 36 20 111 131 1 25 92 -93 -44 -7 -47 -48 56 -43 -129 70 43 -107
6871 -107 -27 56 -37 -112 50 33 -11 49 159 61 32 28 -49 -113 -103 -38 -32 -107 -102 54 73 -55 -4 266 101 -114 106
6898 106 172 -82 -174 100 27 -148 -13 48 -30 -60 -47 13 13 72 61 11 -1 78 95 35 -70 42 85 -39 -2 84 37
6925 37 -178 -7 171 25 -66 144 57 -113 -33 124 -45 -48 93 15 -11 -92 4 21 -62 -55 28 11 -45 -4 127 16
6951 16 -118 48 36 -151 -13 140 -3 -133 79 121 -91 -47 178 -17 -113 9 94 -66 -111 17 65 25 -35
6974 -35 13 58 -23 -63 92 36 -163 22 136 -75 -110 106 32 -205 43 135 -58 -108 180 34 -76 -91 48 11
6998 11 -111 -35 12 -7 -73 7 128 -29 -88 146 55 -129 -47 186 5 -237 106 154 -174 -170 190 127 -33 -37 25
7023 25 86 -21 -97 -13 118 -12 -76 67 -13 -2 23 46 -14 77 102 -103 -61 163 -22 -169 41 174 -80 -89 104
7048A04k7k24R7J19j17p0P7J33m7r0P5K0Qr7R0K6r4L4J67k17q5J31P9j86L5J50
7074I1r9p6J44J5o0K9L0k7K0m8n6J18j27j1R6n1j09J24J04k05JL15j56j93K09
7099G8J08k14j01J93L7j25l5L0R9j53l9Q4Q8p4m8O8J07j04N8N0j07J5N2k5j16
7124g4R9J11k16j5K05j82k0J23m1l0n1Q9M3N1n8m3M5P4j30Q1m2j02J39j8j27J08
7150A9N0j19K8N6N1j77P8J38n1j35J16Kr7j4K3J09r5J3m2R9l4o6O1J03k07O3J28
7177A00j62N5L5Q3j73R3Q7j38j1J7N4j39P3Q7Mj2n0j3J74j31j25J88Q7k76L2J67
7203A06K9k46N0J19j17J2J2P2k5m0N2k8Oq8L7J03q6j19K49j3k20R1J71j77n4M5
7229e9R0m3k7P4q9R5J5j16Q3J36k94P5Q6oj09Q7P7j28J05p8L4M0j4p5J26Q0k10
$$ plain form
7048 104 77 -147 -50 69 -48 -118 -41 92 45 -45 30 50 58 -39 51 77 -17 17 184 -33 -118 13 92 -94 -59 91
7074 91 -8 -84 60 75 15 44 74 47 67 19 -37 81 -46 -57 39 -12 -121 3 107 -98 -97 218 62 -131 78
7099 78 186 -28 -129 64 101 -24 -59 -29 70 -83 -122 -38 50 -24 -72 -4 103 -1 57 107 0 15 67 42 -74
7124 -74 25 136 -80 -95 110 -72 -92 31 -10 -40 -91 -2 41 92 34 -9 36 110 -20 61 19 -83 56 38 -89 19
7150 19 69 -50 -22 34 85 -92 -14 124 73 -62 54 56 -41 -55 -32 77 -18 -5 -47 52 18 -48 13 116 -91 -28 100
7177 100 -62 -7 28 111 -62 31 118 -20 -31 -14 40 -99 -26 61 65 53 3 -10 164 33 -92 96 183 -93 -61 106
7203 106 135 -111 -61 58 -59 -47 -35 37 12 -28 24 -4 2 -86 -49 54 -32 -151 98 85 -135 -44 127 -50 -104 -59
7229 -59 31 -12 -39 35 -54 41 56 -60 23 159 -135 -60 26 20 -89 -2 75 -53 52 -26 8 48 34 -41 85 165 -45
7256d5n1J69n4j31J62J1j23P0L1k1r4J44j31L0P5j0l6n7K3P6j4q3l5J64m7k04
7282a81O6K04j42j32K33J37j92j6J41n9j52J7N6L2p1MP9K7j18mK20q4j85J77N4
7307A11k09n9K56k1j54J06J64j57m0l2l0N0p9O9OK9j3j7J01n3p2J27p6l4P7q8
7333c8q5N0J36j07k5J79o4j75J01Q8j36k1J74o1M1l7qQ7mj21j2O1j0p3K8R1m1
7360A8L8J1r0N4N3j21m8K26j32j09J46J21j77j7J19o8j21K9J09r6n0J21J3L7j55
7385h9J09J05j24r1J36M6j97KJ81m7k17K67L2j62O7P0n7j33J37J4m6m2j5J26P
7410G9q3qJ26q7j09R3O1r8rJ30m8j83J50L8o9P3l0m4N0N9j64M2J68j03o7K4Pn7
7438e9O1M2j11N4nj1M8j1m3L0K2l0p7Q1k1p9Q5J10j92M8J48j28lN9P5q0k4Q2p
$$ plain form
7256 -45 -96 73 19 -112 50 61 -62 8 39 18 -76 68 -63 -33 42 32 -4 -61 -38 38 24 -59 -94 70 23 -181
7282 -181 -115 89 -53 -185 48 185 -7 -23 118 59 -93 -76 -20 12 -59 -55 24 51 -67 -71 149 65 -120 57 111
7307 111 -98 -157 99 78 -76 30 194 37 -3 -35 -65 -15 -94 -25 -19 10 -3 -20 81 28 -44 83 7 -27 50 -38
7333 -38 -123 -73 63 -44 -69 110 46 -129 -28 60 -76 -97 77 16 57 20 12 99 95 -26 -38 23 13 -60 -32 59 18
7360 18 56 67 -23 31 84 -37 -85 141 9 -100 46 167 -10 -27 92 24 -97 -68 41 -55 -105 16 29 66 -89
7385 -89 20 125 1 -90 46 92 -105 -103 78 31 -186 81 113 -49 18 88 31 -102 35 49 3 -39 -54 72 79
7410 79 -4 -12 114 27 -82 11 72 -26 -35 95 47 -136 14 52 -17 56 26 -18 32 91 -73 -31 137 34 -33 -9 -2 -59
7438 -59 2 44 -67 -13 -18 -29 19 8 -35 -5 17 -13 -90 -9 -30 -109 -24 86 -106 -58 90 -38 -41 18 93 13 -11 71 64
7467F4q4K0K0L3m2p5J31Jj20N0R4q6l0J19P6k37N0J65j95o2J12nl9j6P9L6m2%
7495A7rK8N5j80Q4J19j26n9M7K6o6q2O3j0O0N0k5O5l9o2KJ30k0j73R7L7j18J5
7523g4M0K5M5L7M1p8l4Kk4O7m6m7P6%n6J03L3j55M8J8p6lM9P0k39J85J81k29o6
7552a07J98j2j56L9J46o6n9L4N6L9j28n4J16p3j80J03Q6r6J5K08rj68J86J7j54
7577a9L0O0o7q8K2N8j6l5N3J8Mk5N8qK5n3J9N6j68K29m1j90J5J35J0l39J95J88
7605A26k33q3K44K7j62K9J60l6lj16Q7m4j00J1L8j0PJ82Jj74J11J06k01j30K52
7630H9j3k98J30K10m8k20K41Q2j47j29J40Om9p8N4J04q3m5J37lj90R1J57k28J0
7655h0J91n5j58Q8J99j77p5J56L8j93K8oK0l5J16m4L3m4j5J1J3mj8qj17J04P2
$$ plain form
7467 64 -20 0 20 53 11 -64 67 68 -52 -2 92 6 -24 95 171 -66 -16 149 -46 -108 4 -1 -40 -56 23 59 17 17
7495 17 8 36 91 -89 -5 114 -12 -71 -24 2 -64 -146 -83 -93 -33 17 -8 57 18 -44 -42 88 68 -105 -8 29 -89 -74
7523 -74 -34 -9 36 73 114 36 2 4 -20 47 1 -46 30 30 -26 77 110 -45 3 21 -55 -58 -9 61 -178 7 188 -41 -107
7552 -107 91 79 -77 -38 108 42 -17 17 73 112 -16 -70 46 -27 -207 -104 -18 -114 -99 109 100 -68 118 135 -19
7577 -19 11 71 4 -84 -62 -4 -20 -55 -2 16 20 -5 53 45 70 17 36 92 -76 153 112 -78 -63 72 82 -257 -62 126
7605 126 -107 -190 54 81 -81 -52 108 72 69 -47 40 -4 -104 -93 -55 -65 -58 124 125 -49 62 168 -33 -163 89
7630 89 76 -222 -92 118 70 -150 91 173 26 -103 37 43 -6 -84 -30 74 -9 -54 83 80 -110 -19 138 -90 -80
7655 -80 111 56 -102 -14 185 8 -67 89 127 -66 -38 -44 -24 -59 57 13 46 2 -13 -2 11 7 -11 -19 -136 -32 40
7682D0q0j06K00K5j92P2K23j55j86K05J44k70n4J81J7p3LK3J3m3nQ2m5m6K8P9
7708H0q7J1N9K3j21Q7Q5k47l2K53nk38J45O6j05o6R2O5k7r0M4L3q7l3Q2O4j72
7735a21R1J39j32j28K06Q9k05n4K58j20k10J42Q7r1n7O3M6J1m1j5J07k9p5mR8
7760E5n7L9K5Qk9M4n5r6J0J40j63r3K76k4j68J05J43j79k1L5J2k4l5R7j38J4N7
7787b2J3N3j04L6J07j06j23J17J12k48J16J73l6j33J52l8j38L6M2p5p8J06N6k0
7811bjK7Q9q4j35R2R8j45m0J94o3j20J53J26j27n9P5Pk39J04Qp4N4J06J4J3k0
7838E1K0O2r2p1O6J5q5j29J82J8j72R0N2o1LQ8m7q3J08J8n6J69q4r1J06k9q4n5
7866i1J8J9l9P2j3O0O2Pk1k3L6j38J9N0r0N7M9Mj9N7N6j23M6K6o3p3KM4KL4o7
$$ plain form
7682 40 -40 -146 54 79 -113 -41 182 27 -159 46 190 -80 -134 47 64 -9 -6 17 30 -13 -18 64 19 -27 1 80
7708 80 -7 4 63 86 -35 52 137 -110 -142 111 106 -132 13 79 -26 -92 0 65 38 -52 -8 25 -62 -95 -13 51 -121
7735 -121 -30 109 -23 -151 55 144 -61 -115 143 23 -187 -45 42 -49 -106 -43 3 14 -27 -42 65 36 -39 -43 55
7760 55 -2 37 62 70 41 85 30 -66 -56 84 -79 -172 104 80 -88 17 160 -19 -40 -5 7 -17 -52 45 -93 -79 -22
7787 -22 -9 44 -60 -24 83 -23 -146 -29 83 -165 -49 124 88 -45 107 69 -69 -33 9 -66 -144 -38 18 -2
7811 -2 -3 24 113 29 -106 -14 84 -61 -101 93 30 -90 63 189 62 3 78 85 -154 -50 -42 -116 -62 44 58 71 51
7838 51 71 133 41 -30 36 51 -34 -163 19 37 -135 -45 7 -54 -51 37 -10 -93 15 33 -23 146 62 -29 77 48 -36 -91
7866 -91 -73 -54 -93 -21 -34 26 88 95 74 51 87 -51 -32 18 -72 -15 34 38 19 76 132 9 55 81 18 -55 -53 -9 -7 27 -40
7897d0O3L7l6q9P7O4j21N5N2n5m3O7m0n6J24j02q9J31Q7j83jJ09M3nm4m2P5O9
7925A07k18M3K20j62j32R3J40k8j55J72P6j46j0J15n5n6j5j6P9q0q8J45Mo3j4
7950d4J32p6j0Q3K2j26N7J6o9j27J64j6m4mN3kK0m0k4J20o8l9j0M9l6j3M9p8J
7979f0P6J1j20J26J9j02K3J50j05m2J05l4m9l1N8q2P8pj12N7J52l4p2M7J0Qj12
8006d2o8P7L4k5l0J43P5j95M7R2o0j45J24nj06K3P6l0n8M8RN7j2m2J01r4o2O0
8034hJ14j11l3J14L6j58P6O7r6j10N8R8j04R4R0r3j4K0K5or9m8O6Pn8M4O8MmO0
8064I9m2r1M6P9j48j0P8j8m9P3J28j85N3k5kM1l7J1nN7r6Q8L8m8jm3N9r8K5Pn4
8095g0L5M5o0N8N9l2r9J17qr4K9O7n7lL9P1q7k4L5N3n6m4m4J34j08J4J10mr4M0
$$ plain form
7897 -40 23 60 24 -65 12 76 -45 10 62 7 -36 31 -9 -65 59 -43 -132 -1 86 -97 -98 11 54 49 5 -37 38 107
7925 107 -111 -68 152 -10 -142 -49 91 63 -92 80 156 10 0 115 60 4 -11 -27 52 -28 -116 29 33 -30 -44
7950 -44 88 12 2 85 107 -19 38 54 -15 -142 22 6 -38 -42 11 9 29 -11 -35 85 17 -22 -32 17 -19 -32 17 -61 -60
7979 -60 16 27 -93 33 52 -50 -27 123 18 -24 81 47 -2 -33 25 -57 21 14 -98 -41 111 77 5 52 62 70 -42
8006 -42 -110 -33 1 -24 -54 89 164 -31 16 108 48 -97 27 22 -84 -61 15 -15 -73 -25 -16 41 29 -13 88 -6 -68 -8
8034 -8 106 -5 -38 76 112 -46 30 97 1 -109 -51 47 -57 37 127 34 20 40 65 59 -40 -88 -22 -15 -73 -29 39 43 39 99
8064 99 57 -34 12 91 -57 -67 11 -7 -56 17 145 -40 13 -12 -14 27 -10 1 -4 53 -43 45 83 35 34 -9 50 -48 -23 -16 -70
8095 -70 -35 10 -50 8 67 35 -64 53 45 -49 -20 47 -10 -13 26 97 10 -14 21 74 18 -26 -70 64 -44 -30 80 76 -18 22
8125B2M0m6j47R5Q2j00OR0m3j7N0j6KJ8n6L4j7r9L7O8l3l0M7J30n3j48R0r3M5
8154d2R3j06M1Q3r5j5J30J7j19LO8m8k2J03j6o5j8J1lM0J7r9O1N1k3j10J00p7
8182d0J9Q9o1l6R9m8j05J07J0
$$ plain form
8125 22 62 16 -131 -36 46 -54 -48 42 -1 -18 32 16 18 36 -20 14 -3 -102 -65 3 -30 -60 -13 117 64 -84 6 -87 -42
8154 -42 51 -55 -14 69 -26 -41 89 106 -13 -10 58 10 -12 91 75 10 -8 3 0 40 57 -42 19 70 47 -63 37 -40
8182 -40 -21 68 7 -29 70 22 -83 24 34
8191C4
$$ Imaginary data points
##PAGE= N=2
##DATA TABLE= (X++(I..I)), XYDATA
0@%%%%%%%%%%%%%%%jNnJmQqQqQqQqOlKkKj%JmPrJ0j4K0j9J7j9J9j6PNj8M3q8J56
53I8k62M39p44J303k430N088j3498Q0018L74488m23748l92052M84701K67473n03336
67a22462j89072M71391O9437m36983J3914L83256p6714k95922J33153K15935j64507
78A426j31625J71190N8522j48465Q526R4142p6586l9829J21864j6725j27759Q8195
90B876J19150j51118r0215J93078L1018k36749K1559K53373p0226k32725J35859
101b4120K05635j94198j71281K33925J19961k61652n9851K75612k698k67988P1805
112g4850K48764j34323k18630J77338J68196k05305j05601K14811L4362k13590
122a08828K9191J96935p7066j56679J21876J12363j50545o1378J66381O790j75012
$$ plain form
0 0 0 0 0 0 0 0 0 0 0 0 0 0 0 0 0 -1 4 -1 0 -4 4 -4 4 -4 4 -4 4 -4 2 -1 1 -1 1 0 0 1 -3 4 -5 5 -9 11 -8 9 -10 9 -7 0 5 -13 30 -58 98
53 98 -164 275 -469 834 -1596 3492 -10006 70012 444500 20752 -371300 113401 380874 -122462
67 -122462 -311534 159857 229294 -207689 -193775 189481 112767 -183155 -50002 165933 1426
78 1426 -130199 40991 99513 -48952 -40426 53716 -22870 -62699 59165 42440 -85319 2876
90 2876 122026 -29092 -119307 73771 104789 -131960 -110401 142972 72746 -159979 -24120
101 -24120 181515 -12683 -183964 49961 169922 -91730 -151581 124031 121333 -146655 -74850
112 -74850 173914 39591 -179039 -1701 166495 -38810 -144411 70400 104762 -108828
122 -108828 -79637 117298 40232 -116447 5429 117792 -32753 -94131 72250 79040 -95972
133i5972L8009J65385p8149j39768J15574J03792j48023o6772J64270K7728j61447
144g5373J5276J47398n0919j18355Q1197Q3130j01492n0202J01257J1495r2262
155d8850K3639P3176n5944m9691Q2680K8134r2096N418R7385m1120r7076P2181
167b164Q3154j04901o5671J25954L7825j35408J805J41469l8265j34809P3193
178a7818J20936r9687r7800J17802O5687j34899l8389J40729R840j39992J6970
189e6621J33720l6993j14467O0550R3650p8918p1390Q5848M2950q6365j6368P5937
201C1533r624n8670L1758M0239m2563j8073M4569n286m0636K5946L1127m4211
213a3891j9878N6947P039o2586J0582O5139l0041o4750M7911N7799o4881m5990
$$ plain form
133 -95972 -57963 107422 29273 -110495 5079 108871 -39152 -105924 58346 86074 -75373
144 -75373 -60097 87301 36382 -81973 -776 82354 -19138 -69340 31917 43412 -48850
155 -48850 -25211 47965 -7979 -57670 25010 53144 -38952 -33534 63851 22731 -74345 -2164
167 -2164 80990 -23911 -89582 36372 74197 -61211 -59406 82063 43798 -91011 -17818
178 -17818 103118 3431 -94369 23433 89120 -45779 -84168 56561 66401 -73591 -56621
189 -56621 77099 40106 -74361 -13811 79839 921 -70469 15379 58329 -28036 -44404 31533
201 31533 21909 -36761 -5003 35236 -7327 -25400 19169 13883 -26753 -807 30320 -13891
213 -13891 -33769 23178 30217 -32369 -21787 43352 13311 -51439 -3528 54271 -10610 -56600
225e6600P6890K7449q3176l149Q6123j9497q1482L9476P0104n5602n4576O6477
237A2437L6607p2498j8128P5527K872p3908J0147O6296k4220n6756L7187M5768
249D1331m4900k9717N0564J2727n0864K916M2391k1833l3723L4191K2060l9542
261a4399o256M2832n844l9418J7685L3687k8156k9616L2077K0822l6585j2049
273b5220L9755M180l7295Q355L6788j7425l1508K3313J8267l2483q274L4348l599
286I202l0785J8056K9549k3317k0806K8531J1609l3769p815L1730J321l0762L232
299a4024K9200o088k4419J1177K0558j4763j5179J6030P137j6027J445J4390p277
312B160p745J4136K664j6923J783J2900j0770j4483J1223J0482j1659n307J5146
$$ plain form
225 -56600 20290 47739 -35437 -38586 47537 28040 -53442 -13966 56138 536 -54040 12437
237 12437 49044 -23454 -41582 33945 36817 -37091 -26944 39352 15132 -41624 -4437 41331
249 41331 -3569 -33286 17278 30005 -20859 -17943 24448 2615 -31108 3083 25143 -14399
261 -14399 -20655 22177 16333 -23085 -5400 28287 131 -29485 2592 23414 -13171 -25220
273 -25220 14535 18715 -18580 -10225 26563 9138 -22370 943 19210 -13273 -21547 12801 9202
286 9202 -21583 -3527 26022 2705 -18101 10430 22039 -11730 -19545 12185 13506 -17256 -14024
299 -14024 15176 9088 -15331 -4154 16404 1641 -13538 2492 9629 -6398 -4953 9437 2160
312 2160 -5585 8551 11215 -5708 -3925 8975 -1795 -16278 -5055 5427 -6232 -11539 3607
325C607P083j1330l226J1844N96j3203L01J0946m760j0094P259N743j0763j436
339g433J1689l503j0467Q625R494r496n053J1717M347r926l153Q279K744q692
353h28o308N370M727o836m762Q217O477m262k375M010J356k601l831k988K463
368b171L523m328k672P944M000o620r02O225r17n464q1J407r58j404j828P1L601
385e74N16k519K942M418j754k141J370p53j988m15j104m88K301j41j940J427Q45
402Bj862J162R92k569K155N356l314m231O016K906p902k784O892J060o424j554
418d099M668K250m561l653M959N253m682l143P112K732p040j481M255k788m419
433d637J792Q43j764K004J991j255J323L093j147j854J336J163j663k833q92K090
$$ plain form
325 3607 10690 -640 -3866 7978 8574 -4629 -4328 6618 1858 -8236 -977 4766 -5997 -7433
339 -7433 4256 753 -9714 -1089 8405 -1091 -6144 5573 9920 -6 -3159 5120 7864 -828
353 -828 -7136 -1766 2961 -3875 -8637 -420 6057 1795 -580 3430 4786 2185 -1646 -4634 -2171
368 -2171 1352 -2976 -5648 2296 6296 -324 -1226 4999 4082 -1382 -1463 -56 -1014 -2418 -4246 -4175 -574
385 -574 -58 -2577 365 4783 3029 888 2258 1505 -483 -898 -2002 -2490 -189 -330 -2270 -843 2
402 2 -1860 -698 294 -2275 -120 5236 1922 -2309 3707 6613 -1289 -4073 2819 3879 -2545 -4099
418 -4099 569 2819 -1742 -5395 -436 4817 135 -3008 4104 6836 -204 -1685 2570 -218 -4637
433 -4637 -2845 -2002 -3766 -1762 229 -1026 297 3390 2243 389 1725 2888 1225 -1608 -2500 -410
449d10p20m706J284O569j419m244O122M697o617j922O357k589o903M243M278o389
465b369k194P332O20p591p0P659k83p886J553R874j822j0221L798R641p128q658
481g745R180N243j0563r65J0649l077q715O718N766q743k974R126q60j0194K131
496e023R156m096q158P495R666q259p537J2022N397j6003l933J6468k333j7991
510a3129P005J6957j1053j2578J5521Q765j6299k879J6934j526j6041N327J4478
523A1482q900j2974J1969J0983j5030q770J7102M015k0518k42K0206n301j7550
536a3528J2509J5112j5368p949J8495Q66j9310M690J6006j1359j3276J4758Q318
549I964j7979l887J9834m68j9456P027K0166j2347j8421J8382J4372k4718q978
$$ plain form
449 -410 -1130 -5836 -4552 2017 598 -3646 2476 7173 556 -1366 4991 2402 -4501 -258 4020 -2369
465 -2369 -4563 2769 3389 -4202 -4272 3387 3104 -4782 -3229 6645 4823 -5398 -1600 8041 913 -7745
481 -7745 1435 6678 -3885 -4850 5799 2722 -5993 725 6491 -2252 -5226 3900 3040 -7154 -5023
496 -5023 4133 37 -8121 -626 9040 781 -6756 5266 10663 -5340 -9273 7195 4862 -13129
510 -13129 -6124 10833 -220 -12798 2723 11488 -4811 -7690 9244 7718 -8323 -2996 11482
523 11482 2582 -10392 1577 12560 -2470 -11240 5862 9877 -10641 -10883 9323 4022 -13528
536 -13528 -1019 14093 -1275 -9224 9271 10137 -9173 -4483 11523 164 -13112 1646 9964
549 9964 -8015 -11902 7932 7464 -11992 -4965 15201 2854 -15567 2815 17187 -7531 -16509
562a6509K9028J319l0622P589K9003j6904k5398K3686J8563k7971r457L1294J503
575A5124l1105O655K8933j4869k6412K1309K2048k6792j5039L2335P657l5092
587a5248J521L4831j1954l2067K0977K4439k9676j4762L4547L905l5004Q883L3353
600B3745j8921k7269K7200J8010l5111r919L7858j468l8947J3920L8636k4733
612C001l3226L7243K6062m7593j5570N4109Q59n7949J3836N6041k8818m9041M2327
625A281L9475n0722k4965N6113R562n8086M578N4469j8785m8463L1346L9860m0677
638e014k7345M8233J3570n1955J095N0768j7103m5302L0819L4329m2324k0138
650c0367M9536M794m9817J1954M6292k6307l7806L7068K5013m5466j1891M8172
$$ plain form
562 -16509 12519 13838 -16784 -9195 19808 2904 -22494 1192 19755 -8216 -17673 13621 15124
575 15124 -15981 -9326 19607 4738 -21674 -365 21683 -5109 -20148 12187 19844 -15248
587 -15248 -13727 21104 9150 -22917 -1940 22499 -7177 -21939 12608 16513 -18491 -9608 23745
600 23745 4824 -22445 4755 22765 -12346 -22265 15593 14125 -24822 -10902 27734 3001
612 3001 -30225 7018 33080 -14513 -30083 24026 24885 -33064 -19228 36813 7995 -41046 1281
625 1281 40756 -9966 -34931 21182 30744 -27342 -22764 31705 12920 -35543 -4197 35663 -5014
638 -5014 -32359 15874 29444 -22511 -21416 29352 12249 -33053 -2234 32095 -10229 -30367
650 -30367 19169 23963 -25854 -13900 32392 6085 -31721 5347 30360 -15106 -26997 21175
662B1175l020m7045J8363M2553l2031l3348M4674K1116n3749n844N7972j2424
674A8392n7626L0564N0701m7524l8295O0744K1798o7877j302P0464j8854o6517
686d5332L8007N7553n4809m5071O7012K8430p5612j0005P9970r191p8683K8545
698a9186P2386m6227o0641O1022M4165p1274k4907P5444M516p2819J4797O4350
710D1626l0859n0758M2320L3936m9236j7052M8909j153m4849J7199L6828l0210
722c299k3811M1905J0244m7606O891M9060k5011m5935M1159L5886n6362k2372
734c9251O5614M366o9668J5396O8244l3587o0190N0582M8873o2661l3433P0900
746B5185J6190p4572J546P3689j9287o8908L5216N8593m9510m5285N9938K7954
$$ plain form
662 21175 18155 -28890 -10527 32026 -5 -33353 11321 32437 -21312 -27156 30816 18392
674 18392 -39234 -8670 42031 -5493 -43788 16956 38754 -29123 -30425 40039 21185 -45332
686 -45332 -7325 50228 -4581 -49652 17360 45790 -29822 -39827 40143 30952 -47731 -19186
698 -19186 53200 6973 -53668 7354 51519 -19755 -44662 30782 35298 -37521 -22724 41626
710 41626 10767 -39991 2329 36265 -12971 -30023 18886 17733 -27116 -9917 26911 -3299
722 -3299 -27110 14795 25039 -22567 -15676 33384 8373 -37562 3597 39483 -16879 -39251
734 -39251 26363 30729 -38939 -23543 44701 11114 -49076 1506 50379 -12282 -45715 25185
746 25185 41375 -33197 -31651 42038 22751 -46157 -10941 47652 -1858 -47143 12795 40749
758D0749o5677q724O6196r729o0018K7256M9532l9913l4031M8533J7072n1705
770b0459o15M8167j6415m2586K8934L1475l9905j8707M7400N272m9077J1409M8625
783C3518k5913m1800L9956L0683n1600j7276N7277l19n8825J7753N4727l3523
795D658m5320M6714L2950n5788j8437O0027K847n9948J2910N7103k6122m9266
807c7672L8920L9599m8595k7099N4557J0662n8733L968N5795k0015m9556L3616
819d553L9877m2238k5204M8849J1768m9094K542M5760j4916l9673K4028K9968
831B7114l2233k0842L5566R177l7122K043L5631j2779k9499K3914K2072l1147
843h105j0812L6185j607l6823J3710L2830k5828k6880L4086J7439l8985o937M0895
$$ plain form
758 40749 -24928 -33652 32544 22815 -37203 -9947 39585 -328 -34359 14174 31246 -20459
770 -20459 -21074 27093 10678 -31908 -2974 28501 -11404 -30111 17289 22561 -26516 -15107 33518
783 33518 7605 -34195 5761 36444 -15156 -32432 24845 24526 -34299 -16546 38181 4658
795 4658 -40662 6052 39002 -16786 -35223 24804 27651 -32297 -19387 37716 11594 -37672
807 -37672 1248 40847 -7748 -34847 19710 30372 -28361 -24393 31402 11387 -38169 -4553
819 -4553 35324 -6914 -32118 16731 28499 -20595 -18053 27707 12791 -26882 -2854 27114
831 27114 -5119 -25961 9605 18782 -18340 -16297 19334 6555 -22944 970 23042 -8105
843 -8105 -18917 17268 15661 -21162 -7452 25378 -450 -27330 6756 24195 -14790 -21727 19168
856A9168k966l9119J2713L5173k0952k9355K7826K1874l2266j1895L5485J576
868A7262l5834R306L2657k0247k7294K8227J8089l4319p907L6879k781l5595J2854
881h703L2072k0287k5673K5898J8093k9760j1054L1182L284l0470M500K8362j1547
894E897k3585J8107J6935k3940r408K6448K19k6476R145K3841j6817j8526K2993
907D833J2394k5427n022K5829j715k4220P076K0459j2304j6772J5616J1972j7505
920d786n477J9342q70j9212P702J7090j4463j3360J9321P253k2730k10K3844o253
934G191k2069J2195J8957j5942j4230J7994Q558j9309m798J8149M75j6292L726
947e395J4320o839j0670J0264O193j3073j776J3850l871j2858R727J0816j3737
$$ plain form
856 19168 16202 -22917 -10204 24969 4017 -25338 2488 24362 -7904 -19799 15686 17262
868 17262 -18572 -9266 23391 3144 -24150 4077 22166 -12153 -20060 16819 14038 -21557 -8703
881 -8703 23369 3082 -22591 3307 21400 -8360 -19414 11768 15052 -15418 -10918 17444 5897
894 5897 -17688 419 17354 -6586 -15994 10454 10673 -15803 -6658 17183 366 -18160 4833
907 4833 17227 -8200 -13222 12607 10892 -13328 -6252 14207 1903 -14869 747 12719 -4786
920 -4786 -10263 9079 8209 -11003 -3301 13789 -674 -14034 5287 12540 -10190 -10400 13444 7191
934 7191 -14878 -2683 16274 332 -13898 4096 12654 -6655 -11453 6696 7171 -9121 -5395
947 -5395 8925 2086 -8584 1680 7873 -5200 -6976 6874 3003 -9855 -128 10688 -3049
960c049o808J6270K486j6920J492J5191n368j2789P713R994q737o781R897M419
974G010r613j103R684k336j0041M980Q392q362o172J0891L064j1965O73J1857
988F959m022j0407O259Q082o819m577P033K413o169j366L843n01l375K72J583
1003g92j097K09K975m13k366L430L339n283l232O828M77r766J34R174k572p843
1019f798N285O994n282m115N682J980n476j146M109L02l056J029L827o92l595
1034i52J296K984l260l591K926J618l560k68L718J64j181J401M3o42J586j177
1050A105l580J732K809l594k340M966K603m452j668M465J284m964k979L931K587
1065A905n034k474O582L292n672r74O458M52n305J92K979j392k270j19Q3N48K41
$$ plain form
960 -3049 -9857 6413 8899 -8021 -6529 8662 3294 -9495 -1782 8212 -525 -7306 2591 7010
974 7010 -2603 -3706 5978 3642 -6399 -1419 6973 -1389 -7561 3330 6394 -5571 -4898 6959
988 6959 2937 -7470 -1211 6871 52 -4525 2508 4921 -1248 -2614 1229 728 -2647 -2375 -792
1003 -792 -1889 -1680 1295 882 -1484 1946 5285 2 -3230 3598 4075 -5691 -5557 3617 1045 -6798
1019 -6798 -1513 5481 199 -3916 1766 3746 -1730 -2876 1233 1535 -1521 -492 3335 2643 -952
1034 -952 344 3328 68 -3523 -597 1021 -2539 -2807 911 1075 -106 1295 1338 696 2282 1105
1050 1105 -2475 -743 2066 -1528 -3868 1098 3701 -751 -2419 2046 3330 -1634 -4613 -682 1905
1065 1905 -3129 -5603 979 4271 -1401 -2375 4083 4535 -770 -578 2401 1009 -1261 -1380 -1297 -749 -508
1082e08j603Q7K280L13j383P97J732J4k93k4K13L57j212j538O46k16k685N58K678
1101B13j951j328M908J736m364P66M956k123n369J779L367l279l646K280L678
1116A623j643k976K445M076k132l727K585K563l579j838K571j19j421J589Mj876
1132a855K715J907m175j114N223L9n573N84N479q66m996Q22M820p06m955Q21M809
1149B979j618m655K753L602l828j526M641l70m167K728L240m612k117M939M8n599
1165c562N87M964j001m256J613M793q52m387J378M497k269m873K238K972l453
1180a611k046L463P50j709K068J335k050J106K196l243l009K956R42m394r52M145
1196e3J230l017l4L979J305l174m32L533q04l796J495K088l784j381M449j317
$$ plain form
1082 -508 -2111 -2024 256 569 -814 -17 1715 1729 1436 1412 1625 1982 770 -768 -122 -338 -3023 -2465 213
1101 213 -1738 -3066 1842 3578 -786 -20 4936 2813 -2556 -777 2590 -689 -4335 -2055 1623
1116 1623 -20 -2996 -551 3525 1393 -2334 251 2814 -765 -2603 -32 -151 -1572 17 21 -1855
1132 -1855 860 2767 -1408 -2522 2701 2740 -2833 -2249 3230 2364 -2632 -1810 3010 2304 -2651 -1830 2979
1149 2979 1361 -3294 -541 3061 -767 -2293 2348 1978 -2189 539 3779 -833 -2950 1989 2037 -3562
1165 -3562 -2975 1989 988 -3268 -1655 3138 2286 -2101 -723 3774 1505 -3368 -1130 1842 -1611
1180 -1611 -3657 -194 556 -1153 915 2250 200 1306 3502 259 -2750 206 1148 -3246 -4198 -53
1196 -53 1177 -1840 -1874 2105 3410 236 -196 3337 2533 -1263 232 2320 -1464 -2845 1604 287
1212B87m988L364N072n004l399O938L100o659j343P109O05p403j085O272p92p504
1228e430R02P055j934n488M535N035m925k051N521j359n834L763L536o771j239
1243d684Q859n33q861L931R508n899r585O892P987r594p991J0955O678j1764l223
1258g324J4132J360j3921K447J2399p253j1272R450P216j1713k769J3296k25j1750
1272e927M103J0063p135q616P866N231r452k742J0157N44q923L553Q685o463o646
1287e702Q881K442j2190J091J2387o238j1317J1664R716j4843n480J7472R53j8643
1301i807K971J7832p134j5798J0462J3615j2653j0204J4197N734j5374j676J5009
1314G174l325j2955R015J0398j2622n040J5849r30j7740O395J5661j2994j3345
$$ plain form
1212 287 -4701 -1337 3735 -1269 -4668 2270 5370 -1289 -2632 4477 5082 -2321 -3406 2866 2074 -5430
1228 -5430 -4528 2527 593 -4895 -360 4675 -250 -2301 3220 1861 -3973 -210 3326 -3445 -4684
1243 -4684 4175 3642 -5219 -1288 8220 2321 -7264 -372 7615 -1979 -9970 985 7663 -4101 -7324
1258 -7324 6808 8168 -5753 -3306 9093 1840 -9432 18 7234 -4479 -7248 6048 5823 -5927
1272 -5927 -1824 8239 1104 -7512 354 5585 -3867 -6609 3548 4092 -4831 -1278 7407 944 -5702
1287 -5702 3179 5621 -6569 -5478 6909 671 -10646 1018 10734 -4109 -9589 7883 8836 -9807
1301 -9807 -6836 10996 3862 -11936 -1474 12141 -512 -10716 3481 9215 -6159 -7835 7174
1314 7174 3849 -9106 -91 10307 -2315 -7355 8494 7564 -10176 -3781 11880 -1114 -14459
1327a4459J7213R103j9390k940K1435j541k0384O630J7969j1958j5853J5051J1478
1340A2354j8468o235K1167J068k1266N416J9959j1872j7356J6473J2077k0149
1352f832n769K1806J16k0217O322J8097j0870j4107J3509Q390j6112m106J5953
1365F180j479j4960P218J3994j1108r945J6075N926j9459p43K0358o089k0799
1378a4831J1337J7956j6445j3407K0289Q595k0971k288K1142k964j9055P451J4986
1391A1795j1927j1795J4006O478j6008j169J6961l448j5321R712J3453j4360r354
1404a0977J7684L445k0258K077J9421q614j7070J3989J3261j7464p304J9870J940
1417A0000j9850L935J8593r393j6358J3824J2900j8061q616K1027L323k2798K508
$$ plain form
1327 -14459 2754 11857 -7533 -10473 10962 9421 -10963 -4333 13636 1678 -14175 876 12354
1340 12354 -6114 -12349 8818 9886 -11380 -5964 13995 2123 -15233 1240 13317 -6832
1352 -6832 -12601 9205 9321 -10896 -4574 13523 2653 -11454 2055 10445 -5667 -9773 6180
1365 6180 4701 -10259 -3041 10953 -155 -10100 5975 11901 -7558 -8301 12057 5968 -14831
1378 -14831 -3494 14462 -1983 -15390 4899 13494 -7477 -9765 11377 8413 -10642 -3191 11795
1391 11795 -132 -11927 2079 8557 -7451 -8620 8341 4893 -10428 -716 12737 -1623 -10977
1404 -10977 6707 10152 -10106 -8029 11392 2778 -14292 -303 12958 -4506 -11810 8060 10000
1417 10000 -9850 -5915 12678 3285 -13073 751 13651 -4410 -13026 8001 11324 -11474 -8966
1430h966K3055q498k0996J4338J7462j8620j2037K0908N524k2042L03K0145o112
1443D464j7035J0896J3702j3374q315J5884L603j6884Q48J5874o448j5106J0406
1456a485J1985j4488p662J7639K973j8366L037J7710q277j4692J3079J0734j5869
1469c682n438J7355j01j7319M383J4770r936j3214J2758R715j5415m837J8895
1482G934J983j7806M306J8273r384j6937J2658J1438j7645p824J8587J702j8068
1495a0783M789J7320q724j3116J2923Q928j5504m935J6039q9j6235M424J5281
1508A0318q042j2712J2034R474j5295n731J6641Q8j7319M913J5987r622j2234
1521a1500J4074Q105j6322l131J7011k121j5948P015J4276j0329j0834J3443P328
$$ plain form
1430 -8966 14089 5591 -15405 -1067 16395 -2225 -14262 6646 12170 -9872 -9569 10576 4464
1443 4464 -12571 -1675 12027 -1347 -9662 6222 9825 -7059 -6211 9663 3215 -11891 -1485
1456 -1485 10500 -3988 -11650 5989 8962 -9404 -6367 11343 3066 -11626 1453 12187 -3682
1469 -3682 -9120 8235 8134 -9185 -4802 9968 32 -13182 -424 9291 -6124 -10961 7934
1482 7934 9917 -7889 -3583 14690 5306 -11631 1027 12465 -5180 -13004 5583 7285 -10783
1495 -10783 -5994 11326 2602 -10514 2409 11337 -4167 -9102 6937 6848 -9387 -4963 10318
1508 10318 2276 -10436 1598 11072 -4223 -9954 6687 6775 -10544 -5631 10356 734 -11500
1521 -11500 2574 10679 -5643 -8774 8237 6116 -9832 -2817 11459 1130 -9704 3739 11067
1534A1067j5737m441J5543q31j6593M606J5507q231j2093J3250R806j4570m075
1547f792J5898j531j6116N387J2664j0556j0081J3128O089j4105j245J5172k209
1560E703j4127N501J2174q788j0070J1305P154j2959k985J4366r38j4311M944
1573c031J1800r668r483J2348N265j3650l06J4411l199j2236P328J0104j0162
1586d79p758J1105M085j2528j542J2544j212j1394M863J1022p143q542R370N155
1600G546j1369j871J1135k426j0401O087Q277q475m920J0230J819j0453J478R888
1614F545m238q761N886O727p820n015R042K814r744L6J0423k582r789N605Q345
1629G474q527o170J0160L051j1249O4J0798l124r353N691P738o823n350P724L354
$$ plain form
1534 11067 -4670 -9111 6432 5601 -10992 -6386 9121 890 -11203 2047 11853 -2717 -6792
1547 -6792 9106 7575 -8541 -3154 9510 -1046 -11127 2001 8090 -6015 -7260 7912 5703
1560 5703 -8424 -2923 9251 463 -9607 1698 8852 -4107 -7092 7274 6336 -7975 -3031
1573 -3031 8769 -899 -10382 1966 7231 -6419 -6725 7686 4487 -7749 -421 9683 -479
1586 -479 -8237 2868 6953 -5575 -7117 5427 4215 -7179 -2316 8706 1563 -6979 2391 7546
1600 7546 -3823 -5694 5441 3015 -7386 -1299 6978 -1497 -6417 3813 5632 -4821 -3343 6545
1614 6545 2307 -6454 -568 6159 -1661 -6676 2366 5180 -4564 -4528 5895 3313 -6476 -871 7474
1629 7474 -1053 -7223 2937 5988 -5261 -5197 5601 2477 -6876 -1185 6553 -270 -5620 2104 5458
1644E458p888j742P537k43p206J832O569l401n268M963L296o090r19O398j651
1659A645n591M287M157n980k013O852m49o817K297O170l628n315M721M058n444
1674a050l244N794J988o458o92O746p24o529K612N955m146m371N464K378o100
1689b377m78N460j735m502L236L321l588j292M134K52m159L33L608j879l892K316
1705a242L751l099k635M955K399n251o28N666j352n958K590M244m398l162M772
1720F52J644m391n7M220l84l357R18K633j281k319J450K113j598j255K280N40
1736A808k645oJ896j796j883K308L96k385J383K786j800j293L044L54l046K77
1752f02K550j337k454J083J960j232j758J292K037j516j802J958J537k424o66
$$ plain form
1644 5458 -2430 -4172 3365 3122 -4084 -2252 4317 916 -4352 611 3907 -2183 -3102 3296 1645
1659 1645 -3946 341 4498 -1482 -3495 3357 2908 -3909 -1612 4558 930 -4385 336 4394 -1050
1674 -1050 -4294 1500 3488 -2970 -3662 3084 2360 -4169 -1557 4398 252 -4119 1345 3723 -2377
1689 -2377 -2855 2605 870 -3632 -396 2925 -663 -1955 2179 2431 -1728 -1395 2213 334 -3558 -1242
1705 -1242 2509 -590 -3225 1730 4129 -1122 -1750 3916 2564 -3394 -804 3440 -958 -4120 652
1720 652 2296 -2095 -2152 2068 1684 -1673 -755 1878 597 -1722 -272 1841 243 -1012 1268 1808
1736 1808 -837 -843 1053 -743 -2626 -318 78 -2307 -924 1862 62 -1231 1813 2167 -879 -602
1752 -602 1948 611 -1843 -760 1200 -32 -1790 -498 1539 23 -1779 179 1716 -708 -1374
1767a374K692q3k086J291J640j889p01J652r35j647J273P50j545R9J611l22q93
1784d67L96M81m48p67J09R58rj010O88J550r61q77J374Q2j938%Q83j419o27J564
1804d38r6r20J537J370p69j35Q61j92q78l93k47K21k81q59K98J272o09p27J228
1823B43O24j210K60J152n34o17N55m7l14J87j71j2M54p51o33J248O8j862M95J826
1843I61j076j365J763J009j607m43J264K32p65n54M30R83q73j326R69J431j511
1860d78j130J756R06j417k41J030R8l34m12l22P99N10j434l22J813J44j696M12
1878c18J381m27p68J10K30L18m34j111M11J583r75j418J678J370j839p79J792
1895H04N12j775o71J264P54j320j056J657J348k180r76K997N37l229K12K991j301
$$ plain form
1767 -1374 1318 1235 -851 440 2080 191 -510 1142 207 -1440 -167 583 -962 -863 748 426 -467
1784 -467 -71 410 -38 -805 -696 262 253 -757 -69 1481 520 -357 1017 1099 -839 -839 44 -1375 -2002 -438
1804 -438 -534 -1454 83 1453 684 549 1410 1218 340 -53 -300 -79 -360 -1219 -921 351 -258 -985 243
1823 243 867 -343 -83 1069 535 -82 473 426 112 299 128 116 570 -181 -814 434 502 -1360 -865 961
1843 961 -115 -1480 283 1292 -315 -758 506 738 -27 -581 -151 832 -41 -1367 -398 1033 -478
1860 -478 -1608 148 1054 -363 -604 426 524 190 -222 -544 255 765 -669 -991 822 966 -730 -318
1878 -318 1063 636 -132 -22 208 526 92 -1019 -608 975 0 -1418 260 1630 -209 -988 804
1895 804 1316 -459 -1130 134 888 -432 -1488 169 1517 -663 -1639 1358 1895 -1334 -1122 1869 568
1912E68k772J436J879j694j336J487J278n85p40M85J443k52j709J90J522o45j822
1929a267J13J234J65r51o25J360J823j425k169K600K403l495k310L938J277m414
1945a743n39M225k35l630O91L190r16k859Q87K282j030k274J575J794j790q74
1961a246K176R7j995J209J275k346l26K617j261k833K435K012l372q77M134n3
1977A646l796J342L776k095l463K823L052l786k860M484K129n288j404O093J49
1992B802o325J562O163k951n100M065L547m663j945M505K92l793R74K909j765
2007B77j801K218P15k672L8K962j209l219K348L176l697k426N144J390n925K20
2023b461O244k129n939L514M572m920l079N529J448n360N85N066j650m239K975
$$ plain form
1912 568 -2204 -768 1111 -583 -1919 -432 846 261 -479 6 1449 1197 -512 -322 1200 555 -1267
1929 -1267 -1154 80 245 -706 -1331 29 1852 427 -1742 858 3261 -234 -2544 1394 2671 -1743
1945 -1743 -2282 1943 1708 -1922 -1231 1959 1043 -1816 -929 1353 323 -1951 -376 1418 -372 -1246
1961 -1246 930 1027 -968 241 1516 -830 -1156 1461 200 -2633 -198 1814 -1558 -2435 1699 1646
1977 1646 -2150 -808 2968 873 -2590 233 3285 -501 -3361 1123 3252 -2036 -3440 2653 2802
1992 2802 -3523 -1961 4202 1251 -3849 216 3763 -900 -2845 1660 1952 -1841 -867 2042 277
2007 277 -1524 694 1409 -1263 -1225 1737 528 -2691 -343 2833 -864 -3290 1854 3244 -2681 -2461
2023 -2461 3783 1654 -4285 -771 3801 -1119 -4198 1331 2779 -2581 -1996 3070 1420 -2819 156
2038A56L227l990k466M650J074n514K82N800j903n446L967M716n292k813O397
2053B845N86o696J508N944l828m724N271L042o193j058O708p44o664K259O148
2068D404l763n713N205M751o436l358P615J686q077O30P795k825o933M696M913
2083D590o208k844O617O05o399J770N649l415m361M907K957n643j482O323ko703
2099c639J653O517l488n868N115M510o620k463P557K2p623K565O738m702n267
2114d993O459L390p317j279P641o11p534K300O747l983o045N178M847o310l402
2129d912P189J564p246P71O933k859n751M636L518o125j167O250j310n641L642
2144e08M852n140l043O432J434p064K40P012k122p125L593O436n544n301P055
$$ plain form
2038 156 3383 -607 -3073 1577 2651 -2863 -2581 3219 1316 -4130 -163 4553 -739 -3552 2845
2053 2845 3431 -3265 -1757 4187 359 -4365 906 3948 -2245 -3303 3405 2661 -4003 -1744 4404
2068 4404 641 -5072 133 4884 -1552 -4910 2705 4391 -3686 -3056 4739 1914 -5019 -323 4590
2083 4590 -1618 -4462 2155 2760 -3639 -1869 3780 365 -3996 911 3868 -1775 -3257 3066 3064 -3639
2099 -3639 -1986 4531 1043 -4825 290 4800 -1820 -4283 3274 3296 -4327 -1762 4976 274 -4993
2114 -4993 1466 4856 -2461 -3740 3901 3290 -4244 -1944 4803 820 -5225 -47 4800 -1510 -4912
2129 -4912 2277 3841 -3405 -2634 4299 1440 -4311 325 3843 -2282 -3449 2801 1491 -4150 -508
2144 -508 4344 -796 -3839 2593 4027 -3037 -2797 4215 2093 -5032 -1439 4997 -547 -5848 1207
2159A207L855q117j230R018j023q540L829P424o150n719P461L162q658j213Q406
$$ plain form
2159 1207 5062 -3055 -4285 4733 3710 -4830 -1001 6423 273 -5446 2015 5177 -3481 -4694 3712
$$ [...]
8191B
##END NTUPLES=NMR FID
##END=
