##TITLE=1H_EC-2738
 DMSO
 8 sc, 
 31.7.2023
##JCAMPDX= 6.0         $$ Bruker NMR JCAMP-DX V2.0
##DATA TYPE= NMR SPECTRUM
##DATA CLASS= NTUPLES
##ORIGIN= UXNMR, Bruker Analytische Messtechnik GmbH
##OWNER= root
$$ XWIN-NMR		Version 3.5
$$ Mon Jul 31 14:07:41 2023 Russian Standard Time (UT+4h)  she@DPX200
##.OBSERVE FREQUENCY= 200.13135
##.OBSERVE NUCLEUS= ^1H
##.ACQUISITION MODE= SIMULTANEOUS
##.ACQUISITION SCHEME= undefined
##.AVERAGES= 8
##.DIGITISER RES= 18
##SPECTROMETER/DATA SYSTEM= spect
##.PULSE SEQUENCE= zg30
##.SOLVENT NAME= DMSO
##.SHIFT REFERENCE= (INTERNAL, DMSO, 0, 15.7557)
##AUDIT TRAIL= $$ (NUMBER, WHEN, WHO, WHERE, WHAT)
$$ ##TITLE= Audit trail, XWIN-NMR		Version 3.5
$$ ##JCAMPDX= 5.01
$$ ##ORIGIN= Bruker BioSpin GmbH
$$ ##OWNER= she
$$ F:/spectra/data/she/nmr/H-F/1/pdata/1/auditp.txt
$$ ##AUDIT TRAIL=  $$ (NUMBER, WHEN, WHO, WHERE, WHAT)
(   1,<2023-07-31 14:06:24.42 +0400>,<she>,<DPX200>,
      <created by zg, POWCHK disabled, PULCHK disabled
       configuration hash MD5:
       00 E9 B6 7A A2 85 ED C7 34 08 36 98 17 FE 4E 26
       data hash MD5: 16K
       3E 05 2D B8 84 76 5F AC 0D 70 19 F7 EE CE 90 E8>)
(   2,<2023-07-31 14:06:27.03 +0400>,<she>,<DPX200>,
      <Start of raw data processing
       efp BC_mod = 2 LB = 0.24 FT_mod = 6 PKNL = 1 PHC0 = -21035.97 PHC1 = 3.85272 SI = 16K 
       data hash MD5: 16K
       D7 28 63 84 A0 68 ED BF AA 36 12 2B FC 8A 84 F2>)
(   3,<2023-07-31 14:06:47.45 +0400>,<she>,<DPX200>,
      <pk PHC0 = -6.636895 PHC1 = 4.2 
       data hash MD5: 16K
       4E 2B EB 9C 16 C8 6D E5 09 2B B5 E0 5B 16 57 17>)
(   4,<2023-07-31 14:06:51.46 +0400>,<she>,<DPX200>,
      <abs ABSG = 5 
       data hash MD5: 16K
       A4 79 AA B6 50 B8 C7 66 B3 33 1B 2F 81 D9 FC 8A>)
$$ ##END=
$$ 
$$ hash MD5
$$ 1B CD 88 E2 E1 EB 86 45 F5 95 B9 9C 43 99 7D E1
##$RELAX= 
##$RELAX= 
##$RELAX= 
##$RELAX= 
##$RELAX= 
##$RELAX= 
$$ Bruker specific parameters
$$ --------------------------
##$DU= <F:/spectra>
##$EXPNO= 1
##$NAME= <H-F>
##$PROCNO= 1
##$TYPE= <nmr>
##$USER= <she>
##$AMP= (0..31)
100 100 100 100 100 100 100 100 100 100 100 100 100 100 100 100 100 100 
100 100 100 100 100 100 100 100 100 100 100 100 100 100 
##$AQSEQ= 0
##$AQ_mod= 1
##$AUNM= <au_zg>
##$AUTOPOS= <>
##$BF1= 200.13
##$BF2= 200.13
##$BF3= 200.13
##$BF4= 200.13
##$BF5= 200.13
##$BF6= 200.13
##$BF7= 200.13
##$BF8= 200.13
##$BYTORDA= 1
##$CFDGTYP= 0
##$CFRGTYP= 5
##$CHEMSTR= <none>
##$CNST= (0..31)
1 1 145 1 1 1 1 1 1 1 1 1 1 1 1 1 1 1 1 1 1 1 1 1 1 1 1 1 1 1 1 1 
##$CPDPRG= <>
##$CPDPRG1= <>
##$CPDPRG2= <>
##$CPDPRG3= <>
##$CPDPRG4= <mlev>
##$CPDPRG5= <mlev>
##$CPDPRG6= <mlev>
##$CPDPRG7= <mlev>
##$CPDPRG8= <mlev>
##$CPDPRGB= <>
##$CPDPRGT= <>
##$D= (0..31)
0 1.2 0 0 0 0 0 0 0 0.06 0 0.03 0 0 0 0 0.0002 0 0 0 0 0 0 0 0 0 0 0 0 
0 0 0 
##$DATE= 1690797983
##$DBL= (0..7)
120 120 120 120 120 120 120 120 
##$DBP= (0..7)
150 150 150 150 150 150 150 150 
##$DBP07= 0
##$DBPNAM0= <>
##$DBPNAM1= <>
##$DBPNAM2= <>
##$DBPNAM3= <>
##$DBPNAM4= <>
##$DBPNAM5= <>
$$ [...]
##$SUBNAM3= <"">
##$SUBNAM4= <"">
##$SUBNAM5= <"">
##$SUBNAM6= <"">
##$SUBNAM7= <"">
##$SUBNAM8= <"">
##$SUBNAM9= <"">
##$SW= 18.05172834244
##$SWIBOX= (0..15)
0 0 2 0 0 0 0 0 0 0 0 0 0 0 0 0 
##$SW_h= 3612.71676300578
##$TD= 16384
##$TD0= 1
##$TE= 0
##$TE2= 300
##$TE3= 300
##$TEG= 300
##$TL= (0..7)
0 120 120 120 120 120 120 120 
##$TP= (0..7)
150 150 150 150 150 150 150 150 
##$TP07= 0
##$TPNAME0= <>
##$TPNAME1= <>
##$TPNAME2= <>
##$TPNAME3= <>
##$TPNAME4= <>
##$TPNAME5= <>
##$TPNAME6= <>
##$TPNAME7= <>
##$TPOAL= (0..7)
0.5 0.5 0.5 0.5 0.5 0.5 0.5 0.5 
##$TPOFFS= (0..7)
0 0 0 0 0 0 0 0 
##$TUNHIN= 0
##$TUNHOUT= 0
##$TUNXOUT= 0
##$USERA1= <user>
##$USERA2= <user>
##$USERA3= <user>
##$USERA4= <user>
##$USERA5= <user>
##$V9= 5
##$VALIST= <valist>
##$VCLIST= <CCCCCCCCCCCCCCC>
##$VD= 0
##$VDLIST= <DDDDDDDDDDDDDDD>
##$VPLIST= <PPPPPPPPPPPPPPP>
##$VTLIST= <TTTTTTTTTTTTTTT>
##$WBST= 1024
##$WBSW= 4
##$XGAIN= (0..3)
0 0 0 0 
##$XL= 0
##$YL= 0
##$YMAX_a= 323550
##$YMIN_a= -330201
##$ZGOPTNS= <>
##$ZL1= 120
##$ZL2= 120
##$ZL3= 120
##$ZL4= 120
##$ABSF1= 15.74909
##$ABSF2= -2.302759
##$ABSG= 5
##$ABSL= 3
##$ALPHA= 0
##$AQORDER= 0
##$ASSFAC= 0
##$ASSFACI= 0
##$ASSFACX= 0
##$ASSWID= 0
##$AUNMP= <proc_1d>
##$AZFE= 0.1
##$AZFW= 0.1
##$BCFW= 0
##$BC_mod= 2
##$BYTORDP= 0
##$COROFFS= 0
##$CY= -3
##$DATMOD= 1
##$DC= 0
##$DFILT= <>
##$DTYPP= 0
##$F1P= 0
##$F2P= 0
##$FCOR= 1
##$FTSIZE= 16384
##$FT_mod= 6
##$GAMMA= 0
##$GB= 0
##$INTBC= 1
##$INTSCL= 3.70164e-10
##$ISEN= 128
##$LB= 0.24
##$LEV0= 0
##$LPBIN= 0
##$MAXI= 10000
##$MC2= 0
##$MEAN= 0
##$ME_mod= 0
##$MI= 1.114404
##$NCOEF= 0
##$NC_proc= -5
##$NLEV= 6
##$NOISF1= 3.799351
##$NOISF2= 2.8
##$NSP= 0
##$NTH_PI= 0
##$NZP= 0
##$OFFSET= 15.7557
##$PC= 1
##$PHC0= -21042.61
##$PHC1= 8.05272
##$PH_mod= 1
##$PKNL= yes
##$PPARMOD= 0
##$PSCAL= 0
##$PSIGN= 0
##$REVERSE= no
##$SF= 200.130003168305
##$SI= 16384
##$SIGF1= 3
##$SIGF2= 2
##$SINO= 5.538805
##$SIOLD= 16384
##$SREGLST= <1H.CDCl3>
##$SSB= 0
##$STSI= 16384
##$STSR= 0
##$SW_p= 3612.71676300578
##$SYMM= 0
##$S_DEV= 0
##$TDeff= 16384
##$TDoff= 0
##$TI= <>
##$TILT= no
##$TM1= 0
##$TM2= 0
##$TOPLEV= 0
##$USERP1= <user>
##$USERP2= <user>
##$USERP3= <user>
##$USERP4= <user>
##$USERP5= <user>
##$WDW= 1
##$XDIM= 16384
##$YMAX_p= 440052145
##$YMIN_p= -157365
$$ End of Bruker specific parameters
$$ ---------------------------------
##NTUPLES= NMR SPECTRUM
##VAR_NAME=  FREQUENCY,     SPECTRUM/REAL,   SPECTRUM/IMAG
##SYMBOL=    X,             R,               I
##VAR_TYPE=  INDEPENDENT,   DEPENDENT,       DEPENDENT
##VAR_FORM=  AFFN,          ASDF,            ASDF
##VAR_DIM=   16384,         16384,           16384
##UNITS=     HZ,            ARBITRARY UNITS, ARBITRARY UNITS
##FACTOR=    0.220516191357247, 1,           1
##FIRST=     3153.18831321118, 0,            0
##LAST=      -459.528449794604, 0,           0
##MIN=       -459.528449794604, -157365,     0
##MAX=       3153.18831321118, 440052145,    0
$$ Real data points
##PAGE= N=1
##DATA TABLE= (X++(R..R)), XYDATA
$$ [...]
$$ plain form
8725 3693841 3899401 4072162 4350685 4625394 4935555 5256421 5727659 6363491 7132031 8284051
8715 8284051 9770406 11359666 12666818 13412554 13256130 12152990 10663563 9031149 7580048
8706 7580048 6566781 5885188 5323371 4935332 4660227 4359257 4177004 4019134 3873923
8697 3873923 3799516 3692038 3614560 3589808 3501848 3524590 3579721 3645694 3721978 3840593 4023415
8686 4023415 4184347 4400942 4644710 4991132 5399089 5868217 6553709 7399603 8583431
8677 8583431 10222783 12277717 14434837 15929968 16573881 16055578 14383595 12385701 10123070
8668 10123070 8249703 6859349 5778459 4979862 4398471 3953241 3671818 3428388 3159650
8659 3159650 2916704 2712364 2542655 2386752 2311361 2223463 2155212 2062413 1973644 1921107 1851015
$$ packed form
8725C693841K05560J72761K78523K74709L10161L20866M71238O35832P68540J152020
8715H284051J486355J589260J307152P45736j56424j103140j489427j632414j451101
8706G580048j013267o81593n61817l88039k75105l00970j82253j57870j45211
8697C873923p4407j07478p7478k4752q7960K2742N5131O5973P6284J18615J82822
8686D023415J60932K16595K43768L46422M07957M69128O85492Q45894J183828
8677H583431J639352K054934K157120J495131O43913n18303j671983j997894k262631
8668A0123070j873367j390354j080890p98597n81391m45230k81423k43430k68738
8659C159650k42946k04340j69709j55903p5391q7898o8251r2799q8769n2537p0092
$$ plain form
8648 1851015 1744672 1675816 1651595 1597000 1563154 1498184 1484957 1444503 1347348 1302458 1273179
8637 1273179 1327067 1296882 1230679 1193951 1216400 1184013 1127112 1123921 1097508 1079374 1098149 1089993
8625 1089993 1065040 1029699 1070394 1114752 1141206 1095556 1074806 1100952 1073870 1101824 1174842
8614 1174842 1229827 1301794 1408734 1484105 1495183 1501990 1484271 1431509 1395176 1285275 1219409
8603 1219409 1226817 1194104 1193033 1155006 1166830 1118086 1075672 1066765 1028516 971587 998855 944965
8591 944965 889908 882439 886830 925019 978895 982734 960235 980052 1051424 1119809 1206190 1251427
8579 1251427 1302154 1260384 1240272 1292655 1311570 1390998 1425171 1548520 1716653 1854907 2005245
8568 2005245 2014047 1847319 1669452 1494007 1355469 1238878 1208737 1182138 1116894 1092342 1078441
$$ packed form
8648A851015j06343o8856k4221n4595l3846o4970j3227m0454r7155m4890k9279
8637A273179N3888l0185o6203l6728K2449l2387n6901l191k6413j8134J8775q156
8625A089993k4953l5341M0695M4358K6454m5650k0750K6146k7082K7954P3018
8614A174842N4985P1967J06940P5371J1078O807j7719n2762l6333j09901o5866
8603A219409P408l2713j071l8027J1824m8744m2414q907l8249n6929K7268n3890
8591I44965n5057p469M391L8189N3876L839k2499J9817P1372O8385Q6381M5237
8579A251427N0727m1770k0112N2383J8915P9428L4173J23349J68133J38254J50338
8568B005245Q802j66728j77867j75445j38538j16591l0141k6599o5244k4552j3901
$$ plain form
8557 1078441 1024882 972185 980137 929711 896097 867189 809827 775538 809456 832597 846844 834391
8545 834391 810157 786107 774349 769416 759578 846613 870845 815948 822531 870143 827103 819157
8533 819157 809548 815911 819526 863074 848389 867725 903107 926760 920339 907971 913179 964784 1052926
8520 1052926 1071466 1039178 1097912 1076237 1111043 1152808 1118946 1124397 1123133 1142691 1200608 1240998
8508 1240998 1301437 1361818 1344049 1406647 1416623 1425735 1382589 1367570 1424977 1425662 1477405 1549750
8496 1549750 1654508 1741197 1827115 1858418 1906027 1989601 2079022 2126231 2184480 2260196 2292189
8485 2292189 2375474 2464537 2545258 2698552 2923016 3152978 3401059 3651406 3796739 3828134
8475 3828134 3786890 3687252 3643148 3682191 3790476 3965233 4199315 4440718 4730231 5113784
$$ packed form
8557A078441n3559n2697P952n0426l3614k8908n7362l4289L3918K3141J4247j2453
8545H34391k4234k4050j1758m933r838Q7035K4232n4897O583M7612m3040p946
8533H19157r609O363L615M3548j4685J9336L5382K3653o421j2368N208N1605Q8142
8520A052926J8540l2288N8734k1675L4806M1765l3862N451j264J9558N7917M0390
8508A240998O0439O0381j7769O2598R976R112m3146j5019N7407O85N1743P2345
8496A549750J04758Q6689Q5918L1303M7609Q3574Q9421M7209N8249P5716L1993
8485B292189Q3285Q9063Q0721J53294K24464K29962K48081K50347J45333L1395
8475C828134m1244r9638m4104L9043J08285J74757K34082K41403K89513L83553
$$ plain form
8465 5113784 5480558 6040643 6788700 7782664 9123614 10483385 11360426 11429452 10802530
8456 10802530 9823269 9065325 8702933 8826475 9382518 10269450 11008024 11048053 10393258 9178868
8446 9178868 7855653 6789124 5970058 5392773 4970049 4713903 4510789 4341763 4264995
8437 4264995 4210158 4160227 4069599 3926809 3836435 3839299 3833551 3895610 4028315 4126813 4326767
8426 4326767 4554565 4958431 5510161 6255579 7193619 8181540 8722625 8616063 7990805 7129274
8416 7129274 6552030 6332789 6419996 6836628 7454817 7904301 7744041 7118000 6098463 5038293
8406 5038293 4246508 3638523 3216260 2819276 2529928 2364187 2232761 2099984 1992602 1893597
8396 1893597 1752285 1645570 1563148 1491492 1433676 1344228 1323232 1202287 1165025 1131727 1100343
$$ packed form
8465E113784L66774N60085P48057R93964J340950J359771Q77041O9026o26922
8456A0802530r79261p57944l62392J23542N56043Q86932P38574M0029o54795j214390
8446I178868j323215j066529q19066n77285m22724k56146k03114j69026p6768
8437D264995n4837m9931r0628j42790r0374K864n748O2059J32705R8498J99954
8426D326767K27798M03866N51730P45418R38040R87921N41085j06562o25258q61531
8416G129274n77244k19241Q7207M16632O18189M49484j60260o26041j019537j060170
8406E038293p91785o07985m22263l96984k89348j65741j31426j32777j07382r9005
8396A893597j41312j06715q2422p1656n7816q9448k0996j20945l7262l3298l1384
$$ plain form
8385 1100343 1037106 1002691 964794 887011 856477 794026 788674 766713 737818 767475 738331 707380
8373 707380 702954 688192 643379 663221 623670 567963 593055 569430 583203 509501 473402 494184
8361 494184 499441 479432 480989 486980 485658 462329 411712 404615 380464 379190 430542 439833 454628
8348 454628 466735 395228 359186 302567 327947 358732 417587 453940 481256 474522 417357 387470
8336 387470 350535 332391 336650 333445 337695 337084 319142 302225 290052 294985 262141 237047 242394
8323 242394 223000 211629 185348 158244 181262 174017 200850 231444 224477 235627 218076 177604
8311 177604 172376 189548 182873 210984 247877 129771 119479 179042 180499 159510 195046 211491
8299 211491 252413 289060 229325 189488 147962 119137 136924 159863 172716 165012 108431 110096
$$ packed form
8385A100343o3237l4415l7897p7783l0534o2451n352k1961k8895K9657k9144l0951
8373G07380m426j4762m4813J9842l9551n5707K5092k3625J3773p3702l6099K0782
8361D94184N257k0009J557N991j322k3329n0617p097k4151j274N1352R291J4795
8348D54628J2107p1507l6042n6619K5380L0785N8855L6353K7316o734n7165k9887
8336C87470l6935j8144M259l205M250o11j7942j6917j2173M933l2844k5094N347
8323B42394j9394j1371k6281k7104K3018p245K6833L0594o967J1150j7551m0472
8311A77604n228J7172o675K8111L6893j18106j0292N9563J457k0989L5536J6445
8299B11491M0922L6647n9735l9837m1526k8825J7787K2939J2853p704n6581J665
$$ plain form
8287 110096 99514 94119 94121 131191 138654 129618 103892 126065 125024 76362 96288 123193 130049
8274 130049 118675 165087 140404 115603 128834 113387 97865 99743 69618 114449 154109 147352
8262 147352 125801 95134 120607 141933 108072 63820 48452 49950 66443 86431 72780 85196
8250 85196 75034 122052 142373 94623 80713 105458 55164 23972 35531 41761 42780 52291
8238 52291 23107 13939 25087 58723 76825 124421 81874 35565 35860 37266 37557 7260 13753
8225 13753 -2564 28833 36840 96963 64289 70689 34549 23213 3238 -2095 30835 64492
8213 64492 71771 55762 39319 63403 38884 -9019 -4851 56680 23640 60922 33253 27008
8201 27008 59862 57413 76757 39606 85853 52580 83993 103535 221186 235183 -35999 -35973
$$ packed form
8287A10096j0582n395KL7070P463r036k5726K2173j041m8662J9926K6905O856
8274A30049j1374M6412k4683k4801J3231j5447j5522J878l0125M4831L9660o757
8262A47352k1551l0667K5473K1326l3861m4252j5368J498J6493J9988j3651J2416
8250H5196j0162M7018K0321m7750j3910K4745n0294l1192J1559O230J019R511
8238E2291k9184r168J1148L3636J8102M7596m2547m6309K95J406K91l0297O493
8225A3753j6317L1397Q007O0123l2674O400l6140j1336j9975n333L2930L3657
8213F4492P279j6009j6443K4084k4519m7903M168O1531l3040L7282k7669o245
8201B7008L2854k449J9344l7151M6247l3273L1413J9542J17651J3997k71182K6
$$ plain form
8189 -35973 31555 -37543 -10311 3782 -43531 -9657 -9540 45379 43589 -16834 7979 8660 31409
8176 31409 23453 33681 27236 -5270 -11154 33886 -6509 -8849 7424 -5832 -34127 -38622 9261
8163 9261 27313 16539 4728 -22415 -6938 17212 -9405 -15251 -14693 2231 31950 13122 78727
8150 78727 83064 115930 99441 67733 45470 22951 21183 47129 82807 39654 -24240 -18393
8138 -18393 38179 3712 -19958 60619 94210 5497 -42895 -9258 -2943 21387 22873 5593
8126 5593 28919 48405 34146 -15083 11920 38951 92487 61356 71831 44239 43083 9815
8114 9815 -24975 -4786 -23221 -11560 14672 -11980 -8248 11313 -11363 -4839 15092 4386
8102 4386 29246 40630 66691 67209 47353 40560 32787 1550 -5541 8947 36761 42084 74635
$$ packed form
8189c5973O7528o9098K7232J4093m7313L3874J17N4919j790o0423K4813O81K2749
8176C1409p956J0228o445l2506n884M5040m0395k340J6273j3256k8295m495M7883
8163I261J8052j0774j1811k7143J5477K4150k6617n846N58J6924K9719j8828O5605
8150G8727M337L2866j6489l1708k2263k2519j768K5946L5678m3153o3894N847
8138a8393N6572l4467k3670Q0577L3591q8713m8392L3637O315K4330J486j7280
8126E593K3326J9486j4259m9229K7003K7031N3536l1131J0475k7592j156l3268
8114I815l4790K0189j8435J1661K6232k6652L732J9561k2676O524J9931j0706
8102D386K4860J1384K6061N18j9856o793p773l1237p091J4488K7814N323L2551
$$ plain form
8089 74635 52418 17809 43534 38626 96626 58859 74004 97011 52612 43942 74724 81648
8077 81648 75088 59794 72539 32607 73268 55011 257 12690 64645 64900 55091 105166 117029
8064 117029 72872 39907 34569 59617 37286 83057 103886 158616 155961 172219 203986 243764
8052 243764 265515 223362 231372 208504 230537 132776 94921 134867 155654 106255 57601 74443
8040 74443 123856 95588 88245 129169 110289 101056 113714 106676 105018 53677 24068 75984 123797
8027 123797 102819 67017 80986 91080 107736 124095 102314 110536 76275 108185 93681 95903
8015 95903 170658 175931 193397 227014 205221 181503 126731 76580 109764 99806 57396 36252
8003 36252 56101 116795 74195 66225 44449 6911 9845 81978 109883 84027 70680 -23912
$$ packed form
8089G4635k2217l4609K5725m908N8000l7767J5145K3007m4399q670L0782O924
8077H1648o560j5294J2745l9932M0661j8257n4754J2433N1955K55r809N0075J1863
8064A17029m4157l2965n338K5048k2331M5771K0829N4730k655J6258L1767L9778
8052B43764K1751m2153Q010k2868K2033r7761l7855L9946K0787m9399m8654J6842
8040G4443M9413k8268p343M0924j8880r233J2658p038j658n1341k9609N1916M7813
8027A23797k0978l5802J3969J0094J6656J6359k1781Q222l4261L1910j4504K222
8015I5903P4755N273J7466L3617k1793k3718n4772n0151L3184r958m2410k1144
8003C6252J9849O0694m2600p970k1776l7538K934P2133K7905k5856j3347r4592
$$ plain form
7991 -23912 -52697 -7304 28102 37614 20957 -2452 2153 -2438 28095 11137 8576 33584 48376
7978 48376 50297 834 3046 17856 -18364 -4754 5596 -25827 -61637 -26900 -46338 -17791
7966 -17791 -12583 -180 15386 -25314 -8782 -39151 -53807 31963 -5399 -73292 -57789 -30937
7954 -30937 -26723 -36128 -14923 -17732 -6516 -46979 -70439 -90252 -29378 -47973 -53953 -26804 -40328
7941 -40328 -34051 -26911 -27307 13366 7175 -7205 -11062 -31951 2378 -30056 -47383 -32300 4538
7928 4538 11704 3556 -13102 -20316 -36599 16181 -32738 -2327 7602 18473 -53295 -39432 15381
7915 15381 22488 55375 5335 46332 56510 49958 3294 -31472 -34023 -15393 -17699 -43596 -26739
7902 -26739 61 -18416 15124 -6833 -4189 -14047 -42019 -49177 -30324 -8768 2484 14825
$$ packed form
7991b3912k8785M5393L5406R512j6657k3409M605m591L0533j6958k561K5008J4792
7978D8376J921m9463K212J4810l6220J3610J0350l1423l5810L4737j9438K8547
7966a7791N208J2403J5566m0700J6532l0369j4656Q5770l7362o7893J5503K6852
7954c0937M214r405K1205k809J1216m0463k3460j9813O0874j8595n980K7149j3524
7941d0328O277P140l96M0673o191j4380l857k0889L4329l2434j7327J5083L6838
7928D538P166q148j6658p214j6283N2780m8919L0411R929J0871p1768J3863N4813
7915A5381P107L2887n0040M0997J0178o552m6664l4766k551J8630k306k5897J6857
7902b6739K6800j8477L3540k1957K644r858k7972p158J8853K1556J1252J2341
$$ plain form
7890 14825 -13497 -24531 -61044 -30360 -9551 -18739 22849 527 -42822 -58612 -17304 -56288
7878 -56288 -35657 -11103 32907 11831 -18278 -55362 -41558 -29673 -50138 11064 -7487 -6591
7866 -6591 15508 28005 -19771 -23316 -13572 -49674 -57148 -85197 -44525 -21856 -36886 9740 37957
7853 37957 2884 -52854 -71964 -38540 -46309 -32796 -30197 -38072 19295 -34452 -39830 -16062 -1233
7840 -1233 -646 -65414 -81376 2516 21166 8674 -2917 -7736 -37693 -69834 -38081 1522 35133
7827 35133 -2659 25300 23767 -25429 -26927 11197 7929 -31233 -11602 -52368 -54558 -24590 -11802
7814 -11802 13179 17531 -48812 -60902 -4727 -42320 -43834 -61753 -157365 -54235 -2409 20247
7802 20247 1053 2799 -10410 -13742 -34072 5604 -6558 -5977 11887 -28511 -31471 -87369 -32535
$$ packed form
7890A4825k8322j1034l6513L0684K0809r188M1588k2322m3349j5790M1308l8984
7878e6288K0631K4554M4010k1076l0109l7084J3804J1885k0465O1202j8551Q96
7866f591K2099J2497m7776l545R744l6102p474k8049M0672K2669j5030M6626K8217
7853C7957l5073n5738j9110L3424p769J3513K599p875N7367n3747n378K3768J4829
7840a233N87o4768j5962Q3892J8650j2492j1591m819k9957l2141L1753L9603L3611
7827C5133l7792K7959j533m9196j498L8124l268l9162J9631m0766k190K9968J2788
7814a1802K4981M352o6343j2090N6175l7593j514j7919r5612J03130N1826K2656
7802B0247j9194J746j3209l332k0330L9676j2162N81J7864m0398k960n5898N4834
$$ plain form
7789 -32535 -43089 -71439 -66662 -49011 14098 18254 -24467 -6205 3661 -12230 8587 31040
7777 31040 26097 37360 -6634 6417 -43021 -70757 -57108 -25437 32653 -2712 -11819 -32177
7765 -32177 -1505 31543 8341 40585 27649 -36319 -21942 -26946 -37031 -41273 -53772 -66235
7753 -66235 -50248 -22605 -7961 43239 10687 -19934 -27227 3957 -32506 -32954 -56402 -35536
7741 -35536 -33427 -34574 -19372 -10459 -27059 -6042 45307 -14792 -58051 -56592 -67742 -59752 -92438
7728 -92438 -84966 -105795 -53764 3869 9784 -5108 -56385 -56040 -113754 -127081 -112930 -14354 -59623
7715 -59623 -29428 -16233 -51396 -43021 -47982 -79898 -79365 -91799 -115489 -104027 -41255 -43597 -26635
7702 -26635 -55906 -46825 -48219 -37056 -16647 -17154 -12419 -34208 -27813 -57231 -13457 -32921 -39305
$$ packed form
7789c2535j0554k8350M777J7651O3109M156m2721J8262R866j5891K0817K2453
7777C1040m943J1263m3994J3051m9438k7736J3649L1671N8090l5365r107k0358
7765c2177L0672L3048k3202L2244j2936o3968J4377n004j0085m242j2499j2463
7753f6235J5987K7643J4644N1200l2552l0621p293L1184l6463m48k3448K0866
7741c5536K109j147J5202Q913j6600K1017N1349o0099m3259J459j1150P990l2686
7728i2438P472k0829N2031N7633N915j4892n1277L45n7714j3327J4151R8576m5269
7715e9623L0195J3195l5163Q375m961l1916N33j2434k3690J1462O2772k342J6962
7702b6635k9271R081j394J1163K0409n07M735k1789O395k9418M3774j9464o384
$$ plain form
7689 -39305 -24945 -48909 -31724 -25794 -33254 -17467 -8304 328 -38281 -43412 -54330 -7972 -536
7676 -536 -15493 -8468 -49052 -17931 45157 -31031 -4463 16927 32639 -8898 -32896 -15976
7664 -15976 -1286 18703 42798 63289 -19445 -51199 -29242 -41580 -19279 -15971 10577 41010
7652 41010 -28689 -32876 18475 -23192 -326 -36512 -49652 -6908 13691 -27756 -64563 -45166
7640 -45166 10648 21643 -34207 -26319 -55379 -64742 -63172 -61026 -40328 -54587 -61887 -22767 -15868
7627 -15868 16206 -8926 -13323 -7735 -13321 -14031 -3820 9993 18562 -22590 -2196 13850 -17339
7614 -17339 -20097 15330 10545 33736 33081 34170 -6661 21976 -55267 -94485 -72712 -94667 -42533
7601 -42533 -23193 4329 13094 -6534 -22427 772 38989 10632 -41005 -18555 -14343 -42978
$$ packed form
7689c9305J4360k3964J7185N930p460J5787R163Q632l8609n131j0918M6358P436
7676e36j4957P025m0584L1121O3088p6188K6568K1390J5712m1537k3998J6920
7664a5976J4690J9989K4095K0491q2734l1754K1957j2338K2301L308K6548L0433
7652D1010o9699m187N1351m1667K2866l6186j3140M2744K0599m1447l6807J9397
7640d5166N5814J0995n5850P888k9060r363J570K146K0698j4259p300L9120O899
7627a5868L2074k5132m397N588n586p10J0211J3813Q569m1152K0394J6046l1189
7614a7339k758L5427m785K3191o55J089m0831K8637p7243l9218K1773k1955N2134
7601d2533J9340K7522Q765j9628j5893K3199L8217k8357n1637K2450M212k8635
$$ plain form
7589 -42978 -63313 -30648 13240 17410 66039 34750 24908 -47623 -61975 -60560 -82685 -54889
7577 -54889 -54492 -53679 -45275 -23799 -12372 -32057 -39462 -50781 -67881 -27037 -796 -7282 347
7564 347 3495 -10169 -25805 -12181 15293 44993 33934 -36424 -66057 -60025 -16839 -36327 26171
7551 26171 36524 62550 23072 3067 -42106 -19949 -3102 -50381 -23398 -16409 5801 -10461
7539 -10461 -30922 -66772 -30185 -7756 2952 -33852 -59378 -15949 -13197 44662 43084 10839
7527 10839 -35902 -16187 -34355 -86189 -69992 -82742 -63219 -69211 -60145 -40117 -73663 -67696
7515 -67696 -73963 -1757 6556 -20989 -16809 -12905 -34269 -17111 -52384 -25336 -10917 -29373 -59537
7502 -59537 -66465 -63113 -106919 -98156 -39285 -20281 -11615 -13039 20012 41231 28899 5314 11651
$$ packed form
7589d2978k0335L2665M3888M170M8629l1289r842p2531j4352J415k2125K7796
7577e4889L97Q13Q404K1476J1427j9685p405j1319j7100M0844K6241o486P629
7564C47L148j3664j5636J3624K7474K9700j1059p0358k9633O032M3186j9488O2498
7551B6171J0353K6026l9478k0005m5173K2157J6847m7279K6983O989K2210j6262
7539a0461k0461l5850L6587K2429J0708l6804k5526M3429K752N7859j578l2245
7527A0839m6741J9715j8168n1834J6197j2750J9523n992R066K0028l3546N967
7515f7696o267P2206Q313k7545M180L904k1364J7158l5273K7048J4419j8456l0164
7502e9537o928L352m3806Q763N8871J9004Q666j424L3051K1219j2332k3585O337
$$ plain form
7489 11651 -46036 -99029 -74677 -57202 23803 12306 -34807 -38009 -12918 -54819 -58153 -63757
7477 -63757 -73488 -75585 -87144 -36081 18213 -16923 -16526 -26759 -10338 6324 -69239 -46956 11398
7464 11398 22089 18592 -15717 -26403 -58627 -33625 -62364 -23315 -42734 -16102 -42178 -38036
7452 -38036 -6482 -6329 -8627 -73532 -89930 -40328 -26946 7246 9061 -44150 -65480 18258 13968
7439 13968 -24855 -22977 -48064 -28586 -24597 43038 23584 6415 -21671 -82317 -52506 -84222
7427 -84222 -75679 -59493 -80565 -105862 -80513 -25745 -40521 -61013 3198 8949 -56340 -45649
7415 -45649 -65623 -48405 -87012 -82436 -33144 -30528 -32985 -31133 -34269 -25044 -14250 -16494 -3340
7402 -3340 23065 -41015 -21053 400 -36175 -2550 15320 11087 -11050 -31632 -54802 -97447
$$ packed form
7489A1651n7687n2993K4352J7475Q1005j1497m7113l202K5091m1901l334n604
7477f3757r731k097j1559N1063N4294l5136L97j0233J6421J6662p5563K2283N8354
7464A1398J0691l497l4309j0686l2224K5002k8739L9049j9419K6632k6076M142
7452c8036L1554J53k298o4905j6398M9602J3382L4192J815n3211k1330Q3738m290
7439A3968l8823J878k5087J9478L989O7635j9454j7169k8086o0646K9811l1716
7427h4222Q543J6186k1072k5297K5349N4768j4776k0492O4211N751o5289J0691
7415d5649j9974J7218l8607M576M9292K616k457J852l136R225J0794k244J3154
7402c340K6405o4080J9962K1453l6575L3625J7870m233k2137k0582k3170m2645
$$ plain form
7390 -97447 -79004 -49494 -55301 -34948 -27007 -45896 -79115 -71086 -51620 -47293 -42849 -25372 -6306
7377 -6306 10611 13018 -25143 1532 4034 19374 34674 28586 -23255 -84260 -51244 -48379 -11231
7364 -11231 17383 -36968 -32601 -14056 8203 -7720 7342 982 18052 -17837 -22442 -19485 21641
7351 21641 40217 -10152 -79575 -68086 -33520 -24079 -49294 -87641 -26583 -16107 -34943 -32509
7339 -32509 -37789 -29680 -5620 4380 -30669 -5173 5361 -4181 -27894 -14410 -6500 -8292 7575
7326 7575 -53845 -35523 -6225 25025 50462 7168 -51214 -3871 -5030 8772 7106 -29497
7314 -29497 -28587 40276 -19536 -23242 -40304 -4154 -27976 -30705 -7367 -13439 -18069 -3794 706
7301 706 32235 4960 15808 29541 -21365 17380 14924 -16497 -15469 -19921 -48232 -22545 13576
$$ packed form
7390i7447J8443K9510n807K0353P941j8889l3219Q029J9466M327M444J7477J9066
7377f306J6917K407l8161K6675K502J5340J5300o088n1841o1005L3016K865L7148
7364a1231K8614n4351M367J8545K2259j5923J5062o360J7070l5889m605K957M1126
7351B1641J8576n0369o9423J1489L4566R441k5215l8347O1058J0476j8836K434
7339c2509n280Q109K4060J0000l5049K5496J0534r542k3713J3484P910j792J5867
7326G575o1420J8322K9298L1250K5437m3294n8382M7343j159J3802j666l6603
7314b9497R10O8863n9812l706j7062L6150k3822k729K3338o072m630J4275M500
7301G06L1529k7275J0848J3733n0906L8745k456l1421J028m452k8311K5687L6121
$$ plain form
7288 13576 44546 14885 47086 68662 28673 27444 22083 30890 -8126 -37644 -26704 -32119 -36528
7275 -36528 -7351 -16079 -12590 49829 86223 44701 -6473 -4397 26122 31217 42192 51649 63799
7262 63799 60889 37844 12237 19962 89844 57978 50422 -5885 44779 59736 104625 129482
7250 129482 150167 102401 98330 90936 65299 84397 150526 160647 99940 50223 88971 165683
7238 165683 178155 148507 107126 100063 131666 172743 263432 294287 226654 191476 153877 166166
7226 166166 247178 228075 146779 154840 193657 208442 184799 188402 182031 140401 148308 157124 180855
7213 180855 148518 104312 113336 88174 75382 119112 106888 92755 133739 129869 104414 79343
7201 79343 37765 3338 25583 83882 83179 77428 80756 14908 15554 8966 17975 -11502 -16334 -13461
$$ packed form
7288A3576L0970k9661L2201K1576l9989j229n361Q807l9016k9518J0940n415m409
7275c6528K9177q728L489O2419L6394m1522n1174K076L0519N095J0975R457J2150
7262F3799k910k3045k5607P725O9882l1866p556n6307N0664J4957M4889K4857
7250A29482K0685m7766m071p394k5637J9098O6129J0121o0707m9717L8748P6712
7238A65683J2472k9648m1381p063L1603M1077R0689L0855o7633l5178l7599J2289
7226A66166Q1012j9103q1296Q061L8817J4785k3643L603o371m1630P907Q816K3731
7213A80855l2337m4206R024k5162j2792M3730j2224j4133M0984l870k5455k5071
7201G9343m1578l4427K2245N8299p03n751L328o5848O46o588R009k9477m832K873
$$ plain form
7187 -13461 4517 -27581 -71594 -75483 -12756 16931 41593 36255 22157 -19978 10966 -3351
7175 -3351 20502 31230 13432 -23280 -14431 59749 26999 -35994 -6577 -20557 -15425 -6562 20232
7162 20232 46531 -45954 -47746 -46955 30988 36585 -591 -41857 -5975 21117 -7712 -12170 33942
7149 33942 30369 -9566 -5227 -43571 -46530 3940 -911 -62560 -99118 -73463 -68198 -79135 -30472
7136 -30472 -7462 -9680 4666 -12210 -20733 -1610 -366 -53452 -28656 65456 55226 29171
7124 29171 -29308 16517 60493 -1181 -46584 -77422 -82591 11320 17354 2005 -7724 -29392
7112 -29392 -14882 17337 755 -33112 -6623 35486 44964 1889 18695 28305 1820 -14907
7100 -14907 14437 -2914 -6856 -12879 916 32717 28424 15705 55735 12872 -16533 -17994 -38025
$$ packed form
7187a3461J7978l2098m4013l889O2727K9687K4662n338j4098m2135L0944j4317
7175c351K3853J0728j7798l6712Q849P4180l2750o2993K9417j3980N132Q863K6794
7162B0232K6299r2485j792P91P7943N597l7176m1266L5882K7092k8829m458M6112
7149C3942l573l9935M339l8344k959N0470m851o1649l6558K5655N265j0937M8663
7136c0472K3010k218J4346j6876q523J9123J244n3086K4796R4112j0230k6055
7124B9171n8479M5825M3976o1674m5403l0838n169R3911O034j5349r729k1668
7112b9392J4510L2219j6582l3867K6489M2109R478m3075J6806R610k6485j6727
7100a4907K9344j7351l942o023J3795L1801m293j2719M0030m2863k9405j461k0031
$$ plain form
7087 -38025 -23443 -29745 -24949 -28897 13817 25619 875 -9387 -46562 -15197 -1215 -24743
7075 -24743 -6472 12842 4823 -12311 -11669 17231 22811 26193 -5907 -34186 -12290 -16245 -54730
7062 -54730 -37247 14639 -22406 20467 3856 -13513 4142 11953 37060 14816 47669 55701
7050 55701 57574 -12999 -41371 -85741 -52763 -38348 -30959 -19577 7102 -1100 2741 -5705 22677
7037 22677 -33367 3525 -3340 -63659 -65217 -20382 10189 -5330 19848 -8197 -9310 -22087
7025 -22087 41842 -45935 -30979 26513 9866 -4524 32030 -9005 -31618 -28680 -32541 -37210
7013 -37210 -15222 22659 -3246 5714 -7923 -42861 -15182 -5917 -6212 -36405 -31024 28269 13297
7000 13297 -16245 3890 -15287 13384 -8221 -23585 -42090 -38871 -27583 -48779 -46861 -27814
$$ packed form
7087c8025J4582o302M796l948M2714J1802k4744j0262l7175L1365J3982k3528
7075b4743J8271J9314q019j7134O42K8900N580L382l2100k8279K1896l955l8485
7062e4730J7483N1886l7045M2873j6611j7369J7655P811K5107k2244L2853Q032
7050E5701J873p0573k8372m4370L2978J4415P389J1382K6679q202L841q446K8382
7037B2677n6044L6892o865o0319j558M4835L0571j5519K5178k8045j113j2777
7025b2087O3929q7777J4956N7492j6647j4390L6554m1035k2613K938l861m669
7013c7210K1988L7881k5905Q960j3637l4938K7679R265k95l0193N381N9293j4972
7000A3297k9542K0135j9177K8671k1605j5364j8505L219J1288k1196J918J9047
$$ plain form
6988 -27814 -63884 -88143 -39964 -50246 -45045 -72827 -63688 -63225 -55677 -45576 -51899 -32252 -41540
6975 -41540 -39176 -10477 -35320 -70574 -22075 -11754 -73563 -55005 -1693 -18033 -12815 9205
6963 9205 -6688 -24724 15947 -35010 -63782 -21980 11752 12902 -5181 -7742 7163 22507
6951 22507 -2707 -21915 -17160 -1655 12518 -5215 -13463 -14945 16413 32902 7112 -28986
6939 -28986 -15435 6984 11194 2020 9397 -816 -12902 -12121 3948 6626 -65844 -39262 -4058
6926 -4058 -19892 -10948 57973 15038 22800 44677 57046 46075 18710 34045 21360 -12049
6914 -12049 854 29760 20040 3050 -7091 -64507 -87969 -60860 -64447 -4722 -9577 -5466 51990
6901 51990 38494 51659 -19358 -22329 38530 50270 30098 27778 6393 -36301 19558 41353
$$ packed form
6988b7814l6070k4259M8179j0282N201k7782R139M63P548J0101o323J9647r288
6975d1540K364K8699k4843l5254M8499J0321o1809J8558N3312j6340N218K2020
6963I205j5893j8036M0671n0957k8772M1802L3732J150j8083k561J4905J5344
6951B2507k5214j9208M755J5505J4173j7733q248j482L1358J6489k5790l6098
6939b8986J3551K2419M210r174P377j0213j2086P81J6069K678p2470K6582L5204
6926d058j5834Q944O8921m2935P762K1877J2369j0971k7365J5335j2685l3409
6914a2049J2903K8906r720j6990j0141n7416k3462K7109l587N9725m855M111N7456
6901E1990j3496J3165p1017k971O0859J1740k0172k320k1385m2694N5859K1795
$$ plain form
6889 41353 2199 6310 26764 27152 3361 -5850 -8884 15589 42945 95902 117322 63333 40363
6876 40363 43026 42246 73865 104533 65655 19733 -33834 713 56066 88015 77363 49705
6864 49705 41723 -5636 -53181 -32 19718 39468 67058 40000 21505 49229 74694 94604
6852 94604 98031 97882 74967 81552 73617 81932 65545 51262 34109 42204 54576 69984 57220
6839 57220 68043 102165 91464 110040 79166 75008 109367 139202 97744 61955 65605 76192
6827 76192 45486 44534 68334 73907 34293 95709 155396 117514 53162 32274 56358 61759 810
6814 810 17043 52829 36642 22037 30794 54573 5610 18109 23344 49725 44524 46623 15132
6801 15132 45539 8916 -21 -10484 5468 -18364 8386 69083 64634 101510 34262 57803
$$ packed form
6889D1353l9154M111K0454L88k3791r211l034K4473K7356N2957K1420n3989k2970
6876D0363K663p80L1619L0668l8878m5922n3567L4547N5353L1949j0652k7658
6864D9705p982m7359m7545N3149J9750J9750K7590k7058j8495K7724K5465J9910
6852I4604L427j49k2915O585p935Q315j6387j4283j7153Q095J2372J5408j2764
6839E7220J0823L4122j0701J8576l0874m158L4359K9835m1458l5789L650J0587
6827G6192l0706r52K3800N573l9614O1416N9687l7882o4352k0888K4084N401o0949
6814H10J6233L5786j6187j4605Q757K3779m8963J2499N235K6381n201K099l1491
6801A5132L0407l6623q937j0463J5952k3832K6750O0697m449L6876o7248K3541
$$ plain form
6789 57803 47743 11625 -15040 33332 27559 45087 -12084 63143 81377 81658 87926 75279 80315
6776 80315 66845 -442 34095 21510 -29551 -11476 -57101 -58298 -40799 -19691 -22276 -31322
6764 -31322 -29327 -43970 -59475 -74428 -6673 -22365 -31190 -11590 39588 40044 33454 15588 -11558
6751 -11558 -215 -30414 4042 -28070 -5832 6060 38265 49454 29290 39078 42392 -31040
6739 -31040 -3673 -36352 -11282 69418 67739 40187 48262 -6544 3299 -17180 -10342 25619 -2826
6726 -2826 -19026 25374 -8358 -29693 -32211 -40275 -13910 -14527 -3009 11992 18046 -4802 20354
6713 20354 -6196 -36771 16499 -18562 -3008 16994 -12365 -42166 -49112 -41654 24175 -2453
6701 -2453 1913 35645 5103 26702 29062 27089 13076 -62951 -60635 -37678 -44424 -18302 10081
$$ packed form
6789E7803j0060l6118k6665M8372n773J7528n7171P5227J8234K81O268j2647N036
6776H0315j3470o7287L4537j2585n1061J8075m5625j197J7499K1108k585r046
6764c1322J995j4643j5505j4953O7755j5692q825J9600N1178M56o590j7866k7146
6751a1558J1343l0199L4456l2112K2238J1892L2205J1189k0164R788L314p3432
6739c1040K7367l2679K5070Q0700j679k7552Q075n4806R843k0479O838L5961k8445
6726b826j6200M4400l3732k1335k518q064K6365o17J1518J5001O054k2848K5156
6713B0354k6550l0575N3270l5061J5554K0002k9359k9801o946P458O5829k6628
6701b453M366L3732l0542K1599K360j973j4013p6027K316K2957o746K6122K8383
$$ plain form
6688 10081 -1352 12063 12016 12537 -12242 -36657 -69197 5641 40780 67852 52576 -13237 -12554
6675 -12554 -19158 904 6502 10221 -17945 7211 -19166 -8088 -5105 -14185 30386 30855 -33046
6662 -33046 -9111 -14633 -8488 -51822 -2340 30770 45385 25772 -10507 3157 42495 26239
6650 26239 21954 53234 99148 33292 23307 9770 13467 66277 50792 37382 -7588 6209
6638 6209 29889 37256 38601 8421 31767 2917 8130 2444 15333 21153 4675 18639 -14145
6625 -14145 -49571 -16646 -25429 -926 6451 -9605 -31285 12363 10410 -44602 -19549 -6083
6613 -6083 -22706 -45918 -20008 -232 -5768 -41653 4088 -7668 -1207 14802 39041 41429 -21632
6600 -21632 -18321 -52426 -13304 14852 29085 4932 -13261 -2521 12437 15486 -7311 29090
$$ packed form
6688A0081j1433J3415m7N21k4779k4415l2540P4838L5139K7072j5276o5813O83
6675a2554o604K0062N598L719k8166K5156k6377J1078K983r080M4571M69o3901
6662c3046K3935n522O145m3334M9482L3110J4615j9613l6279J3664L9338j6256
6650B6239m285L1280M5914o5856r985j3537L697N2810j5485j3410m4970J3797
6638F209K3680P367J345l0180K3346k8850N213n686J2889N820j6478J3964l2784
6625a4145l5426L2925q783K4503P377j6056k1680M3648j953n5012K5053J3466
6613f083j6623k3212K5910J9776n536l5885M5741j1756O461J6009K4239K388o3061
6600b1632L311l4105L9122K8156J4233k4153j8193J0740J4958L049k2797L6401
$$ plain form
6588 29090 31199 61376 60123 64122 3484 -15518 6601 -16813 -10682 20665 -16190 59996 66276
6575 66276 2917 22379 13153 -2816 -15690 -22657 -19182 -33815 -64223 -52563 -41271 -19280
6563 -19280 -11166 -46323 9881 -2158 -9192 -58053 -85664 -5140 26935 10451 -7287 -75471
6551 -75471 -17737 50461 13702 -10042 97 7590 9381 -35911 -28629 23878 62711 20917
6539 20917 -7056 9769 30202 13329 -5909 1877 29368 28719 1065 -29959 -77434 -83026 -38727
6526 -38727 -5903 -17156 -21693 -9804 18785 61625 42145 91849 79000 7494 23650 14446
6514 14446 -22118 1297 33593 -23090 -16944 -7749 -6277 -37655 -48450 -23263 35067 11503
6502 11503 15489 41872 33944 12520 28027 42715 -3424 19107 44757 60082 84585 9689
$$ packed form
6588B9090K109L0177j253L999o0638j9002K2119k3414O131L1347l6855P6186O280
6575F6276o3359J9462r226j5969j2874o967L475j4633l0408J1660J1292K1991
6563a9280Q114l5157N6204j2039p034m8861k7611Q0524L2075j6484j7738o8184
6551g5471N7734O8198l6759k3744J0139P493J791m5292P282N2507L8833m1794
6539B0917k7973J6825K0433j6873j9238P786K7491o49k7654l1024m7475n592M4299
6526c8727L2824j1253m537J1889K8589M2840j9480M9704j2849p1506J6156r204
6514A4446l6564K3415L2296n6683O146R195J472l1378j0795K5187N8330k3564
6502A1503L986K6383p928k1424J5507J4688m6139K2531K5650J5325K4503p4896
$$ plain form
6490 9689 34185 2407 8224 7295 34222 30118 -7221 -15559 -23253 -45036 -26293 -1642 53
6477 53 -38674 -15778 33320 8507 38239 55313 73583 51258 50715 17283 -10334 -18575 -11943
6464 -11943 10072 -1959 53287 94034 15681 42539 44424 32043 -11583 5644 32666 43705
6452 43705 63617 74607 16919 62512 61027 -13202 -13785 -11939 2359 -24342 22784 -25471 -42268
6439 -42268 59201 58134 39588 38841 48111 81091 49045 -16412 -43991 -27549 -45630 -3400
6427 -3400 -11009 -22498 -38991 -69154 -49916 2961 15742 -9987 460 64901 30370 27145
6415 27145 -12599 12669 -25902 -24102 610 66706 70652 -20539 28898 9894 61002 68146
6403 68146 76171 84953 42259 91370 125143 102903 66167 23854 13678 -18569 -16760 -4228
$$ packed form
6490I689K4496l1778N817r29K6927m104l7339q338p694k1783J8743K4651J695
6477E3l8727K2896M9098k4813K9732J7074J8270k2325n43l3432k7617q241O632
6464a1943K2015j2031N5246M0747p8353K6858J885j2381m3626J7227K7022J1039
6452D3705J9912J0990n7688M5593j485p4229n83J846J4298k6701M7126m8255j6797
6439d2268J01469j067j8546p47R270L2980l2046o5457k7579J6442j8081M2230
6427c400p609j1489j6493l0163J9238N2877J2781k5729J0447O4441l4531l225
6415B7145l9744K5268l8571J800K4712O6096L946r1191M9437j9004N1108P144
6403F8146Q025Q782m2694M9111L3773k2240l6736m2313j0176l2247J809J2532
$$ plain form
6391 -4228 55151 73801 14564 -10518 -18917 19017 55617 82521 53714 54797 67906 32552
6379 32552 17784 81224 89229 79944 75154 9134 46740 56491 68160 97059 84744 73619 79365
6366 79365 79734 100273 85482 52043 47028 57549 26913 61866 57291 47849 28865 64699 76988
6353 76988 32513 -3187 31567 85465 -4273 34123 71339 23669 24363 -14188 15257 -17389
6341 -17389 56848 74734 55030 70800 23333 -8092 -3262 12458 18655 -4463 50133 51161
6329 51161 48614 33961 55367 97483 95815 42639 -2915 5172 81523 79988 64145 73582 45301
6316 45301 50042 23622 41156 -5242 45977 43362 107535 121530 79486 40704 30263 12792
6304 12792 29690 46536 38298 43333 52991 61558 59895 18897 -24783 -206 27986 6675 54852
$$ packed form
6391d228N9379J8650n9237k5082q399L7934L6600K6904k8807J083J3109l5354
6379C2552j4768O3440Q005r285m790o6020L7606R751J1669K8899j2315j1125N746
6366G9365L69K0539j4791l3439n015J0521l0636L4953m575r442j8984L5834J2289
6353G6988m4475l5700L4754N3898q9738L8396L7216m7670O94l8551K9445l2646
6341a7389P4237J7886j9704J5770m7467l1425M830J5720O197k3118N4596J028
6329E1161k547j4653K1406M2116j668n3176m5554Q087P6351j535j5843R437k8281
6316D5301M741k6420J7534m6398N1219k615O4173J3995m2044l8782j0441j7471
6304A2792J6898J6846q238N035R658Q567j663m0998m3680K4577K8192k1311M8177
$$ plain form
6291 54852 20510 -7857 46235 40457 49843 88181 71456 76681 109047 111765 98412 45602 58352
6278 58352 47587 -15955 29377 65549 69394 54506 84067 65166 60504 63278 44029 34044 33417
6265 33417 49060 24907 4323 7931 25798 -23079 21363 51571 104686 102300 65662 45994
6253 45994 28331 81940 90317 82808 54746 37085 -9548 8845 51827 88608 118059 100301
6241 100301 112250 81168 82487 70303 58866 50223 15588 20629 16056 -19297 44964 75857
6229 75857 39008 24695 -878 8150 80878 74829 -25531 -1554 34511 61551 57865 51739
6217 51739 47415 56881 28530 97309 69851 63528 88869 68755 113027 78425 60860 63642 66108
6204 66108 73637 96300 78806 76670 64686 61823 8758 4367 24015 46874 55186 21687 52613
$$ packed form
6291E4852l4342k8367N4092n778R386L8338j6725N225L2366K718j3353n2810J2750
6278E8352j0765o3542M5332L6172L845j4888K9561j8901m662K774j9249r985o27
6265C3417J5643k4153k0584L608J7867m8877M4442L0208N3115k386l6638j9668
6253D5994j7663N3609Q377p509k8062j7661m6633J8393M2982L6781K9451j7758
6241A00301J1949l1082J319j2184j1437q643l4635N041m573l5353O4261L0893
6229G5857l6849j4313k5573R028P2728o049j00360K3977L6065K7040l686o126
6217E1739m324R466k8351O8779k7458o323K5341k0114M4272l4602j7565K782K466
6204F6108P529K2663j7494k136j1984k863n3065m391J9648K2859Q312l3499L0926
$$ plain form
6191 52613 96653 88372 119293 95598 104869 75097 31298 23989 23880 50971 81154 95826 101693
6178 101693 41862 12508 49048 4398 -26900 10785 50228 107628 63323 -912 47924 104548
6166 104548 90206 11538 3138 62422 97714 77843 71824 137759 81099 32823 75758 62697
6154 62697 70830 50753 6575 40103 32419 10679 42386 65087 87498 76806 102264 71486
6142 71486 76485 89552 83393 34267 24961 29912 30760 61049 128801 95252 40663 96157 113192
6129 113192 106731 93089 64552 76999 62539 29165 62866 79726 65896 95336 83853 63481
6117 63481 110718 107353 43704 25587 99654 130749 107985 87233 99176 58245 57901 104064
6105 104064 82011 95973 140824 83178 87814 64454 67425 77332 71860 92075 87263 46392 41562
$$ packed form
6191E2613M4040q281L0921k3695R271k9772m3799p309j09K7091L0183J4672N867
6178A01693n9831k9354L6540m4650l1298L7685L9443N7400m4305o4235M8836N6624
6166A04548j4342p8668q400N9284L5292j9871o019O5935n6660m8276M2935j3061
6154F2697Q133k0077m4178L3528p684k1740L1707K2701K2411j0692K5458l0778
6142G1486M999J3067o159m9126r306M951Q48L0289O7752l3549n4589N5494J7035
6129A13192o461j3642k8537J2447j4460l3374L3701J6860j3830K9440j1483k0372
6117F3481M7237l365o3649j8117P4067L1095k2764k0752J1943m0931l44M6163
6105A04064k2053J3962M4851n7646M636k3360K971R907n472K0215m812m0871m830
$$ plain form
6092 41562 64034 41543 72703 69732 51994 70816 86921 66700 117755 84364 58430 95729
6080 95729 127720 106254 60586 142743 132699 156264 146688 97106 96879 103819 90797 96788 143782
6067 143782 151919 199877 154205 190938 177131 118801 135339 109886 111008 142749 193524 188884
6055 188884 184180 183426 163536 128383 139510 119117 64380 82067 80439 70674 106733 99360 119473
6042 119473 165975 139893 142894 67209 65689 131400 81298 68554 134864 67196 35021 94281
6030 94281 91298 90251 95921 130709 152734 119700 120653 129148 179851 139123 130818 126973 162256
6017 162256 154076 126955 138063 158997 195993 160874 179588 188259 203472 222287 221352 207657
6005 207657 179096 196453 198823 164384 211209 225644 199619 211485 202931 204060 194192 163283
$$ packed form
6092D1562K2472k2491L1160k971j7738J8822J6105k0221N1055l3391k5934L7299
6080I5729L1991k1466m5668Q2157j0044K3565r576m9582k27O940j3022N991M6994
6067A43782Q137M7958m5672L6733j3807n8330J6538k5453J122L1741N0775m640
6055A88884m704p54j9890l5153J1127k0393n4737J7687j628r765L6059p373K0113
6042A19473M6502k6082L001p5685j520O5711n0102j2744O6310o7668l2175N9260
6030I4281k983j047N670L4788K2025l3034R53Q495N0703m0728q305l845L5283
6017A62256q180k7121J1108K0934L6996l5119J8714Q671J5213J8815r35j3695
6005B07657k8561J7357K370l4439M6825J4435k6025J1866q554J129r868l0909
$$ plain form
5993 163283 189036 201013 190435 157602 183941 159694 139501 137683 107238 119397 137562 115695
5981 115695 195982 222107 164035 117846 148338 207642 210648 171928 170979 157538 140149 142116
5969 142116 147100 139484 204057 176664 116595 200789 176079 137650 136051 190592 180537 205975
5957 205975 169508 153967 182099 151844 136782 109688 95277 102308 123038 104722 139912 184207
5945 184207 151825 110596 162737 186584 141121 119399 134135 131282 115050 116827 134308 125578
5933 125578 107637 117666 148747 115597 133096 121360 124051 143490 176078 234590 221118 215398
5921 215398 194470 200230 197903 225000 219982 162145 132384 161306 226479 186474 131449 149972
5909 149972 173097 198341 194441 140384 180971 187918 199654 212297 131388 105993 76047 80287
$$ packed form
5993A63283K5753J1977j0578l2833K6339k4247k0193j818l0445J2159J8165k1867
5981A15695Q0287K6125n8072m6189L0492N9304L006l8720r49j3441j7389J967
5969A42116M984p616O4573k7393o0069Q4194k4710l8429j599N4541j0055K5438
5957B05975l6467j5541K8132l0255j5062k7094j4411P031K0730j8316L5190M4295
5945A84207l2382m1229N2141K3847m5463k1722J4736k853j6232J777J7481q730
5933A25578j7941J0029L1081l3150J7499j1736K691J9439L2588N8512j3472n720
5921B15398k0928N760k327K7097n018n7837k9761K8922O5173m0005n5025J8523
5909A49972K3125K5244l900n4057M0587O947J1736J2643q0909k5395k9946M240
$$ plain form
5897 80287 138548 175273 181418 136615 158949 185477 161998 155192 149709 148954 136414 171985 144437
5884 144437 109661 107083 127877 163725 172116 218325 197922 198523 245923 256486 234106 215819
5872 215819 223355 173087 155080 131449 103453 140913 162986 177685 167563 173616 209406 192413
5860 192413 160029 197727 201385 173288 198453 154729 141842 166815 194959 173999 175214 165360
5848 165360 177354 141294 93984 131915 144561 151563 224406 177551 214837 186302 173488 175207
5836 175207 169684 191407 174073 189881 191501 212604 189940 199368 212504 172815 193818 114806
5824 114806 109692 162720 130728 172068 208089 206100 208159 212839 260259 231839 206399 198136 144797
5811 144797 187448 245719 285521 226378 210879 254868 332266 303976 281003 278922 288925 241929
$$ packed form
5897H0287N8261L6725O145m4803K2334K6528k3479o806n483p55j2540L5571k7548
5884A44437l4776k578K0794L5848Q391M6209k0403O01M7400J0563k2380j8287
5872B15819P536n0268j8007k3631k7996L7460K2073J4699j0122O053L5790j6993
5860A92413l2384L7698L658k8097K5165m3724j2887K4973K8144k0960J215r854
5848A65360J1994l6060m7310L7931J2646P002P2843m6855L7286k8535j2814J719
5836A75207n523K1723j7334J5808J620K1103k2664R428J3136l9689K1003p9012
5824A14806n114N3028l1992M1340L6021j989K059M680M7420k8420k5440q263n3339
5811A44797M2651N8271L9802n9143j5499M3989P7398k8290k2973k081J0003m6996
$$ plain form
5799 241929 226707 163819 149434 219448 226881 211338 215347 225404 272783 293480 259576 249582
5787 249582 240348 242219 248268 273327 333192 332879 307492 329707 289514 268631 321506 337621 282846
5774 282846 279315 333950 307750 215067 229594 295303 315971 335168 326449 341359 336807 341879
5762 341879 333531 301340 263892 322294 353625 283318 238014 293808 325877 287081 296548 319812
5750 319812 355267 376307 319648 345171 307446 288086 284324 342852 361572 318015 367744 347474
5738 347474 365362 354362 340163 329114 321861 329587 308489 365038 391745 332600 347338 400989
5726 400989 384617 397757 400158 393349 386150 370861 372531 394896 404487 392893 354292 368491 415500
5713 415500 373503 363629 363913 409885 417069 373356 375787 397352 401975 389635 388846 422751 406964
$$ packed form
5799B41929j5222o2888j4385P0014P433j5543M009J0057M7379K0697l3904r994
5787B49582r234J871O049K5059N9865l13k5387K2215m0193k0883N2875J6115n4775
5774B82846l531N4635k6200r2683J4527O5709K0668J9197q719J4910m552N072
5762C41879q348l2191l7448N8402L1331p0307m5304N5794L2069l8796R467K3264
5750C19812L5455K1040n6659K5523l7725j9360l762N8528J8720m3557M9729k0270
5738C47474J7888j1000j4199j1049p253P726k1098N6549K6707n9145J4738N3651
5726D00989j6372J3140K401o809p199j5289J670K2365R591j1594l8601J4199M7009
5713D15500m1997r874K84M5972P184m3713K431K1565M623j2340p89L3905j5787
$$ plain form
5700 406964 393882 393954 394788 330838 372790 354428 377952 419555 432994 401455 389445 460954 490597
5687 490597 486007 483225 453047 463243 412379 407898 473290 487359 510315 531052 498583 460048
5675 460048 485133 458483 448865 522916 532539 529928 521950 465357 486913 500878 534728 591815
5663 591815 579457 536182 550321 528555 510882 578314 581108 585082 572150 584670 629300 565090
5651 565090 538808 616710 632323 606863 617021 643739 659139 674832 730973 693662 663520 681605
5639 681605 733368 756381 707514 732612 749445 707901 686161 704261 742890 747021 748625 727610
5627 727610 741878 787229 816996 794482 796687 815421 810821 819925 799116 824725 897226 887079
5615 887079 918123 955185 928889 916128 984329 1012391 1015682 1045616 1043249 1016422 1039221 1022861
$$ packed form
5700D06964j3082P2Q34o3950M1952j8362K3524M1603J3439l1539j2010P1509K9643
5687D90597m590k782l0178J0196n0864m481O5392J4069K2956K0737l2469l8535
5675D60048K5085k6650r618P4051R623k611p978n6593K1556J3965L3850N7087
5663E91815j2358m3275J4139k1766j7673O7432K794L974j2932J2520M4630o4210
5651E65090k6282P7902J5613k5460J0158K6718J5400J5693N6141l7311l0142J8085
5639F81605N1763K3013m8867K5098J6833m1544k1740J8100L8629M131J604k1015
5627G27610J4268M5351K9767k2514K205J8734m600R104k0809K5609P2501j0147
5615H87079L1044L7062k6296j2761O8201K8062L291K9934k367k6827K2799j6360
$$ plain form
5603 1022861 1025752 1024990 995285 985672 993681 1001046 974556 962704 952808 963621 955597 945936 958276
5590 958276 983073 978215 942444 966161 1014145 1048409 1054115 1079207 1105089 1084574 1087613 1066343
5578 1066343 1047114 1049646 1032395 1050974 1024598 1065396 1070746 1100293 1097853 1109243 1117918 1124041
5566 1124041 1133408 1066567 1052976 1070722 1106773 1131213 1109371 1117007 1154259 1156708 1178887 1152313
5554 1152313 1181050 1216087 1301472 1326708 1281953 1230642 1258987 1281467 1256626 1274386 1281337 1298182
5542 1298182 1325103 1281306 1323043 1303330 1333129 1370589 1358557 1331561 1365763 1376400 1450554
5531 1450554 1430145 1460965 1476218 1564673 1612651 1583414 1614653 1606080 1685575 1694320 1748248 1743464
5519 1743464 1779338 1780548 1857237 1853312 1863403 1877987 1860370 1862184 1843543 1853938 1875901 1918437
$$ packed form
5603A022861K891p62k9705r613Q009P365k6490j1852r896J0813q024r661J2340
5590I58276K4797m858l5771K3717M7984L4264N706K5092K5882k0515L039k1270
5578A066343j9229K532j7251J8579k6376M0798N350K9547k440J1390Q675O123
5566A124041R367o6841j3591J7746L6051K4440k1842P636L7252K449K2179k6574
5554A152313K8737L5037Q5385K5236m4755n1311K8345K2480k4841J7760O951J6845
5542A298182K6921m3797M1737j9713K9799L7460j2032k6996L4202J0637P4154
5531A450554k0409L0820J5253Q8455M7978k9237L1239q573P9495Q745N3928m784
5519A743464L5874J210P6689l925J0091J4584j7617J814j8641J0395K1963M2536
$$ plain form
5507 1918437 1925980 1984757 1993938 1960722 1966479 1953547 1983026 1944242 1921332 1932310 1963525 1984589
5495 1984589 1998012 1998905 2013782 2015694 2013545 2066520 2123964 2157117 2146740 2163510 2199704 2216174
5483 2216174 2308186 2309099 2363538 2400881 2433223 2490300 2511697 2572811 2624727 2633385 2625144 2646903
5471 2646903 2711860 2787250 2789287 2799162 2794055 2801256 2817754 2809402 2819127 2845969 2926866 2951553 2964521
5458 2964521 3012301 3051420 3091604 3120633 3181142 3262009 3301480 3310367 3357135 3462112 3533711
5447 3533711 3531104 3578746 3683619 3768103 3824888 3850905 3890027 3965223 4001987 4053612 4090113
5436 4090113 4135736 4122664 4179803 4205888 4245810 4351127 4379743 4447472 4559050 4549372 4575112
5425 4575112 4690282 4811896 4905690 4941770 5049698 5168375 5231213 5312768 5397757 5472967 5537081
$$ packed form
5507A918437P543N8777R181l3216N757j2932K9479l8784k2910J0978L1215K1064
5495A984589J3423Q93J4877J912k149N2975N7444L3153j0377J6770L6194J6470
5483B216174R2012R13N4439L7343L2342N7077K1397O1114N1916Q658q241K1759
5471B646903O4957P5390K037R875n107P201J6498q352R725K6842Q0897K4687J2968
5458B964521M7780L9119M0184K9029O0509Q0867L9471Q887M6768J04977P1599
5447C533711k607M7642J04873Q4484N6785K6017L9122P5196L6764N1625L6501
5436D090113M5623j3072N7139K6085L9922J05317K8616O7729J11578r678K5740
5425D575112J15170J21614R3794L6080J07928J18677O2838Q1555Q4989P5210O4114
$$ plain form
5414 5537081 5634563 5701109 5750028 5807234 5878525 5917600 6005978 6167939 6274900 6371897 6484992
5403 6484992 6620168 6780936 6932341 7013743 7104592 7289468 7423026 7545530 7695353 7820785
5393 7820785 8004683 8165302 8369903 8588723 8725479 8925715 9095561 9262642 9395035 9548285
5383 9548285 9730454 9953081 10119011 10284140 10462263 10666897 10878942 11112293 11374078 11601511
5373 11601511 11848423 12167413 12513851 12802127 13138266 13440524 13820483 14194231 14595251
5364 14595251 14997054 15443548 15900197 16347217 16856980 17364980 17827154 18391153 18931146
5355 18931146 19476831 20077355 20585641 21180997 21814840 22429993 23056973 23674481 24383907
5346 24383907 25147045 25911502 26668680 27400236 28241574 29154498 30114954 31106360 32053502
$$ packed form
5414E537081R7482O6546M8919N7206P1291L9075Q8378J61961J06961R6997J13095
5403F484992J35176J60768J51405Q1402R0849J84876J33558J22504J49823J25432
5393G820785J83898J60619K04601K18820J36756K00236J69846J67081J32393J53250
5383I548285J82169K22627J65930J65129J78123K04634K12045K33351K61785K27433
5373A1601511K46912L18990L46438K88276L36139L02258L79959L73748M01020
5364A4595251M01803M46494M56649M47020N09763N08000M62174N63999N39993
5355A8931146N45685O00524N08286N95356O33843O15153O26980O17508P09426
5346B4383907P63138P64457P57178P31556Q41338R12924R60456R91406R47142
$$ plain form
5337 32053502 33132856 34309803 35511411 36711571 38027182 39399933 40847580 42355755
5329 42355755 43893286 45475298 47061154 48861155 50767959 52695888 54760800 56937823
5321 56937823 59263359 61785590 64478105 67388097 70486270 73844963 77411290 81157149
5313 81157149 85055602 88992856 93106689 97253209 101383532 105427417 109218741 112610417
5305 112610417 115588890 118211328 120696748 123211135 125989296 129135279 132719792 136887525
5297 136887525 141736270 147462726 154272348 162278387 171640140 182631409 195387594 210086424
5289 210086424 226833146 245665534 266229492 288139867 310786165 333542704 356001631
5282 356001631 377761351 398230342 416280783 430347574 438763103 440052145 433006616
$$ packed form
5337C2053502J079354J176947J201608J200160J315611J372751J447647J508175
5329D2355755J537531J582012J585856J800001J906804J927929K064912K177023
5321E6937823K325536K522231K692515K909992L098173L358693L566327L745859
5313H1157149L898453L937254M113833M146520M130323M043885L791324L391676
5305A12610417K978473K622438K485420K514387K778161L145983L584513M167733
5297A36887525M848745N726456O809622Q006039R361753J0991269J2756185J4698830
5289B10086424J6746722J8832388K0563958K1910375K2646298K2756539K2458927
5282C56001631K1759720K0468991J8050441J4066791Q415529J289042p045529
$$ plain form
5275 433006616 417637090 395000988 367314977 337358950 307479930 279287413 253488163
5268 253488163 230387235 209949264 191952730 176057285 162062064 149676692 138669869
5261 138669869 128826330 120071432 112256482 105117960 98719141 92925898 87707877 82916451
5253 82916451 78492782 74574414 70892338 67525449 64368508 61389511 58623044 56057651
5245 56057651 53604487 51359168 49243206 47206198 45372834 43637959 41962571 40338094
5237 40338094 38775528 37329458 35975614 34718891 33516193 32366422 31288723 30298403
5229 30298403 29263556 28301807 27427162 26656705 25934950 25195597 24480811 23796400 23142069
5220 23142069 22495290 21939972 21392745 20850604 20338010 19876766 19380316 18884977 18416798
$$ packed form
5275D33006616j5369526k2636102k7686011k9956027k9879020k8192517k5799250
5268B53488163k3100928k0437971j7996534j5895445j3995221j2385372j1006823
5261A38669869r843539q754898p814950p138522o398819n793243n218021m791426
5253H2916451m423669l918368l682076l366889l156941k978997k766467k565393
5245E6057651k453164k245319k115962k037008j833364j734875j675388j624477
5237D0338094j562566j446070j353844j256723j202698j149771j077699r90320
5229C0298403j034847r61749q74645p70457p21755p39353p14786o84411o54331
5220B3142069o46779n55318n47227n42141n12594m61244m96450m95339m68179
$$ plain form
5211 18416798 17969073 17584316 17213633 16772726 16406939 15964571 15619890 15301386 14905113
5202 14905113 14629588 14312464 13923479 13633202 13339298 12996150 12718365 12488831 12188542
5193 12188542 11946437 11685578 11422519 11158909 10883030 10629329 10459553 10281209 10004346
5184 10004346 9781242 9580466 9342045 9124623 8958471 8781597 8569491 8388676 8162797
5175 8162797 7969733 7827143 7640913 7504345 7379451 7177708 7029130 6909367 6764301 6652050
5165 6652050 6576863 6545887 6387344 6247270 6154177 6134267 6029964 5963572 5827313 5770005 5734387
5154 5734387 5629196 5526186 5465513 5447619 5346549 5229802 5135575 5114602 5019953 4932419 4865033
5143 4865033 4749572 4704195 4637421 4537559 4456296 4413094 4321039 4244747 4210252 4142394 4069270
$$ packed form
5211A8416798m47725l84757l70683m40907l65787m42368l44681l18504l96273
5202A4905113k75525l17124l88985k90277k93904l43148k77785k29534l00289
5193A2188542k42105k60859k63059k63610k75879k53701j69776j78344k76863
5184A0004346k23104k00776k38421k17422j66152j76874k12106j80815k25879
5175H162797j93064j42590j86230j36568j24894k01743j48578j19763j45066j12251
5165F652050p5187l0976j58543j40074r3093j9910j04303o6392j36259n7308l5618
5154E734387j05191j03010o0673j7894j01070j16747r4227k0973r4649q7534o7386
5143D865033j15461m5377o6774r9862q1263m3202r2055p6292l4495o7858p3124
$$ plain form
5132 4069270 4078833 4073341 3985664 3921916 3893175 3859920 3852976 3720961 3613401 3590948 3545907 3531416
5120 3531416 3504481 3428132 3369179 3381251 3320014 3259687 3214610 3133310 3087953 3126085 3105899
5109 3105899 3078835 3030246 3045748 3034621 2975351 2887984 2891405 2861702 2825923 2746323 2727184 2702014
5097 2702014 2655462 2634535 2559455 2568555 2574185 2534519 2497628 2424259 2353161 2267643 2272338 2291828
5085 2291828 2184875 2145775 2132530 2115816 2091656 2065213 2099532 2080110 2041317 2054326 2072277
5074 2072277 2046209 2050624 2016767 2032467 2000502 1982957 1932048 1888276 1922720 1910735 1911460 1901866
5062 1901866 1900729 1878432 1853640 1793554 1746040 1707806 1692285 1642063 1583982 1550773 1515717 1476382
5050 1476382 1521187 1534921 1517230 1507048 1497220 1444232 1427624 1435189 1406978 1381768 1440108 1472537
$$ packed form
5132D069270R563n492q7677o3748k8741l3255o944j32015j07560k2453m5041j4491
5120C531416k6935p6349n8953J2072o1237o0327m5077q1300m5357L8132k0186
5109C105899k7064m8589J5502j1127n9270q7367L421k9703l5779p9600j9139k5170
5097B702014m6552k0927p5080R100N630l9666l6891p3369p1098q5518M695J9490
5085B291828j06953l9100j3245j6714k4160k6443L4319j9422l8793J3009J7951
5074B072277k6068M415l3857J5700l1965j7545n0909m3772L4444j1985P25r594
5062A901866j137k2297k4792o0086m7514l8234j5521n0222n8081l3209l5056l9335
5050A476382M4805J3734j7691j0182r828n2988j6608P565k8211k5210N8340L2429
$$ plain form
5038 1472537 1432884 1427207 1389674 1350494 1376135 1387039 1347460 1329550 1334614 1334839 1378327 1342704
5026 1342704 1371412 1377948 1357805 1447805 1485216 1396994 1413507 1417933 1415004 1409812 1337458 1341281
5014 1341281 1332618 1375589 1416604 1375666 1328666 1316969 1308111 1322612 1346723 1363007 1352410 1363531
5002 1363531 1459825 1415796 1320608 1349427 1354990 1409521 1403039 1372122 1385163 1375895 1373859 1314828
4990 1314828 1315661 1311616 1280909 1289299 1331562 1322606 1359815 1329657 1345754 1357142 1331184 1363928
4978 1363928 1366509 1381303 1336632 1360396 1370790 1426713 1435317 1457304 1447209 1431379 1426846 1454149
4966 1454149 1475262 1459878 1465506 1486411 1457762 1478288 1498976 1520847 1506985 1524089 1525596 1488827
4954 1488827 1476618 1438497 1410343 1417432 1459032 1367183 1369969 1341816 1368023 1383216 1383768 1361614
$$ packed form
5038A472537l9653n677l7533l9180K5641J0904l9579j7910N064K25M3488l5623
5026A342704K8708O536k0143R0000L7411q8222J6513M426k929n192p2354L823
5014A341281q663M2971M1015m0938m7000j1697q858J4501K4111J6284j0597J1121
5002A363531R6294m4029r5188K8819N563N4531o482l0917J3041r268k036n9031
4990A314828Q33m045l0707Q390M2263q956L7209l0158J6097J1388k5958L2744
4978A363928K581J4794m4671K3764J0394N5923Q604K1987j0095j5830m533K7303
4966A454149K1113j5384N628K0905k8649K0526K0688K1871j3862J7104J507l6769
4954A488827j2209l8121k8154P089M1600r1849K786k8153K6207J5193N52k2154
$$ plain form
4942 1361614 1306413 1340014 1338744 1327397 1270977 1220663 1242947 1231807 1260372 1249825 1256360 1286829
4930 1286829 1265305 1265061 1304884 1265436 1242614 1311763 1314412 1326492 1374282 1365065 1374563 1363814
4918 1363814 1332837 1363770 1401250 1444082 1434503 1429678 1453906 1439146 1431815 1475397 1533722 1570998
4906 1570998 1624374 1610483 1602671 1677129 1733075 1747758 1736484 1773468 1752807 1766047 1749589 1731843
4894 1731843 1678495 1634159 1589351 1530128 1553486 1529921 1456839 1453194 1496442 1458739 1380940 1377175
4882 1377175 1339748 1291245 1287400 1312422 1293147 1272223 1237862 1292684 1276208 1251603 1202133 1167059
4870 1167059 1163700 1125186 1158258 1178191 1122306 1104008 1147843 1126933 1096998 1072064 1056586 1086896
4858 1086896 1077313 1071269 1074965 1025690 1021831 995722 974628 969106 957690 967854 995016 990606 1043625
$$ packed form
4942A361614n5201L3601j270j1347n6420n0314K2284j1140K8565j0547O535L0469
4930A286829k1524k44L9823l9448k2822O9149K649J2080M7790r217R498j0749
4918A363814l0977L0933L7480M2832r579m825K4228j4760p331M3582N8325L7276
4906A570998N3376j3891p812P4458N5946J4683j1274L6984k0661J3240j6458j7746
4894A731843n3348m4336m4808n9223K3358k3565p3082l645M3248l7703p7799l765
4882A377175l7427m8503l845K5022j9275k0924l4361N4822j6476k4605m9470l5074
4870A167059l359l8514L3072J9933n5885j8298M3835k0910k9935k4934j5478L0310
4858A086896r583o044L696m9275l859k6109k1094n522j1416J0164K7162m410N3019
$$ plain form
4845 1043625 1003436 1019604 995071 978583 990232 959516 953432 940150 924221 930612 945824 912056
4833 912056 902392 921120 915268 937954 970431 943983 934577 959774 979586 978124 975629 949652 938882
4820 938882 899480 918013 930295 922119 917984 933817 977921 923900 970625 1007247 956497 956592 969941
4807 969941 974201 891680 904361 922822 967436 1013535 942826 973655 997079 1069823 1070977 1030415
4795 1030415 1031596 1042008 1085516 1074174 1076451 1106223 1115680 1073767 1118931 1142052 1078809 1033542
4783 1033542 1040847 1102666 1056243 1085303 1092219 1068648 1096008 1069135 1063503 1086265 1063334 1036124
4771 1036124 1045511 1070749 1076057 1097209 1073769 1090882 1097248 1111971 1092939 1106918 1085090 1087346
4759 1087346 1093782 1085313 1101598 1103551 1103932 1105894 1124063 1198293 1201578 1214772 1203117 1210797 1245016
$$ packed form
4845A043625m0189J6168k4533j6488J1649l0716o084j3282j5929O391J5212l3768
4833I12056r664J8728n852K2686L2477k6448r406K5197J9812j462k495k5977j0770
4820I38882l9402J8533J2282q176m135J5833M4104n4021M6725L6622n0750R5J3349
4807I69941M260q2521J2681J8461M4614M6099p0709L0829K3424P2744J154m0562
4795A030415J181J0412M3508j1342K277K9772R457m1913M5164K3121o3243m5267
4783A033542P305O1819m6423K9060O916k3571K7360k6873n632K2762k2931k7210
4771A036124R387K5238N308K1152k3440J7113O366J4723j9032J3979k1828K256
4759A087346O436q469J6285J953L81J962J8169P4230L285J3194j1655P680L4219
$$ plain form
4746 1245016 1250145 1272330 1236638 1268947 1225948 1255417 1268682 1282723 1284120 1318080 1370674 1420215
4734 1420215 1421301 1401941 1390402 1423097 1445174 1485326 1509401 1556594 1612771 1623404 1610437 1627762
4722 1627762 1604316 1595125 1661184 1687480 1747011 1827236 1827359 1814589 1850230 1910968 1966439 2058305
4710 2058305 2068424 2115704 2112200 2138319 2201291 2240468 2319668 2376480 2429171 2493126 2503903 2580048
4698 2580048 2660399 2681311 2761750 2848198 2900520 2985225 3060893 3141800 3235091 3333453 3399099
4687 3399099 3496969 3662723 3763818 3893619 4020773 4227126 4384609 4559442 4681843 4846601
4677 4846601 5027877 5234436 5494759 5669796 5809821 5957710 6190211 6348522 6458931 6711864
4667 6711864 6952121 7220173 7432461 7588475 7804042 8061742 8293134 8520232 8735210 8962950
$$ packed form
4746A245016N129K2185l5692L2309m2999K9469J3265J4041J397L3960N2594M9541
4734A420215J086j9360j1539L2695K2077M0152K4075M7193N6177J0633j2967J7325
4722A627762k3446r191O6059K6296N9531Q0225J23j2770L5641O0738N5471R1866
4710B058305J0119M7280l504K6119O2972L9177P9200N6812N2691O3955J0777P6145
4698B580048Q0351K0912Q0439Q6448N2322Q4705P5668Q0907R3291R8362O5646
4687C399099R7870J65754J01095J29801J27154K06353J57483J74833J22401J64758
4677D846601J81276K06559K60323J75037J40025J47889K32501J58311J10409K52933
4667F711864K40257K68052K12288J56014K15567K57700K31392K27098K14978K27740
$$ plain form
4657 8962950 9197605 9382339 9547178 9705323 9905100 10173035 10475702 10815151 11224167 11635979
4647 11635979 12102159 12639648 13231270 13795853 14483681 15176881 15832276 16531957 17216315
4638 17216315 17904621 18533671 19082926 19621275 20037240 20381859 20711030 21037500 21418026
4629 21418026 21768344 22215142 22691928 23232417 23827509 24451819 25118902 25856256 26567401
4620 26567401 27196170 27815138 28316130 28655377 28944091 29181075 29385831 29612296 29825882
4611 29825882 30062950 30371169 30564922 30603225 30569116 30282167 29625777 28727678 27574034 26264722
4601 26264722 24949708 23664690 22541199 21671535 20958474 20488595 20255930 20256629 20425629
4592 20425629 20726316 21064433 21172569 20843814 20189470 19175556 17985331 16771270 15492408
$$ packed form
4657H962950K34655J84734J64839J58145J99777K67935L02667L39449M09016M11812
4647A1635979M66180N37489N91622N64583O87828O93200O55395O99681O84358
4638A7216315O88306O29050N49255N38349M15965L44619L29171L26470L80526
4629B1418026L50318M46798M76786N40489N95092O24310O67083P37354P11145
4620B6567401O28769O18968N00992L39247K88714K36984K04756K26465K13586
4611B9825882K37068L08219J93753L8303l4109k86949o56390q98099j153644j309312
4601B6264722j315014j285018j123491q69664p13061m69879k32665O99J69000
4592B0425629L00687L38117J08136l28755o54344j013914j190225j214061j278862
$$ plain form
4583 15492408 14420909 13433086 12570610 11842234 11274734 10801473 10336746 9999870 9735412
4574 9735412 9475372 9242164 9067710 9016812 8947618 8823108 8715310 8600949 8423926 8193501
4564 8193501 7956481 7718016 7389594 7076691 6765708 6483074 6301057 6120735 5960703 5830505
4554 5830505 5703586 5600008 5483131 5384830 5206623 5050329 4882725 4705248 4536558 4389573
4544 4389573 4209842 4055891 3939931 3816332 3718945 3575478 3531829 3378622 3307960 3192164
4534 3192164 3121153 3036664 2915499 2908050 2847569 2802049 2740820 2679595 2610265 2519139 2513720 2537544
4522 2537544 2439162 2381006 2342592 2293887 2270819 2256572 2268607 2225266 2206573 2142251 2114697
4511 2114697 2129060 2108461 2093142 2082045 2051594 1979007 1997995 1984287 1989756 1999729 1988454 1960890
$$ packed form
4583A5492408j071499r87823q62476p28376n67500m73261m64727l36876k64458
4574I735412k60040k33208j74454n0898o9194j24510j07798j14361j77023k30425
4564H193501k37020k38465l28422l12903l10983k82634j82017j80322j60032j30198
4554E830505j26919j03578j16877r8301j78207j56294j67604j77477j68690j46985
4544D389573j79731j53951j15960j23599r7387j43467m3649j53207p0662j15796
4534C192164p1011q4489j21165p449o0481m5520o1229o1225o9330r1126n419K3824
4522B537544r8382n8156l8414m8705k3068j4247J2035m3341j8693o4322k7554
4511B114697J4363k0599j5319j1097l0451p2587J8988j3708N469R973j1275k7564
$$ plain form
4499 1960890 1958548 2006861 1959716 1875596 1899158 1918327 1913088 1923277 1928827 1899386 1897261 1909624
4487 1909624 1889246 1874514 1881898 1903506 1946109 1924425 1970459 1970921 1926161 1928763 1945977 1973738
4475 1973738 1984125 1971988 1923661 1949351 1952895 1927738 1974771 1894733 1877646 1888056 1905118 1944552
4463 1944552 1947731 2001123 2001835 2040110 2057205 2058202 2111574 2185871 2230926 2197159 2233979 2301792
4451 2301792 2333217 2398658 2359010 2352216 2309241 2241431 2251933 2243686 2220270 2179597 2193837 2152744
4439 2152744 2146130 2205859 2186182 2234087 2263019 2308887 2358607 2370461 2386235 2395029 2455746 2582081
4427 2582081 2594465 2611234 2689801 2680735 2714480 2795404 2844165 2857849 2869413 2884882 2896571 2975047
4415 2975047 2975854 3007413 3022232 3059451 3105217 3142031 3186877 3238680 3360204 3431980 3533004
$$ packed form
4499A960890k342M8313m7145q4120K3562J9169n239J0189N550k9441k125J2363
4487A909624k0378j4732P384K1608M2603k1684M6034M62m4760K602J7214K7761
4475A973738J0387j2137m8327K5690L544k5157M7033q0038j7087J0410J7062L9434
4463A944552L179N3392P12L8275J7095R97N3372P4297M5055l3767L6820O7813
4451B301792L1425O5441l9648o794m2975o7810J0502q247k3416m0673J4240m1093
4439B152744o614N9729j9677M7905K8932M5868M9720J1854J5774Q794O0717J26335
4427B582081J2384J6769P8567r066L3745Q0924M8761J3684J1564J5469J1689P8476
4415B975047Q07L1559J4819L7219M5766L6814M4846N1803J21524P1776J01024
$$ plain form
4404 3533004 3600248 3654610 3778728 3919435 4111948 4241685 4430278 4581571 4767822 4955715
4394 4955715 5210319 5517687 5842026 6169984 6508919 6852171 7140410 7358055 7527764 7832722
4384 7832722 8201076 8605991 9083885 9591207 10013482 10344524 10621692 10985228 11479889 12196653
4374 12196653 12994650 13781573 14359586 14708409 14802708 14765217 14948306 15378332 16074874 16853588
4364 16853588 17401357 17487523 17093169 16458463 15844058 15486169 15405115 15569470 15704993 15627914
4354 15627914 15253653 14637705 14019456 13478189 13147034 13014554 12874262 12717612 12478684
4345 12478684 12153251 11791331 11373030 11090668 10884092 10758421 10724227 10735229 10804926 10934286
4335 10934286 11120638 11318675 11528815 11760954 12055774 12408041 12762782 13191030 13682713
$$ packed form
4404C533004O7244N4362J24118J40707J92513J29737J88593J51293J86251J87893
4394D955715K54604L07368L24339L27958L38935L43252K88239K17645J69709L04958
4384G832722L68354M04915M77894N07322M22275L31042K77168L63536M94661P16764
4374A2196653P97997P86923N78013L48823R4299l7491J83089M30026O96542P78714
4364A6853588N47769Q6166l94354o34706o14405l57889q1054J64355J35523p7079
4354A5627914l74261o15948o18249n41267l31155j32480j40292j56650k38928
4345A2478684l25433l61920m18301k82362k06576j25671l4194J1002O9697J29360
4335A0934286J86352J98037K10140K32139K94820L52267L54741M28248M91683
$$ plain form
4326 13682713 14122639 14578630 15165960 15836583 16571198 17452697 18417937 19599588 20974130
4317 20974130 22530183 24346853 26534635 29020782 31980240 35616230 39984659 45033977
4309 45033977 50812052 56790458 61953570 64883825 64577856 61175826 55610878 49238803
4301 49238803 43149391 37787798 33340955 29682439 26703303 24240761 22192869 20460022
4293 20460022 18958582 17688082 16491923 15479461 14535992 13690066 12992647 12347121 11766058
4284 11766058 11245265 10771079 10330803 9949286 9509090 9089729 8746177 8307835 7936880
4275 7936880 7667548 7410946 7166340 6987722 6809421 6686208 6551240 6419088 6365438 6344426
4265 6344426 6309137 6303085 6257962 6201634 6072540 5882753 5705541 5510006 5257562 5057952
$$ packed form
4326A3682713M39926M55991N87330O70623P34615Q81499R65240J181651J374542
4317B0974130J556053J816670K187782K486147K959458L635990M368429N049318
4309D5033977N778075N978406N163112K930255l05969l402030n564948o372075
4301D9238803o089412n361593m446843l658516k979136k462542k047892j732847
4293B0460022j501440j270500j196159j012462r43469q45926o97419o45526n81063
4284A1766058n20793m74186m40276l81517m40196m19361l43552m38342l70955
4275G936880k69332k56602k44606j78618j78301j23213j34968j32152n3650k1012
4265F344426l5289o052m5123n6328j29094j89787j77212j95535k52444j99610
$$ plain form
4255 5057952 4847022 4682215 4522401 4404066 4298827 4169452 4084242 4016318 3973094 3906311
4245 3906311 3893819 3857233 3832192 3788389 3818493 3893985 3953287 3995631 3959040 4001964 4021775
4234 4021775 4029415 4017221 3981933 3946024 3846180 3793273 3746278 3630952 3546594 3458019 3372635
4223 3372635 3329228 3315469 3308346 3298930 3343740 3361070 3345195 3297544 3241064 3238437 3229893 3223403
4211 3223403 3227456 3185598 3092536 3079640 3048052 3056465 2994857 2935278 2916210 2804232 2722806 2648442
4199 2648442 2474643 2354198 2304434 2239166 2242480 2207116 2158998 2133105 2116771 2153069 2092194
4188 2092194 2079350 2103137 2110582 2106999 2109739 2104773 2110667 2112570 2107234 2132591 2102602 2091916 2073032
4175 2073032 2021391 1999675 1898686 1812595 1753751 1689856 1696695 1662182 1663963 1636846 1651947 1702056
$$ packed form
4255E057952k10930j64807j59814j18335j05239j29375q5210o7924m3224o6783
4245C906311j2492l6586k5041m3803L0104P5492N9302M2344l6591M2924J9811
4234D021775P640j2194l5288l5909r9844n2907m6995j15326q4358q8575q5384
4223C372635m3407j3759p123r416M4810J7330j5875m7651n6480k627q544o490
4211C223403M053m1858r3062j2896l1588Q413o1608n9579j9068j11978q1426p4364
4199B648442j73799j20445m9764o5268L314l5364m8118k5893j6334L6298o0875
4188B092194j2844K3787P445l583K740m966N894J903n336K5357k9989j0686j8884
4175B073032n1641k1716j00989q6091n8844o3895O839l4513J781k7117J5101N0109
$$ plain form
4163 1702056 1755539 1774757 1803948 1839943 1872912 1914952 1960654 1916231 1914558 1943084 2019782 2123869
4151 2123869 2309272 2502628 2626023 2597879 2481357 2304794 2111397 1984813 1948938 1903138
4141 1903138 1806973 1755533 1794669 1770132 1683227 1630662 1587647 1597920 1575683 1512442 1492345
4130 1492345 1516624 1589715 1592554 1563701 1598226 1560335 1512102 1550080 1602781 1581176 1587293 1635368
4118 1635368 1727129 1813400 1879429 1952603 2072691 2180381 2334464 2571348 2808291 3098904
4108 3098904 3401926 3732318 3915324 3870644 3660397 3338723 2972153 2685290 2412870 2184026
4098 2184026 2001129 1808145 1687420 1599360 1516103 1391838 1336247 1274071 1211218 1208283 1156301
4087 1156301 1122445 1118880 1086992 995738 962549 898912 906116 924540 887067 940070 916265 964949
$$ packed form
4163A702056N3483J9218K9191L5995L2969M2040M5702m4423j673K8526P6698J04087
4151B123869J85403J93356J23395k8144j16522j76563j93397j26584l5875m5800
4141A903138r6165n1440L9136k4537q6905n2565m3015J0273k2237o3241k0097
4130A492345K4279P3091K839k8853L4525l7891m8233L7978N2701k1605O117M8075
4118A635368R1761Q6271O6029P3174J20088J07690J54083K36884K36943K90613
4108C098904L03022L30392J83006m4680k10247l21674l66570k86863k72420k28844
4098B184026j82897j92984j20725q8060q3257j24265n5591o2176o2853k935n1982
4087A156301l3856l565l1888r1254l3189o3637P204J8424l7473N3003k3805M8684
$$ plain form
4075 964949 972299 953078 958770 991735 1003419 1024338 1031876 1022658 1040724 1036456 1012923 939452 908316
4062 908316 905698 825466 763041 824600 836596 848892 872428 833988 865884 845596 842925 770268
4050 770268 790567 783878 772473 778325 748069 765903 759575 689790 679154 648398 615052 649774
4038 649774 587820 576962 555977 522926 494103 467447 510885 550893 560734 555725 518619 521938
4026 521938 520080 504461 532656 495868 493050 499514 496283 488984 500285 492732 482699 469395 446753
4013 446753 487108 510653 501646 525456 511408 507309 552833 563111 616908 670318 699664 641500
4001 641500 591675 653343 676640 590387 540366 547752 577657 524056 454570 437650 462905 471047
3989 471047 414380 420267 439203 389505 350796 333041 370535 446862 457638 416707 425561 401872
$$ packed form
4075I64949P350j9221N692L2965J1684K0919P538r218J8066m268k3533p3471l1136
4062I08316k618q0232o2425O1559J1996J2296K3536l8440L1896k0288k671p2657
4050G70268K0299o689j1405N852l0256J7834o328o9785j0636l0756l3346L4722
4038F49774o1954j0858k0985l3051k8823k6656M3438M0008R841n009l7106L319
4026E21938j858j5619K8195l6788k818O464l231p299J1301p553j0033j3304k2642
4013D46753M0355K3545r007K3810j4048m099M5524J0278N3797N3410K9346n8164
4001F41500m9825O1668K3297q6253n0021P386K9905n3601o9486j6920K5255Q142
3989D71047n6667N887J8936m9698l8709j7755L7494P6327J0776m0931Q854k3689
$$ plain form
3977 401872 348663 311137 335220 341296 329433 324584 361832 333446 358966 371816 367387 379608
3965 379608 353984 300245 275782 289835 277724 327492 337709 349784 370189 365794 358330 310526
3953 310526 265043 276190 256924 268032 286070 271788 280613 268059 267285 278020 260120 241825
3941 241825 220071 235310 259069 257977 253779 307258 319832 232477 205358 196336 209686 200339
3929 200339 221900 208838 210955 219483 210794 203169 237669 277295 247412 219562 194757 241625
3917 241625 285309 298897 274708 265129 246050 233223 241155 207793 192139 206666 192086 226127
3905 226127 255957 212381 187853 206506 195652 221515 217319 231684 189010 172638 211699 201848
3893 201848 169472 196407 203202 222232 200329 203018 233029 201297 237489 227736 220808 275492
$$ packed form
3977D01872n3209l7526K4083O076j1863m849L7248k8386K5520J2850m429J2221
3965C79608k5624n3739k4463J4053j2111M9768J0217J2075K0405m395p464m7804
3953C10526m5483J1147j9266J1108J8038j4282Q825j2554p74J0735j7900j8295
3941B41825k1754J5239K3759j092m198N3479J2574q7355k7119r022J3350r347
3929B00339K1561j3062K117Q528q689p625L4500L9626k9883k7850k4805M6868
3917B41625M3684J3588k4189r579j9079j2827P932l3362j5654J4527j4580L4041
3905B26127K9830m3576k4528J8653j0854K5863m196J4365m2674j6372L9061r851
3893B01848l2376K6935O795J9030k1903K689L0011l1732L6192r753o928N4684
$$ plain form
3881 275492 239880 163191 168827 192970 193834 209258 251260 223031 245039 211791 204264 194335 173564
3868 173564 202027 214400 227115 234200 246432 277848 176706 178910 219846 194679 209649 221168
3856 221168 294997 267145 203666 186057 219708 192648 241575 248025 247333 240137 224224 226551 219383
3843 219383 216798 269874 335638 301373 308121 274114 205012 186133 169680 163124 174643 155006
3831 155006 180820 161656 179059 143490 155814 165268 142622 195462 192489 174328 147685 162143
3819 162143 145162 137415 163553 142771 158755 228154 171748 188692 227607 148231 155838 195479
3807 195479 132306 104572 150436 142797 145208 187975 117023 107956 144760 196717 170724 125541
3795 125541 150455 119953 102281 85117 84686 54165 65668 89590 117448 108057 143622 116929
$$ packed form
3881B75492l5612p6689N636K4143Q64J5424M2002k8229K2008l3248p527r929k0771
3868A73564K8463J2373J2715P085J2232L1416j01142K204M0936k5167J4970J1519
3856B21168P3829k7852o3479j7609L3651k7060M8927O450o92p196j5913K327p168
3843B19383k585N3076O5764l4265O748l4007o9102j8879j6453o556J1519j9637
3831A55006K5814j9164J7403l5569J2324R454k2646N2840k973j8161k6643J4458
3819A62143j6981p747K6138k0782J5984O9399n6406J6944L8915p9376P607L9641
3807A95479o3173k7734M5864p639K411M2767p0952r067L6804N1957k5993m5183
3795A25541K4914l0502j7672j7164m31l0521J1503K3922K7858r391L5565k6693
$$ plain form
3783 116929 169365 173328 153394 169641 129375 190523 192522 199870 267106 228792 161613 186791
3771 186791 175085 162385 173380 123520 118239 124324 94177 134224 129825 79057 70092 76975 94482
3758 94482 108790 93782 85299 58702 74112 128612 86309 91344 81565 94776 71846 39902
3746 39902 89365 75630 80257 76383 105342 71410 109776 114424 103646 134001 91965 60456
3734 60456 69059 109339 109060 82344 115318 75656 62912 95305 120012 133056 82573 96856
3722 96856 148723 138562 79310 26704 40650 49082 78387 74620 38272 10762 43961 71203
3710 71203 66976 94986 106395 109574 112494 106637 57745 82761 76407 52862 47649 93898 92702
3697 92702 90633 73245 84344 53418 44719 34254 57732 95375 42861 56675 43994 20708
$$ packed form
3783A16929N2436L963j9934J6247m0266O1148J999P348O7236l8314o7179K5178
3771A86791j1706j2700J0995m9860n281O085l0147M0047m399n0768q965O883J7507
3758I4482J4308j5008q483k6597J5410N4500m2303N035r779J3211k2930l1944
3746C9902M9463j3735M627l874K8959l3932L8366M648j0778L0355m2036l1509
3734F0456Q603M0280k79k6716L2974l9662j2744L2393K4707J3044n0483J4283
3722I6856N1867j0161n9252n2606J3946Q432K9305l767l6348k7510L3199K7242
3710G1203m227K8010J1409L179K920n857m8892K5016o354k3545n213M6249j196
3697I2702k069j7388J1099l0926q699j0465K3478L7643n2514J3814j2681k3286
$$ plain form
3685 20708 8073 16294 17583 17134 24178 12068 77017 67074 77636 81282 67262 33030 5839
3672 5839 19454 51023 63693 25770 49712 71848 70972 72830 88158 48773 40739 52416 71735
3659 71735 56600 40218 28801 20785 26378 -2504 27510 69142 77710 97326 91213 58354 55310
3646 55310 48566 31189 -12800 -24448 13328 18543 28726 40046 19037 22362 42485 23757
3634 23757 27424 56388 18234 6390 21269 35303 87555 11109 23240 83559 61805 62721
3622 62721 99169 65557 72849 49170 -350 2978 16861 16423 28918 15211 32497 54939 82386
3609 82386 93906 63923 17830 -9606 11829 55142 66653 49127 45060 31210 45757 34872
3597 34872 32754 61224 78602 109814 128477 83319 74100 35379 18736 49736 20526 5029
$$ packed form
3685B0708j2635Q221J289m49P044j2110O4949r943J0562L646j4020l4232k7191
3672E839J3615L1569J2670l7923K3942K2136q76J858J5328l9385q034J1677J9319
3659G1735j5135j6382j1417q016N593k8882L0014M1632Q568J9616o113l2859l044
3646E5310o744j7377m3989j1648L7776N215J0183J1320k1009L325K0123j8728
3634B3757L667K8964l8154j1844J4879J4034N2252p6446J2131O0319k1754R16
3622F2721L6448l3612P292k3679m9520L328J3883m38J2495j3707J7286K2442K7447
3609H2386J1520k9983m6093k7436K1435M3313J1511j7526m067j3850J4547j0885
3597C4872k118K8470J7378L1212J8663m5158r219l8721j6643L1000k9210j5497
$$ plain form
3585 5029 19757 22868 17920 31484 41454 65003 35954 12546 17868 29335 58050 74657 120449
3572 120449 53405 12042 24123 30302 54776 54979 50828 75754 81793 93477 85071 86199 74157
3559 74157 78737 50526 45339 69388 60046 22701 7972 -1980 45307 32180 34337 31403 26371
3546 26371 77862 86108 85224 86194 85027 35390 95405 155043 126897 117992 171730 151452 112891
3533 112891 148739 137974 110394 90451 83240 54984 59334 62511 32714 31427 26377 67804 62410
3520 62410 59521 45465 15108 65521 87055 83497 110349 74952 39161 43817 37894 80013 102554
3507 102554 67573 93541 59318 26462 41058 25762 36410 25990 66347 74297 71280 28161
3495 28161 36980 105411 132854 107933 80771 105412 106423 137357 99545 86627 110276 118324
$$ packed form
3585E029J4728L111m948J3564R970K3549k9049k3408N322J1467K8715J6607M5792
3572A20449o7044m1363J2081O179K4474K03m151K4926O039J1684q406J128j2042
3559G4157M580k8211n187K4049r342l7345j4729r952M7287j3127K157k934n032
3546B6371N1491Q246q84R70j167m9637O0015N9638k8146q905N3738k0278l8561
3533A12891L5848j0765k7580j9943p211k8256M350L177k9797j287n050M1427n394
3520F2410k889j4056l0357N0413K1534l558K6852l5397l5791M656n923M2119K2541
3507A02554l4981K5968l4223l2856J4596j5296J0648j0420M0357P950l017m3119
3495B8161Q819O8431K7443k4921k7162K4641J011L0934l7812j2918K3649Q048
$$ plain form
3483 118324 85291 122251 78419 34823 17078 47172 76536 96790 114883 72058 102885 84709
3471 84709 70969 33973 80153 83992 34668 59178 27239 -23340 2528 57926 40584 57022
3459 57022 109044 95103 63733 40616 11460 -5789 12977 52401 76019 98015 89895 70930
3447 70930 -10733 -6871 65868 50716 60560 92195 75284 63285 71326 115755 77801 40232
3435 40232 25257 56970 40267 43887 86401 63853 73655 110608 84245 27898 17553 44303
3423 44303 56091 37151 65026 9304 60471 50198 26352 54316 26826 -1657 -42819 23191
3411 23191 79206 45142 16368 28209 18621 37293 63936 51916 23993 5194 8085 724
3399 724 3615 18932 37889 25232 49732 37577 206 -8184 39527 54477 21325 1106 20465
$$ packed form
3483A18324l3033L6960m3832m3596j7745L0094K9364K0254J8093m2825L0827j8176
3471H4709j3740l6996M6180L839m9324K4510l1939n0579K5868N5398j7342J6438
3459E7022N2022j3941l1370k3117k9156j7249J8766L9424K3618K1996q120j8965
3447G0930q1663L862P2739j5152R844L1635j6911j1999Q041M4429l7954l7569
3435D0232j4975L1713j6703L620M2514k2548R802L6953k6363n6347j0345K6750
3423D4303J1788j8940K7875n5722N1167j0273k3846K7964k7490k8483m1162O6010
3411B3191N6015l4064k8774J1841r588J8672K6643j2020k7923j8799K891p361
3399G24K891J5317J8957j2657K4500j2155l7371q390M7711J4950l3152k0219J9359
$$ plain form
3386 20465 54193 44713 6833 -22734 -29923 -17716 -36838 -4780 -19802 -36135 -8498 4013
3374 4013 -34050 -7335 23195 54426 49706 -20155 -34850 -24851 -25373 -4910 11670 13821 2974
3361 2974 334 -1436 27156 34685 28142 43270 49875 53353 20338 5007 22152 -13250 -24322
3348 -24322 -16136 -45932 -39662 1699 48509 35495 38717 30228 16168 17181 -19645 -24358 -18397
3335 -18397 -74123 -41816 4375 25016 22152 39061 45772 18359 48022 6572 -8328 25172
3323 25172 28506 -12270 -47473 -36471 -44860 -33187 -51579 21434 28708 24608 52324 62793 -15651
3310 -15651 -18528 -628 24016 53805 56189 -13389 -4419 33822 15789 2195 15342 59009
3298 59009 56789 40018 57393 35744 72741 54817 28920 95237 60065 87268 69502 100060
$$ packed form
3386B0465L3728r480l7880k9567p189J2207j9122L2058j5022j6333K7637J2511
3374D013l8063K6715L0530L1231m720o9861j4695R999n22K0463J6580K151j0847
3361B974k640j770K8592P529o543J5128O605L478l3015j5331J7145l5402j1072
3348b4322Q186k9796O270M1361M6810j3014L222q489j4060J013l6826m713N961
3335a8397n5726L2307M6191K0641k864J6909O711k7413K9663m1450j4900L3500
3323B5172L334m0776l5203J1002q389J1673j8392P3013P274m100K7716J0469p8444
3310a5651k877J7900K4644K9789K384o9578Q970L8241j8033j3594J3147M3667
3298E9009k220j6771J7375k1649L6997j7924k5897O6317l5172K7203j7766L0558
$$ plain form
3286 100060 93899 70847 113125 121376 135696 146926 107515 109017 100588 88247 80618 19126 8849
3273 8849 64648 112251 64455 71733 111944 84830 85981 44173 17126 42750 72769 59038
3261 59038 75482 116836 97969 94653 68624 85790 86563 50939 34644 -4140 3212 7299 21105
3248 21105 66323 31418 79366 60719 62681 78571 55715 57276 62459 75793 124118 163442
3236 163442 147870 153503 100270 120741 114889 109984 80425 56212 103941 148460 148648 126293 71058
3223 71058 114243 127565 137129 171081 207374 241209 230712 151063 152440 197687 191850 169970
3211 169970 250461 285400 290054 259161 216293 248135 284186 349399 285928 288435 307687 353609
3199 353609 388100 390132 381390 412524 419878 451034 461354 419213 397364 355928 355361 324526 306719
$$ packed form
3286A00060o161k3052M2278Q251J4320J1230l9411J502q429j2341p629o1492j0277
3273H849N5799M7603m7796P278M0211k7114J151m1808k7047K5624L0019j3731
3261E9038J6444M1354j8867l316k6029J7166P73l5624j6295l8784P352M087J3806
3248B1105M5218l4905M7948j8647J962J5890k2856J561N183J3334M8325L9324
3236A63442j5572N633n3233K0471n852m905k9559k4213M7729M4519J88k2355n5235
3223G1058M3185J3322R564L3952L6293L3835j0497p9649J377M5247n837k1880
3211A69970Q0491L4939M654l0893m2868L1842L6051O5213o3471K507J9252M5922
3199C53609L4491K032q742L1134P354L1156J0320m2141k1849m1436n67l0835j7807
$$ plain form
3186 306719 253971 278157 261576 222133 207678 205296 193867 166444 160325 172708 118954 175078
3174 175078 182900 145902 176629 188159 136690 129170 93751 98956 117712 88350 89053 84298 112701
3161 112701 143224 112761 93579 105052 93242 119970 49171 69729 96907 144138 113945 142714
3149 142714 174047 148750 93854 96123 74470 86858 58343 38278 38341 96535 109618 137812
3137 137812 169695 152636 172798 142990 135475 138791 171095 194603 172091 155605 191302 156045
3125 156045 98613 121750 177415 192024 126640 82010 134091 92945 66080 112287 124408 113907
3113 113907 97219 52648 51088 -921 -47481 -4844 39164 66147 28084 43061 67132 33764
3101 33764 -10685 -18117 22685 42871 51171 85374 108327 102940 108561 72612 49822 117129 128728
$$ packed form
3186C06719n2748K4186j6581l9443j4455k382j1429k7423o119J2383n3754N6124
3174A75078P822l6998L0727J1530n1469p520l5419N205J8756k9362P03m755K8403
3161A12701L0523l0463j9182J1473j1810K6728p0799K0558K7178M7231l0193K8769
3149A42714L1333k5297n4896K269k1653J2388k8515k0065O3N8194J3083K8194
3137A37812L1883j7059K0162k9808p515L316L2304K3508k2512j6486L5697l5257
3125A56045n7432K3137N5665J4609o5384m4630N2081m1146k6865M6207J2121j0501
3113A13907j6688m4571j560n2009m6560M2637M4008K6983l8063J4977K4071l3368
3101C3764m4449p432M0802K0186Q300L4203K2953n387N621l5949k2790O7307J1599
$$ plain form
3088 128728 51933 33789 34653 28947 17514 13837 16419 42476 29197 9615 44588 69622 72191
3075 72191 107243 88467 99010 97872 14266 -28301 13704 7304 19687 32468 44702 44391 7603
3062 7603 30057 33598 32636 80876 73296 118972 139883 93435 68394 102992 120010 206210 218780
3049 218780 170331 279453 344964 435406 449191 420536 345460 311643 252607 194990 154781
3038 154781 153951 157725 109934 113357 107745 77419 167875 166044 123391 110298 127940 101080 117711
3025 117711 192620 195776 194297 266057 289070 309973 339470 385988 419856 375218 343318 238153
3013 238153 178549 170583 135924 101972 95756 89825 72208 50685 58537 79508 78708 67037 25572
3000 25572 50543 28246 51659 36181 31054 52214 39039 48304 35591 28735 31366 67101 45131
$$ packed form
3088A28728p6795j8144Q64n706j1433l677K582K6057j3279j9582L4973K5034K569
3075G2191L5052j8776J0543j138q3606m2567M2005o400J2383J2781J2234l11l6788
3062G603K2454L541r62M8240p580M5676K0911m6448k5041L4598J7018Q6200J2570
3049B18780m8449J09122O5511R0442J3785k8655p5076l3817n9036n7617m0209
3038A54781q30L774m7791L423n612l0326R0456j831m2653j3093J7642k6860J6631
3025A17711P4909L156j479P1760K3013K0903K9497M6518L3868m4638l1900j05165
3013B38153n9604p966l4659l3952o216n931j7617k1523P852K0971q00j1671m1465
3000B5572K4971k2297K3413j5478n127K1160j3175R265j2713o856K631L5735k1970
$$ plain form
2987 45131 84997 34474 50043 31495 18095 -9730 -22948 -26430 -20538 -34440 -28907 -11134
2975 -11134 17554 2353 3531 -33285 -27407 14749 13290 43188 -57222 -58518 -39238 -53428
2963 -53428 -84380 -54108 -8800 -26687 -31968 -25072 21025 3147 -30075 -11997 -40538 -12437
2951 -12437 19857 -10671 19291 34147 6820 -5985 3595 -7368 24710 41533 27134 -25485
2939 -25485 4634 5972 28736 35216 4504 47089 29819 8927 9207 -55798 -73330 -9432 -11578
2926 -11578 24584 1517 -18571 -4468 -6902 12552 271 -14370 -27912 9266 57963 69405
2914 69405 70610 22774 -6646 -10637 -7614 -14156 -19627 56407 51812 -2991 -3070 5728 41734 51039
2900 51039 36363 30762 24838 5444 -13632 7142 32948 12140 -45140 5228 30349 8580
$$ packed form
2987D5131L9866n0523J5569j8548j3400k7825j3218l482N892j3902N533J7773
2975a1134K8688j5201J178l6816N878M2156j459K9898j00410j296J9280j4190
2963e3428l0952L0272M5308j7887n281O896M6097j7878l3222J8078k8541K8101
2951a2437L2294l0528K9962J4856k7327j2805R580j0963L2078J6823j4399n2619
2939b5485L0119J338K2764O480l0712M2585j7270k0892K80o5005j7532O3898k146
2926a1578L6162k3067k0088J4103k434J9454j2281j4641j3542L7178M8697J1442
2914F9405J205m7836k9420l991L023o542n471P6034m595n4803p9Q798L6006R305
2900E1039j4676n601n924j9394j9076K0774K5806k0808n7280N0368K5121k1769
$$ plain form
2888 8580 34134 -2659 2957 795 -6256 6428 17075 36192 -888 -26111 -17038 2621 63615
2875 63615 88741 58936 8355 -37325 15179 34412 -12093 41786 15383 35501 56265 51308
2863 51308 33519 39567 -40743 -48378 33682 96246 86287 110148 97898 138379 71295 45656
2851 45656 -1698 -20665 50850 65134 56746 76636 62979 2468 -2045 -525 53334 71017
2839 71017 82936 53751 -6898 -27938 24298 12872 -24614 -18889 -10503 -34782 -55653 -9601
2827 -9601 18937 317 20291 33848 69352 -18311 8999 6198 -26424 -19126 16451 66352
2815 66352 49040 32244 9274 3696 26648 -2314 -6379 2180 -6057 -32309 -30130 -34306 -53774
2802 -53774 -37951 -62068 -70731 -41716 -42086 -10726 49825 29087 21634 35872 10429 -22898 -20288
$$ packed form
2888H580K5554l6793N616k162p051J2684J0647J9117l7080k5223R073J9659O0994
2875F3615K5126k9805n0581m5680N2504J9233m6505N3879k6403K0118K0764m957
2863E1308j7789O048q0310p635Q2060O2564r959K3861j2250M0481o7084k5639
2851D5656m7354j8967P1515J4284q388J9890j3657o0511m513J520N3859J7683
2839G1017J1919k9185o0649k1040N2236j1426l7486N725Q386k4279k0871M6052
2827i601K8538j8620J9974J3557L5504q7663K7310k801l2622P298L5577M9901
2815F6352j7312j6796k2970n578K2952k8962m065Q559q237k6252K179m176j9468
2802e3774J5823k4117q663K9015l70L1360O0551k0738p453J4238k5443l3327K610
$$ plain form
2789 -20288 29091 60797 86293 37796 -11598 -21916 -45682 -6253 12242 -54653 -25346 -57810
2777 -57810 -58832 -18340 -36323 -41338 -75550 -50732 -14164 -54541 -20724 -4662 -14007 13683
2765 13683 2405 977 -21451 -74086 3820 50824 748 -4580 -6126 -25783 -31538 -45660 -37622
2752 -37622 -35695 -54743 -14815 18519 23390 28413 12866 -8867 -9646 32800 -35664 -22664 28277
2739 28277 15544 7049 -8905 -10834 -30084 14384 -27793 -76198 -104303 -70365 -38351 -18263
2727 -18263 -54283 -55100 -44958 -64746 -47421 -58377 -56999 -63849 -78997 -71267 -52848 -32007 -5003
2714 -5003 -15466 -16483 -48535 -35386 35925 -18388 -40934 -5719 -10574 -23189 889 -11967
2702 -11967 -33358 -9382 -31701 -9790 -4849 -78372 -72056 -73396 -47083 -81968 -86974 -42879 -49099
$$ packed form
2789b0288M9379L1706K5496m8497m9394j0318k3766L9429J8495o6895K9307l2464
2777e7810j022M0492j7983n015l4212K4818L6568m0377L3817J6062r345K7690
2765A3683j1278j428k2428n2635P7906M7004n0076n328j546j9657n755j4122Q038
2752c7622J927j9048L9928L3334M871N023j5547k1733p79M2446o8464J3000N0941
2739B8277j2733q495j5954j929j9250M4468m2177m8405k8105L3938L2014K0088
2727a8263l6020q17J0142j9788J7325j0956J378o850j5148P730J8419K0841K7004
2714e003j0463j017l2052J3149P1311n4313k2546L5215m855j2615K4078j2856
2702a1967k1391K3976k2319K1911M941p3523O316j340K6313l4885n006M4095o220
$$ plain form
2689 -49099 -68311 -7197 -6624 20083 -40694 -42163 -67397 -54854 -17087 -52167 -48438 -61090 -40080
2676 -40080 -59041 -34716 8279 -16005 -7308 3831 -24307 28747 -14073 -37204 -43157 -23648
2664 -23648 -30361 -44012 -110672 -91020 -35230 -6751 -33669 -24014 22261 25177 3598 -18372
2652 -18372 -18992 -7293 -21660 -27625 -7917 22483 29606 36090 21739 2598 -22856 -13883 11117
2639 11117 -15049 -8796 -16988 -25843 -63810 -70739 -49185 -80638 -38448 -3725 -39101 9398 9648
2626 9648 10079 -59511 -32831 -3649 6552 37871 21956 19825 -9189 -1128 1378 7812 8837
2613 8837 -8236 -27503 -5862 -3194 -39967 -39603 -45384 -43981 -2939 -22813 12135 -10715 -69158
2600 -69158 -58645 -59090 -36104 -57574 -71883 -107476 -41999 -46896 -3548 25353 -57617 -83709
$$ packed form
2689d9099j9212O1114N73K6707o0777j469k5234J2543L7767l5080L729j2652K1010
2676d0080j8961K4325M2995k4284Q697J1139k8138N3054m2820k3131n953J9509
2664b3648o713j3651o6660J9652N5790K8479k6918R655M6275K916k1579k1970
2652a8372o20J1699j4367n965J9708L0400P123O484j4351j9141k5454Q973K5000
2639A1117k6166O253q192q855l7967o929K1554l1453M2190L4723l5376M8499K50
2626I648M31o9590K6680K9182J0201L1319j5915k131k9014Q061K506O434J025
2613H837j7073j9267K1641K668l6773L64n781J403M1042j9874L4948k2850n8443
2600f9158J0513m45K2986k1470j4309l5593O5477m897M3348K8901q2970k6092
$$ plain form
2588 -83709 -131850 -86157 -48873 -82272 -55142 -36502 -9002 238 -35691 -55864 -65574 -58410
2576 -58410 -89310 -82161 -16876 21418 -16685 -47468 -61022 -34188 -36171 -47658 -23598 -7158
2564 -7158 -600 -30275 24230 22651 -43492 -106127 -110277 -70338 -38450 -59921 -93856 -87451 -46688
2551 -46688 -10059 -49167 -89304 -78697 -63414 -37609 -100029 -60475 -41254 -86929 -21857 -57967
2539 -57967 -54387 -60889 -45582 -82735 -59516 -55384 -106173 -113653 -107432 -97798 -89673 -68201 -3962
2526 -3962 -11618 -13175 -28087 -57089 -109725 -96395 -95932 -84836 -101510 -76668 -70157 -31591 39476
2513 39476 -1761 11420 11448 -8805 -38977 -73152 -68901 -25976 -3147 36180 -14552 -1542 9460
2500 9460 -38822 -32245 -58667 -36849 -53452 -4665 19637 -39263 -38527 -47461 -28773 -34664 -14457
$$ packed form
2588h3709m8141M5693L7284l3399K7130J8640K7500R240l5929k0173r710P164
2576e8410l0900P149O5285L8294l8103l0783j3554K6834j983j1487K4060J6440
2564g158O558k9675N4505j579o6143o2635m150L9939L1888k1471l3935O405M0763
2551d6688L6629l9108m0137J0607J5283K5805o2420L9554J9221m5675O5072l6110
2539e7967L580o502J5307l7153K3219M132n0789p480O221R634Q125K1472O4239
2526c962p656j557j4912k9002n2636J3330M63J1096j6674K4842O511L8566P1067
2513C9476m1237J3181K8k0253l0172l4175M251M2925K2829L9327n0732J3010J1002
2500I460m8282O577k6422K1818j6603M8787K4302n8900P36q934J8688n891K0207
$$ plain form
2487 -14457 329 -31478 6090 29466 -23582 -20103 -11301 -41824 -450 9358 -22918 -1283
2475 -1283 -28 -29698 -21792 -24069 -104752 -68770 -22522 -11374 -49523 -59572 19995 -19075 -66790
2462 -66790 -14736 -694 5023 7372 -8122 -77150 -87626 -60711 -60289 -68507 -71062 -27494 -28101
2449 -28101 -110366 -121237 -76347 -91320 -99544 -83542 -62887 -22836 -53093 -87220 -82341 -51686
2437 -51686 -31053 -54575 -69594 -42936 -53097 -65759 -50686 879 -22530 -33440 -23696 -46
2425 -46 -48801 -54659 -35565 -10008 -3898 5730 28335 22278 -2500 -24180 -15336 -21333 -67224 -80131
2411 -80131 3902 14656 6958 -68753 -54848 -80073 -45841 13455 65627 76114 8082 -25394
2399 -25394 -13204 -26366 -28684 152 -2124 6902 3836 -29736 -87833 -56879 -53494 -66989 -54841
$$ packed form
2487a4457J4786l1807L7568K3376n3048L479Q802l0523M1374R808l2276K1635
2475a283J255k9670P906k277q0683L5982M6248J1148l8149j0049P9567l9070m7715
2462f6790N2054J4042N717K349j5494o9028j0476K6915M22q218k555M3568o07
2449b8101q2265j0871M4890j4973q224J6002K0655M0051l0257l4127M879L0655
2437e1686K0633k3522j5019K6658j0161j2662J5073N1565k3409j0910R744K3650
2425d6m8755n858J9094K5557O110R628K2605o057k4778k1680Q844n997m5891j2907
2411h0131Q4033J0754p698p5711J3905k5225L4232N9296N2172J0487o8032l3476
2399b5394J2190j3162k318K8836k276R026l066l3572n8097L0954L385j3495J2148
$$ plain form
2386 -54841 -28620 -41828 -97217 -97641 -117754 -98358 -35233 -48984 -74546 -49969 -77526 -61543
2374 -61543 8765 -11503 -57878 -35700 3179 -22686 -56109 -74719 -88010 -105178 -96356 -84734
2362 -84734 -5238 23580 6226 28549 -37821 -70860 -51353 -40914 -24254 1247 25776 40838
2350 40838 7134 -32910 -53841 4788 6841 -50118 -50838 -19132 -15152 -88479 -108043 -104895 -81984
2337 -81984 -59332 -86852 -47711 1908 -38268 -20782 -13755 17074 9463 -63156 -88981 -33174
2325 -33174 9602 -7491 31045 -17247 9877 43369 54912 18315 6322 29767 33702 5126
2313 5126 7284 -16431 -33160 -33939 59931 47112 -1971 5702 7315 -20556 -47949 -20445 -40840
2300 -40840 725 -34642 -25629 -13153 -57358 -29630 -11423 -34532 -46837 -37719 -76677 -29416
$$ packed form
2386e4841K6221j3208n5389m24k0113J9396O3125j3751k5562K4577k7557J5983
2374f1543P0308k0268m6375K2178L8879k5865l3423j8610j3291j7168Q822J1622
2362h4734P9496K8818j7354K2323o6370l3039J9507J0439J6660K5501K4529J5062
2350D0838l3704m0044k0931N8629K053n6959p20L1706L980p3327j9564L148K2911
2337h1984K2652k7520L9141M9619m0176J7486P027L0829p611p2619k5825N5807
2325c3174M2776j7093L8536m8292K7124L3492J1543l6597j1993K3445L935k8576
2313E126K158k3715j6729p79R3870j2819m9083P673J613k7871k7393K7504k0395
2300d0840M1565l5367R013J2476m4205K7728J8207k3109j2305R118l8958M7261
$$ plain form
2288 -29416 1035 -71892 -44336 -13928 -35575 -23877 1467 6034 24472 -10580 -14616 8872
2276 8872 -1973 13617 -1614 -26240 -35624 -35658 8796 -6323 -44745 -34059 -24285 8212 -8310
2263 -8310 -9324 1409 -17893 6460 -36183 -12014 5128 49270 75707 70534 54911 4726
2251 4726 -51746 -20028 -3873 -40895 -73013 -115706 -120223 -51856 -83494 -86516 -36070 -33505 -37502
2238 -37502 -10705 24668 11939 4114 -43165 -10928 29996 20406 26811 40115 -9251 -51264
2226 -51264 -26634 -56340 -70515 -61809 -71553 -20899 -29626 -68992 -52442 -40898 -15691 24940
2214 24940 -1790 23225 -1907 33663 39816 18920 -17585 -84568 -99147 -83407 -3085 -731
2202 -731 -10996 -35970 -56396 -70422 -89211 -53679 17604 -2023 31903 39010 23855 -69788
$$ packed form
2288b9416L0451p2927K7556L0408k1647J1698K5344M567J8438l5052m036K3488
2276H872j0845J5590j5231k4626r384l4M4454j5119l8422J0686R774L2497j6522
2263h310j014J0733j9302K4353m2643K4169J7142M4142K6437n173j5623n0185
2251D726n6472L1718J6155l7022l2118m2693m517O8367l1638l022N0446K565l997
2238c7502K6797L5373j2729p825m7279L2237M0924r590O405J3304m9366m2013
2226e1264K4630k9706j4175Q706r744N0654q727l9366J6550J1544K5207M0631
2214B4940k6730K5015k5132L5570O153k0896l6505o6983j4579J5740Q0322K354
2202g31j0265k4974k0426j4026j8789L5532P1283j9627L3926P107j5155r3643
$$ plain form
2190 -69788 -77132 -55682 -11526 -18551 -75200 -36328 12066 3968 -19330 -10426 -9510 -6876 19861
2177 19861 -9582 -3423 12516 -16358 -13910 -8719 4030 -25200 -34874 -20046 -33191 -4981 -8000
2164 -8000 -54100 5082 -14299 -36274 -16989 -13170 -38230 -20097 -24966 -6719 -256 39629 81556
2151 81556 16086 32783 59284 28478 93004 36904 -37992 -66960 -7946 -10661 -46988 -38091
2139 -38091 -21434 -13896 -36274 -59420 -53538 -31125 -44942 -35093 -17251 6573 39345 14825
2127 14825 -16451 -47996 -40171 -34877 9319 11689 48990 71502 48140 40429 5017 30698 17604
2114 17604 16948 43014 30471 22182 12285 29199 29696 10666 33701 48829 55161 65436 79506
2101 79506 21029 65518 117912 159655 168611 152984 108940 113514 124020 122934 163542 213011
$$ packed form
2190f9788p344K1450M4156p025n6649L8872M8394q098k3298Q904R16K634K6737
2177A9861k9443O159J5939k8874K448N191J2749k9230r674J4828j3145K8210l019
2164h000m6100N9182j9381k1975J9285L819k5060J8133m869J8247O463L9885M1927
2151H1556o5470J6697K6501l0806O4526n6100p4896k8968N9014k715l6327Q897
2139c8091J6657P538k2378k3146N882K2413j3817R849J7842K3824L2772k4520
2127A4825l1276l1545P825N294M4196K370L7301K2512k3362p711l5412K5681j3094
2114A7604o56K6066j2543q289r897J6914M97j9030K3035J5128O332J0275J4070
2101G9506n8477M4489N2394M1743Q956j5627m4044M574J0506j086M0608M9469
$$ plain form
2089 213011 290885 369823 432281 527473 688754 779888 768843 687859 543650 424060 370370
2078 370370 262215 193370 226455 215233 141232 132515 152448 109523 147491 85194 66738 50081
2066 50081 93223 49771 12668 16661 19373 43247 4214 6663 19924 53800 14260 36447
2054 36447 92600 86695 -5238 -19818 12023 5756 -37294 -33363 -6233 28274 68055 91040
2042 91040 68647 -1859 71 36618 16054 -9889 -16980 -50030 -49300 -55047 -9114 54849 16725
2029 16725 87 2074 31425 16528 -18769 -38179 17480 27128 16399 -23763 -11061 -42476
2017 -42476 -10656 8411 -7318 34379 -26277 -47677 -42624 -49390 -61127 -63570 -59084 -35492 -66461
2004 -66461 -1057 8040 -3920 1484 18931 -4195 -7022 -14686 13970 29731 3943 -8397 -26050
$$ packed form
2089B13011P7874P8938O2458R5192J61281R1134j1045q0984j44209j19590n3690
2078C70370j08155o8845L3085j1222p4001q717J9933m2925L7968o2297j8456j6657
2066E0081M3142m3452l7103L993K712K3874l9033K449J3261L3876l9540K2187
2054C6447N6153n905r1933j4580L1841o267m3050L931K7130L4507L9781K2985
2042I1040k2393p0506J930L6547k0564k5943p091l3050P30n747M5933O3963l8124
2029A6725j6638J987K9351j4897l5297j9410N5659R648j0729m0162J2702l1415
2017d2476L1820J9067j5729M1697o0656k1400N053o766j1737k443M486K3592l0969
2004f6461O5404R097j1960N404J7447k3126k827p664K8656J5761k5788j2340j7653
$$ plain form
1991 -26050 -41039 -30095 27076 57093 12726 -11718 -12379 -19767 -21547 -50475 -58622 -80532 -70816
1978 -70816 -41626 -20463 -47991 -71238 -47493 -52496 -23156 -29491 -51171 -6241 -18276 -13088
1966 -13088 -79835 -43892 -20048 -31826 -32956 -6604 7499 2253 27971 225 -33187 -38540
1954 -38540 -32022 1287 17560 -20284 -12936 -6197 -37904 -42447 -69137 -78172 -93411 -82550 -40024
1941 -40024 1071 -40952 -38816 -8899 215 -9176 -49572 -19367 10942 -4731 16160 22492 3331
1928 3331 -690 -5962 38468 9434 16546 -1300 11323 19425 8393 -25054 6710 6179 -32747
1915 -32747 -35480 -62554 -47271 6808 6367 26116 20424 8824 -43028 -51202 -33261 -28063 6405
1902 6405 24297 9389 -35651 -8389 35481 25569 -34717 -39396 5572 -16514 -74747 -14347
$$ packed form
1991b6050j4989J0944N7171L0017m4367k4444o61p388j780k8928q147k1910R716
1978g0816K9190K1163k7528k3247K3745n003K9340o335k1680M4930j2035N188
1966a3088o6747L5943K3844j1778j130K6352J4103n246K5718k7746l3412n353
1954c8540O518L3309J6273l7844P348O739l1707m543k6690r035j5239J0861M2526
1941d0024M1095m2023K136K9917R114r391m0396L0205L0309j5673K0891O332j9161
1928C331m021n272M4430k9034P112j7846J2623Q102j1032l3447L1764n31l8926
1915c2747k733k7074J5283N4079m41J9749n692j1600n1852q174J7941N198L4468
1902F405J7892j4908m5040K7262M3870r912o0286m679M4968k2086n8233O0400
$$ plain form
1890 -14347 -15104 7863 13394 -19120 14240 -27385 -33761 -18205 30996 33232 -42539 -77524 -50942
$$ packed form
1890a4347p57K2967N531l2514L3360m1625o376J5556M9201K236p5771l4985K6582
$$ [...]
##END NTUPLES=NMR SPECTRUM
##END=
