##TITLE=1H_EC-2738(I)
 DMSO
 8 sc, 
 8.8.2023
##JCAMPDX= 6.0         $$ Bruker NMR JCAMP-DX V2.0
##DATA TYPE= NMR SPECTRUM
##DATA CLASS= NTUPLES
##ORIGIN= UXNMR, Bruker Analytische Messtechnik GmbH
##OWNER= root
$$ XWIN-NMR		Version 3.5
$$ Tue Aug  8 13:43:39 2023 Russian Standard Time (UT+4h)  she@DPX200
##.OBSERVE FREQUENCY= 200.13135
##.OBSERVE NUCLEUS= ^1H
##.ACQUISITION MODE= SIMULTANEOUS
##.ACQUISITION SCHEME= undefined
##.AVERAGES= 8
##.DIGITISER RES= 18
##SPECTROMETER/DATA SYSTEM= spect
##.PULSE SEQUENCE= zg30
##.SOLVENT NAME= Acetone
##.SHIFT REFERENCE= (INTERNAL, Acetone, 0, 15.7491)
##AUDIT TRAIL= $$ (NUMBER, WHEN, WHO, WHERE, WHAT)
$$ ##TITLE= Audit trail, XWIN-NMR		Version 3.5
$$ ##JCAMPDX= 5.01
$$ ##ORIGIN= Bruker BioSpin GmbH
$$ ##OWNER= she
$$ F:/spectra/data/she/nmr/H-F/1/pdata/1/auditp.txt
$$ ##AUDIT TRAIL=  $$ (NUMBER, WHEN, WHO, WHERE, WHAT)
(   1,<2023-08-08 13:42:37.10 +0400>,<she>,<DPX200>,
      <created by zg, POWCHK disabled, PULCHK disabled
       configuration hash MD5:
       00 E9 B6 7A A2 85 ED C7 34 08 36 98 17 FE 4E 26
       data hash MD5: 16K
       16 A1 63 C6 22 02 D0 75 72 10 7B E3 62 4B 47 9F>)
(   2,<2023-08-08 13:42:43.68 +0400>,<she>,<DPX200>,
      <Start of raw data processing
       efp BC_mod = 2 LB = 0.24 FT_mod = 6 PKNL = 1 PHC0 = -21053.88 PHC1 = 23.05272 SI = 16K 
       data hash MD5: 16K
       8C 8D 9F 70 17 C0 F5 BE 19 29 DB 69 59 3F 40 60>)
(   3,<2023-08-08 13:42:58.92 +0400>,<she>,<DPX200>,
      <pk PHC0 = 10.54438 PHC1 = -15.4 
       data hash MD5: 16K
       7F B9 3A 56 D0 DF 16 53 BF 0E E3 E4 2E 51 4D EF>)
(   4,<2023-08-08 13:43:05.54 +0400>,<she>,<DPX200>,
      <abs ABSG = 5 
       data hash MD5: 16K
       B6 BC 08 9D 61 11 C9 D0 88 1C 73 5B B8 CA 0C 18>)
$$ ##END=
$$ 
$$ hash MD5
$$ A9 74 09 DF BB 03 DD 0D 72 97 FA A0 7A 34 E4 60
##$RELAX= 
##$RELAX= 
##$RELAX= 
##$RELAX= 
##$RELAX= 
##$RELAX= 
$$ Bruker specific parameters
$$ --------------------------
##$DU= <F:/spectra>
##$EXPNO= 1
##$NAME= <H-F>
##$PROCNO= 1
##$TYPE= <nmr>
##$USER= <she>
##$AMP= (0..31)
100 100 100 100 100 100 100 100 100 100 100 100 100 100 100 100 100 100 
100 100 100 100 100 100 100 100 100 100 100 100 100 100 
##$AQSEQ= 0
##$AQ_mod= 1
##$AUNM= <au_zg>
##$AUTOPOS= <>
##$BF1= 200.13
##$BF2= 200.13
##$BF3= 200.13
##$BF4= 200.13
##$BF5= 200.13
##$BF6= 200.13
##$BF7= 200.13
##$BF8= 200.13
##$BYTORDA= 1
##$CFDGTYP= 0
##$CFRGTYP= 5
##$CHEMSTR= <none>
##$CNST= (0..31)
1 1 145 1 1 1 1 1 1 1 1 1 1 1 1 1 1 1 1 1 1 1 1 1 1 1 1 1 1 1 1 1 
##$CPDPRG= <>
##$CPDPRG1= <>
##$CPDPRG2= <>
##$CPDPRG3= <>
##$CPDPRG4= <mlev>
##$CPDPRG5= <mlev>
##$CPDPRG6= <mlev>
##$CPDPRG7= <mlev>
##$CPDPRG8= <mlev>
##$CPDPRGB= <>
##$CPDPRGT= <>
##$D= (0..31)
0 1.2 0 0 0 0 0 0 0 0.06 0 0.03 0 0 0 0 0.0002 0 0 0 0 0 0 0 0 0 0 0 0 
0 0 0 
##$DATE= 1691487756
##$DBL= (0..7)
120 120 120 120 120 120 120 120 
##$DBP= (0..7)
150 150 150 150 150 150 150 150 
##$DBP07= 0
##$DBPNAM0= <>
##$DBPNAM1= <>
##$DBPNAM2= <>
##$DBPNAM3= <>
##$DBPNAM4= <>
$$ [...]
##$SUBNAM3= <"">
##$SUBNAM4= <"">
##$SUBNAM5= <"">
##$SUBNAM6= <"">
##$SUBNAM7= <"">
##$SUBNAM8= <"">
##$SUBNAM9= <"">
##$SW= 18.05172834244
##$SWIBOX= (0..15)
0 0 2 0 0 0 0 0 0 0 0 0 0 0 0 0 
##$SW_h= 3612.71676300578
##$TD= 16384
##$TD0= 1
##$TE= 0
##$TE2= 300
##$TE3= 300
##$TEG= 300
##$TL= (0..7)
0 120 120 120 120 120 120 120 
##$TP= (0..7)
150 150 150 150 150 150 150 150 
##$TP07= 0
##$TPNAME0= <>
##$TPNAME1= <>
##$TPNAME2= <>
##$TPNAME3= <>
##$TPNAME4= <>
##$TPNAME5= <>
##$TPNAME6= <>
##$TPNAME7= <>
##$TPOAL= (0..7)
0.5 0.5 0.5 0.5 0.5 0.5 0.5 0.5 
##$TPOFFS= (0..7)
0 0 0 0 0 0 0 0 
##$TUNHIN= 0
##$TUNHOUT= 0
##$TUNXOUT= 0
##$USERA1= <user>
##$USERA2= <user>
##$USERA3= <user>
##$USERA4= <user>
##$USERA5= <user>
##$V9= 5
##$VALIST= <valist>
##$VCLIST= <CCCCCCCCCCCCCCC>
##$VD= 0
##$VDLIST= <DDDDDDDDDDDDDDD>
##$VPLIST= <PPPPPPPPPPPPPPP>
##$VTLIST= <TTTTTTTTTTTTTTT>
##$WBST= 1024
##$WBSW= 4
##$XGAIN= (0..3)
0 0 0 0 
##$XL= 0
##$YL= 0
##$YMAX_a= 143356
##$YMIN_a= -174964
##$ZGOPTNS= <>
##$ZL1= 120
##$ZL2= 120
##$ZL3= 120
##$ZL4= 120
##$ABSF1= 15.74909
##$ABSF2= -2.302759
##$ABSG= 5
##$ABSL= 3
##$ALPHA= 0
##$AQORDER= 0
##$ASSFAC= 0
##$ASSFACI= 0
##$ASSFACX= 0
##$ASSWID= 0
##$AUNMP= <proc_1d>
##$AZFE= 0.1
##$AZFW= 0.1
##$BCFW= 0
##$BC_mod= 2
##$BYTORDP= 0
##$COROFFS= 0
##$CY= -3
##$DATMOD= 1
##$DC= 0
##$DFILT= <>
##$DTYPP= 0
##$F1P= 0
##$F2P= 0
##$FCOR= 1
##$FTSIZE= 16384
##$FT_mod= 6
##$GAMMA= 0
##$GB= 0
##$INTBC= 1
##$INTSCL= 3.70164e-10
##$ISEN= 128
##$LB= 0.24
##$LEV0= 0
##$LPBIN= 0
##$MAXI= 10000
##$MC2= 0
##$MEAN= 0
##$ME_mod= 0
##$MI= 1.114404
##$NCOEF= 0
##$NC_proc= -6
##$NLEV= 6
##$NOISF1= 3.799351
##$NOISF2= 2.8
##$NSP= 0
##$NTH_PI= 0
##$NZP= 0
##$OFFSET= 15.74909
##$PC= 1
##$PHC0= -21043.34
##$PHC1= 7.652719
##$PH_mod= 1
##$PKNL= yes
##$PPARMOD= 0
##$PSCAL= 0
##$PSIGN= 0
##$REVERSE= no
##$SF= 200.130004492375
##$SI= 16384
##$SIGF1= 3
##$SIGF2= 2
##$SINO= 5.538805
##$SIOLD= 16384
##$SREGLST= <1H.CDCl3>
##$SSB= 0
##$STSI= 16384
##$STSR= 0
##$SW_p= 3612.71676300578
##$SYMM= 0
##$S_DEV= 0
##$TDeff= 16384
##$TDoff= 0
##$TI= <>
##$TILT= no
##$TM1= 0
##$TM2= 0
##$TOPLEV= 0
##$USERP1= <user>
##$USERP2= <user>
##$USERP3= <user>
##$USERP4= <user>
##$USERP5= <user>
##$WDW= 1
##$XDIM= 16384
##$YMAX_p= 407102994
##$YMIN_p= -262560
$$ End of Bruker specific parameters
$$ ---------------------------------
##NTUPLES= NMR SPECTRUM
##VAR_NAME=  FREQUENCY,     SPECTRUM/REAL,   SPECTRUM/IMAG
##SYMBOL=    X,             R,               I
##VAR_TYPE=  INDEPENDENT,   DEPENDENT,       DEPENDENT
##VAR_FORM=  AFFN,          ASDF,            ASDF
##VAR_DIM=   16384,         16384,           16384
##UNITS=     HZ,            ARBITRARY UNITS, ARBITRARY UNITS
##FACTOR=    0.220516191357247, 1,           1
##FIRST=     3151.86549141656, 0,            0
##LAST=      -460.85127158922, 0,            0
##MIN=       -460.85127158922, -262560,      0
##MAX=       3151.86549141656, 407102994,    0
$$ Real data points
##PAGE= N=1
##DATA TABLE= (X++(R..R)), XYDATA
$$ [...]
8563A999899j21839j06298j39006l1868n8384n3507l1590r3769j02516p8824n5672
8552A126626j0602O1198l9950m3333p735j29503j1745n582J36503J38187q5609
8541A128455m2695J788R2372o0838Q7111P3506M0161n6754o3631P6944J7376j6921
8529A276874L0688p3728o5422p238O3782J92509p078J8605k5173J15423M6546
8518A565788k3370m9214J33680J19426L9791l1247j4693L2108L2816Q1196Q1763
8507A968044O1366m8936k7303R0869N4194P8027P0437J32455J12087N483N4989
8496B551712N1828M8014J08278K37493J11345L0431L1668K15451K76384L24574
8486C987178L30723L92838M21628L87042L30460M6692M265j30126j33965j50279
$$ plain form
8563 1999899 1878060 1771762 1632756 1600888 1542504 1488997 1457407 1363638 1261122 1182298 1126626
8552 1126626 1116024 1177222 1137272 1093939 1086204 956701 944956 939374 1075877 1214064 1128455
8541 1128455 1085760 1087548 1179920 1119082 1206193 1279699 1319860 1263106 1199475 1276419 1293795 1276874
8529 1276874 1307562 1233834 1168412 1161174 1224956 1417465 1410387 1428992 1403819 1519242 1565788
8518 1565788 1542418 1493204 1626884 1746310 1786101 1754854 1740161 1772269 1805085 1886281 1968044
8507 1968044 2029410 1980474 1953171 2044040 2098234 2176261 2246698 2379153 2491240 2496723 2551712
8496 2551712 2603540 2651554 2759832 2997325 3108670 3139101 3170769 3386220 3662604 3987178
8486 3987178 4317901 4710739 5132367 5519409 5849869 5896561 5900826 5770700 5636735 5486456
8476E486456n9461k2478k1160K14952J14285j8263J9357J79142J85997K06153
8466F284980K67586L11221M35834P54472Q27409J015639J451120J832010J707107
8457A4887378J917354K049478K200814J957977J362014P19223l79932j314152
8449B3400154j145083p04534j8314O35583P43812M87336j68600r80774k105576
8440B0144004k883882k712819j966616j624331j178262q45190o36406m69237l36343
8431G490918k81267k04555r7286j32593J02090K1959K66931L33920N04801P20183
8421H725101R83140J111923J124311J458250J471512J335911J064924Q07469K02631
8412A8285172o42574r55791r69986m82984M0184L58510K42858J23895k17461j112350
$$ plain form
8476 5486456 5426995 5404517 5383357 5598309 5712594 5694331 5713688 5892830 6078827 6284980
8466 6284980 6552566 6863787 7299621 8054093 8881502 9897141 11348261 13180271 14887378
8457 14887378 16804732 18854210 21055024 23013001 24375015 25094238 24714306 23400154
8449 23400154 22255071 21550537 21532223 22167806 22911618 23398954 23230354 22249580 20144004
8440 20144004 17260122 14547303 12580687 10956356 9778094 8932904 8296498 7827261 7490918
8431 7490918 7209651 7005096 6907810 6775217 6877307 6899266 7166197 7500117 8004918 8725101
8421 8725101 9708241 10820164 11944475 13402725 14874237 16210148 17275072 18082541 18285172
8412 18285172 17642598 16686807 15716821 15233837 15274021 15632531 15875389 15999284 15781823 14669473
8402A4669473j891442k294928j901590j448055r42930p80519o80084n47670l42104
8393C840151j81473j87703j60010k91183j34892r6693j54820k00253j31765r6493
8383B204866k9152m8003j86003m2435j06169o7951j64421n8435q2718n6637l1417
8372A331525K052P124r9106l6971l6921q5684j7151n1055o1343p0085k0356j5434
8360H46595P1574n3537p6684m9604m3280L6077k4887l84r0021j53009M7562n0081
8348D60321L0565n3711N5069J7289l097l4376k0199m167k0164k2857J50330K3586
8336E78589j2756L826j04384M6999P1879k5268K3935k9606j48508J06657q4091
8325D27272j57867o9486J51377N6812n6674k3406m2716l4615m4545O970L53j6234
$$ plain form
8402 14669473 12778031 10483103 8581513 7133458 6190528 5410009 4729925 4182255 3840151
8393 3840151 3658678 3470975 3310965 3019782 2884890 2788197 2633377 2433124 2301359 2204866
8383 2204866 2175714 2127711 1941708 1899273 1793104 1725153 1560732 1502297 1419579 1362942 1331525
8372 1331525 1333577 1340701 1241595 1204624 1167703 1082019 1064868 1013813 952470 882385 862029 846595
8360 846595 918169 864632 787948 738344 695064 731141 706254 705870 615849 462840 510402 460321
8348 460321 490886 437175 492244 509533 506436 472060 451861 447694 427530 404673 555003 578589
8336 578589 565833 569659 465275 512274 584153 558885 582820 553214 404706 511363 427272
8325 427272 269405 199919 351296 408108 351434 328028 285312 250697 206152 213122 213475 197241
8313A97241M1825l484k6542k8464m1357k7426M0107M8882J6899m5536K2015j08464
8301H5696M6870L3352n3593J34149N1090q3082r150N8464m460k2546P7694J6979
8289C31463o4600o4842k6073l231j19111n6235J23832k578j7294m5412N300J6903
8277G8122M6260r262p8330J3487K0369n6281n699k5461R348R6130m6771o1966
8265b0054P891j6590N1275P4243O768O1875O167q1028K9470J43206P5987o9380
8253B69830j796l8714j53467l6678Q1891j06143j52455Q1485M4373J3666p9308
8242g7316L5007J07467L2780P7580m1778o3285K561j0036j7644P0754o0250j19829
8230f3989O750M9580J4716K7211R328o6991L1145R242n6283L0497N329M2786m9600
$$ plain form
8313 197241 239066 235582 209040 180576 139219 111793 151900 200782 217681 172145 194160 85696
8301 85696 132566 165918 112325 246474 297564 214482 205332 263796 259336 236790 314484 331463
8289 331463 266863 202021 175948 172717 53606 -2629 121203 118625 101331 55919 61219 78122
8277 78122 124382 115120 36790 50277 70646 14365 8666 -16795 -7447 88683 41912 -20054
8265 -20054 -12163 -28753 22522 96765 103533 165408 171575 90547 120017 263223 339210 269830
8253 269830 268034 229320 75853 39175 121066 14923 -137532 -56047 -11674 1992 -77316
8242 -77316 -42309 65158 97938 175518 133740 70455 73016 62980 45336 116090 55840 -63989
8230 -63989 -57239 -7659 7057 34268 43596 -23395 7750 16992 -39291 -8794 -3465 39321 -10279
8217a0279J293O1141k5483n827o0477P6830J17539o6224q2172O983J6998P5856
8205A06178J10118p0614J678J21840o2810j04993j07912o4523J19643j58678j4247
8194a24320r207J44571P82214k25506m22582n2459n2284N364p612N9365K2477
8183A20021p5100o7420j6989M2023P8660Q5059n0717n1090n310j44914K6391J2863
8171d6523J3083P0027O3700m1023k2078n3154J3119o0833M2476n584M7692l5621
8159a4719n5067l3172J123O9866k3514J1417J1144M4148p1512l5881K0761Q1877
8147F471L6710j10881l20J16068m3628j39771M8258Q6985j9976Q0941l3167l4115
8135f425l0227L2569o7689N468K5243M8313r2278K6001J2186J1462M8166p173
$$ plain form
8217 -10279 -8986 52155 26672 20845 -39632 37198 154737 88513 6341 13324 30322 106178
8205 106178 216296 145682 147360 269200 206390 101397 -6515 -71038 48605 -110073 -124320
8194 -124320 -133527 11044 793258 567752 145170 92711 40427 45791 38179 97544 120021
8183 120021 44921 -22499 -39488 2535 81195 166254 115537 64447 59137 -85777 -59386 -46523
8171 -46523 -33440 36587 100287 59264 37186 -15968 -2849 -63682 -21206 -26790 20902 -14719
8159 -14719 -69786 -102958 -101835 -31969 -55483 -44066 -32922 11226 -60286 -96167 -75406 6471
8147 6471 43181 -67700 -68020 48048 4420 -135351 -87093 -108 -20084 60857 27690 -6425
8135 -6425 -36652 -4083 -71772 -66304 -41061 7252 -85026 -59025 -46839 -35377 12789 5616
8123E616K2322o038k5738o24J8110j5301j0046j8311J1947J3131k2076L5309j7159
8110h858L1828L2411j2779N7076k6018q3046M2788J05413M5810j06350r0444n565
8098a7734O4483J1037J2057l3923J35846J5115l8935J1988l7298r102o0337J27928
8086A81125j19358k764J26119p3204j0082k3104j9058P876j5308n1426m6505J35280
8074H9591m7162J07159J01344N3126l8668k5496j10379p3331J37725M1430k0772
8063B14567p5664P8286k2735j07584M0564M1128J36364j088n796m3448K668M5423
8051C02685n5891l4749l5205O9009n1694l0212N3717O6950j52272j05587N9144
8040H5895K7101k8157n7672j4414O351Q0633M5896K9573j09754M8313o3394N5793
$$ plain form
8123 5616 27938 21900 -3838 -4462 13648 -1653 -11699 -30010 -18063 -4932 -27008 8301 -8858
8110 -8858 22970 55381 42602 99678 73660 -9386 33402 138815 184625 78275 -12169 -17734
8098 -17734 46749 57786 69843 35920 171766 186881 147946 159934 122636 113534 53197 181125
8086 181125 61767 59003 185122 111918 101836 78732 59674 67550 52242 816 -45689 89591
8074 89591 42429 149588 250932 304058 265390 239894 129515 56184 193909 235339 214567
8063 214567 138903 217189 194454 86870 127434 168562 304926 303838 298042 254594 257262 302685
8051 302685 246794 212045 176840 245849 194155 163943 217660 284610 132338 26751 85895
8040 85895 112996 84839 27167 12753 19104 99737 145633 175206 65452 113765 50371 106164
8028A06164K0970l4125P9759l7315q9797O9571J3047o1468K509l989N5943N6481
8016A77750M2279n4867M387k1088p3191m7519l3308l856j9973r126j7619P4108
8004A7977L8979l9226o6174l0746N6862j4467q0694J00075k5130L0871P7772p4028
7992g929N9301L0355o9114p0819M2616N7528l9260m2069o0412L2421M8572O6532
7980D7722k4753K8406N043p9984j31274J3161J98164j2728j03078l7641M8709
7969d8253l3588P6493Q1805n3320L3418k9278L205j19720n2515O2329m1018K6462
7957i3980J2047O9677K7824M5385j27115l3800J8424R3945n3273j7192o9227J33901
7945F616j9612j9251O0284P844N9987q4385l2675R612K9058l3702p3109P3744
$$ plain form
8028 106164 127134 93009 172768 135453 45656 115227 128274 66806 69315 65326 121269 177750
8016 177750 220029 165162 169549 148461 75270 27751 -5557 -9413 -29386 -38512 -56131 17977
8004 17977 56956 17730 -48444 -79190 -22328 -36795 -117489 -17414 -42544 -11673 66099 -7929
7992 -7929 51372 81727 12613 -58206 -15590 41938 2678 -39391 -99803 -67382 -18810 47722
7980 47722 22969 51375 56418 -23566 -154840 -141679 56485 43757 -59321 -96962 -48253
7969 -48253 -81841 -5348 76457 23137 56555 27277 30482 -89238 -141753 -79424 -120442 -93980
7957 -93980 -81933 -12256 15568 60953 -66162 -99962 -81538 12407 -40866 -58058 -127285 6616
7945 6616 -12996 -32247 28037 35881 95868 11483 -21192 -11580 17478 -16224 -89333 -15589
7933a5589k8973j30249M7255P6934j3288L1119n7259K6802M8110o3582j4874J37504
7921D3910r893q9917M6793l0790P829N5766k7430K6602O5593o5530o2807Q928
7909c0946j9943k530J24760o0595p5205n5772m2356M7113P5773n7995o1479M3462
7897a15713O7496J22300j81471j55172J9339J32329Q1234K9830j0888q5452j11458
7886b07626R412J21040m7306n5362M1535Q709n3331K8041N4112l2333O0505P1844
7874g60n8913l3507J1193M8809k2736k4085N3061P5390p2803O568j8173L9091
7862C135K9045O2225k7359m4969k7439l2639l7445Q305l1520o685P9921P8678
7850E3253r0390L628J5508L1856m6983m2402M6323n8962N5757N6338P9399n2978
$$ plain form
7933 -15589 -44562 -174811 -127556 -50622 -63910 -32791 -90050 -63248 -15138 -78720 -93594 43910
7921 43910 34017 -55900 -9107 -39897 -32068 23698 -3732 22870 88463 22933 -39874 -30946
7909 -30946 -50889 -53419 71341 10746 -64459 -120231 -162587 -115474 -39701 -97696 -159175 -115713
7897 -115713 -48217 74083 -107388 -262560 -243221 -110892 -29658 172 -10716 -96168 -207626
7886 -207626 -198214 -77174 -124480 -179842 -138307 -129598 -182929 -154888 -100776 -133109 -72604 -760
7874 -760 -59673 -93180 -81987 -33178 -55914 -79999 -26938 48452 -24351 -17783 -35956 3135
7862 3135 32180 94405 67046 22077 -5362 -38001 -75446 -67141 -98661 -105346 -25425 53253
7850 53253 -37137 -33509 -18001 13855 -33128 -75530 -29207 -88169 -32412 23926 103325 50347
7838E0347n0106m6272k3510M5111M9002M078K8997k6100j37746J0889k8052L6130
7826h7232j6330Q7817q8394l6614R2892J8218L5270o7002l3831J11592J0807n1363
7814b4170r5924J03061N816M538n7051L82352J55967n25089K1917q9990K3569
7803i5004m0392N7656p5365m267R6236N6095J12701j9063r5144l3637J1919K6177
7791b088J7579m5114m0599k2703N8555J30193j6325m1244R276r7881n2872N7011
7779d6212m2128p299P1326R568j39462j7296K5929J157M2089m2776P8277J13388
7767D6561j62779J5276k9897L4115L6304l6945K4488P554M4489l5744Q2404J9860
7755D5686L6120k3691j4317r6442J1k6359O4768M7319M3066l8896o4536K2638
$$ plain form
7838 50347 241 -46031 -69541 -24430 24572 28650 57647 31547 -106199 -95310 -123362 -87232
7826 -87232 -103562 -15745 -104139 -140753 -47861 -29643 5627 -61375 -95206 16386 27193 -24170
7814 -24170 -120094 -17033 -11217 -6679 -63730 318622 474589 -50500 -28583 -118573 -95004
7803 -95004 -135396 -77740 -153105 -157372 -61136 -5041 107660 88597 -6547 -40184 -28265 -2088
7791 -2088 15491 -29623 -70222 -92925 -34370 95823 79498 38254 47530 -50351 -103223 -46212
7779 -46212 -88340 -95639 -24313 -14745 -154207 -171503 -145574 -144417 -102328 -145104 -66827 46561
7767 46561 -116218 -100942 -130839 -96724 -60420 -97365 -72877 -65323 -20834 -56578 25826 45686
7755 45686 81806 58115 43798 -52644 -52633 -78992 -14224 33095 76161 37265 -27271 -4633
7743d633r8711N5504k4449j05233K1062M791Q6925j7040n195p2394K5911L4758
7731i8704N0375m992q416J6950p2882M8915M677j3454m2387j0771J1459J29221
7719I991K5565O1292r2500j5666K3819j2850k197m3467k8787L0733n3174o9920
7707a67161K9162J10763Q041n3657m9551J19645M5039p4978j9226j0228j0700
7696g2851R3730O413r2016K8122j9758Q9091o8734o5466N297l7722M5929M2238
7684d5727M2897j07822q9728J27667O1449P0417m2651l2057l0514J8780k5764
7673e3053L751p9606P117j9639r122J8594M9781J2752r7744J53952k4182k6135
7661f3534m7927L037j1848K993N7191l6513N2418L6479j00526Q3064N985p5503
$$ plain form
7743 -4633 -103344 -47840 -72289 -177522 -156460 -151669 -64744 -81784 -86979 -159373 -133462 -98704
7731 -98704 -48329 -53321 -61737 -44787 -117669 -68754 -64077 -77531 -119918 -130689 -119230 9991
7719 9991 35556 96848 4348 -11318 12501 -349 -2546 -46013 -74800 -44067 -97241 -167161
7707 -167161 -137999 -27236 -19195 -72852 -122403 -2758 42281 -32697 -51923 -62151 -72851
7696 -72851 20879 27292 -64724 -36602 -56360 32731 -36003 -101469 -96172 -133894 -87965 -45727
7684 -45727 -2830 -110652 -200380 -72713 -11264 59153 16502 -15555 -46069 -27289 -53053
7673 -53053 -49302 -128908 -121791 -141430 -150552 -131958 -82177 -69425 -167169 -13217 -37399 -63534
7661 -63534 -111461 -108424 -120272 -117279 -60088 -96601 -44183 -7704 -108230 -25166 -19181 -94684
7649i4684O1875J7913L2335Q5704o085q6890K6423K6112J2791l7974j27566M2851
7637d7195m1763k7692J12680J7759M9412j43958j15901J38514M5674m580m5J027
7625a6068n7150J2943m422L4270O4772o835o4004R678m8116o1126L8097N9449
7613c8512O9940m5052o8851o0295M4364M2445P6635j9373k2258j5212l8403p0529
7601a45101k3454n670J12476J3563Q6976j5980N927l2982p2189N6815m4434m1654
7589a05707j0263K0940j5429Q4182P7877m7768q3586J00587J954m6535k1289m0008
7577h5045J27850m7423r4814M1159M123O0686k4120J4089J62960j33175r0951
7566f4661J4684M013N821J45481q7087j9157n096O621m612k5208O771n4290R8634
$$ plain form
7649 -94684 -32809 -14896 17439 103143 97058 10168 36591 62703 75494 37520 -90046 -47195
7637 -47195 -88958 -116650 -3970 13789 63201 -80757 -196658 -58144 -12470 -17050 -17095 -16068
7625 -16068 -73218 -60275 -64697 -30427 34345 27510 -36494 -26816 -74932 -136058 -97961 -38512
7613 -38512 31428 -13624 -82475 -142770 -98406 -55961 20674 1301 -20957 -36169 -74572 -145101
7601 -145101 -168555 -174225 -61749 -48186 38790 22810 28737 -4245 -76434 -19619 -64053 -105707
7589 -105707 -115970 -95030 -110459 -26277 51600 3832 -79754 20833 22787 -23748 -45037 -85045
7577 -85045 42805 -4618 -99432 -58273 -54150 6536 -17584 -3495 159465 26290 -64661
7566 -64661 -49977 -45964 -40143 105338 18251 -906 -6002 619 -3993 -29201 -22430 -76720 21914
7553B1914o0601K9499P4082K7882n1632r2222K8489P3103K1770n7438o935J7886
7541B5797J2596k9132J2608P0576P3728p3021p9533P2559r4436j818q0152K4641
7529f5587J29626j5231L9123n0610q3265Q7322M1642m3414o0178q000n7746K1493
7517f4825K3338O8150p8548L3546J20042P7327j45192r9556N0844j7647M3031
7506A0510M6688j07269n6815j7250J01083Q4802K5505p3574m6050J1415K4286
7495C331J0397j1088J5311j8913j3135j2480L0656j3363l2620N5345J7558L4657
7483F5656j71787J141J29695l5898r2251k531M6861o0564R1655L6016J13989j35083
7471a3101l8571P9824P164n1028n217J6764j10987j9339J18468j615o0776j3008
$$ plain form
7553 21914 -38687 -9188 64894 92776 41144 -51078 -22589 50514 72284 14846 7911 25797
7541 25797 38393 9261 21869 92445 166173 93152 13619 86178 -8258 -10076 -90228 -65587
7529 -65587 64039 48808 87931 37321 -45944 41378 83020 39606 -20572 -28572 -86318 -64825
7517 -64825 -41487 26663 -51885 -18339 101703 179030 33838 -65718 -14874 -32521 10510
7506 10510 57198 -50071 -106886 -124136 -23053 61749 87254 13680 -32370 -20955 3331
7495 3331 13728 2640 17951 -962 -14097 -26577 4079 -9284 -41904 13441 30999 65656
7483 65656 -106131 -104990 24705 -11193 -103444 -105975 -59114 -119678 -28023 7993 121982 -13101
7471 -13101 -51672 28152 35316 -15712 -20929 -4165 -115152 -134491 -16023 -17638 -78414 -91422
7459i1422R814p201N1450N5966k6183j5188j2310o6661l2015M3124N5378N997
7447b9251o9692K683Q252M5234n1022M5296L6941j04249P723N4413Q7411j21725
7435h7986R6020J7747q6935p5237N0216O9782m5610M7853k676n6515n8630j310
7423a33281R3672n667Q8499p3361m3996O1802r368j7028M9002j6137L7257M209
7411C5603o9706M4227L540K65j070j5241K7017j5450q1396p4398m6320L582J72348
7398a6999Q5510m6516M4214o2016p5421N0801J5856m0612m9420J3560o0697k2548
7386a64288K9532N3958J21741p0709L2496m7386O3084j4196o5277l9010N0465
7375d9590M3411k7477o8278o5061K3170J17034j149o7342M5783N2319K1316j2774
$$ plain form
7459 -91422 -81608 -88809 -37359 18607 -7576 -22764 -35074 -101735 -133750 -90626 -35248 -29251
7447 -29251 -98943 -96260 -88008 -42774 -93796 -48500 -11559 -115808 -108085 -53672 33739 -87986
7435 -87986 8034 25781 -61154 -136391 -86175 -16393 -62003 -14150 -16826 -73341 -131971 -133281
7423 -133281 -39609 -45276 43223 -30138 -74134 -12332 -21700 -38728 10274 -5863 31394 35603
7411 35603 -34103 10124 13664 13929 12859 -2382 24635 9185 -72211 -146609 -192929 -189347 -16999
7398 -16999 68511 21995 66209 4193 -71228 -20427 -4571 -45183 -94603 -81043 -141740 -164288
7386 -164288 -134756 -80798 40943 -29766 2730 -44656 18428 4232 -61045 -100055 -49590
7375 -49590 -6179 -33656 -101934 -166995 -143825 -26791 -27940 -95282 -49499 2820 24136 11362
7363A1362O3053q747r4948M11m1994j786N2726O8887q896K133M1040p2767r3287
7350h2813R2038Q569j7490m4743q3343O7893m479K8727o1346L4381M4236j77759
7338a96129J08704N3318q1039Q8292j7157j5788R1590l7106m66o8614n5018K1056
7326a08357L0827o9743q225J03131Q0866r3583n1981l3791m868J10716m7521R9464
7314F935L2388q5330O1897r8078l449O8331j2597O0318k3949m6604O3252r146
7302A3968n5658J3907p606q34O7787Q7060l9837k9744l5416P1723r9603K9922
7290A5669M7451M5666k8378q3540j30225J4305O2899P2279j36281K7353K3195
7279f9607K299L964M7073M3666l739N973l9571m9352k8067R0349r1073Q5469n3665
$$ plain form
7363 11362 74415 65668 -29280 -28869 -70863 -72649 -19923 48964 40068 42201 83241 10474 -82813
7350 -82813 9225 17794 304 -44439 -127782 -59889 -64368 -35641 -96987 -62606 -18370 -196129
7338 -196129 -87425 -34107 -115146 -26854 -44011 -59799 31791 -5315 -5781 -74395 -129413 -108357
7326 -108357 -77530 -147273 -155498 -52367 28499 -65084 -117065 -150856 -155724 -45008 -92529 6935
7314 6935 39323 -46007 15890 -82188 -85637 -17306 -29903 30415 6466 -40138 23114 13968
7302 13968 -41690 -27783 -35389 -36223 31564 118624 78787 49043 13627 85350 -14253 15669
7290 15669 63120 108786 80408 -3132 -133357 -119052 -56153 16126 -120155 -92802 -69607
7279 -69607 -67308 -63344 -16271 27395 23656 29629 -9942 -59294 -87361 2988 -88085 -2616 -56281
7266e6281M4037o3711M0296q410k0325P6151j33064l332J53600J0461p9491k8063
7254f8132m314m2100m7967M8381O2811J09386L1152l3714l8609j5136l3821k2185
7242e4248J04879J13212j27874p9430L1237K4363J09708M1352n9888j5239M5287
7231A33359M3526O9485j90339j1572k3361l9438N1907N6034M6314o9285N6381
7220A23011J0556m281k7283n500J1294Q4521Q7232j13250j06520Q9653L3537k8500
7208A54470J1899p545m2842N7539j4863o3140O831M4163L5235Q386J0966j6423
7196A84676m1204j03452J4983O3981j7398l4363J09059J2875p4593m5345o8359
7185H60L0790Q5258j4335j26067L622O1936O7660r5839N2399J09137l454k01168
$$ plain form
7266 -56281 -12244 -75955 -35659 -44069 -64394 11757 -121307 -124639 28961 39422 -40069 -68132
7254 -68132 -72446 -114546 -162513 -114132 -51321 58065 89217 55503 16894 1758 -32063 -54248
7242 -54248 50631 163843 35969 -43461 -12224 12139 121847 163199 103311 88072 133359
7231 133359 176885 246370 56031 44459 21098 -18340 33567 89601 135915 66630 123011
7220 123011 133567 129286 102003 96503 107797 192318 279550 166300 59780 149433 182970 154470
7208 154470 166369 158824 115982 173521 158658 95518 102349 146512 181747 190133 201099 184676
7196 184676 143472 40020 55003 118984 101586 67223 176282 189157 114564 69219 860
7185 860 31650 116908 102573 -23494 -19872 42064 109724 13885 66284 175421 171967 -29201
7173b9201o0433L1123J0202L5644O1051m8834p439K9295m2992O4177O7636J6379
7161A26608o4261m8440p7615N6876J7255o3112q671M6179L1169q9453M2002P4082
7149D2619r7134j5081p4738J9365J12771o443J5075P8154k2969L0500J4013M2930
7137A39062q5539O073n0602M824P0452M7383j42453K0234M2086n170p9833n405
7125c8888q8416P0771j3498R785R6150L1101k2272j21327M1341j9096p6916k5926
7113a57191J71180l0972R937j8408o3418l9684n3016O7071m4481J43621J03921
7102H8560j16344j4239o368O6003q3051k1313L4260P621N4037N1758l6124p79
7090B4021j20374k9903j0226N961O4083N0652k026o5397L2981Q132p6197J36826
$$ plain form
7173 -29201 -89634 -58511 -48309 -12665 48386 -448 -7887 21408 -21584 42593 110229 126608
7161 126608 62347 13907 -63708 -6832 10423 -52689 -61360 -15181 15988 -73465 -31463 42619
7149 42619 -54515 -69596 -144334 -124969 -12198 -18641 -3566 74588 51619 82119 96132 139062
7137 139062 53523 59596 8994 13818 84270 131653 -10800 9434 51520 46350 -33483 -38888
7125 -38888 -127304 -56533 -70031 -60246 35904 67005 44733 -76594 -35253 -54349 -131265 -157191
7113 -157191 13989 -16983 -7046 -25454 -88872 -128556 -181572 -114501 -158982 -15361 88560
7102 88560 -27784 -42023 -48391 17612 -65439 -86752 -52492 -44871 9166 60924 24800 24021
7090 24021 -96353 -126256 -136482 -130521 -66438 -15786 -17812 -83209 -50228 -42096 -118293 18533
7078A8533M8743j01883j8068K6042N2194j4065K6083r1867l2551N5225O0274J9584
7066D8244m1912J9863j07807N9017j04839j0409N5440J20904J01267q2787k3614
7055C3367M2958o6056m0157q6441N4397N6183P9250J7355J3329p4661J3059j01272
7043e8689o4528N0020K6345l1466m877R5256n716M5403o4422n6259p322j0302
7031h6557M4256Q5402p3591j1767O2454j4078o5696p2995Q6005k0521L0515L1445
7019e128l9493L306r303k4416l4675J78790o8804J6133j4769n8051j6978N5462
7007a7926L772o2549j458k2784J16734L5774o5479K1101n7024j6400L18P5237
6995I316j15759L9477M2329K42J5974L8580k7522l9735Q3501j0718m7358M323
$$ plain form
7078 18533 67276 -34607 -52675 -26633 25561 11496 37579 -54288 -86839 -31614 28660 48244
7066 48244 6332 26195 -81612 -22595 -127434 -137843 -82403 38501 139768 56981 33367
7055 33367 76325 10269 -29888 -116329 -61932 -5749 73501 90856 104185 29524 42583 -58689
7043 -58689 -123217 -73197 -46852 -78318 -83195 12061 6345 51748 -12674 -68933 -76255 -86557
7031 -86557 -42301 43101 -30490 -42257 20197 6119 -59577 -132572 -46567 -67088 -36573 -5128
7019 -5128 -44621 -41315 -50618 -75034 -109709 69081 277 16410 1641 -56410 -73388 -17926
7007 -17926 -14154 -76703 -78161 -100945 15789 51563 -13916 7185 -49839 -66239 -65921 9316
6995 9316 -106443 -66966 -24637 -24395 -8421 30159 2637 -37098 46403 35685 -11673 -7350
6983g350K2754L0016k1393R280n4163O6841J1j1395K7001R9999l4489R3889p8133
6970A42868j10663P8902k7422k1065n392p3760o363N6381k9414k5745q5712K8348
6958g9037Q3156M4472j8109k1136n9784j4662P2234J4143m3241k6282K5368N0085
6946B7207p0618L1723K6237N9110m9547j1977K6695r1072n5177N2993N6520O4030
6934F6124m2011k0981p5534j1773P445M7240l3758J21826j7566l2175p122l7273
6922c5558L7875o0627Q4107k8844j13060J17590M8798o4036J060L2470j04406
6911h4631R610J55066k3880j2793L4119K2153m8717K9828n3237k084M8369k3260
6899E0543N755L9134j01778R4310O1778o7579K2042J9618j02122o1386n1701R4835
$$ plain form
6983 -7350 15404 45420 24027 33307 -20856 45985 45996 34601 61602 161601 127112 221001 142868
6970 142868 32205 111107 83685 62620 57228 -16532 -22895 33486 4072 -21673 -107385 -79037
6958 -79037 4119 48591 30482 9346 -50438 -65100 7134 21277 -21964 -48246 -22878 27207
6946 27207 -43411 -11688 14549 73659 24112 12135 38830 -52242 -107419 -54426 2094 66124
6934 66124 24113 3132 -72402 -84175 -76730 -29490 -63248 58578 41012 8837 1715 -35558
6922 -35558 2317 -58310 25797 -3047 -116107 1483 50281 -13755 -12695 19775 -84631
6911 -84631 -75021 80045 56165 43372 77491 99644 50927 80755 27518 25434 73803 50543
6899 50543 56298 95432 -6346 87964 149742 82163 104205 123823 21701 -39685 -91386 3449
6887C449N5936J3981n6409r158Q2767k1736j1357P6493j0072j08711N8573M6568
6875A20324o0478n599p3108j14638R1536O7310L5000R7516p8375q7570O6844m7908
6863A0854J09144J746k0069J7429n468j18695L7822p0663L5967L3028k5127N5305
6851F1273r8934K4989O7496R4871P6459N5123m4473p9796K3784Q752O9155q9316
6839A69383n0118m3164N3783l0968j8613L2659l4173k1688p6063R3683Q9227q3131
6827H0817O6561N7883q0753J1600J4616r6562o3569P8039M7768N3152n433M96
6815A64615K9838r2749p5827l3609M5114j793l7710Q102L7234J8543o0446q296
6803f984j0778J5524k1927K8679K0493p959L2387n3827L2195O6916j4467j4748
$$ plain form
6887 3449 59385 73366 16957 7799 90566 68830 57473 133966 123894 15183 73756 120324
6875 120324 59846 54247 -18861 -133499 -41963 25347 60347 157863 79488 -8082 58762 10854
6863 10854 119998 121744 101675 119104 113636 -5059 32763 -37900 -1933 31095 5968 61273
6851 61273 -37661 -12672 54824 149695 226154 281277 236804 157008 180792 189544 258699 169383
6839 169383 119265 76101 129884 98916 80303 112962 78789 57101 -18962 74721 163948 80817
6827 80817 147378 205261 124508 136108 150724 54162 -9407 68632 116400 169552 164119 164615
6815 164615 194453 101704 25877 -7732 37382 35589 -2121 5981 43215 61758 1312 -6984
6803 -6984 -17762 -2238 -24165 4514 25007 17048 49435 -4392 27803 94719 80252 65504
6791F5504k4589M7817q0838M0113J690j09650L876Q2664J4720K7615M3970n1653
6779F1239K3819n0605o2518p900J8475K090O958L4216m5609Q400N5932K9203q8910
6766a5210n8949j15605R3986J45032R3809m9276J9425l320l2945J469n1087N5830
6754H3159k0534p9071L3380o3549N1328L4052m1794K2094N1048l6657k4366O4251
6742G3341O6649o9519p7129L8282P0339n1901j4155k1743o5107k8896J16390M807
6730D1358p6775O7284M0697M7939p0671j12974P7377K6068k1360j9927J9211J2280
6718C0507M1032P5804j4911m2164n4602j2937K5114j0910j72813Q1093J35511
6707H0724J8690j2051J0019n1718L7298L6724K5883m6222o4756l8651N2738R0810
$$ plain form
6791 65504 40915 88732 7894 48007 49697 -59953 -56077 26587 41307 68922 112892 61239
6779 61239 85058 34453 -28065 -35965 -17490 -15400 -8442 25774 -19835 -11435 44497 73700 -15210
6766 -15210 -74159 -189764 -95778 49254 143063 93787 113212 109892 76947 78416 27329 83159
6754 83159 62625 -16446 16934 -46615 4713 38765 -3029 19065 70113 33456 9090 73341
6742 73341 139990 70471 -6658 31624 101963 50062 35907 14164 -50943 -79839 36551 41358
6730 41358 -35417 31867 72564 120503 49832 -63142 14235 40303 18943 -984 18227 30507
6718 30507 71539 147343 132432 90268 35666 22729 47843 36933 -135880 -54787 80724
6707 80724 99414 87363 97382 45664 82962 119686 145569 99347 34591 -4060 48678 139488
6695A39488l5112j09448J4090K091O0270j0501m1791R6260j6062j24882k811j5175
6683d3583K0243n501m4495L359L6719N0807L7340j4301q1390O828K7916l2699
6671c8757m3730L3311N3838N910j2312O0201L2300k8896r8233P2878M2819o0175
6659A9154R8613j24500P9155m3625n6888L0155K0562l0428k5580L5867n8440J3430
6647d2525M6665j59566Q9949J46021L0933l9733k3449L9740k2832j418m2424L1930
6635E3291L4781p474k4281m0271L7684J24094p4565q6655P2627J4484J4693K5365
6623A43773q8304q642q19n9057O2407r539L4431q6756J6430O8856r8853l5489
6611f1562j3977P1077j2434M618l8063k124N1460r740p030P0656l5469M9625o0813
$$ plain form
6695 139488 104376 -5072 9018 11109 71379 60878 19087 115347 99285 -25597 -28408 -43583
6683 -43583 -23340 -28841 -73336 -69977 -33258 17549 54889 40588 -40802 -33974 -6058 -38757
6671 -38757 -82487 -49176 4662 10572 -1740 58461 90761 61865 -36368 36510 79329 19154
6659 19154 117767 -6733 72422 28797 -28091 2064 22626 -7802 -33382 2485 -55955 -42525
6647 -42525 4140 -155426 -65477 80544 111477 71744 48295 88035 65203 63785 21361 53291
6635 53291 88072 80598 56317 16046 53730 177824 103259 16604 89231 103715 118408 143773
6623 143773 55469 46827 46008 -13049 49358 39819 74250 -12506 3924 72780 -26073 -61562
6611 -61562 -75539 -4462 -16896 -12278 -50341 -52465 -1005 -10745 -17775 52881 17412 67037 6224
6598F224O5732M1435l0805j33600O1523L4769k823n8285l1907L9341k8235J07080
6586G0449k4537l652M2928n690o9095J3284L5613m9481r6569j0934L143J00450
6574E909n5143L5473m4011o1169J12312O4638l5509o9971J11005M1582n3401m9795
6562A920r468j9219N5859k5648P0574k7507q5399p4724L7942J70360n8947K595
6550C8338N024j32558N259M8713j3850N8808k2944m4236n3998l5144J63653J14473
6538A31538n8751q0917k5479K7043K0861p2016j897l416K6074l3456O8875K9430
6526B7889N5418N2519j13312O6367o9632K7820k2866n4195N3284j10176O3783
6515b3101M8505m1672Q5954m3701J6241L3088j6466K2936M1759r017j85097M8512
$$ plain form
6598 6224 71956 113391 82586 -51014 10509 45278 42455 -15830 -47737 -8396 -36631 70449
6586 70449 45912 42260 85188 79498 10403 23687 59300 9819 -86750 -97684 -94541 5909
6574 5909 -49234 -13761 -57772 -118941 -6629 58009 22500 -47471 63534 105116 51715 1920
6562 1920 -7548 -26767 29092 3444 74018 46511 -38888 -113612 -75670 94690 35743 38338
6550 38338 43362 -89196 -83937 -35224 -49074 9734 -13210 -57446 -111444 -146588 17065 131538
6538 131538 72787 -8130 -33609 -6566 14295 -57721 -59618 -63034 -36960 -70416 -1541 27889
6526 27889 83307 135826 22514 88881 19249 47069 24203 -29992 23292 -86884 -23101
6515 -23101 25404 -16268 69686 25985 42226 75314 58848 81784 123543 114526 -70571 -22059
6503b2059q1783J21866j05197M1221R8831K5429K615k5841j1131Q9853q1434q1162
6491b8792N3177p779J38193l1463p8649o1121L976O941J08496p3921k1119R404
6479A7343P8583o540l0010q2206L7966j9842M6971N1793J6830o4768P9195K2683
6467A47998k3765o3277l4615L6675l9586l9660K1107R2603J974k4509l1739k6133
6455A7073m9333J1872J85n9223J55253k671r5270l7544P3691N0759k9391j7802
6443A7599n1640j4557L2773N9312k8224M0357O8429n0304M6231j3711R436q3734
6431C1967K155P0441r2127N1913J1663L9581n7415o3033K2735O2423L7502m4274
6419G3531o609J8574j1885k9816n0835O7200J02327q9455r6266O6746j1541N1159
$$ plain form
6503 -22059 -103842 18024 -87173 -45952 52879 78308 80923 55082 43951 133804 52370 -28792
6491 -28792 24385 16606 154799 123336 44687 -16434 -12458 -5517 102979 29058 7939 17343
6479 17343 95926 89386 59376 -22830 15136 -4706 42265 94058 110888 46120 125315 147998
6467 147998 124233 60956 26341 63016 23430 -16230 4877 97480 99454 74945 43206 17073
6455 17073 -32260 -20388 -20203 -79426 75827 73156 -22114 -59658 14033 64792 35401 17599
6443 17599 -34041 -48598 -15825 43487 15263 55620 124049 73745 119976 106265 115701 31967
6431 31967 34122 104563 12436 64349 76012 115593 58178 -4855 17880 80303 117805 73531
6419 73531 66922 85496 73611 43795 -7040 60160 162487 73032 -23234 43512 31971 83130
6407H3130N4604n8968O4603p7233j01539R7954J3798l4142Q0022K1121n3852L817
6395I3315P5345q804m2767j23809k440J7425R318n2309L0258K9017m4498n703
6383b5652M1932J28824l3249p6387l9884j5791K2400r725J29601q3016k5842Q2705
6371I5916n0153P9138j8691p2739N8001Q1071P930r6996N244K2364p4349R9630
6359A36366r6472M2343O1638l5074O8287M3461M0577m9952j18229K5954R787R1444
6347B20130q9401j7332k6502R2185l0189J194O6592L6124n070n4959p1796j8393
6335A02583O4916R084j32179k1407O1547n1070J5180P5793m2860K7862k9857j6225
6323F3367l6673R1263O2945l2360n1110O962j025l5275K2108m0574O4122N546
$$ plain form
6407 83130 137734 78766 143369 66136 -35403 62551 76349 42207 122229 143350 89498 93315
6395 93315 168660 159856 117089 -6720 -9160 8265 17583 -34726 -4468 24549 -19949 -25652
6383 -25652 16280 145104 111855 35468 -4416 -20207 2193 -7532 122069 39053 13211 95916
6371 95916 45763 124901 106210 33471 91472 172543 180473 83477 88721 111085 36736 136366
6359 136366 39894 82237 143875 108801 177088 220549 261126 211174 92945 118899 128686 220130
6347 220130 130729 113397 86895 179080 148891 150085 216677 252801 247731 192772 120976 102583
6335 102583 167499 176583 44404 22997 84544 33474 48654 124447 81587 109449 79592 63367
6323 63367 26694 117957 180902 148542 97432 104394 103369 68094 90202 49628 113750 119296
6311A19296o4884j550n519m1991Q5540M1401o7347j37144O3930P8010O9630N9945
6299A99317q4590k6019L7326o7016J0323L4411j9091M0374r016K7391N4081j6134
6287A81357n8130l9959k1577L4887k838l0940O547j33821N7311p505j3106P6121
6275D8347M8385r2811j5810n5688P4007j8455N5578R8081Q5123P694j45734m7005
6263D1712M1715m7140l3664P3999J32491k7189p5611K5134q9480P2522J1782P3366
6251A99637q323p7144j9423j9304j7345n8133K4128R4016M3415L13l7521k6560
6239I7756j0206m6859M7828J4836l9074k8012P5319q6787K8485K2667l0195L4936
6227H0694J0487P4306J46682j08440k5303Q9104k4995o9140o0147M4477j02359
$$ plain form
6311 119296 54412 52862 47343 5352 90892 132293 64946 -72198 -8268 69742 139372 199317
6299 199317 114727 88708 126034 59018 69341 103752 84661 125035 116019 143410 197491 181357
6287 181357 123227 83268 61691 96578 93740 62800 69347 -64474 -7163 -14668 -27774 48347
6275 48347 96732 3921 -11889 -67577 6430 -12025 43553 141634 226757 234451 88717 41712
6263 41712 83427 36287 2623 76622 209113 181924 106313 131447 41967 114489 126271 199637
6251 199637 191314 114170 94747 75443 58098 -35 24093 118109 161524 161837 124316 97756
6239 97756 87550 40691 88519 103355 64281 36269 111588 24801 53286 75953 45758 80694
6227 80694 91181 165487 312169 203729 178426 267530 242535 173395 113248 157725 55366
6216E5366Q1730J6717n3799q0654M945M9883Q7335Q5509p4585r9980o9803l585
6204i21K0272L2379j1556M8616p0335m092O0209p479P2429j2540k4246l4500J06439
6191A74675o561m5852N9189J4904n1173j21003o6289Q8248J43972q7451o1644
6180D1015j1622J04445m391p8328N805N0909K9083q4150J7412J05127Q678o4256
6168A19727j5729M6295R9098k9299O4461O5170m7225l0508m697k6637K5430r9012
6156A67074P0952J9433q6940R163P8523J2608j79437R3767m7449Q9399Q8036j26404
6144A88725r5455q447O492r2358Q0773n160K5953k3499j33795J01542L0443R5622
6132A70836R64p7318o2953k7067O5297p0293M6562o331P0726P1587o6770j404
$$ plain form
6216 55366 137096 153813 100014 19360 24305 74188 161523 247032 172447 72467 2664 -921
6204 -921 19351 51730 40174 88790 18455 14363 74572 67093 139522 126982 102736 68236 174675
6191 174675 168114 122262 181451 196355 145182 24179 -42110 46138 190110 102659 41015
6180 41015 29393 133838 129447 51119 56924 107833 136916 52766 70178 175305 183983 119727
6168 119727 103998 150293 249391 220092 284553 349723 302498 271990 267293 240656 266086 167074
6156 167074 238026 257459 170519 179682 258205 270813 91376 185143 137694 227093 315129 188725
6144 188725 93270 84823 91315 -1043 79730 74570 100523 77024 -56771 44771 75214 170836
6132 170836 171800 94482 31529 4462 69759 -534 46028 39697 110423 182010 115240 113836
6120A13836M597P6375k6839j04931j933K6768N486r086P5025j22376N609J47096
6108A89627L1889j3279K9526j12397l0957M1672P8585m4453P5513m9192l4529
6097A62005J04597n2277j26173N7462M4545n1309O0423J3794L231k7406J4139
6086B03031l455r6502N540j16629n2781N56O8603Q0401P7821n1066k6020J61677
6074B51176j14313q2584J6120K9765J30661k4168p7447N9378o9397Q3225O4484
6063B66900p102j00704L0757J2188L7441k7446l0662K6303n8734m970r285r6671
6051C8015q833P4186L6506r7215J04491k9481M6829O1891j14974n3167k8143Q9939
6039A20044Q053n7195M1090M7159k0980R3660q4480j02362K5133L1580J4465k4808
$$ plain form
6120 113836 118433 194808 167969 63038 61105 87873 93359 84273 159298 36922 42531 189627
6108 189627 221516 208237 237763 125366 94409 136081 214666 170213 245726 196534 162005
6097 162005 266602 214325 88152 145614 190159 138850 199273 213067 216298 188892 203031
6086 203031 199576 103074 108614 -8015 -60796 -60240 8363 88764 166585 115519 89499 251176
6074 251176 136863 54279 70399 100164 230825 206657 129210 188588 119191 202416 266900
6063 266900 259798 159094 189851 202039 239480 212034 181372 207675 148941 143971 134686 38015
6051 38015 29182 103368 139874 42659 147150 117669 164498 226389 111415 58248 30105 120044
6039 120044 128097 70902 111992 159151 138171 231831 147351 44989 70122 101702 116167 91359
6027I1359n7145j2858L0802j2618K9295M2084m5824j0010P5695l2021k2455M7710
6015A24014R1897K1228p1789k9109M7951m1061J6846L0160k6706Q4807L2676q3388
6003A97526n9146K5406Q440j5888N4412m2923k7595j8916N7365q0473o6034N3135
5991H5309N1686J5488m4534j6346Q245M0458K1342n056p7832L6779p2181k304
5979D1054o3733L8125R2595j340R6925J5463L5108k1511n549j06758o4188K7982
5967H4173J30080L5893j5713q2830P4091L2592o5876K944k3846L5946N7440j3425
5955B51469j05147p0673R8487O0280j4195O8602R18J8841j3325p7645P8164L1855
5943C27631p0269p8849m8783j06573L1087M0496M8377J05171j0042M4968n8626
$$ plain form
6027 91359 34214 21356 52158 39540 68835 110919 65095 55085 130780 98759 76304 124014
6015 124014 215911 237139 165350 136241 184192 143131 159977 190137 163431 248238 280914 197526
6003 197526 138380 163786 172226 156338 210750 167827 140232 121316 178681 98208 32174 85309
5991 85309 136995 152483 107949 91603 99848 140306 161648 156592 78760 115539 43358 41054
5979 41054 -22679 15446 108041 106701 203626 219089 254197 232686 227137 120379 56191 84173
5967 84173 214253 250146 234433 151603 225694 258286 192410 195354 171508 207454 264894 251469
5955 251469 146322 75649 174136 234416 220221 288823 289741 308582 295257 217612 295776 327631
5943 327631 257362 178513 129730 23157 54244 94740 143117 248288 238246 283214 224588
5932B24588j6930N4994k8336q6165J59112j4671n2502O7081n2267q9953J43627
5921C08578q880m4930P5319O9347j7901m5611j23080O6911q2120O8678J49979
5910D16290l269k0724J7027m1231q610j18568k7144j4140J2096M8225P6549J1962
5898C48463P757j5835N913p007r84j0958k8554R6592k7124k6253m4651J3426N3753
5885C64538j34946L6358M6638m8044p136p6345M8733M4740j26295J232Q8084n0978
5873A86579J7078O2176J4704j14255O451m4714P5008L6766K7241l8877P6732L7076
5861C41965M958l9804Q6936r1854L2065K9189q3595p9282N0341J0279n4453r311
5849A97434J3209o083P5077j095m5415P6116n4560M1700R07J3101m6819k8245
$$ plain form
5932 224588 207658 262652 234316 148151 307263 292592 240090 307171 254904 164951 308578
5921 308578 299698 254768 330087 399434 381533 335922 212842 279753 197633 266311 416290
5910 416290 413021 392297 409324 368093 359483 240915 213771 199631 211727 259952 336501 348463
5898 348463 356220 340385 346298 339291 338307 327349 298795 395387 368263 342010 297359 310785 364538
5885 364538 229592 265950 312588 264544 257408 181063 229796 274536 148241 149473 237557 186579
5873 186579 203657 265833 280537 166282 172733 128019 203027 239793 267034 228157 304889 341965
5861 341965 346923 307119 394055 302201 334266 363455 279860 200578 250919 261198 206745 197434
5849 197434 210643 204560 279637 278542 233127 309243 254683 296383 297290 310391 263572 235327
5837B35327M7930J3087l4903L2867Q646J6548P6599j07502j66278J06794J24614
5826C53729r4176L3356o1653M8464J0123j5577k4403P774j7296m5902J5043o1768
5814A47714Q2493R0682p4329n9635J20720j5519J2036r1532l3333O7949K9403
5803B76649J1470M7089L8467M9747r607M586j02648l3653J16180r6042m7464M6703
5791C01477n9486P859O103o9457k6317Q593M7201L6375L9689o8610J26354P7533
5779D27314r5745j5801m112j10500M7124Q7596l2616k4337p3574L4206l4673k1703
5767A83179l5569M5567N0113O162j9490O1976q2387K8315N1526j054o6018l7899
5755A84421O6048R4156J00791q4459n77L2050o7884m9288m1506M7422M5686L5773
$$ plain form
5837 235327 283257 296344 261441 294308 302954 319502 396101 288599 122321 229115 353729
5826 353729 259553 292909 231256 279720 289843 274266 249863 257637 240341 194439 209482 147714
5814 147714 230207 320889 246560 186925 307645 292126 304162 212630 179297 247246 276649
5803 276649 288119 335208 373675 423422 413815 418401 315753 282100 398280 302238 254774 301477
5791 301477 241991 249850 255953 186496 160179 168772 215973 252348 292037 223427 349781 427314
5779 427314 331569 315768 311656 201156 248280 335876 303260 278923 205349 239555 204882 183179
5767 183179 147610 193177 243290 249452 229962 291938 209551 237866 289392 288338 222320 184421
5755 184421 250469 344625 445416 360957 360380 392430 324546 275258 233752 281174 326860 362633
5743C62633L0827j9578m097q7305o975p4201p5951P2563k8581m818N2328J24692
5731C41537J75236j29657j0042o0618k704O7484k0023J6856j6998L9629K6427
5720D27127j47356k8910J6802L2514P5632m0480o8249N727Q6449n7217j6210l7643
5708B48186L0333J8960N2027M2788J3880J6273j6489k4378q2722Q535M2614M0416
5696C90423M1702q3597n7292J07967O229J8894l1637o2366m9183m5837N8356N1765
5684C45424R472K2474L1935N9255m3827k3244k5291P3387Q890n0391p9112O6856
5672C95828L2853k5763L2701L4962k5874o8570L5478L3854L6353n2264j8662n081
5660D05815q4252R0538k2281o1271Q0043K2275R2488k8359L5503N0517n3118m2712
$$ plain form
5743 362633 393460 373882 369785 282480 275505 201304 125353 197916 169335 164517 216845 341537
5731 341537 516773 387116 377074 316456 313752 381236 361213 378069 361071 400700 427127
5720 427127 279771 250861 267663 300177 375809 335329 267080 272807 359256 302039 285829 248186
5708 248186 278519 297479 349506 392294 406174 422447 405958 381580 298858 307393 350007 390423
5696 390423 432125 348528 291236 399203 405432 424326 392689 330323 281140 235303 293659 345424
5684 345424 354896 377370 409305 468560 424733 401489 376198 449585 458475 408084 328972 395828
5672 395828 428681 402918 435619 470581 444707 376137 411615 445469 481822 429558 410896 405815
5660 405815 321563 412101 389820 328549 408592 430867 523355 494996 530499 581016 527898 485186
5648D85186J0529k0309R33Q044p3993j05722K0898N8141o409k0427o7068R2918
5636C82721O5043n5171k2088l9268Q7427j2984k7178L3295P9389k905K4116L1048
5624E43445J831L0132o1003k8805O4283J0984l6357j03527N524N1377J4136n9750
5612D32270P3714P8301q7048K037J07285l8145J3607L5710k7300n3005O4858l0460
5600E71824J02130K4555r9420l5477L9922k4995J30220l9373m9893Q1301M2221
5589G43015j13651J8578M7863n9060J13980N5187k8199n0825O0286j1127J5610
5578G91657o8271k4598M450J5429K9644K4876k5653N9285O041j7382m2573J12000
5566H64905O620q2366k7570N8694J04934J09789n6522r9174R988M0454J2571P4653
$$ plain form
5648 485186 495715 475406 476339 484383 410390 304668 325566 383707 377298 356871 289803 382721
5636 382721 447764 392593 370505 331237 418664 405680 378502 411797 491186 488281 512397 543445
5624 543445 545276 575408 514405 485600 549883 560867 524510 420983 426507 477884 492020 432270
5612 432270 505984 584285 497237 499274 606559 568414 582021 617731 590431 537426 602284 571824
5600 571824 673954 698509 599089 563612 603534 578539 708759 669386 619493 700794 743015
5589 743015 629364 647942 695805 636745 750725 805912 777713 726888 787174 776047 791657
5578 791657 723386 698788 703238 718667 748311 773187 747534 806819 812860 795478 752905 864905
5566 864905 871525 789159 761589 820283 925217 1035006 978484 879310 889298 929752 942323 1016976
5554A016976O1210M509j10628J07905K2448n2002p8455K7787J2119n0459O2688
5543A024098k3769L476J0001p0573O4621M6251p070p5436K3783r0197k1718N1231
5531I34698M9984j34671j9970L4969M3299n4594L0825K3000Q5978j4736o6019
5520I12763N4644M6326m2197r4235O8519P0017Q212k551m6599p1056M988l0571
5508H78260J2796j12088L2835M1293K7852p9633q4949O0801J06406L9763J15108
5497A038444m0392n6305O0614N7129L8215J33846j15879p3285R7347L1495o5678
5486A105551N8517L9107p463l8065m8786J9067J5792q369J2931P2476J53859o8423
5474A306194n009J5237o6154L8814J5638L8111m4274O7455m808k3170O1189q5513
$$ plain form
5554 1016976 1078186 1082695 972067 1079972 1102420 1050418 971963 999750 1011869 961410 1024098
5543 1024098 1000329 1003805 1013806 943233 1007854 1054105 1047035 971599 995382 905185 883467 934698
5531 934698 984682 850011 830041 865010 908309 853715 884540 907540 993518 978782 912763
5520 912763 967407 1013733 971536 877301 945820 1015837 1024049 1021498 974899 903843 908831 878260
5508 878260 891056 778968 811803 853096 880948 801315 716366 777167 883573 923336 1038444
5497 1038444 998052 941747 1002361 1059490 1097705 1231551 1115672 1042387 1139734 1171229 1105551
5486 1105551 1164068 1203175 1195712 1157647 1108861 1127928 1143720 1135351 1148282 1220758 1374617 1306194
5474 1306194 1301185 1316422 1250268 1289082 1304720 1342831 1298557 1366012 1361204 1338034 1399223 1313710
5462A313710k08j9919J0097M339L8550j0850J13425M5679k6138J4339k0477M0589
5450A503136R5253j2691j5717K7908R4144R216O1592L7783L124O7914l2093o2845
5438A776724J5503R6356L205r6570O6708N8002J259J8660P9462L246l4615N1979
5426B039919K8604K8848j6487N0290N1341N6485l587L0525Q9175K1421p6578m6036
5414B253920R8923M5381J25434p581M510L5859M6064O198m5124P1170k8308J06413
5402B712859J2147K0261k9775K4733O356O7230L6964Q4480j0200K3536q0020M950
5390B873521J13717J4983J0989m0469K6240k6060M7515L8678M7985p954M3756
5379C142901L5343n1079J28134J29635j26889P5J24956j2176K3862Q7421P8390
$$ plain form
5462 1313710 1313502 1293583 1303680 1308019 1346569 1335719 1449144 1494823 1468685 1483024 1462547 1503136
5450 1503136 1598389 1585698 1569981 1597889 1692033 1701249 1762841 1800624 1803748 1871662 1839569 1776724
5438 1776724 1792227 1888583 1891788 1795218 1861926 1919928 1921187 1939847 2019309 2022555 1987940 2039919
5426 2039919 2068523 2097371 2080884 2131174 2182515 2239000 2235413 2265938 2355113 2376534 2299956 2253920
5414 2253920 2352843 2398224 2523658 2516077 2520587 2556446 2602510 2608708 2563584 2634754 2606446 2712859
5402 2712859 2725006 2745267 2715492 2740225 2746581 2813811 2850775 2935255 2925055 2948591 2868571 2873521
5390 2873521 2987238 3002221 3013210 2972741 2998981 2972921 3020436 3059114 3107099 3099145 3142901
5379 3142901 3178244 3127165 3255299 3384934 3258045 3258120 3383076 3370900 3394762 3482183 3560573
5368C560573k9950R001J5922M9410j10369R4579J32681o1284J3786M7922J62823
5357C885094J28867O3687N123N8234J21257O1848R6837R1830P2704O9704J26259
5346D781444L9122L6302Q3434J7401P3212R8959R0278r2319N5649J43392K04893
5335E531767J55645J63440J16881L4437J15999N690O7881J12253R3778J60610
5325F558381K00194J09334J14333P7801J45812J45557J46695J77808K32685J20506
5315H029106P4126K01090K96897J50893J41103K47060K28080J37066K76863J51055
5305I933339K89282K35439K98028J93113J98330K50954K54534L19296L49885L66988
5295A2689188K19482M19565M14362L64833M01760M98028M96390M80057N75036
$$ plain form
5368 3560573 3530623 3539624 3555546 3604956 3494587 3589166 3721847 3660563 3674349 3722271 3885094
5357 3885094 4013961 4077648 4082771 4141005 4262262 4324110 4420947 4512777 4585481 4655185 4781444
5346 4781444 4820566 4856868 4940302 4957703 5030915 5129874 5220152 5127833 5183482 5326874 5531767
5335 5531767 5687412 5850852 5967733 6002170 6118169 6123859 6191740 6303993 6397771 6558381
5325 6558381 6758575 6867909 6982242 7060043 7205855 7351412 7498107 7675915 7908600 8029106
5315 8029106 8103232 8304322 8601219 8752112 8893215 9140275 9368355 9505421 9782284 9933339
5305 9933339 10222621 10458060 10756088 10949201 11147531 11398485 11653019 11972315 12322200 12689188
5295 12689188 12908670 13328235 13742597 14107430 14509190 15007218 15503608 15983665 16558701
5286A6558701N96254O00950O30188O21818O84057Q22692Q66533P38436R11693
5277B3031322Q55270P67971R13239J047278J069792J152341J185664J312970J478362
5268C2814209J593416J678989J897040K203652K350983K608772K946569L225357
5260E1318987L614701M025829M335262M566288M998871M992461N158843M989409
5252H8000651M636656M293000L797489L123105K525590J534497N05001o30098
5244A07785891j592216k145191k360552k088393k006821j710987j386429j192853
5236I3302449q41876j66297M48391R20512J770419K443743L380506M301818N364893
5227A10924558O539923P900804R595292J1639646J3993884J6810837K0011761
$$ plain form
5286 16558701 17154955 17755905 18386093 19007911 19691968 20514660 21381193 22119629 23031322
5277 23031322 23886592 24654563 25567802 26615080 27684872 28837213 30022877 31335847 32814209
5268 32814209 34407625 36086614 37983654 40187306 42538289 45147061 48093630 51318987
5260 51318987 54933688 58959517 63294779 67861067 72859938 77852399 83011242 88000651
5252 88000651 92637307 96930307 100727796 103850901 106376491 107910988 108415989 107785891
5244 107785891 106193675 104048484 101687932 99599539 97592718 95881731 94495302 93302449
5236 93302449 92460573 92294276 92742667 93663179 95433598 97877341 101257847 105559665 110924558
5227 110924558 117464481 125365285 134960577 146600223 160594107 177404944 197416705
5220A97416705K3865723K7945301L1959981L4969010L5258693L0669728J9971426
5213D02056567N046427j0711950k3601324l1870191l5118965l4974543l2161340
5206B38664681k8226947k4280604k0723521j7626521j4851011j2633984j0784558
5199A09537535r393447q089144p149852o161901n483820m841303m352488l932830
5191F0132750l440561l240473k950554k794404k416574k248484k242663k075869
5183C8723168j807758j811183j669834j594239j480267j314032j226765j244938
5175B6574152r58805q98636j004544j016952q52962q00392p49397q90193q93515
5166A8508756o84309o67058p93938o20721n42003n50502m57940m69729m35924
$$ plain form
5220 197416705 221282428 249227729 281187710 316156720 351415413 382085141 402056567
5213 402056567 407102994 396391044 372789720 340919529 305800564 270826021 238664681
5206 238664681 210437734 186157130 165433609 147807088 132956077 120322093 109537535
5199 109537535 100144088 92054944 84905092 78743191 73259371 68418068 64065580 60132750
5191 60132750 56692189 53451716 50501162 47706758 45290184 43041700 40799037 38723168
5183 38723168 36915410 35104227 33434393 31840154 30359887 29045855 27819090 26574152
5175 26574152 25615347 24716711 23712167 22695215 21842253 21041861 20292464 19402271 18508756
5166 18508756 17824447 17157389 16363451 15742730 15200727 14650225 14192285 13722556 13286632
5157A3286632l80759m20420n01506l88246l68955l60617l38598l32670j47671
5148A0047190m14555k86567j23192l24633j97000j91914k50006k22947k44442
5139G791934j40208j18460j65584k06308j35970k56779k40585j08024o1446o2682
5129F295888k55301j62814j03263j03337k75857k55546j8350j19197j48666j56223
5119D697334j52730l7999n1583K3109j01206j47684Q0633m9010j25924n2455k3780
5108D058705r0749l6446M0781k7960Q437j18615p2872j9737o2469j05326j04618
5097C469131j64776m2681p7131j20826j79998j30646R272j29513j1377k4345j22203
5086B474907o5145j09556j3729k5893j03213j48652J57833k4692j07644q4765
$$ plain form
5157 13286632 12905873 12485453 11983947 11595701 11226746 10866129 10527531 10194861 10047190
5148 10047190 9632635 9346068 9222876 8898243 8701243 8509329 8259323 8036376 7791934
5139 7791934 7651726 7533266 7367682 7161374 7025404 6768625 6528040 6420016 6358570 6295888
5129 6295888 6040587 5877773 5774510 5671173 5395316 5139770 5121420 5002223 4853557 4697334
5119 4697334 4544604 4506605 4455022 4478131 4376925 4229241 4309874 4260864 4134940 4082485 4058705
5108 4058705 3967956 3931510 3972291 3944331 3952768 3834153 3761281 3741544 3679075 3573749 3469131
5097 3469131 3304355 3261674 3184543 3063717 2883719 2753073 2762345 2632832 2621455 2597110 2474907
5086 2474907 2409762 2300206 2286477 2260584 2157371 2008719 2166552 2141860 2034216 1949451
5076A949451q7577m1161J3245K965P4552K9407n5393K7740p9998o6158O4524O7298
5064A898895m7572o1191o6237q4006p8558Q2191n6364j11541p3029K191l8789
5053A365990j6579p3015N560M3328p314o0979m0775l5981q575k381P3133j05398
5041A137014q7609L4132M838p1713k054n0415m7754P433r3701M7106q476O118
5029H74919j7012P9179m4228J7616p4401l5828Q3459L9563q3532k8465P4649j8548
5017H67371q623N4259p2873M0561r4408k9178R3524R6435L7277k3926j253l7091
5005I22075J8914P7153j3904r6107j4349K3360J11582J5246p1341o6601R8841
4994A004869J49821M920k3733j06264k6610J24064J43024K6229m6626n6666J8931
$$ plain form
5076 1949451 1861874 1820713 1833958 1836923 1911475 1940882 1885489 1913229 1833231 1767073 1831597 1898895
5064 1898895 1851323 1790132 1723895 1639889 1561331 1643522 1587158 1475617 1402588 1404779 1365990
5053 1365990 1349411 1276396 1281956 1325284 1317970 1256991 1216216 1180235 1171660 1169279 1242412 1137014
5041 1137014 1049405 1083537 1088375 1016662 1014608 964193 916439 923872 830171 877277 868801 874919
5029 874919 857907 937086 892858 910474 836073 800245 883704 923267 839735 811270 885919 867371
5017 867371 858748 913007 840134 880695 786287 757109 850633 947068 984345 960419 959166 922075
5005 922075 940989 1018142 1004238 908131 893782 917142 1028724 1043970 972629 906028 1004869
4994 1004869 1154690 1159610 1135877 1029613 1003003 1127067 1270091 1296320 1249694 1193028 1211959
4983A211959K5765j1934O6330q5173n2026L073J20915q0327r0345K9560q5079
4972A052718n0604l3892K5090n9036J0159J09415P4582J1558J2486P718L6671
4961A196865L7826j05329J09270j36879j10024J04869L9977m3352L2201K9439
4951A154863L3401m7144M5094L8984l8112J13020K2718j00940O0029R2501N258
4940A379672p0583j6421J8085j09449j450K9342l734m6426R6808j0062j26937
4929A138845k9518O9014m2190n8j19r2215l1200R0943l1808j70326l5790N4691
4917I20269N1793L293k3595M0354p0138L653P6328p5480R2962o176m4670j0008
4905I58585O7394N1755j06603q0007N0545m2552P4838R0436p3160R7568R5076
$$ plain form
4983 1211959 1237724 1225790 1292120 1206947 1154921 1157994 1278909 1198582 1108237 1137797 1052718
4972 1052718 1002114 968222 993312 934276 944435 1053850 1128432 1139990 1152476 1160194 1196865
4961 1196865 1234691 1129362 1238632 1101753 991729 1096598 1136575 1093223 1125424 1154863
4951 1154863 1188264 1141120 1186214 1225198 1187086 1300106 1322824 1221884 1281913 1374414 1379672
4940 1379672 1309089 1292668 1310753 1201304 1199854 1229196 1225462 1179036 1275844 1265782 1138845
4929 1138845 1109327 1178341 1136151 1136093 1135974 1043759 1012559 1103502 1071694 901368 865578 920269
4917 920269 972062 975355 951760 992114 921976 925629 1001957 926477 1019439 1013263 968593 958585
4905 958585 1025979 1077734 971131 891124 941669 899117 973955 1064391 991231 1088799 1183875
4894A183875k7756j09688n2223M5153O0546L4561n6965J7774p2549R1797J60206
4883A274731j1327L1621l1254L6454j09003n9936j0710M3640N0576M3825O5410
4872A324027M4751j37961l188L3532K2885P917J12197l4718p0618K1066k0194
4861A299696n3592L0475M4453m8699R7784l1828Q0114J31100j2792l2320L4066
4850A538457J5001K1003m4366n8548J7803N9821o825J96486J2607j04358Q1531
4839A728612K9787M5916n0082p7070l7874q837N0987K5961q5566l9858L8301j06154
4827A514123j14750k6403P4615n4260L5586K1949J10451k3053n3497q9189J5625
4816A411197M6143L0293m201O004J7736l3880J4868r6335J49J3593N178N6366
$$ plain form
4894 1183875 1156119 1046431 994208 1039361 1099907 1134468 1077503 1095277 1022728 1114525 1274731
4883 1274731 1263404 1295025 1263771 1300225 1191222 1131286 1120576 1164216 1214792 1258617 1324027
4872 1324027 1368778 1230817 1227629 1261161 1284046 1291963 1404160 1369442 1298824 1319890 1299696
4861 1299696 1246104 1276579 1321032 1272333 1370117 1338289 1418403 1549503 1536711 1504391 1538457
4850 1538457 1553458 1574461 1530095 1471547 1489350 1549171 1542346 1738832 1751439 1647081 1728612
4839 1728612 1758399 1804315 1754233 1677163 1639289 1630452 1681439 1707400 1621834 1581976 1620277 1514123
4827 1514123 1399373 1372970 1447585 1393325 1428911 1450860 1561311 1538258 1484761 1395572 1411197
4816 1411197 1457340 1487633 1483432 1489436 1507172 1473292 1488160 1391825 1391974 1405567 1410745 1467111
4804A467111P502q3533j76777m4161J55166J77731p0714j8521l664M0468j73677
4793A276931L3973N7181p8442J15908k7208J4139k7768M4057l1535P060o1988
4782A322308M1631O6609o858r9863J1774j2455J64192q2259n7388l9232K5293
4771A333752n8733j4185M7919J04246j08267K632J32214N0123M6833Q273M4161
4760A588968P85R9606K1840l8935N5972k6730o9184O2722R2086k8744k9288L7824
4748A766922N6882K3078O981j3993j3114O267L952l2597r8543J85783O3237P9911
4736B034766M9670q904J37559Q5600M299j726P0367L7289O0690L4457Q6374R0958
4724B681399N8247J36301P401m9445L8015P6293J4941K5921n8746o68j5773N9951
$$ plain form
4804 1467111 1474613 1391080 1214303 1170142 1325308 1503039 1432325 1413804 1410140 1450608 1276931
4793 1276931 1310904 1368085 1289643 1405551 1378343 1392482 1364714 1408771 1377236 1384296 1322308
4782 1322308 1363939 1430548 1423690 1323827 1335601 1323146 1487338 1405079 1347691 1308459 1333752
4771 1333752 1275019 1260834 1308753 1412999 1304732 1307364 1439578 1489701 1536534 1544807 1588968
4760 1588968 1589753 1689359 1711199 1672264 1728236 1701506 1632322 1695044 1787130 1758386 1729098 1766922
4748 1766922 1823804 1846882 1853863 1839870 1826756 1833023 1836975 1804378 1705835 1891618 1954855 2034766
4736 2034766 2084436 2075532 2213091 2298691 2302990 2301264 2371631 2408920 2469610 2504067 2590441 2681399
4724 2681399 2739646 2875947 2883348 2833903 2871918 2948211 2963152 2989073 2930327 2929659 2913886 2973837
4712B973837j5646l2971j0977m2216M2072J30761J7553j12396o7827J7786j0312
4701B889664N48J09774J15266M9178o1N1078L1972J9026K4025J1339O6200J06255
4689C474264O3858O2071Q1032J35505O9002M9701J21391N9345J32215J49118O6542
4678D464044J27158M1980K6810K89969J84040J33504Q3791J23080J78375J83582
4668E836333L14747K83757L25115K35682J76136M75565K11582L04154M35271L71997
4658H970339N62243O40043N99091N15161N95755M82488N88226O81880M76037M90933
4648A4602196M38690N73397L85033M22272M76344L95023L40607L46388N02066
4639A8482016N21887M95135M79119N95115O56176N57422O72680Q79710Q85966
$$ plain form
4712 2973837 2958191 2925220 2914243 2872027 2914099 3044860 3062413 2950017 2882190 2899976 2889664
4701 2889664 2890212 2999986 3115252 3164430 3164369 3215447 3247419 3266445 3290470 3301809 3368009 3474264
4689 3474264 3538122 3600193 3681225 3816730 3885732 3935433 4056824 4116169 4248384 4397502 4464044
4678 4464044 4591202 4633182 4659992 4949961 5134001 5267505 5351296 5474376 5652751 5836333
4668 5836333 6151080 6434837 6759952 6995634 7171770 7647335 7858917 8163071 8598342 8970339
4658 8970339 9532582 10172625 10771716 11286877 11882632 12365120 12953346 13635226 14111263 14602196
4648 14602196 15040886 15614283 15999316 16421588 16897932 17292955 17633562 17979950 18482016
4639 18482016 19003903 19499038 19978157 20573272 21229448 21786870 22459550 23339260 24225226
4630B4225226R39717J095546R31670R80061J234398J084903J093121J033922J039475
4621C3658039R12814Q80181O54691N91496M87559N8990o2301k78018m48335n95199
4611C5859917n80505n91147m50777l41114k33660q3942l3958K67511L34660M00445
4601C4547430M63731M78194O09691N59231K86351K07632K3164k54248o20138p47060
4591C5553978r26594j112684j366053j341107j530025j514216j448628j282552
4583B5032119j220244j143739j005115q73767o93053o44034l23384l64621k58218
4574A8505944j13684q03R0234L12409L91751K91815N00130P26805P31728R30757
4564B2367086J247342J271760J559473J660717J727486J863237J880595J888335
$$ plain form
4630 24225226 25164943 26260489 27192159 28172220 29406618 30491521 31584642 32618564 33658039
4621 33658039 34570853 35451034 36105725 36697221 37184780 37243770 37181469 36903451 36455116 35859917
4611 35859917 35279412 34688265 34237488 33896374 33662714 33578772 33544814 33812325 34146985 34547430
4601 34547430 35011161 35489355 36099046 36658277 36944628 37152260 37175424 36921176 36301038 35553978
4591 35553978 34627384 33514700 32148647 30807540 29277515 27763299 26314671 25032119
4583 25032119 23811875 22668136 21663021 20789254 20096201 19452167 19128783 18764162 18505944
4574 18505944 18392260 18391457 18481691 18794100 19185851 19477666 19977796 20704601 21436329 22367086
4564 22367086 23614428 24886188 26445661 28106378 29833864 31697101 33577696 35466031
4556C5466031J828368J461217J081679O36449J23355k53706p15783j272619j464911
4547C6890080j453673j598023j490078j274163q49887l03922p6245L26644O53974
4538C0824707R99587J250578J318849J429517J452073J514702J109414N90034
4530D0489461p189p72070j455828j908316k107485k171946k005611j656372j419437
4521B6985207j166085j146986j107295r42966q47875q73061q70616o19297o03097
4512A8807929m92633l94651l44580l21324k14366j68836k22572l33454m78680
4503A5836833m76837m81893m42939m69097m43967n04565m81813n63211o51693
4494A1320818o03967n74453n78553n89930o37955m75902m54289m21960k78598
$$ plain form
4556 35466031 37294399 38755616 39837295 40473744 40597099 40343393 39627610 38354991 36890080
4547 36890080 35436407 33838384 32348306 31074143 30224256 29920334 29844089 30170733 30824707
4538 30824707 31824294 33074872 34393721 35823238 37275311 38790013 39899427 40489461
4530 40489461 40482272 39710202 38254374 36346058 34238573 32066627 30061016 28404644 26985207
4521 26985207 25819122 24672136 23564841 22621875 21774000 20900939 20030323 19411026 18807929
4512 18807929 18315296 17920645 17576065 17254741 17040375 16871539 16648967 16315513 15836833
4503 15836833 15359996 14878103 14435164 13966067 13522100 13017535 12535722 11972511 11320818
4494 11320818 10716851 10142398 9563845 8973915 8335960 7860058 7405769 6983809 6705211
4485F705211j67485l62660k71877j45240k44349j06057j15353k59286j70755m0129
4475D822020j17480j10504q1583j14478l2211n6397j73041q5611o9152j13619
4465C867944p470p0069j49316J9722o297m1920j0667j57841P9069k4650M5580
4454C544085P085j84481M2063K7202J2280q1619q0374j3347K2977N4178M92m8218
4442C302323l6788K8312q6890p3117j2198J8240q5707m7059O3780m331o572o1674
4430B998319l7919O0818J37850M3480m9729Q0868m368m7767M6829M0990K2935
4419C292306k9409J73086K8472q1734L5763R0650K1796m4755P6222j0167J88766
4408C740996J35140n4441k4308J01316J35961Q476K15542L3708R358K30031O5473
$$ plain form
4485 6705211 6537726 6175066 5903189 5757949 5513600 5407543 5292190 5032904 4862149 4822020
4475 4822020 4704540 4594036 4512453 4397975 4365764 4309367 4136326 4050715 3981563 3867944
4465 3867944 3860474 3790405 3641089 3660811 3654514 3612594 3601927 3444086 3523155 3498505 3544085
4454 3544085 3551170 3366689 3408752 3435954 3448234 3366615 3286241 3272894 3295871 3350049 3350541 3302323
4442 3302323 3265535 3293847 3206957 3133840 3121642 3139882 3054175 3007116 3070896 3066565 3059993 2998319
4430 2998319 2960400 3021218 3159068 3202548 3152819 3233687 3229319 3181552 3228381 3269371 3292306
4419 3292306 3262897 3435983 3464455 3382721 3418484 3509134 3530930 3486175 3562397 3552230 3740996
4408 3740996 3876136 3821695 3797387 3898703 4034664 4043140 4258682 4292390 4301748 4531779 4597252
4397D597252N9001J19614K08020J52666K00419K04743K23166K90411L28699L41937
4387F725928L39075N71726N46189N81920N51075P59566Q05547P00583O39934O52710
4377A2874253N99072O42685P07797P68491P31274P13734O85059N26258M00908
4368A8649531J32646L14444L41278L38036L96565K29562k566k30548n86522p08217
4358A8874209n65100m80415k03558l37650l56227m45920o94335p69694q02342
4349A4218968n95081l69314l70425k51518l64178l88499n24051n08333m70212
4340A0377357l93137k42469j62199j32044j06168K2809J1965m0732N7534J49319
4330I542235J38206L14670J47016J72273K61096K04830K14026J47062J48894K10216
$$ plain form
4397 4597252 4656253 4775867 4983887 5136553 5336972 5541715 5764881 6055292 6383991 6725928
4387 6725928 7065003 7636729 8182918 8764838 9315913 10075479 10881026 11581609 12221543 12874253
4377 12874253 13473325 14116010 14823807 15592298 16323572 17037306 17722365 18248623 18649531
4368 18649531 18782177 19096621 19437899 19775935 20172500 20402062 20399496 20168948 19582426 18874209
4358 18874209 18309109 17828694 17625136 17287486 16931259 16485339 15791004 15021310 14218968
4349 14218968 13623887 13254573 12884148 12632630 12268452 11879953 11355902 10847569 10377357
4340 10377357 9984220 9741751 9579552 9447508 9341340 9364149 9376114 9335382 9392916 9542235
4330 9542235 9680441 9995111 10142127 10314400 10575496 10780326 10994352 11141414 11290308 11500524
4320A1500524J23241J10829N6091J35512J79273J54531K05305K77894L09382L37359
4310A3389941L80454K72670L50054N37962M94551M44692M80812O77024N31346
4301A7559506N23331Q29651P55082P50574Q86918R04450R05268J073521J213010
4292B5401311J249858J452085J595148J686996K022309K422216K777177L186786
4284D1793886L905578M610958N493819O453215P536647Q642929R375449R593197
4276I7405678R808023R855929R369355P740756M818741J048382l728372q742352
4268A27576140j2789459j4577599j4038319j2353004j0201135q071684o502047
4261D9042893n390029m345538l693382l112823k740646k247157j864443j630118
$$ plain form
4320 11500524 11623765 11734594 11790685 11926197 12105470 12260001 12465306 12743200 13052582 13389941
4310 13389941 13770395 14043065 14393119 14931081 15425632 15870324 16351136 17028160 17559506
4301 17559506 18082837 18912488 19667570 20418144 21305062 22209512 23114780 24188301 25401311
4292 25401311 26651169 28103254 29698402 31385398 33407707 35829923 38607100 41793886
4284 41793886 45699464 50310422 55804241 62257456 69794103 78437032 87812481 97405678
4276 97405678 107213701 117069630 126438985 134179741 138998482 140046864 136318492 127576140
4268 127576140 114786681 100209082 86170763 73817759 63616624 55544940 49042893
4261 49042893 43652864 39307326 35613944 32501121 29760475 27513318 25648875 24018757
4253B4018757j375905j318904j125368j015392p28888q82595q62263p83765p05879
4244A5219798q14030p05377n74445n10757n13231m51605l94373l53901k31421
4235A0670658k96819k53543j23098k42393j29360k55601k30445j63578k52096
4226H723725l40744l53208l01651k99404j75345j99405l31349k08165j77103o7209
4216F270142m9372k28854j56970q6334o295j58735o5491k0304J2103j36918l7058
4205E335914j14665j02496p1338j83811j2385j73733r0840j3061p4310j54582
4195D344693q0687K3985j64732j0722j21169n2004J16120j45588m4161M0861o4037
4184C842559j4994R863o8360P3067M2033K2402m5007j14354q0898j69574j04355
$$ plain form
4253 24018757 22642852 21323948 20198580 19183188 18454300 17571705 16709442 15925677 15219798
4244 15219798 14405768 13700391 13125946 12615189 12101958 11650353 11255980 10902079 10670658
4235 10670658 10373839 10120296 9997198 9754805 9625445 9369844 9139399 8975821 8723725
4226 8723725 8382981 8029773 7728122 7428718 7253373 7053968 6722619 6514454 6337351 6270142
4216 6270142 6220770 5991916 5834946 5748612 5742317 5583582 5518091 5497787 5509890 5372972 5335914
4205 5335914 5221249 5118753 5047415 4863604 4851219 4677486 4586646 4573585 4499275 4344693
4195 4344693 4264006 4287991 4123259 4112537 3991368 3939364 4055484 3909896 3865735 3906596 3842559
4184 3842559 3827565 3837428 3769068 3842135 3884168 3906570 3861563 3747209 3666311 3496737 3392382
4173C392382j57637j75408j96759r8496o2999k2950j16183o0046K0452j38723
4163B383633o6938m001o0499J344M7487p1725j4312j13511N3369O6242k1753q6121
4151B113215m9679J82895M2877m2403K5056J13899k3885L7834J39216P5829l1258
4140B583596Q802j03854k2158R887p1574j40012j12414Q977K1692K8472j22936
4129B088478n6428M0134O3952L9424k4425K3742o6458M2335J63949J10712K6028
4118B451443j239P7050J02496J24599J32247R8791K9423R8617J28534j24820m4373
4107C072768K2093J04403N9467K05551K29008K59226M13374K99732L37752L79997
4097E383371N52019N12868L51599J22138J9898r4951m33854o71163p59318p15927
$$ plain form
4173 3392382 3234745 3059337 2862578 2764082 2701083 2678133 2561950 2501904 2522356 2383633
4163 2383633 2316695 2312694 2252195 2253539 2301026 2229301 2214989 2101478 2154847 2221089 2199336 2113215
4151 2113215 2063536 2246431 2289308 2246905 2271961 2385860 2361975 2399809 2539025 2614854 2583596
4140 2583596 2592398 2488544 2466386 2476273 2404699 2264687 2152273 2161250 2182942 2211414 2088478
4129 2088478 2032050 2072184 2136136 2175560 2151135 2174877 2108419 2150754 2314703 2425415 2451443
4118 2451443 2450204 2527254 2629750 2754349 2886596 2985387 3014810 3113427 3241961 3117141 3072768
4107 3072768 3094861 3199264 3258731 3464282 3693290 3952516 4365890 4665622 5003374 5383371
4097 5383371 5935390 6448258 6799857 6921995 6941893 6846942 6413088 5741925 4982607 4266680
4087D266680n91824l80265k86196l35023k88876j10173j28798j68760j20817j38195
4077A717753q6351n9426p9026j2864j49374j22666K6461o9360k6650O5049M3118
4066A246664J7440R3513j35155o779j3782o6048l1543j3828q3329j03296N0262
4055I54119O2113K4758J6598n757O153l7401Q4518j6183N9198r1746K8348K1213
4043A105931j51057r9844L3910L1838o4637j6045M2712m9379l3159J9776j26801
4032F93245P2058K1418Q7236m3563j4199J54584K3665O5810M7778n4665N8631
4021A111998J22860k0642r5687L2978P4239K3483J1541R462k73123L9103K1197
4010A057409j30194j28607q3207j4691l0697j09274l386j1448r0921M3388K3283
$$ plain form
4087 4266680 3674856 3294591 3008395 2673372 2384496 2274323 2145525 1976765 1855948 1717753
4077 1717753 1631402 1571976 1492950 1480086 1330712 1208046 1234507 1165147 1138497 1203546 1246664
4066 1246664 1264104 1357617 1222462 1215683 1201901 1135853 1104310 1090482 1007153 903857 954119
4055 954119 1016232 1040990 1057588 1051831 1057984 1020583 1105101 1088918 1148116 1056370 1084718 1105931
4043 1105931 954874 855030 888940 920778 856141 840096 882808 833429 800270 820046 693245
4032 693245 765303 786721 873957 830394 816195 970779 994444 1060254 1108032 1053367 1111998
4021 1111998 1234858 1214216 1118529 1151507 1225746 1249229 1260770 1270232 997109 1036212 1057409
4010 1057409 927215 798608 715401 700710 670013 560739 557353 545905 454984 498372 521655
3999E21655l6330N2847q4204k4956N101m4263J29243Q99k7292Q3059m8284o9173
3987D58302L8225O4602l0481N0958R8411o0203k6706J05309j225j7506J04953
3976G84639J23k5314l8197Q9797J26271N7998j21078P214q9782M8238N5683k1687
3964H73905n5141j04788l7358o9050q8868o2272J3452K7665l6356j3641k7881
3953D19667O7739k8039M4478J4003l7714j44478P2854k3004p8880L0943O210P2416
3941D16195J4383q2964M7041j4642q1719M1567p9866J01452P49J4092m7957o9328
3929B59003J1004M4432l8958J3106K2998k4246q2928k7438k1493J19325O2176
3918C36981p1013j9459J08621J5165n1957N6889Q0436O5206j01231P856O7806
$$ plain form
3999 521655 485325 538172 453968 429012 434113 389850 519093 519992 492700 575759 527475 458302
3987 458302 496527 561129 530648 581606 680017 619814 593108 698417 697192 679686 784639
3976 784639 784762 759448 721251 811048 937319 995317 874239 881453 791671 839909 895592 873905
3964 873905 818764 713976 676618 607568 518700 456428 469880 497545 461189 447548 419667
3953 419667 487406 459367 503845 517848 480134 335656 408510 385506 306626 337569 343779 416195
3941 416195 430578 347614 394655 380013 298294 339861 259995 361447 362196 376288 328331 259003
3929 259003 270007 314439 275481 288587 311585 287339 204411 176973 155480 274805 336981
3918 336981 265968 246509 355130 370295 318338 375227 455663 520869 419638 427494 495300
3907D95300J165p1215r1440J06506k8357q0286L8313N588K9951j8421O878J8007
3895D11989J1892q9501J5311L0404p1289j4606J12166K4088J8745o6689N004N7169
3883D44683l1758J03147j83635l1211L7082J0779k2561j4549n4497j0482l375
3872B43623P4533j16077M4279Q7420j09192k7117m5895K5334J01753N8147J2352
3861C49160o1769n6997J05157m4163O8828P7651n458q9149n6958J9114m7073J3076
3849B71419k3161j7015J6485K9742m986O2972R828r609j912N3170m1785n9420
3837B85728p3956J30904n5383j42504J39707Q84m164O102j0067M641k1583j9597
3825B40712n2653j3533j8365q7602O1350J8396j7595j3603k4056j02468O9101
$$ plain form
3907 495300 496465 425250 333810 440316 411959 331673 369986 375574 405525 387104 393982 411989
3895 411989 423881 334380 349691 380095 308806 294200 406366 430454 449199 382510 387514 444683
3883 444683 412925 516072 332437 301226 338308 349087 326526 311977 257480 246998 243623
3872 243623 318156 202079 246358 333778 224586 197469 151574 176908 278661 336808 349160
3861 349160 287391 230394 335551 291388 360216 437867 432409 343260 286302 305416 258343 271419
3849 271419 248258 231243 247728 277470 272484 335456 345284 335675 333763 386933 345148 285728
3837 285728 211772 342676 287293 144789 284496 285380 281216 287318 277251 281892 260309 240712
3825 240712 188059 174526 156161 68559 129909 148305 130710 117107 93051 -9417 59684
3814E9684j601L9145k6682j5141Q1361K0065m7154K7659K0819M1529K6678j47405
3802G8957r10K7923J8125P5874j08626n9137L5393R332P5030k622k5839K9226
3790A52726k7712o44n1896R8039m2077o2969Q4438M7007M829p2621o1230P0778
3778A38668l9869K7041o566p1926K1680j7847J2959J6821l9170L629K8202K2329
3766I5951n1358m5196j1213L9532L3792n8998J41944J36147m5746j19302k2239
3755I3314j03075l3668N5505O1593J8001p1131K3872N8098m4881n256K4948j593
3743G5727q8072N8715O0026k5528p2283j5361O6741J8115L3087m5876P2784P087
3731A45162l0255k9966l0837j00469j2608K5126k6303N584J29683L3199n7532
$$ plain form
3814 59684 58083 97228 70546 55405 136766 156831 109677 137336 158155 199684 226362 78957
3802 78957 78047 105970 124095 199969 91343 32206 67599 76931 151961 149339 123500 152726
3790 152726 125014 124370 72474 170513 128436 65467 149905 196912 201741 129120 67890 138668
3778 138668 98799 125840 119274 47348 69028 51181 64140 80961 41791 45420 73622 95951
3766 95951 44593 -603 -11816 27716 61508 2510 144454 280601 234855 115553 93314
3755 93314 -9761 -43429 12076 73669 91670 20539 44411 102509 57628 52372 77320 75727
3743 75727 -12345 46370 106396 80868 8585 -6776 59965 78080 111167 65291 138075 145162
3731 145162 114907 84941 54104 -46365 -58973 -33847 -60150 -54566 75117 108316 50784
3720E0784N1179N2019L0303p5987r7881O5140J18889m1684K5967l5986K9633m2202
3708A30174o0226m0840M629o8847l6650Q8655L0414p6977J0843J269K2940N6853
3696F2237l4492r260O5225m8552r387J250l6850j6911K7394n684R077L9222J2145
3683E5414O1195j16426j09215J2800R6314J6961l8086M0602j9706j75792J02558
3672g3381Q4364k1366p2450p4197J16044p2510J5203R894q8356M9637N6733l7276
3660a07661K3455J8778l342P1347P29R213j622M8123J0608n2869k7433J00655
3648H9981o0927r6266L6425P5931k6480Q3863p1414n4325P1370l2335K2913m9976
3636a1240k3424R119M0094o5317Q0851J4339P6313j23826r6621L8630l4703l5920
$$ plain form
3720 50784 101963 153982 184285 108298 10417 75557 194446 152762 178729 142743 172376 130174
3708 130174 69948 29108 33737 -35110 -71760 16895 47309 -29668 -18825 -17556 5384 62237
3696 62237 27745 18485 83710 35158 25771 27021 -9829 -26740 654 -5030 4047 43269 55414
3683 55414 116609 183 -109032 -96232 82 17043 -21043 19559 -147 -175939 -73381
3672 -73381 10983 -10383 -82833 -157030 -40986 -113496 -98293 -88399 -176755 -127118 -70385 -107661
3660 -107661 -84206 -65428 -68770 2577 3306 12519 10897 59020 69628 16759 -10674 89981
3648 89981 29054 -67212 -30787 45144 18664 102527 31113 -23212 48158 15823 38736 -11240
3636 -11240 -34664 -25545 14549 -50768 30083 44422 120735 -3091 -99712 -61082 -95785 -131705
3624a31705O9961J3455R0915O3100j26466l6518r2787N8454P4626k5906m2560
3613h5431M7659P0787M8046n5210j7365P8020j18363k9406M2814n7101j2416l098
3601i1064K7141L4959o762J4639N0528n9089n8922K9992M7889P61k861q7320m4081
3588a44190P3581q6791q0246R5989O7990n7890M3242P8224N4468m5877M2285P267
3576D8052m1047M1144r6400q194k5273Q323K7578J1743J42104n6451l1318n890
3564A4371n8565L1125L1104M7393J3919p5525N5713L6682j16987M9897m9473N0760
3552C0414Q3675l9961p3936n9092O6473J07714n9004M325k7395l3213K2836L4685
3540E7521P4850j02831m0665R1970r190N6384j1507M7146o521l1571k3407N935
$$ plain form
3624 -131705 -61744 -48289 42626 105726 -20740 -57258 -150045 -91591 -16965 -42871 -85431
3613 -85431 -37772 33015 81061 25851 8486 86506 -31857 -61263 -18449 -75550 -87966 -91064
3601 -91064 -63923 -28964 -35726 -21087 29441 -29648 -88570 -58578 -10689 -9928 -12789 -100109 -144190
3588 -144190 -70609 -157400 -237646 -141657 -73667 -131557 -88315 -10091 44377 -1500 40785 48052
3576 48052 7005 48149 -48251 -56445 -81718 -73395 -45817 -34074 108030 51579 20261 14371
3564 14371 -44194 -13069 18035 65428 79347 3822 59535 96217 -20770 29127 -20346 30414
3552 30414 114089 74128 192 -58900 7573 115287 56283 60608 33213 0 22836 57521
3540 57521 132371 29540 -11125 80845 71655 128039 116532 163678 157157 125586 102179 108114
3528A08114O449N3253J0979N2559r113p2431k5509P4443j3681L2837K9672m1873
3516B05699O3515J9488P694o417Q657J0512j4236J4853L0286m0015J1598q4795
3504B26839j1604N0277L723O291l0385J4036p728q1520R8001O399o5035n6879
3492A52415P1040j1990j00582m0394M6376o123J9747O9384j11758n7829K0138
3481E0424N8907Q362Q969j2542k4640k103l172p1465o261J10233n2060n0782L7054
3468E0924o9112L0215J48692K366Q004M2778N5730r9947J4078k7107l3438o1789
3456F1394P4091P2478L0536m9263m8446N2780j32060Q3692J23793j739o1240l8532
3444A67484o4875P2185N4049k1777j33157m1685J1705q6018J10645J041j7872
$$ plain form
3528 108114 114563 167816 178795 231354 222241 149810 124301 198744 185063 217900 247572 205699
3516 205699 269214 288702 296396 289979 298636 309148 294912 309765 340051 300036 311634 226839
3504 226839 215235 265512 269235 275526 245141 259177 251449 169929 267930 274329 209294 152415
3492 152415 223455 211465 110883 70489 116865 110742 130489 199873 88115 30286 50424
3481 50424 109331 117693 126662 114120 89480 87377 84205 12740 6479 116712 64652 13870 50924
3468 50924 -18188 12027 160719 163085 171089 213867 269597 169650 183728 156621 123183 61394
3456 61394 135485 207963 238499 189236 140790 193570 61510 145202 268995 267256 206016 167484
3444 167484 102609 174794 228843 207066 73909 32224 43929 -42089 68556 69597 51725
3433E1725l4335J02797m087P3085j40555j26871P7095L4138O2419l5976p2231
3422a2796o7659j8391P0688R1590n6574j02206O0626K3276q7795J42186O554L6501
3410H6000j5509m4343O662l664o1634j5669O3605N014M1294N8964j69894o6628
3398a15802K280O4754J09671O01j52259J311J95812m7596j38648Q6729o519l5498
3386c5164L7025J4210L2514j02904P7814l0827l2251j1292m2985n7480N0745Q1856
3374a8739R1668j8452K7592q7741j843j6369r447j0135j7516K1170l210J9126
3362b3896R6675K8654j32353K1110m6590P3166l1254k3174N9639k75j0047j05134
3350i3479n1225Q0894P8739m0459L2706N6331j33332p162N1835J02064q4783j09247
$$ plain form
3433 51725 17390 120187 116100 189185 48630 -78241 -1146 32992 95411 59435 -12796
3422 -12796 -80455 -98846 -28158 63432 6858 -95348 -34722 -11446 -99241 42945 49499 86000
3410 86000 70491 26148 32810 29146 -32488 -48157 15448 20462 61756 120720 -49174 -115802
3398 -115802 -113522 -48768 60903 61504 -90755 -89444 106368 58772 -79876 6853 334 -35164
3386 -35164 1861 16071 48585 -54319 23495 -7332 -39583 -50875 -93860 -151340 -100595 -18739
3374 -18739 72929 54477 82069 -5672 -7515 -23884 -33331 -43466 -60982 -39812 -43022 -23896
3362 -23896 72779 101433 -30920 -9810 -56400 16766 -14488 -37662 21977 21702 11655 -93479
3350 -93479 -144704 -63810 14929 -25530 7176 63507 -69825 -76987 -25152 76912 -7871 -117118
3338a17118k3967Q0712M575M5639M4194J5041J7774r8187K9875J7123p7741K3798
3326c8282J2125N9373M9102o7001j40626L2777O610j2389J458K5630R2560K2953
3314D4290p6085P0043k1074r0411J38122J7775j32091q316j9510Q0913K2559q2057
3302e5842n2657J17769J4570j07784p685J02782M6856l6913K6933l9819N924J928
3290A6062l030J36828l4142j26075J8897l8127M2505N3596L0211L410K6411k2197
3278A04349n9323j27007P0316P1527j00299J09514P8933l0138o3577p3301J24907
3267A05901N385m7891N4821J5020J2274j9855j11222p578j000R3410L2384j4714
3255A16935L0610k2781l6911L1204p625P3410p86r818k7146M517l2959J9252N4485
$$ plain form
3338 -117118 -141085 -60373 -55798 -10159 34035 49076 66850 -31337 -1462 15661 -62080 -38282
3326 -38282 -26157 33216 82318 15317 -125309 -92532 -85922 -98311 -96853 -71223 21337 44290
3314 44290 -31795 38248 17174 -73237 64885 82660 -49431 -57747 -77257 3656 26215 -55842
3302 -55842 -108499 9270 23840 -83944 -91629 11153 58009 21096 48029 8210 14134 16062
3290 16062 13032 149860 115718 -10357 8540 -29587 12918 66514 96725 100135 126546 104349
3278 104349 45026 -81981 -11665 59862 -40437 69077 148010 117872 54295 -19006 105901
3267 105901 111286 63395 118216 133236 145510 125655 14433 6855 5855 99265 131649 116935
3255 116935 147545 124764 87853 119057 111432 184842 184056 174238 147092 151609 118650 137902 192387
3242A92387J0784p8823j4706l2978J54737J8968j5899J9592j18711K4950N5158
3231B15459O250o2080p0534m9223N6678P9856K1455k1037Q5399l3029p0395j0687
3219A48112j1631M4600O7573n866J9441K4413l802l7484P7706l7665q0324R7612
3207C02685J58376Q030j896j0795K3670M9154P734j9504L6658Q2120l4207M1472
3195F43497J8932m3963N7611q4220j4988Q5070K999J7742n3256j38589o6788p0431
3183C53616o4693J4922l2595k1681K5839m7276k2938o2733k6360L6694n6975l0938
3171F4882n7126J00813R001N0117R524O4252j7213j10476L0942l496j63157K8631
3159F694M6483k8942M9280M1938j6560j31724K4196J36599M0267m5558r0125J338
$$ plain form
3242 192387 203171 124348 109642 76664 231401 250369 234470 254062 135351 160301 215459
3231 215459 221709 159629 89095 39872 96550 176406 197861 176824 262223 229194 158799 148112
3219 148112 136481 181081 248654 242788 262229 286642 282840 245356 323062 285397 205073 302685
3207 302685 461061 469091 467195 456400 480070 529224 536958 517454 554112 636232 602025 643497
3195 643497 662429 618466 676077 591857 576869 661939 664938 682680 629424 490835 424047 353616
3183 353616 288923 303845 271250 249569 275408 228132 205194 142461 116101 152795 95820 64882
3171 64882 7756 108569 117570 167687 177211 241463 224250 113774 144716 141220 -21937 6694
3159 6694 53177 24235 73515 115453 98893 -32831 -8635 127964 168231 122673 32548 33886
3147C3886L5616n6873j735N7885J7667K5235N5679n8742k4096l3143N0716J9871
3135A21966J28133r6556P8827Q7786q1214k2069p6843K9426L0167N0744M8587
3124B98954j25135j22405L9227L9048K0878m2720n3130p0544n0689R7628n737
3113B5375N8915m939j8280q7654j02619M6766J7593J05323j5277M4776j37110
3102f7131k6058J55316q6382l8846m2597q425L6328N8216k0979n0049j01488O6618
3090a25477K1773O0396M8897n195K2308m6117k8538K2937J19693n8499o7828J4860
3078b0790j36034L3813Q4378J31100j0193p4209J2654j3991O683r0779L3068K1248
3066b3052l2230L9654P7339r9733O1455N162L1934J09985j7952j205j34801j0948
$$ plain form
3147 33886 69502 12629 10894 68779 86446 111681 167360 108618 84522 51379 102095 121966
3135 121966 250099 153543 232370 320156 238942 216873 140030 169456 199623 250367 298954
3124 298954 173819 51414 90641 129689 150567 107847 54717 -15827 -66516 31112 25375
3113 25375 84290 79351 61071 -26583 -129202 -82436 -64843 40480 25203 69979 -67131
3102 -67131 -93189 62127 -24255 -63101 -105698 -114123 -77795 -19579 -40558 -90607 -192095 -125477
3090 -125477 -103704 -43308 5589 394 22702 -23415 -51953 -29016 90677 32178 -35650 -20790
3078 -20790 -156824 -123011 -38633 92467 82274 8065 20719 6728 13411 -77368 -44300 -23052
3066 -23052 -55282 -15628 61711 -38022 23433 28595 60529 170514 152562 151357 16556 5608
3054E608K0463K6296j9159k1751M5025O7291l366j7739L607o4690P814o8926P2646
3041E3119k0453l0822n617o144K0547N7868N6731O5906p0779j8433j6617j6079
3029F9227M9498j63899M8563O2166Q454O3251j1836L1738o5079n0198O9664J5975
3017A27524m301Q4366q9834J3095j17501j4647m4029r7951J3405J62955l0529
3006B553l3798n3919K9294J14657M9517m1065p3861P4155L9404m5177O217n4087
2994A3890j01327J44628j6655J7444n7930M9495K6234k134O2970r2862M8021o4923
2982B6851K3810L157j10135k2754o2796L2943N8777N701N490N0382j2619J396
2970B03o5368L1925N0460J14431M1595r5873j29150n719L6070p975j07701o0764
$$ plain form
3054 5608 26071 52367 33208 11457 56482 123773 120407 102668 106275 41585 49399 -19527 53119
3041 53119 32666 1844 -3773 -9917 10630 68498 125229 191135 120356 101923 85306 69227
3029 69227 118725 -45174 3389 65555 74009 137260 125424 157162 92083 41885 111549 127524
3017 127524 123223 207589 117755 130850 13349 -1298 -45327 -143278 -129873 33082 2553
3006 2553 -31245 -85164 -55870 58787 108304 67239 -6622 67533 106937 61760 67977 13890
2994 13890 -87437 57191 40536 57980 50 49545 75779 73645 136615 43753 91774 26851
2982 26851 50661 53818 -56317 -79071 -141867 -108924 -50147 -44446 -38956 11426 -1193 203
2970 203 -65165 -33240 17220 131651 173246 77373 -51777 -57496 -21426 -29401 -137102 -197866
2958a97866N5571J65872n6075O9681k7366n1003m4180O3882L5572M8196l8597
2947B3687Q1774o6628j15314N0500O7360J7151p9191J9458Q253Q7157J0854p3460
2935C1601m7503j6362R7364M4834r9442L0246k4055J08999o4326n1551n9903N4929
2923D831O6557k6282K8710l3540k7271R9024p1696Q1028q6939L6575p0j33623
2911f2696N7875J2438J8255K5798O2199J4281r8583n9085M3098P5827L5927r7316
2899B8018p8043q738K5442O8282n117J5903J7537J8411R6919J9282l5246j64916
2887b266j6307l5274k7665R2160K8010l9065L8263M1893L9164Q8761J1592P787
2875B27053q351l5917j11546m7866N5525q0096R6482k8070k4892M671k1628K5789
$$ plain form
2958 -197866 -142295 23577 -32498 37183 9817 -41186 -85366 -21484 14088 62284 23687
2947 23687 105461 38833 -76481 -25981 41379 58530 -20661 -1203 7050 94207 105061 31601
2935 31601 -15902 -32264 65100 109934 10492 40738 16683 125682 61356 9805 -50098 4831
2923 4831 71388 45106 73816 40276 13005 112029 40333 121361 34422 70997 70927 -62696
2911 -62696 -4821 7617 25872 51670 113869 128150 29567 -29518 13580 89407 125334 28018
2899 28018 -50025 -58763 -33321 34961 29844 45747 63284 81695 178614 197896 162650 -2266
2887 -2266 -18573 -53847 -81512 10648 38658 -407 37856 79749 118913 207674 219266 227053
2875 227053 218702 182785 71239 23373 78898 -1198 95284 67214 42322 46993 25365 51154
2863E1154j8623n1983Q5375j4903n9414N1290k9464J7959R1146p7839j93064K7683
2851a20683K5214P528Q3575O1318Q26k0846o701J1422o5843j19088J18645J18656
2839I4023p1419n1977k2486P8854M4011K2027l7583m4310m0027L9593O764K1809
2827C9279k439n4425o4744o798K8542K14273j4290j84530n6917K4916k4068M3670
2815e7531J6379n0798L7097K7314l4268m3266J7894J3499P9077j4831p031O3833
2803D7368k7335m3707k5293L1245K5773J5439k8307l6851p464J5807N9765q406
2791A8034j1505K1081K0779M3324k6975l8307L2589j08129L6258L6335k1932j8895
2779a7343k4551L0714O283n5290J6138q4442j4386J22672M1933j10798N1849j9030
$$ plain form
2863 51154 32531 -19452 65923 51020 -8394 42896 13432 31391 122537 44698 -148366 -120683
2851 -120683 -95469 -87941 -4366 56952 57778 36932 30231 41653 -24190 -143278 -24633 94023
2839 94023 22604 -29373 -51859 26995 71006 93033 55450 11140 -28887 10706 17470 39279
2827 39279 36840 -17585 -82329 -89127 -60585 153688 139398 -45132 -102049 -77133 -101201 -57531
2815 -57531 -41152 -91950 -54853 -27539 -61807 -105073 -87179 -73680 5397 -9434 -16465 47368
2803 47368 20033 -23674 -48967 -17722 8051 23490 -4817 -41668 -49132 -33325 26440 18034
2791 18034 6529 27610 48389 91713 64738 26431 59020 -49109 -12851 23484 1552 -17343
2779 -17343 -41894 -11180 -4897 -60187 -44049 -128491 -142877 -20205 21728 -89070 -37221 -56251
2767e6251L0295r8527K8175J3739k4547O9175k8396K7500j0488l8790r659J3925
2755h3849K1098j8340M7101q3020K4675J8994j5049J0660k6288P4869l7455m5342
2743a11946p4313J57488J25317m2084o7221R015j01478R4873R5613p2877p4513
2732f2126O4065N3316M2577j567j9449j00645Q3589p6844K2224J0215l6212o8784
2720h9641M624L1154o7523l2411K8222J9133P194j6999o343Q36J3051N1454j1005
2707f8254n4094p1428M6041L0407j821k6386O9439j07047l2133P3974j0810M6824
2695a05288R2024n2732J8544Q8365r1675j17575M7958Q3899P0785o2579J6336
2684a1938k0327n0366J2417Q9256n6090o879o385J8617k0453n6286L9658m5381
$$ plain form
2767 -56251 -25956 -124483 -96308 -82569 -107116 -37941 -66337 -38837 -49325 -88115 -97774 -83849
2755 -83849 -62751 -81091 -33990 -117010 -92335 -73341 -88390 -77730 -104018 -29149 -66604 -111946
2743 -111946 -186259 -28771 96546 54462 -12759 -3744 -105222 -10349 85264 12387 -62126
2732 -62126 1939 55255 97832 96265 76816 -23829 59760 -17084 5140 15355 -20857 -89641
2720 -89641 -85017 -53863 -121386 -153797 -125575 -106442 -99248 -116247 -122590 -121754 -108703 -57249 -68254
2707 -68254 -122348 -193776 -147735 -117328 -119149 -145535 -76096 -183143 -215276 -141302 -152112 -105288
2695 -105288 -13264 -65996 -47452 40913 -50762 -168337 -120379 -36480 34305 -28274 -11938
2684 -11938 -32265 -82631 -70214 19042 -37048 -43927 -50312 -31695 -52148 -108434 -68776 -114157
2672a14157N354L7767N388M1566M214l2293L2377J4611J2614l0049m4657Q7494
2660B0229m5623j65838K6194K4829K9331l0914L9291K4135L8301J2700p6290P3246
2648c0409j9870m3516K584L0941M5530Q2079k0147K1970j04136Q247j5476n4709
2636i6912N3203K5871m1494j3468R3973q3372M355J9941L2320N3814j673n9906
2624a3348j1085P684k6006K6279J0623m1028J10822k4173o7830l5284l0279q646
2612a02271K8620m9686l7794O3884N5511j4597R9101j3004m5584k2330o6911R9927
2600e134m4655n3124L5975O681p2801K7846k6659l6899N2691J1406O0797N661
2588c8215L2544J3367k0454k1174q1944R9160K9522p7016q5887k4785O4060M876
$$ plain form
2672 -114157 -108803 -71036 -65648 -24082 -19868 -52161 -19784 -5173 7441 -22608 -67265 20229
2660 20229 -25394 -191232 -165038 -140209 -110878 -141792 -102501 -78366 -40065 -27365 -103655 -30409
2648 -30409 -50279 -93795 -91211 -60270 -14740 67339 47192 69162 -34974 -26727 -42203 -96912
2636 -96912 -43709 -17838 -59332 -72800 21173 -62199 -57844 -37903 -5583 48231 46558 -13348
2624 -13348 -24433 -16749 -42755 -16476 -5853 -46881 63941 39768 -28062 -63346 -93625 -102271
2612 -102271 -73651 -123337 -161131 -97247 -41736 -56333 42768 29764 -15820 -38150 -105061 -5134
2600 -5134 -49789 -102913 -66938 -60257 -133058 -105212 -131871 -168770 -116079 -104673 -43876 -38215
2588 -38215 -5671 7696 -12758 -33932 -115876 -16716 12806 -64210 -150097 -174882 -110822 -105946
2576a05946M5065p3073n6591J15726j2993k168Q7306m114J3009j9327J2819J0338
2564A0051o4603k3225M1723Q4423m6018j10992L7079J7493N276P1345N3429r0331
2552a4350l1921L7560q8987j0040N3984O607J054m0575R2332N9483Q0001o9047
2540G6101j04017L2644k735j09798m669M9864j711N5470R8918Q4769j02581l2287
2528C9968j4618K2634l0825k5636n3190J6075N835L2136R281J7711o2326j6708
2516e9663O2098P175p1841j9813j6081M6096m486J9826k5798l8054J1404j2761
2504a01898R640P1568r0956P3236L1451o4990J12074M5319k2933j53412r6312
2493a87213J20216R8643j18090M0596J22782N848o8823l3399l3550j481j5454
$$ plain form
2576 -105946 -60881 -133954 -190545 -74819 -87812 -89980 -2674 -6788 6221 -13106 -287 10051
2564 10051 -54552 -77777 -36054 48369 2351 -108641 -71562 -54069 -48793 22552 75981 -14350
2552 -14350 -46271 -8711 -97698 -107738 -53754 -47147 -46093 -86668 5664 65147 145148 76101
2540 76101 -27916 4728 1993 -107805 -112474 -62610 -64321 -8851 90067 174836 72255 39968
2528 39968 25350 47984 17159 -8477 -61667 -45592 -39757 -7621 1660 19371 -42955 -59663
2516 -59663 2435 9610 -62231 -82044 -98125 -52029 -56515 -36689 -62487 -100541 -89137 -101898
2504 -101898 -92258 -20690 -111646 -38410 -6959 -71949 40125 85444 62511 -90901 -187213
2493 -187213 -66997 31646 -86444 -45848 76934 82782 13959 -19440 -52990 -54471 -69925
2482f9925J4816K4647O8869l5315j2292J6382o4278r6247P3898N5759N8346J1814
2470D6474r9280l5848o490j5815m659k3007J34394k2215j2574L6286K8374k4063
2458A577J5613k7157k3535J234l8201J952Q2051j00050K2999O1282n9130j6332
2446g7697k217P740O9336J00226N2290n8404j20995n7605K5378J39001j01541
2435b4488p4978N015r0180K1021L6348N2208k8381l9977M5077M3860L7385l6650
2423e3740j05981k3529Q1169o8653j700J26493M2044j7349P6805n7884r2533L0227
2411f4631J20425J9875k3399j34434j13117P6867J12212L3855m6473j27120J6
2400a45924O2334N6945k9336l4398n6488J31609Q207m842p1581K5111n5024Q298
$$ plain form
2482 -69925 -55109 -30462 38407 3092 -9200 7182 -57096 -153343 -79445 -23686 34660 46474
2470 46474 -52806 -88654 -95144 -110959 -115618 -138625 -4231 -26446 -39020 -2734 25640 1577
2458 1577 17190 -9967 -33502 -32268 -70469 -68517 13534 -86516 -63517 -2235 -61365 -77697
2446 -77697 -79914 -72174 -2838 97388 149678 91274 -29721 -87326 -61948 77053 -24488
2435 -24488 -99466 -94451 -184631 -163610 -127262 -75054 -103435 -143412 -98335 -54475 -17090 -53740
2423 -53740 -159721 -183250 -102081 -170734 -172434 -45941 -3897 -21246 55559 -2325 -94858 -64631
2411 -64631 55794 75669 52270 -82164 -195281 -118414 -6202 27653 -18820 -145940 -145924
2400 -145924 -83590 -26645 -55981 -90379 -146867 -15258 -7051 -11893 -83474 -58363 -113387 -105089
2388a05089o300O4380O0472N331N6465q5855m3533J7839L733n1493m6947R0681
2376d0316J3137k2059o674j18694J32178N9263K4937l4993O020m1832m6648L8811
2364c6870J517M9972K6442j33826n5003J2119M4478l6349R9787K2548p7363M4184
2352c8364m4042l9494L4103N3357R230o1935Q6443j8376q7599J0396N9499k7328
2340f4110M2222L9020j05234j1862n0447O3030N2623r6697Q7760N841j3686J07000
2328E5460J9746o5095p944L2680n9643p7367J177K2026J5661O130l0870R0019
2316A980p321R602r2301M973K2027q67k8318r257L4938L723J53800l250o9963
2303A9766n6290N2806N2941l9124k3502m2569l8284L9436P5774J12298j87478
$$ plain form
2388 -105089 -111389 -47009 13463 18794 75259 -10596 -54129 -36290 -32557 -84050 -130997 -40316
2376 -40316 -27179 -49238 -55912 -174606 -42428 16835 41772 6779 12799 -29033 -75681 -36870
2364 -36870 -35353 14619 41061 -92765 -147768 -135649 -91171 -127520 -27733 -5185 -82548 -38364
2352 -38364 -82406 -121900 -87797 -34440 -25210 -87145 -702 -19078 -106677 -96281 -36782 -64110
2340 -64110 -21888 17132 -88102 -99964 -150411 -87381 -34758 -131455 -43695 -37854 -51540 55460
2328 55460 75206 10111 2167 34847 -24796 -102163 -100986 -78960 -63299 -57169 -88039 1980
2316 1980 -5341 4261 -88040 -83067 -61040 -61907 -90225 -99482 -64544 -60821 92979 89729 19766
2303 19766 -36524 16282 69223 30099 6597 -35972 -74256 -34820 40954 153252 -34226
2292c4226o1429J04734n6016N1908j2539j5247o3716l0482R1155m353p9035K1309
2280h7937N6931m1680m9364J9063p0703J23840o87l5432M7571J785R397J8910
2268h306Q3825j39046J4938J02552m2917l2473N0643n8261K0086O4563M9413j19281
2256a4264n6987j633p7263r6965m043J53598P0880m0994P4026L0595n0690p7002
2244i0742J802J11978J235j7150l8403N7762R6842o3987j65042n1735J7934M9440
2232i0066o1440p0608N1100m5365R3839j0665J26886j53j30284J05170M3504j1069
2220H49p5571L2666N7127Q928n7428o9106M8773m888n5336M4122k0273l3183K2159
2207a01161L9432K3314Q8829J5292l9471m6609J9666J318l2356p302K5253Q6986
$$ plain form
2292 -34226 -95655 9079 -46937 4971 -7568 -22815 -86531 -117013 -25858 -30211 -109246 -87937
2280 -87937 -31006 -72686 -122050 -102987 -173690 -49850 -50537 -85969 -38398 -36613 -27216 -8306
2268 -8306 75519 -63527 -48589 53963 11046 -21427 29216 -29045 -8959 55604 105017 -14264
2256 -14264 -71251 -72884 -150147 -247112 -251155 -97557 -26677 -67671 6355 36950 -13740 -90742
2244 -90742 -88940 23038 24273 7123 -31280 26482 123324 59337 -105705 -157440 -139506 -90066
2232 -90066 -151506 -222114 -171014 -216379 -122540 -133205 -6319 -6472 -136756 -31586 11918 849
2220 849 -74722 -42056 15071 23999 -33429 -102535 -53762 -58650 -113986 -69864 -90137 -123320 -101161
2207 -101161 -61729 -38415 50414 65706 26235 -20374 -708 610 -31746 -39048 -13795 73191
2195G3191o7676j4534j3587m2772j1842p1590N8714J17278j10679R73M2429l9018
2183g9113N7288L483Q9997r6076r0523J7647M1082K7196O830l2669J15219j1841
2171D8520j4973O8569R794p6622J6715P9857p3883p2354K7990K1888q6127O6074
2159A5448O8995k03097K3845K0843O643P5653l3016J0957N087l3018j844J38007
2147I4503o7695l7500K9435j11198L6414P9085Q1148m3060L4498j15471p5652
2136i5493o636k5564J16383O9899P2461k1644o6952l7153K0978m1342o72l9127
2124e4862k5201m7397k970J67673m1807r6337J51210m8131n3863n8315K5585j9317
2112a03732M3422k6702j8893J13005j8006K9926N5789n851n6859r9185M5906J16275
$$ plain form
2195 73191 5515 -9019 -22606 -65378 -77220 -148810 -90096 27182 -83497 -82524 -40095 -79113
2183 -79113 -21825 -18342 71655 -24421 -114944 -97297 -56215 -29019 -22189 -54858 60361 48520
2171 48520 33547 102116 111910 35288 52003 131860 57977 -14377 13613 35501 -50626 15448
2159 15448 84443 -118654 -94809 -73966 -67323 8330 -24686 -13729 -8642 -41660 -43504 94503
2147 94503 26808 -10692 18743 -92455 -56041 23044 104192 61132 95630 -19841 -95493
2136 -95493 -102129 -127693 -11310 58589 131050 109406 42454 5301 26279 -15063 -15735 -54862
2124 -54862 -80063 -127460 -130430 37243 -4564 -100901 50309 2178 -51685 -110000 -84415 -103732
2112 -103732 -60310 -87012 -105905 7100 -10906 19020 74809 68958 12099 -87086 -41180 75095
2100G5095L5313j06310p0998J01082O1222k4802l1608L9473J42483n1278o0192
2089A09480J16214k2854J6746J9800o3360o5189l90k9177O4467p7859o2084Q4450
2077I0244p4098j01330P0540N1407K6370k4209j5728m3643M4057L0623K5048j4496
2065F4785m0310K5650j8982J4305j01228K9521l6829R6412O6337q6184m8697k1344
2053e6564J5967L4406l9500m0055k1913L8888J8835M0486M56n5037m955O5819
2041c167r6593l9052R9379K8083m987R39J03265q9243j3651q7171K2862R1565
2029A2229n4542O879J2468n8352J1943j3401J2352K9080l5130N9573l5274k7655
2017g9830M9482L364l4347J6431p5158Q2858K3792k8370R4818j28050J6349o22
$$ plain form
2100 75095 110408 4098 -66900 34182 95404 70602 38994 78467 220950 169672 109480
2089 109480 225694 202840 219586 239386 176026 110837 110447 81270 145737 67878 5794 90244
2077 90244 16146 -85184 -14644 36763 63133 38924 23196 -20447 23610 54233 79281 64785
2065 64785 24475 50125 31143 45448 -55780 -26259 -63088 33324 99661 13477 -35220 -56564
2053 -56564 -40597 -6191 -45691 -85746 -107659 -68771 -49936 -9450 -8994 -64031 -68986 -3167
2041 -3167 -99760 -138812 -39433 -11350 -16337 -15398 87867 -1376 -15027 -102198 -79336 12229
2029 12229 -42313 -35434 -22966 -81318 -69375 -82776 -70424 -41344 -76474 -16901 -52175 -79830
2017 -79830 -30348 -26984 -61331 -44900 -120058 -37200 -13408 -41778 53040 -75010 -58661 -59283
2005e9283L9034L7258m9781M8330j5219k2185j03752P6436o7533Q6606J18871
1994H8782o2242r5351Q1942K6470j07442Q538K6634L43O0593m5186r511n7193
1982h3623Q572M2319P6369l5780j30084O9804l4413R4175M7711m9484L7905L0623
1970G4094P3371r7117j05625K9716K1020l37n4028J04669m2647M3018m2045j1748
$$ plain form
2005 -59283 -20249 17009 -32772 15558 339 -21846 -125598 -49162 -116695 -30089 88782
1994 88782 26540 -68811 13131 39601 -67841 -59303 -32669 -32326 28267 -16919 -26430 -83623
1982 -83623 -75051 -32732 43637 7857 -122227 -52423 -86836 7339 55050 5566 43471 74094
1970 74094 147465 50348 -55277 -25561 -4541 -4878 -58906 45763 3116 46134 4089 -7659
$$ [...]
##END NTUPLES=NMR SPECTRUM
##END=
