##TITLE=1H_EC-2738(2)
 CDCl3
 8 sc, 
 6.10.2023
##JCAMPDX= 6.0         $$ Bruker NMR JCAMP-DX V2.0
##DATA TYPE= NMR SPECTRUM
##DATA CLASS= NTUPLES
##ORIGIN= UXNMR, Bruker Analytische Messtechnik GmbH
##OWNER= root
$$ XWIN-NMR		Version 3.5
$$ Fri Oct  6 14:05:17 2023 Russian Standard Time (UT+4h)  she@DPX200
##.OBSERVE FREQUENCY= 200.13135
##.OBSERVE NUCLEUS= ^1H
##.ACQUISITION MODE= SIMULTANEOUS
##.ACQUISITION SCHEME= undefined
##.AVERAGES= 8
##.DIGITISER RES= 18
##SPECTROMETER/DATA SYSTEM= spect
##.PULSE SEQUENCE= zg30
##.SOLVENT NAME= DMF
##.SHIFT REFERENCE= (INTERNAL, DMF, 0, 15.856)
##AUDIT TRAIL= $$ (NUMBER, WHEN, WHO, WHERE, WHAT)
$$ ##TITLE= Audit trail, XWIN-NMR		Version 3.5
$$ ##JCAMPDX= 5.01
$$ ##ORIGIN= Bruker BioSpin GmbH
$$ ##OWNER= she
$$ F:/spectra/data/she/nmr/H-F/1/pdata/1/auditp.txt
$$ ##AUDIT TRAIL=  $$ (NUMBER, WHEN, WHO, WHERE, WHAT)
(   1,<2023-10-06 14:03:51.79 +0400>,<she>,<DPX200>,
      <created by zg, POWCHK disabled, PULCHK disabled
       configuration hash MD5:
       00 E9 B6 7A A2 85 ED C7 34 08 36 98 17 FE 4E 26
       data hash MD5: 16K
       42 6E FD 47 A0 3A 47 17 B4 9C EF C5 E8 E4 85 F8>)
(   2,<2023-10-06 14:03:54.03 +0400>,<she>,<DPX200>,
      <Start of raw data processing
       efp BC_mod = 2 LB = 0.24 FT_mod = 6 PKNL = 1 PHC0 = -22509.45 PHC1 = 9.852713 SI = 16K 
       data hash MD5: 16K
       2F DA A4 3C 05 24 4F 61 5D 8D F5 97 70 FC 25 03>)
(   3,<2023-10-06 14:04:14.51 +0400>,<she>,<DPX200>,
      <pk PHC0 = 83.19555 PHC1 = -3.6 
       data hash MD5: 16K
       79 24 F3 CC C6 68 50 5E 9F 79 36 5A 7D DD C8 6F>)
(   4,<2023-10-06 14:04:17.67 +0400>,<she>,<DPX200>,
      <abs ABSG = 5 
       data hash MD5: 16K
       DA 5E CF A0 27 DA 67 6D DA 1B 71 5C D8 43 F0 60>)
$$ ##END=
$$ 
$$ hash MD5
$$ 39 BD 69 20 46 88 B5 AC 47 58 F3 49 6B 71 CF AF
##$RELAX= 
##$RELAX= 
##$RELAX= 
##$RELAX= 
##$RELAX= 
##$RELAX= 
$$ Bruker specific parameters
$$ --------------------------
##$DU= <F:/spectra>
##$EXPNO= 1
##$NAME= <H-F>
##$PROCNO= 1
##$TYPE= <nmr>
##$USER= <she>
##$AMP= (0..31)
100 100 100 100 100 100 100 100 100 100 100 100 100 100 100 100 100 100 
100 100 100 100 100 100 100 100 100 100 100 100 100 100 
##$AQSEQ= 0
##$AQ_mod= 1
##$AUNM= <au_zg>
##$AUTOPOS= <>
##$BF1= 200.13
##$BF2= 200.13
##$BF3= 200.13
##$BF4= 200.13
##$BF5= 200.13
##$BF6= 200.13
##$BF7= 200.13
##$BF8= 200.13
##$BYTORDA= 1
##$CFDGTYP= 0
##$CFRGTYP= 5
##$CHEMSTR= <none>
##$CNST= (0..31)
1 1 145 1 1 1 1 1 1 1 1 1 1 1 1 1 1 1 1 1 1 1 1 1 1 1 1 1 1 1 1 1 
##$CPDPRG= <>
##$CPDPRG1= <>
##$CPDPRG2= <>
##$CPDPRG3= <>
##$CPDPRG4= <mlev>
##$CPDPRG5= <mlev>
##$CPDPRG6= <mlev>
##$CPDPRG7= <mlev>
##$CPDPRG8= <mlev>
##$CPDPRGB= <>
##$CPDPRGT= <>
##$D= (0..31)
0 1.2 0 0 0 0 0 0 0 0.06 0 0.03 0 0 0 0 0.0002 0 0 0 0 0 0 0 0 0 0 0 0 
0 0 0 
##$DATE= 1696586631
##$DBL= (0..7)
120 120 120 120 120 120 120 120 
##$DBP= (0..7)
150 150 150 150 150 150 150 150 
##$DBP07= 0
##$DBPNAM0= <>
##$DBPNAM1= <>
##$DBPNAM2= <>
##$DBPNAM3= <>
##$DBPNAM4= <>
##$DBPNAM5= <>
$$ [...]
##$SUBNAM3= <"">
##$SUBNAM4= <"">
##$SUBNAM5= <"">
##$SUBNAM6= <"">
##$SUBNAM7= <"">
##$SUBNAM8= <"">
##$SUBNAM9= <"">
##$SW= 18.05172834244
##$SWIBOX= (0..15)
0 0 2 0 0 0 0 0 0 0 0 0 0 0 0 0 
##$SW_h= 3612.71676300578
##$TD= 16384
##$TD0= 1
##$TE= 0
##$TE2= 300
##$TE3= 300
##$TEG= 300
##$TL= (0..7)
0 120 120 120 120 120 120 120 
##$TP= (0..7)
150 150 150 150 150 150 150 150 
##$TP07= 0
##$TPNAME0= <>
##$TPNAME1= <>
##$TPNAME2= <>
##$TPNAME3= <>
##$TPNAME4= <>
##$TPNAME5= <>
##$TPNAME6= <>
##$TPNAME7= <>
##$TPOAL= (0..7)
0.5 0.5 0.5 0.5 0.5 0.5 0.5 0.5 
##$TPOFFS= (0..7)
0 0 0 0 0 0 0 0 
##$TUNHIN= 0
##$TUNHOUT= 0
##$TUNXOUT= 0
##$USERA1= <user>
##$USERA2= <user>
##$USERA3= <user>
##$USERA4= <user>
##$USERA5= <user>
##$V9= 5
##$VALIST= <valist>
##$VCLIST= <CCCCCCCCCCCCCCC>
##$VD= 0
##$VDLIST= <DDDDDDDDDDDDDDD>
##$VPLIST= <PPPPPPPPPPPPPPP>
##$VTLIST= <TTTTTTTTTTTTTTT>
##$WBST= 1024
##$WBSW= 4
##$XGAIN= (0..3)
0 0 0 0 
##$XL= 0
##$YL= 0
##$YMAX_a= 111775
##$YMIN_a= -129851
##$ZGOPTNS= <>
##$ZL1= 120
##$ZL2= 120
##$ZL3= 120
##$ZL4= 120
##$ABSF1= 15.73367
##$ABSF2= -2.318179
##$ABSG= 5
##$ABSL= 3
##$ALPHA= 0
##$AQORDER= 0
##$ASSFAC= 0
##$ASSFACI= 0
##$ASSFACX= 0
##$ASSWID= 0
##$AUNMP= <proc_1d>
##$AZFE= 0.1
##$AZFW= 0.1
##$BCFW= 0
##$BC_mod= 2
##$BYTORDP= 0
##$COROFFS= 0
##$CY= -3
##$DATMOD= 1
##$DC= 0
##$DFILT= <>
##$DTYPP= 0
##$F1P= 0
##$F2P= 0
##$FCOR= 1
##$FTSIZE= 16384
##$FT_mod= 6
##$GAMMA= 0
##$GB= 0
##$INTBC= 1
##$INTSCL= 3.70164e-10
##$ISEN= 128
##$LB= 0.24
##$LEV0= 0
##$LPBIN= 0
##$MAXI= 10000
##$MC2= 0
##$MEAN= 0
##$ME_mod= 0
##$MI= 1.114404
##$NCOEF= 0
##$NC_proc= -7
##$NLEV= 6
##$NOISF1= 3.799351
##$NOISF2= 2.8
##$NSP= 0
##$NTH_PI= 0
##$NZP= 0
##$OFFSET= 15.85597
##$PC= 1
##$PHC0= -22426.25
##$PHC1= 6.252713
##$PH_mod= 1
##$PKNL= yes
##$PPARMOD= 0
##$PSCAL= 0
##$PSIGN= 0
##$REVERSE= no
##$SF= 200.129983104304
##$SI= 16384
##$SIGF1= 3
##$SIGF2= 2
##$SINO= 5.538805
##$SIOLD= 16384
##$SREGLST= <1H.CDCl3>
##$SSB= 0
##$STSI= 16384
##$STSR= 0
##$SW_p= 3612.71676300578
##$SYMM= 0
##$S_DEV= 0
##$TDeff= 16384
##$TDoff= 0
##$TI= <>
##$TILT= no
##$TM1= 0
##$TM2= 0
##$TOPLEV= 0
##$USERP1= <user>
##$USERP2= <user>
##$USERP3= <user>
##$USERP4= <user>
##$USERP5= <user>
##$WDW= 1
##$XDIM= 16384
##$YMAX_p= 455504734
##$YMIN_p= -530230
$$ End of Bruker specific parameters
$$ ---------------------------------
##NTUPLES= NMR SPECTRUM
##VAR_NAME=  FREQUENCY,     SPECTRUM/REAL,   SPECTRUM/IMAG
##SYMBOL=    X,             R,               I
##VAR_TYPE=  INDEPENDENT,   DEPENDENT,       DEPENDENT
##VAR_FORM=  AFFN,          ASDF,            ASDF
##VAR_DIM=   16384,         16384,           16384
##UNITS=     HZ,            ARBITRARY UNITS, ARBITRARY UNITS
##FACTOR=    0.220516191357247, 1,           1
##FIRST=     3173.25508479018, 0,            0
##LAST=      -439.4616782156, 0,             0
##MIN=       -439.4616782156, -530230,       0
##MAX=       3173.25508479018, 455504734,    0
$$ Real data points
##PAGE= N=1
##DATA TABLE= (X++(R..R)), XYDATA
$$ [...]
10141 168197 43236 -30487 2741 -149854 -126062 -82411 -198065 11396 76145 -28787
10131 -28787 106880 63722 199697 26665 74668 1709 -149239 -36678 -147098 -100802
10121 -100802 115980 -38777 12609 176374 -55960 -10083 75465 190525 148344 56272
10111 56272 -44701 -180797 32116 18074 -206003 -236933 -176491 -97358 -223397 -121787
10101 -121787 -146090 -77754 -2093 152399 3282 167470 270061 154022 130253 71840
10091 71840 78837 53892 31116 85672 72497 -83400 -108041 -76195 16426 -130807 -114308
10080 -114308 2553 -149678 -76808 132122 254085 98668 95801 -683 -288156 -196622
10070 -196622 -202675 -315427 -195620 -187458 -130343 -52818 -136436 -16322 71229 -17074 -56151
10059 -56151 -11950 90684 92848 -17944 25985 174092 120763 3669 -125193 16949 74805
10048 74805 -42435 -93076 -70864 -219713 -139800 82278 -133288 -79366 -45333 -160729 -103535
10037 -103535 -64261 151022 243592 19074 -137318 -83598 109181 -198 29207 14497
10027 14497 -18714 56687 -165758 -118227 8630 9963 255335 38502 33143 204325 201099
10016 201099 190883 258492 185631 13625 -299037 -229003 -155040 -198640 -272832 -382091 -135394
10005 -135394 -31198 -132173 -14133 68785 -198548 -228762 -142716 63540 14984 -154649
9995 -154649 -81034 -39315 306103 332595 196424 135276 -103184 -176380 -109389 -262047 -224545
9984 -224545 -101139 -53188 81203 -83510 90775 69511 90864 -26033 -86490 -15582 -70707
9973 -70707 -70913 -120499 -81260 -137134 18483 -31357 -60333 19894 -82213 -97547 -83484 -28334
9961 -28334 -35201 -145452 132251 140706 -2811 -385 -94205 -103086 -163649 -79233 -18355 80339
9949 80339 212467 194575 -28741 -190048 36652 120311 140191 37424 -30843 -126596 12804
9938 12804 49152 45083 92176 109739 178131 107142 -49732 -41233 -43253 190421 219181 -233575
9926 -233575 -7997 161 107459 117960 -106964 -70624 -78187 -273834 32240 96587 80325
9915 80325 110949 -34810 -89528 73566 169214 133924 186062 125106 103542 130062 364743
9904 364743 136268 -44936 -68641 -19363 -124419 -152414 29327 150580 124327 34121 70869
9893 70869 339652 353577 225063 173090 -71305 -131584 -183656 -88161 -130520 -28048 37515
9882 37515 25575 -81101 48313 1754 8744 -11517 -3268 -102894 -164723 -14653 -17238 -89174
9870 -89174 -75271 -10991 14478 3027 26645 -9468 129016 25132 -271648 -195917 -124474
9859 -124474 -115703 -56143 45217 48873 -129510 14912 7658 -70171 -22168 -187944 94260
9848 94260 133703 82231 -187286 -93105 9982 108922 1591 -20910 -108755 192 44265
9837 44265 -74000 -164647 -157696 -292628 -166854 -273383 -359646 -193850 -211823 38065 -65833
9826 -65833 124513 166532 -69591 -60260 -63547 -221643 -181660 -49901 -85558 10151 -58185
9815 -58185 -164981 -89399 -209807 45853 55335 99873 -79657 -44532 -15046 -268521 -191323
9804 -191323 -91755 13285 57771 -104030 -74437 -203191 -334835 -121962 -199743 -116492 58042
9793 58042 -8423 -127852 -261580 -203560 137179 184625 123165 14604 -72552 152601 218094
9782 218094 -147500 -160326 -74661 -165591 -138701 -277159 -258839 -266654 -266817 -25926 -195969
9771 -195969 -150782 -79001 -102243 -97838 -48783 -146510 -373541 -471159 -369145 -80799 -242894
9760 -242894 -88252 -247360 -229323 -10787 -69526 4374 54938 -50993 -109643 2948 -19743
9749 -19743 -56025 -58207 83236 179670 122168 -9570 233063 199519 -110293 -87400 -61661
9738 -61661 -88067 -95383 -115349 -110444 86090 294518 223545 34062 99642 44108 5394 -120248
9726 -120248 20468 -110478 -240163 -284487 -102114 96631 -43581 -141354 -287766 -403267
9716 -403267 -383391 -2929 11086 -145287 -22724 -42982 -106152 4364 38780 86820 -37623
9705 -37623 66692 -134357 -114457 43222 50490 81835 195729 2205 -102248 -16763 67127
9694 67127 -84640 -120884 -42662 40032 64904 -99064 -244313 -192195 -171423 -63184 218484
9683 218484 124044 116612 -90168 -294895 6980 106380 11173 86986 50489 -69929 79696
9672 79696 -6550 -142788 -126583 -88634 -3525 130283 183520 96702 -67620 -20187 127828
9661 127828 52385 4059 110680 205287 112450 170296 107088 -210803 -313164 -173770 -133485
9650 -133485 -55409 -126809 25758 112240 -126510 -145758 -426 26288 314841 344777 298473
9639 298473 91640 166227 269611 84455 -47833 -123567 -202812 -163763 -184346 -97380 -18432
9628 -18432 34719 -97124 -155841 -243216 -174818 -72767 -52306 -248 -34732 -138694 -244841
9617 -244841 -29660 -82821 -140423 -58682 -189040 -177779 90985 31767 17769 77661 176844
9606 176844 252623 59800 -136986 94570 179588 1384 -75419 -127887 -118369 -161844 60133
9595 60133 138602 -119422 -31475 33602 77268 30931 -280982 -116554 72155 -31438 -121846
9584 -121846 -19642 -13770 -201887 -241149 -175374 123206 185905 157405 137126 38996 -277967
9573 -277967 -173569 -132818 -267719 -273317 -182964 88582 42094 -48674 -111679 28627 47308
9562 47308 -20661 -93733 94133 -15406 -71121 73360 59912 -110692 -27986 127151 30920
9551 30920 -7073 77557 -55177 -154479 -152324 -22148 -10470 -129064 -114150 -136190 -19864
9540 -19864 -104954 -105082 -329152 -415358 -409308 -181071 -45969 -128286 37346 104088 40715 -186598
9528 -186598 56582 25174 -42155 49206 18067 -21819 -251763 -272254 -249829 -202789 -157293
9517 -157293 1575 -134557 -40504 127181 122279 -58022 75516 72053 -80938 -58374 -39339
9506 -39339 11931 -63877 -163173 -154682 -61795 -268866 -299801 -99764 -90984 43488 46949 95228
9494 95228 -36798 40492 51168 -38498 -168675 -243594 -181648 -94705 -217158 -37170 -56436
9483 -56436 -119430 4629 178258 36944 -46355 -4363 15807 -255272 -118994 15709 -41103
9472 -41103 -47721 -100479 -313235 -180910 -20556 -4952 160113 7131 883 -223898 -226667
9461 -226667 45232 208494 190841 64642 105426 66274 27261 131892 -99515 12269
9451 12269 -144679 -81085 15901 174141 172994 148105 167383 8680 -89349 -309301 -287592
9440 -287592 -62224 -87652 118084 -74654 -29255 -113801 -100343 -17410 127048 63899 39263
9429 39263 -88283 62675 21418 76076 -16552 -126536 -33167 -58195 -65459 9905 -260895
9418 -260895 -208005 -173309 -264619 -201296 -151955 -275981 -112566 107453 118655 233286 100427
9407 100427 -32856 118644 188618 -27417 211034 -121183 -184041 -124565 -279829 -179821
9397 -179821 -53804 -48569 -210023 -197959 -1393 183904 24605 22028 -209471 -168830 76020
9386 76020 -29699 135522 25017 -64863 66305 86333 -72811 -90693 -265847 -182007 -85921
9375 -85921 -93435 -84980 -62073 -70963 -202463 -292514 -42254 54376 -29167 -74461 -103124 -130024
9363 -130024 -130690 14459 166455 -12668 -13459 95358 74299 20376 195055 127147 216590
9352 216590 116460 64789 38699 96135 -37633 12252 -25495 -66819 191048 184120 34888
9341 34888 74525 128649 138735 -30295 -57288 -59098 -21058 102818 21883 -257990 -283979
9330 -283979 -334262 -173460 45345 -64983 -233489 13083 88882 36295 104820 15487 90915
9319 90915 202283 140987 -65823 75358 -12514 -15336 -39239 -61604 -214497 -139051 -185996
9308 -185996 -184439 -30955 155432 238699 22924 45788 211553 142455 47820 -35595 -10207
9297 -10207 -88653 -132724 -136114 -5837 61570 242727 -92700 -293532 -179958 -151631 -162879
9286 -162879 -319905 -194438 17794 147160 -59095 -214380 -288512 -101751 -181424 -343426
9276 -343426 -182598 -270368 -298559 -139001 17398 69347 28630 -206474 -244930 -243823 -111520
9265 -111520 -115888 -264289 -337305 -103274 185772 -17268 28850 133128 154471 -61829 1981
9254 1981 167324 -96138 -397664 -248126 -95515 -138656 -247287 -347556 -327202 -198869
9244 -198869 -105322 13664 -162870 -103722 -20722 -60263 -2372 68771 6282 -32449 -103058
9233 -103058 -161823 -120508 -34521 220363 172102 241917 269086 112402 -120655 -30482 -20250
9222 -20250 -8769 -149690 -23273 -139629 -189936 -67620 -125373 -17434 123303 -51676
9212 -51676 -155340 -76027 7726 182077 227146 66181 121989 -162079 -119602 -185514 -41422
9201 -41422 -10579 -49455 -54277 -346932 -74667 -66744 -185364 -6881 -105479 -166708 -210713
9190 -210713 -248117 -119009 -17604 -67124 -240559 -61118 121198 -25288 -141903 -155441
9180 -155441 -104587 4868 -153844 -55770 164754 52469 77969 86079 -91772 -67525 -178886
9169 -178886 50216 39426 -16026 207043 136229 -69462 291030 35601 28218 126348 1270
9158 1270 -269558 -233533 79805 -70957 -135870 -7214 -74604 20712 29329 -10794 -138102
9147 -138102 -271157 -265702 -253907 -267297 -175907 -80857 -88691 -42550 -111651 -78335 -11927 -151690
9135 -151690 -125375 -11760 -32508 -78208 -197811 -95943 -7502 29115 30416 51053 103309
9124 103309 3417 -141397 -86728 -22530 208811 161018 9906 -186048 -317918 -112618
9114 -112618 -30927 49300 60995 54919 218976 61799 47219 -3266 -63872 87030 -60972
9103 -60972 -235579 -125887 -11830 -237011 -144255 2576 33518 131363 -16718 -4837 -122911
9092 -122911 -171521 -172168 -321830 -223359 -65099 -185349 -273705 -360417 -338198 -235789 -10717
9081 -10717 45298 -11458 -46985 1533 -7565 58773 -5791 -67418 51344 -165515 -55305
9070 -55305 -217608 -339089 -226504 -146069 -129281 -40056 -79539 -222704 -70827 80598 131204
9059 131204 39575 -58602 95174 7536 127762 6642 58737 -6428 -182582 -215011 -76059
9048 -76059 55568 55645 37744 -40236 102316 146735 109134 29588 -49992 -82856 160718 124564
9036 124564 121073 23858 -34752 -59189 -18209 -89547 -12079 -61282 -124589 -221056 -206158 -71697
9024 -71697 -20144 147843 97676 245163 146018 -40890 61839 100182 172761 203036 180362
9013 180362 229757 337650 155933 325409 376246 296447 47442 215438 374688 385325
9003 385325 382532 305829 306674 336354 445507 466630 305453 307900 425206 338320 287483 83544
8991 83544 54633 153151 188735 283254 225861 269680 310286 156873 -4094 -31463 294121
8980 294121 -48649 -96366 131312 101377 120484 99457 254752 503036 196895 210229 112989
8969 112989 62053 172079 -17393 16361 255665 109502 -34778 247644 401283 292155
8959 292155 280703 391553 271892 222518 239186 117975 25616 172197 201150 194324 84729
8948 84729 69449 108695 102680 149122 336938 287863 231217 212699 57877 -17152 -226647
8937 -226647 -162692 186043 101627 89227 -36605 -58509 153250 -35767 75777 379160
8927 379160 148261 126074 168587 11808 89256 117853 195190 167172 269551 138202 179343
8916 179343 188959 248140 258675 234920 191949 91548 30514 143593 301728 181440 20169
8905 20169 -2604 40475 118364 -29053 172390 318067 240932 246770 153813 -31278 -185919
8894 -185919 104821 178447 223145 120760 185126 184607 -56763 6751 288251 393996 546220
8883 546220 389060 403309 545871 239810 49075 -46600 190430 282388 120094 287076
8873 287076 129228 35919 35785 136361 173506 120605 332258 322673 278719 221153 444933
8862 444933 253836 278215 179140 155865 181364 89018 -6483 104549 272855 80633 143523
8851 143523 310556 273706 390529 474539 530187 793855 496494 541003 430651 344951 295563
8840 295563 338760 365176 560552 572584 424421 507689 329827 388708 500398 376093 334249
8829 334249 537890 404360 273591 292018 408292 205049 164084 410677 205610 328667
8819 328667 442111 514463 458064 97411 281058 537317 434938 355931 391882 451772 440480
8808 440480 557616 811383 710529 601236 621520 534145 553995 505316 613553 452183
8798 452183 628120 751624 919498 948886 828632 729672 848958 907768 639352 775831
8788 775831 778150 773834 892644 830796 1225400 989552 990248 987617 842994 829666 726836 786990
8776 786990 776147 949181 1085568 1260693 1312006 1076723 933972 1227119 1150369 1216501
8766 1216501 949384 916928 957601 1194886 1346299 1417590 1405957 1438901 1387197 1389534 1389477 1399265
8754 1399265 1522603 1550895 1553682 1627501 1604652 1780743 1780094 1927834 1969610 1988468 2140980
8743 2140980 2181952 2185290 2287309 2307011 2307555 2475922 2555060 2622650 2648268 2650616 2688927 2849548
8731 2849548 2714291 2919069 3264171 3304101 3533648 3654044 3691743 3859085 3734522 3760264
8721 3760264 3789970 4157556 4309830 4430970 4372279 4459449 4847183 5036165 5482919 5789204
8711 5789204 6225109 6955972 7730496 8515146 9330161 10265932 11889114 13805995 16496229
8702 16496229 20393957 25802440 32386086 35007813 32416823 26383357 20573937 16725572
8694 16725572 14038443 12230371 10827544 9800965 9215367 8770146 8132964 7841258 7457877
8685 7457877 7242315 7166871 7185650 7112799 7063047 7131600 7087081 7013441 7140414 7295249 7492036
8674 7492036 7455098 7375769 7355183 7599374 7758933 7802572 7944227 7968936 8289275 8644558
8664 8644558 8877647 8886216 9094111 9487657 9890938 10150065 10325328 10679878 11334646 12048193
8654 12048193 12495210 12966490 13511665 13977980 14871852 15958379 17160056 18590644 20210222
8645 20210222 22329617 24920934 27739072 31131737 35350267 40427083 45943372 51581432
8637 51581432 57166321 62190631 65734488 66830862 66693053 66135338 65373928 65350046 65802182
8628 65802182 66414074 67037719 66561134 63957164 59574005 54323552 47781068 41143249 35386134
8619 35386134 30612262 26927638 23798991 21397649 19194611 17652006 16368766 15211075
8611 15211075 14257683 13172369 12478075 11828621 11033858 10632979 10206695 9840565 9317608
8602 9317608 8942090 8842779 8365758 8092373 7857834 7555072 7352581 7212827 7042521 6865735
8592 6865735 6618564 6549142 6337700 6180786 6127963 6053189 6016390 6017062 5767125 5654867 5796759
8581 5796759 5703402 5513796 5242772 5257302 5339343 5478456 5497081 5384065 5418706 5350125 5262414
8570 5262414 5195128 5233860 5236213 5262861 5324559 5452913 5467880 5468778 5559819 5681847 5765342 5856179
8558 5856179 5838946 5975773 6112377 6342012 6413017 6528026 6805158 7046522 7134737 7001367
8548 7001367 7225554 7651600 7831066 7878978 7998510 8276593 8523896 8881443 9229962 9630777
8538 9630777 10315984 11005854 11419286 12446068 13772807 15053767 16698658 18605176 21419824
8529 21419824 25011400 29313667 34655689 41351133 47634223 50204559 50473645 47793352
8521 47793352 41562119 34899278 29025310 24641281 21733937 19652628 17824000 16817550
8513 16817550 15770778 15222581 14846549 14633997 14470469 14092286 13849954 13750168 13645382
8504 13645382 13698731 13858799 13940672 14404710 15089644 15679663 16378747 17230285 18396616 19976114
8494 19976114 22055027 24535316 27831582 32091007 37685903 45063817 53739772 64029432
8486 64029432 72723859 75137595 73989281 68077024 57388445 46817867 37962695 31040588
8478 31040588 26233583 22785384 20333871 18244264 16655678 15492412 14293662 13184905
8470 13184905 12229786 11506560 10577524 10176378 9594195 9030205 8465133 8239514 7920190
8461 7920190 7727044 7629271 7298665 7020301 6575042 6305869 6207325 5984345 5841537 5743179
8451 5743179 5572900 5548051 5388474 5215552 5201735 5017932 4746199 4777121 4728657 4673783
8441 4673783 4618070 4475609 4449186 4229617 4087182 3966169 4129756 4190734 3972291 3801411
8431 3801411 3909363 3912730 4039684 4028045 3880471 3987661 3886995 3841850 4121749 3955722
8421 3955722 3938705 3810141 4137591 4150846 3952983 4217190 4230034 4005950 4178150 3972999
8411 3972999 4065184 4175871 4394436 4669275 4629433 4799907 4862927 4846544 4967409 5155807
8401 5155807 5177201 5246132 5260900 5459986 5439205 5678480 5933500 6082862 5959293 6258394
8391 6258394 6640694 6859929 6818536 7055945 7334689 7622476 7933660 8248149 8348989 8735068
8381 8735068 9138074 9286607 9820732 10289320 10932869 11671314 12463388 13331845 14148374 15304385
8371 15304385 16731302 18453778 20827657 23833948 27222434 31232790 35724195 40944443
8363 40944443 46419009 49542042 48924928 46305546 43197593 41486496 40731000 41128082 43279529
8354 43279529 46239688 47450956 44971821 40519383 34818896 29896530 25999589 22877084
8346 22877084 20516481 18754232 17458292 16311662 15544868 14863061 14236529 13977805 13737939
8337 13737939 13564327 13746118 13788177 13958539 14224259 14981778 15971023 17174155 18576869
8328 18576869 20599684 23029347 25752935 28951794 32088010 33403688 32407626 30265007
8320 30265007 28426396 27217480 26553443 27072840 28478414 30125164 30215478 28401566 25273359
8311 25273359 21765425 18613170 16056547 14020482 12232621 10977513 10239132 9348324
8303 9348324 8684781 8062448 7443177 7003555 6708811 6191465 5880639 5479970 5214067 4975189
8293 4975189 4901899 4795062 4682121 4669539 4332269 4165909 4113349 4046663 3884797 3693277
8283 3693277 3410765 3433245 3293847 3161556 3193500 2923988 2871965 2735192 2758864 2827294
8273 2827294 2889821 2792308 2517315 2662431 2617803 2296536 2330733 2379507 2339269 2357897 2125334
8262 2125334 2094287 2142642 2159423 2263169 2196604 2182529 2010632 1859486 1999552 2011234 1898968
8251 1898968 1823087 1892101 1827676 1583761 1364917 1500299 1691393 1583158 1471943 1305841
8241 1305841 1196093 1321920 1283147 1205141 1370744 1236029 1192324 1210412 1317538 1300164
8231 1300164 1181543 1083872 995246 1160445 1180474 1078500 955971 1133871 1083848 990702
8221 990702 882661 1191609 1020661 1025233 1011219 950304 925905 926792 977349 941136 951296 868115
8209 868115 826785 1006185 901159 612443 617822 787819 936478 968106 825440 625614
8199 625614 606314 603516 655259 852794 483420 334964 320584 134050 554151 381776 547175
8188 547175 471487 461713 610462 574827 394095 382417 421746 584974 659888 808421 477993
8177 477993 578232 689793 728114 739049 706745 792478 913901 769609 841543 842569 673619
8166 673619 738338 573745 327827 356090 452148 372078 487825 647134 839193 707663
8156 707663 666853 749104 852687 692334 796367 766343 751845 757449 797470 795923 825547
8145 825547 581324 336324 359892 350855 248417 246068 439188 394466 400990 405331 512296
8134 512296 680765 388363 622080 602763 590254 587107 629536 572509 456382 367610 515109
8123 515109 661844 749117 634134 567726 527492 565764 516182 599358 572730 641585 635174
8112 635174 702072 842344 475753 405092 482015 461106 423339 442142 399893 378195 447238
8101 447238 562287 579669 632159 410560 429937 379090 399663 294630 432474 379966 190277
8090 190277 246571 399137 321165 369636 397427 393436 204897 217155 489164 271211 231651
8079 231651 353840 142362 196940 69101 127239 241843 247766 139648 104107 153065 221476
8068 221476 218031 159532 191516 297313 54826 -206013 -73524 93823 211923 219275 267015
8057 267015 126164 61385 106464 227127 133891 278182 114858 199430 505839 350377
8047 350377 253217 269558 311251 220556 164993 34842 27774 -54730 -88726 -161602 37872
8036 37872 171440 221636 196408 -55535 52769 35630 132703 303519 243874 282523 225605
8025 225605 91122 252261 294905 391410 371384 314223 388348 234584 171872 266200 223868
8014 223868 237211 367653 281612 191289 225359 222477 172096 79564 162718 198651 407919
8003 407919 225054 -15496 89351 116359 108691 210954 326834 247854 251670 547589 349889
7992 349889 323335 605354 488763 463095 568057 734424 642152 338164 204570 327358
7982 327358 421571 377236 454628 316850 266243 465707 410065 394593 296521 291505 299266 406715
7970 406715 575518 476964 390028 325285 298472 272131 343783 300641 221532 167315 154728
7959 154728 265096 409284 530126 616554 744381 702813 488807 425837 326206 383588 423131
7948 423131 465070 470440 387913 296252 361066 533166 549441 409285 289117 318488 313906
7937 313906 466781 447949 176230 183387 299211 348844 258260 159199 150728 152348 163182 -9199
7925 -9199 91376 178110 16667 -45492 85126 240512 129329 55649 107260 199691 317719
7914 317719 218464 145437 49700 59004 195444 94667 106001 214774 298439 211876 90889
7903 90889 164160 210971 198244 113318 -43934 33137 113922 115793 250130 203389 128830 191441
7891 191441 204211 140622 114191 61431 -4338 -64572 -65321 135822 209591 163315 139558 123497
7879 123497 -6700 -31939 17046 -7467 12565 -141067 -146716 -107592 93843 137781 252960
7868 252960 164975 361261 246500 136022 194049 193644 328784 206178 194345 213495 92688
7857 92688 -23118 149786 287490 112663 -19607 60728 35254 -160208 123211 92273
7847 92273 36017 29860 -160959 -49415 82339 26947 134701 -103476 -155128 -60449 101454
7836 101454 149155 123141 57147 4949 -163351 -388932 -225400 -58219 192047 101751 82925
7825 82925 221241 145917 76264 72652 214877 108348 -289149 -244792 -188884 19162 39284
7814 39284 -14212 70650 60499 95606 235848 257193 1043958 469978 45371 41278 -52366
7803 -52366 59921 -20437 -40596 -34904 89679 340873 225705 185290 200291 85415 -35776
7792 -35776 132411 139310 -176596 -122131 25660 -93958 -86489 -6019 -58874 -42645 49267
7781 49267 -56555 63669 106010 46769 135135 182103 218696 -56954 -93674 -159640 25641
7770 25641 -48258 -4320 -71673 -223169 -181502 -82168 55779 31357 213334 178932 70604
7759 70604 110560 160018 53809 305799 33155 -10309 86568 -43111 247146 -56626 32582
7748 32582 201414 206515 108658 138715 114250 168484 202124 103247 -77818 -153548 -27489
7737 -27489 -111198 -189143 17152 -77849 75753 13546 -70990 -72292 -46711 95777 113602
7726 113602 -17588 -15833 -121400 -59129 132477 96634 69539 42266 142015 48624 -16937
7715 -16937 61637 -119727 54132 196142 23708 -150512 -103323 15786 83298 24714 -23120
7704 -23120 -2250 19434 -157094 -189674 -39231 123081 101292 65413 54108 172582 191220
7693 191220 216908 246734 139297 405881 296029 245564 35508 -104099 -3779 20215
7683 20215 93739 -38540 -182518 -123896 -166870 -96476 -200145 161198 237660 -21258 41688
7672 41688 70178 83377 284082 380090 334486 74031 -31697 42949 100673 119298 207000
7661 207000 2992 -42321 63020 136627 83163 -62949 -14908 -22154 -32907 3710 69954
7650 69954 51487 31951 -70695 -85664 5263 34208 -868 98172 19739 -24708 179434
7639 179434 -33879 108061 25171 -84406 -26698 -7238 -1794 93387 -22628 -4499 -162352
7628 -162352 -4540 76002 -5952 194634 180666 80850 34680 193466 158492 80379 121579
7617 121579 77577 -147396 -60814 -37366 -109845 -198607 -188750 -242149 -217176 -530230 -256071
7606 -256071 -80896 48635 47655 -17673 -129296 15762 117135 230920 243546 277655 111176
7595 111176 190143 -24006 -183438 57711 41806 44859 -70175 -37341 -93999 15969 54139
7584 54139 17168 -30166 48189 -29884 -156376 54332 -52918 12521 168871 193664 215409
7573 215409 56072 27845 -21471 1186 7535 -101552 -131569 -210091 -69934 72633 110868
7562 110868 -20407 28708 184708 27753 179643 32383 -93151 -123252 -35396 29400
7552 29400 91933 -44542 -43535 122048 233685 -35227 50843 100962 158600 231198 252595
7541 252595 123164 23626 140273 171693 116707 150128 98337 -22657 -94221 -91760 19500
7530 19500 -44097 -294511 -344229 -102649 -226871 11866 -42890 -22572 116229 -47266 75790
7519 75790 277776 231280 150577 154542 74020 54932 -58652 -176660 -158324 -200590 -121122
7508 -121122 42081 -15415 -20748 -5083 20802 -86530 -289923 -108111 57078 62205 73547
7497 73547 -123687 -126162 225307 173088 -105336 -180270 -41826 101225 -108887 -54840 -25950
7486 -25950 -152427 -7302 -36823 95393 102238 40250 254362 121875 124363 -4632 -98493
7475 -98493 -43329 9153 207466 236676 25594 -110823 61325 60056 -41572 85495 -941
7464 -941 -22346 56810 66458 -2305 -18503 182986 143666 88977 -137559 -175651 37347 -46168
7452 -46168 -144229 -150286 -39853 33493 100925 -3826 -143402 -204941 -290552 -182281 62005
7441 62005 147615 194223 255856 173156 11490 75297 50948 -131374 -33956 -24681 -34097 -20319
7429 -20319 38702 64686 243118 -34991 7102 17279 -123043 -356659 -218891 -174014 -197056
7418 -197056 -51010 23475 129486 208886 355685 104822 -75377 -68882 68831 280019
7408 280019 78587 135683 12191 -96909 27130 -100089 -28229 27900 30087 36420 173816
7397 173816 122680 198965 143768 17030 -67297 64686 253946 291133 65435 82617 95684
7386 95684 262848 141236 132088 98218 -14268 -28822 -83672 -33977 -230253 -167933 -224505
7375 -224505 -247071 -304713 -196536 -142018 -105296 152513 -50260 -128856 -123989 -53773 35741
7364 35741 -87251 -100493 -230842 -34983 -14486 -81789 -39484 155605 40409 -50115 -40761
7353 -40761 -106186 -18269 75829 65665 -38357 2569 137245 91711 60033 21892 -123059
7342 -123059 -43356 -147841 -197717 -273747 -157327 65877 -133516 -210797 -136703 76136 85724
7331 85724 221578 132370 -108354 93332 44978 -36338 16810 5880 90851 -161540 -276275
7320 -276275 -359961 -69800 133904 4233 57970 -6474 161953 6817 26659 79487 121867
7309 121867 37662 -9987 -118414 -56617 135221 436997 303651 6098 -145775 -126645
7299 -126645 -284279 -184595 -129126 -24136 -13226 -163475 -254030 -135588 -140649 -323994 -165176
7288 -165176 -3344 -21657 32583 167460 17454 -173061 -118904 -21479 -42844 -95801 -192668
7277 -192668 -134104 -316285 -409119 -161770 -231492 -210295 -37061 -29498 64903 72030 -48307
7266 -48307 -59880 56686 117096 -135664 -186540 -45584 -210697 -222845 -217085 -107064 -56479
7255 -56479 -91338 -4658 41847 154625 -19754 -257354 -205659 -154717 -74459 -49610 4748
7244 4748 -34169 55071 7272 -30493 24681 -108088 -191319 -176535 -150764 -8123 -28141 -135582
7232 -135582 -139687 -57755 -50125 -52930 61374 -42274 -112872 25592 -55592 -325004 -129942
7221 -129942 110781 150776 239854 85199 -254884 -149082 -52140 -15030 216331 -103190
7211 -103190 -5955 -43705 14908 -143183 -21705 149260 210201 -37442 -294784 -180231
7201 -180231 67784 7081 116102 51120 59920 41245 173173 73474 118204 -51202 11274
7190 11274 170117 -6276 -120449 -120249 91843 -46091 73349 111785 -35317 -116050 72150
7179 72150 -58407 -36357 -24195 12137 -73729 -85362 -202590 -46121 -164879 -187679 -223833
7168 -223833 -113443 -20800 -86036 -258820 -159661 -38649 26433 16615 -51742 55202 100842
7157 100842 75529 101380 -24619 -115791 -190208 -35340 41667 126254 73762 -11022 57434
7146 57434 22330 -19223 71287 228378 79664 -16478 13910 37337 -115615 -46105 14121
7135 14121 -139594 71436 -31601 -226066 -81182 293746 177115 -115841 -71338 3164
7125 3164 -63979 -194230 -120580 -21851 281187 227392 172018 89046 203099 177358 113580
7114 113580 55696 4869 -115100 -103260 -33963 48411 1068 -36992 137550 -131482 -126174
7103 -126174 -55151 -82397 -27981 -2918 -69948 -223506 -238689 -161819 -237253 19283 -119472
7092 -119472 -117532 -49205 -45080 -126474 -156977 -212045 -246101 -131115 22745 121441 -38378
7081 -38378 26992 156795 119825 -45426 -163324 -164645 -26698 -100585 -163848 -193911 -91146
7070 -91146 -166818 -151399 3988 -11226 26614 -59776 -153803 -241670 -103226 -23725 4809
7059 4809 -213599 -121351 -5760 -40433 180487 33301 -72928 -71999 73050 65593 1895
7048 1895 -111468 -53673 -170873 -131581 -22995 -64715 5584 -94418 -29317 137231 -828
7037 -828 -89697 -165387 13936 -21479 98890 106955 -78490 -42747 105715 7307 -85285 -194819
7025 -194819 -190373 -201711 -141109 9280 13639 -219234 -232213 -96371 -75399 -241235 -244805
7014 -244805 -100625 -365868 -175822 61712 44762 22966 1063 -56208 39028 107833 135975
7003 135975 211013 266836 158324 48643 136660 170539 2914 -72251 -203468 -104411 -197438
6992 -197438 -36404 -109286 78920 66054 -31819 187553 77319 -109274 -159509 -24313
6982 -24313 -182918 -229738 -130873 -177374 -138885 63355 63671 35946 29685 30630 92393 70681
6970 70681 26569 68522 36775 -40438 -36000 764 104401 176150 15828 -61380 -134441 -171025
6958 -171025 -459873 -485678 -281447 19724 234839 17766 44079 -23430 -150457 -8284
6948 -8284 64492 74426 143642 2795 -127746 -23907 -100112 -139347 -150479 -140853 -233432 -103534
6936 -103534 -118062 9204 28845 -14176 74451 113975 -147264 -175956 -119503 -47993 -30447
6925 -30447 -90947 11350 -58581 6772 -112327 -76055 -100895 20091 -40306 -154174 -72291
6914 -72291 -134870 -175969 -290841 -161753 11138 -169008 -236258 -279240 -198961 -153038 -78958
6903 -78958 -223751 -227333 -199744 -277764 -171241 -36734 -56377 -73977 15900 45005 -6095
6892 -6095 -12329 18952 -47122 -154235 -67485 145837 239469 -42900 -65670 22969 131017
6881 131017 -10365 60017 48119 -104236 -64140 -18078 -233063 -405027 -376476 -258444 -76637
6870 -76637 21948 57093 -97016 39733 162867 254495 107934 80697 -38298 -96892 -44847
6859 -44847 -97125 -41487 81195 92292 45278 -246676 -243365 43587 -50509 -60810 -100208
6848 -100208 -272473 -321652 -180600 -42328 113970 172090 181775 13861 -145106 -99062 77392
6837 77392 97702 20000 -12073 -162155 -155366 -241378 -90136 165902 132224 110105 98510
6826 98510 38984 -39363 -92127 -116703 41354 -132047 -281710 -108628 -33710 -90882 -96192
6815 -96192 -105380 -148936 -76703 -40900 -90648 28705 65919 118328 112486 -88917 -1679 67829
6803 67829 64396 -56435 -190044 -90654 -37097 -23638 -184937 -162714 49074 -54702 -14424
6792 -14424 48791 -25564 -182935 -134218 -122119 -158698 -305198 -265649 -30799 -69147 -270797
6781 -270797 -215731 -38329 -15053 142461 60281 27895 21498 -16735 90563 84952 211513
6770 211513 67472 -33791 -75654 -136344 -204631 -49614 -26880 -6927 -264464 -267461 -97541
6759 -97541 -36929 6666 77109 19310 -30900 81179 130176 -228370 -395716 -383525 -214818
6748 -214818 -87991 -165479 -111708 54596 211385 184862 76419 -17860 -184051 -191975 -136347
6737 -136347 87146 22110 -30393 97015 62186 56608 126567 168072 -25378 -2466 -75757
6726 -75757 43386 53781 -27596 -173167 31903 -570 -198114 29601 134012 35062 -61678
6715 -61678 -103387 198502 126237 -143365 -134698 -77409 45034 210211 25799 -16578 -247193
6704 -247193 -164192 112047 3539 5894 -36706 141675 185940 -37463 -55726 -186143 -177911
6693 -177911 -22291 48604 61286 -5289 -40416 -23323 -166361 -67407 -91212 -76096 -143379
6682 -143379 -62342 106006 -76115 -335647 -160237 -50241 -163298 -131804 114234 112207
6672 112207 -7733 -117411 -220931 -133159 24135 -9191 71043 115777 -79323 -160421 -10774
6661 -10774 169233 -4064 -198068 -284274 -201672 -143891 -253494 -162751 -3220 -88361 1353
6650 1353 -110783 -119466 -107087 -96800 -43421 -17673 148649 105599 65584 9135 -56649 -36873
6638 -36873 -27447 -99756 26496 107388 -119486 -141009 -299030 -349536 -326700 -268430 -88317
6627 -88317 -125358 -125521 -42431 -158065 1635 -123724 -164218 -149308 -297872 -370798 -346510
6616 -346510 -180364 -128595 -290280 -252392 -177740 -120443 218411 24091 33261 194463 -23334
6605 -23334 -227871 -214969 -212012 -50091 13007 74977 -9029 -39618 -71105 -64972 -123710 -179317
6593 -179317 10677 -18135 35677 201648 224980 106284 -21467 -149005 -135516 -275413
6583 -275413 -178595 -137809 -62534 -44184 27001 -11064 -111990 18003 -59406 -346169 -278621
6572 -278621 -298826 -235933 -66620 88288 -114419 -105371 -33422 -19163 157292 176149 -112918
6561 -112918 -134184 -240416 -238332 -190409 -103705 -137489 -107670 -209620 -188552 -239462 -252721
6550 -252721 -78024 -85372 -134789 -232188 -124340 -162690 49098 55830 -143722 54125 81474
6539 81474 -196623 -169887 -139077 -282171 -301325 -156848 -138806 -28205 43427 127700 30755
6528 30755 -73567 181122 128839 -290009 -152441 6849 -38276 -201510 59457 -108231
6518 -108231 -208586 -6836 -55928 -133672 -227793 -146950 -30008 50369 -26955 -58285 28388
6507 28388 -105974 -220026 -193206 157938 72487 -151875 -308601 -86230 -140865 -192143 34627
6496 34627 45531 75041 -68461 -342894 -374116 -415427 -145956 91790 -120596 -10644 -34198
6485 -34198 801 -19146 -30466 -10661 12287 -70205 -127770 -81679 -99984 30782 25045 -166349
6473 -166349 -203345 -254032 -141579 -193848 -265259 -237350 -23514 30233 -27736 -106506 91118
6462 91118 260050 20188 -52796 -309187 -430090 -305786 -71008 -55379 -129642 -159714 -88522
6451 -88522 -147242 -62019 -132530 -173737 -164183 -55551 -67989 -153553 -122261 -222400 -47396
6440 -47396 -75618 -249237 -24753 -129385 -230491 5370 -327608 -278658 96740 -182065
6430 -182065 -227983 -134850 -116372 -202745 -236320 -93743 11329 -239491 -221001 -121942 -79566
6419 -79566 -234190 -252841 67651 14698 -33654 -290327 -364136 -328727 -138169 117826 43441
6408 43441 -144685 -68774 11888 104786 -133685 -196937 -47268 220211 139460 -190660 -244048
6397 -244048 -114003 -68371 -214570 -328049 -192043 17676 88585 51976 -151185 -158836 24665
6386 24665 4899 25916 -108192 -170682 16956 -9178 -210169 -10179 89151 -119054 49491
6375 49491 75162 9096 26366 100301 139373 70587 132968 74291 246590 35999 -1010
6364 -1010 228809 145059 -23370 -130758 86017 191178 -58727 -74674 -114433 105813 122185
6353 122185 173286 113316 56892 68064 1136 74599 -147194 -145404 -37634 -155283 -153415
6342 -153415 -190256 -183531 -104583 111242 -82877 -55819 90293 -38690 1360 8781 -9083
6331 -9083 -58109 -5672 11393 58034 -120343 -89314 -106502 -241791 -50453 -27476 -119028
6320 -119028 -83394 -256029 -67201 137125 131050 -60179 -107778 -141350 -86282 -129711 -29367
6309 -29367 -40219 -199778 -52826 -142685 -167577 -236965 -266496 -190164 -182003 -55775 -155749
6298 -155749 -234696 -196408 -116080 -277928 -287412 -329085 -188647 -218346 -119704 -104252 -23444
6287 -23444 125143 176709 28423 50071 160735 131534 -63136 2078 6083 -118469 -78791
6276 -78791 108164 85467 -9816 -52538 -56214 112071 -144225 -205831 -259500 -145421 74825
6265 74825 65777 -49067 -42734 93354 -117562 -54350 -116537 -171042 -71477 38992 152168
6254 152168 128649 153945 -93389 -268592 -21210 -46348 -38255 31833 -106409 125279 187043
6243 187043 144376 93108 43386 -96093 -55689 153940 166052 38297 -15090 82768 -45447
6232 -45447 -226690 -107978 -23310 137241 -95870 -144872 -192521 -208083 -89588 -71856 20828
6221 20828 70678 -86737 -20199 -260868 -123479 140069 -6977 -85577 113714 -47889
6211 -47889 -108427 -90124 -221930 -88423 16711 -46687 -77729 -38189 -39023 -168390 -120464
6200 -120464 67798 -44414 -94426 116932 49678 -81540 -173695 -82847 -283511 -66310
6190 -66310 -22576 -116980 -123604 -164293 -76588 -49372 -63217 -144475 94304 43594 -63427 49926
6178 49926 -56650 -141609 -129892 -95883 -118801 -307364 -175771 -162285 14939 -12404 -56805
6167 -56805 -109590 -203742 -215292 -214609 -216219 29431 -47754 -136535 96307 15701 -65481 -130418
6155 -130418 -141723 -193850 -4726 123506 -42544 148558 -58991 -32993 -89844 -11741 118885
6144 118885 156933 145889 17333 -155475 -239084 -80402 -35856 -424827 -281702 -69299
6134 -69299 -166539 -68388 -109371 -73261 128430 -74185 -62969 -188033 -263338 -137027 -24560
6123 -24560 -63091 -151826 37507 52195 -120211 -50342 31296 -130629 -163981 -157683 6382
6112 6382 -122414 -103011 -286067 -261685 -91678 -181359 15826 -81988 -114452 -142520 -253634
6101 -253634 -171524 -169753 -100881 -92760 -11428 167264 -41746 -144649 29014 24400 -87983
6090 -87983 -153199 -104830 -151960 -122252 59328 143425 -42224 -12728 -149663 -129972 65945
6079 65945 133882 170856 91714 -124456 -92579 -154770 -322963 -101205 -119425 -33471 121819
6068 121819 -154837 -170735 -226262 -21483 51923 -95838 -36653 -144261 -177720 -116832 -125298
6057 -125298 -52764 142181 243115 96393 -16046 -203727 -112265 -181813 77544 2874
6047 2874 -325619 -317088 -239448 -81121 64155 93241 -39712 -12641 -94113 -90739 -185784 -67504
6035 -67504 -78279 -125640 -82588 -78121 -8389 32837 137013 168890 -67546 -136145 -258243
6024 -258243 -210469 -131298 -70981 -152004 -318543 -351456 -263727 -29320 -1264 12542 -348972
6013 -348972 -316442 -189672 -232924 -136977 -175988 -303602 -20189 37443 -89630 -204334 -85083
6002 -85083 38993 -7819 -152890 -211744 -176014 -271132 -160360 68209 5710 -40554 77391
5991 77391 -180515 -153040 87462 93028 12035 -187228 -169413 -21688 -84111 66310 -61966
5980 -61966 -85584 -79823 -9045 -16817 179486 12162 -126245 -31017 -45396 -184515 -137720
5969 -137720 -102704 -29817 -60591 29932 -85914 -145492 -150255 -280389 -205932 -3032 147032
5958 147032 198023 189190 61060 7343 50064 209079 208992 137444 -105237 -49415 -4087 -235563
5946 -235563 -115826 -71495 -221555 -233258 -160299 -181963 -134047 -323605 -193288 -39796 -76537
5935 -76537 33516 -37239 -135544 -250269 -187382 49824 187346 -125539 -310694 -239200 -199374
5924 -199374 -121379 -294487 -321310 -222061 -127975 -275161 -190859 -222564 -480794 -526464 -517962
5913 -517962 -375565 -415816 -248614 -196587 87816 219814 -29927 -189314 -124101 -70069
5903 -70069 -61368 -198066 -190252 -35426 143152 71035 -29592 -55376 -46055 -171393 -143205
5892 -143205 -282112 -222812 -46583 -31136 -114027 -77133 -29693 25253 193003 154153 -46958
5881 -46958 -245326 -165789 73874 31069 1948 -176192 -274719 -132835 -31588 -19327 -41937
5870 -41937 -184704 -211474 -349196 -327452 -325391 -373805 -197035 2226 -22632 -82686 -157994
5859 -157994 13527 -153759 14647 97156 -152824 -147078 -107836 -21811 -157114 -279208 -305412
5848 -305412 -101720 -101043 -256136 -229806 -185374 -201581 -271915 -378176 -317100 -476310 -325583
5837 -325583 -272458 -97577 -230383 -406679 -276735 -126495 -152503 -108486 -193468 -187064 -120667
5826 -120667 -63125 66775 -86922 -99643 82053 -29290 -76642 -330317 -199113 -80412
5816 -80412 -88956 -42303 228555 -19105 -164777 139918 -19148 -91779 -134669 -97465 -221623
5805 -221623 117413 98377 38200 42753 -196220 -168753 -50911 20910 -28180 12447 -45457
5794 -45457 -182331 -166141 49731 59077 -96741 -89316 111800 151917 -31204 -259245 -101777
5783 -101777 -290041 -205788 12481 -17765 45046 14923 -27432 53778 -25764 -259230 -138144
5772 -138144 -62543 -44460 -125999 -98593 -110147 -17914 18987 -187400 -147924 -155129 -208265 -158668
5760 -158668 -54437 -128384 -163836 -188331 -124229 -49797 -61595 87335 125272 -34062 -28090
5749 -28090 219976 183999 121028 -70580 -257818 36059 168917 152709 -2066 -55410 -213888
5738 -213888 -203931 -75407 -171952 -31183 38508 56481 54321 51071 170577 34911 -62233
5727 -62233 67845 94134 41452 -97110 -15941 -124764 -107268 -156739 -158334 -190545 -102813
5716 -102813 31779 20108 -18833 -3927 -62007 -150679 -26530 -102972 -281581 -254926 -173774
5705 -173774 -177819 -53570 -58550 -132212 -114240 -66666 -120906 -269039 -159377 -44149 52807
5694 52807 -68827 -90469 -121644 79373 -41906 -139045 -41670 226999 312775 182080 50380
5683 50380 109719 271921 195877 78763 115807 -42789 -55864 78502 13334 -86095 -33636
5672 -33636 -103704 -109537 -28807 54022 -138180 -74721 -33716 -62546 5766 -258890 35472
5661 35472 125315 -16834 -130433 -79533 45889 -75946 4041 101366 20100 -72112 -292
5650 -292 201058 199311 237600 347982 313702 248949 88697 3305 53106 -11156 63341 -13234
5638 -13234 -89775 -258759 -202642 -337433 -199310 13378 -84080 -184225 114950 -1485
5628 -1485 -1455 68084 196873 190253 104369 -141994 -113873 185903 324778 467058 265150 136633
5616 136633 17244 72257 32212 18818 -26534 42704 231990 341425 246050 104397 99993
5605 99993 109479 152634 29341 177929 266266 366015 214042 132367 29771 387124 460213
5594 460213 361197 310264 119961 316279 468484 419171 403812 331055 482310 584643 351806
5583 351806 572822 742226 801856 635547 611610 565006 402888 474708 498053 500713 614191
5572 614191 611595 653701 620230 531131 224059 20902 -20009 270274 417901 317317 277774
5561 277774 203036 68439 105738 91673 64468 122471 316896 147750 117214 90817 138133
5550 138133 205852 226555 67990 58893 116496 -70445 -55875 90068 369409 468248 329973
5539 329973 376146 169516 129520 160144 194107 243774 409532 345287 249216 208460 215949
5528 215949 153084 127116 121820 249524 340540 265569 257672 170052 143945 13717 319965
5517 319965 333129 284885 11523 12212 125263 91609 8891 48532 85879 311813 244089
5506 244089 218307 234920 336419 353590 153603 67568 254151 287367 253555 226945 204958
5495 204958 118191 245926 319466 497343 428321 537370 575759 251393 359167 200117
5485 200117 80966 158577 546378 403791 307069 -3774 148336 123892 -8786 305103
5475 305103 492236 573456 513447 584445 507855 102899 81143 155304 163979 308820 319400
5464 319400 485931 677320 842126 502468 276817 348885 379055 280832 317817 414204 322828
5453 322828 445718 598741 742253 883928 849536 826029 749542 678617 802287 996083
5443 996083 819999 653969 667964 743590 746237 596869 708826 743459 713223 696575 923885
5432 923885 981663 927829 765493 746058 712473 835644 1118222 1080236 966580 997735 926029
5421 926029 894403 1083195 933999 889024 885014 1037131 1066587 973374 1113221 1308113 1210783
5410 1210783 1243719 1152153 1057940 1002098 899423 1147329 1092435 1176777 1284556 1219914 1337068
5399 1337068 1408441 1329953 1488109 1355372 1291652 1446803 1525982 1555518 1370137 1425251 1690786
5388 1690786 1812589 1605325 1683271 1695446 1875270 1851358 1779440 1834576 1810133 2001633 2092458
5377 2092458 2112615 2099309 2192822 2406062 2393456 2443016 2358315 2506035 2818006 2781669 2925250
5366 2925250 2784741 2798791 3023454 3153097 3161435 3358013 3471172 3559090 3519259 3614646 3665348
5355 3665348 3696232 3906341 4064983 4030915 4099017 3983880 4081869 4492740 4635172 4744295
5345 4744295 4830911 4904941 5013457 5220789 5308216 5481954 5984745 6392175 6311149 6350964
5335 6350964 6656495 6716401 6914384 7339509 7434644 7703399 7805127 8093810 8437259 8620555
5325 8620555 8952205 9332583 9521204 9884465 10309047 10692058 11049271 11390456 12004392 12421171
5315 12421171 12973101 13276972 13563387 14166958 14698362 15234641 15653525 16347382 16930661
5306 16930661 17700806 18340614 19092003 19789237 20617150 21719220 22787790 23936087 25223166
5297 25223166 26749467 28274385 29896312 32117878 34604701 37338902 40458229 44311746
5289 44311746 48677359 53842550 59988064 67167532 75178709 83994721 93299943 102726563
5281 102726563 111824462 120335200 128577741 135909895 142529251 147509974 149135707 146383178
5273 146383178 140328478 132290073 123999796 115989249 108340302 100579629 92236268 83258018
5265 83258018 74435447 66294128 59086682 52781305 47336648 42589943 38722011 35420171
5257 35420171 32294045 29705022 27690555 25617929 23861721 22262984 20933573 19953334
5249 19953334 18830417 17664420 16687031 15810303 15108103 14286434 13838586 13360896 12804932
5240 12804932 12450221 11814316 11297859 10930619 10497012 10144219 9804142 9484404 9215473
5231 9215473 8816598 8633487 8378142 7860320 7601761 7226788 7002292 7018208 6674485 6518031
5221 6518031 6350666 6027301 5656314 5603845 5436213 5209708 4999922 4847554 4760665 4522892
5211 4522892 4308988 4291390 4224282 3931544 3764711 3776455 3673896 3688313 3654393 3661426 3320791
5200 3320791 3044015 3120957 3071275 3061224 2966083 2872099 2966037 2830442 2781287 2708908 2673975
5189 2673975 2654770 2517257 2480241 2594797 2687364 2585887 2532700 2468572 2439878 2539677 2442564
5178 2442564 2068684 2020025 1984177 1897408 2005447 1870704 1809294 1913857 2081620 2004761
5168 2004761 2053306 1833630 1621016 1722014 1638785 1669975 1766334 1600611 1333157 1418019
5158 1418019 1324598 1331605 1381644 1600941 1447770 1249630 1252437 1244216 1287540 1336271 1412482
5147 1412482 1239310 1129115 1221053 1190502 1046779 1127897 1132224 1080365 1173849 1012045 958529
5136 958529 883461 740354 864592 775023 865005 889749 907814 1035663 797271 847468 851217
5125 851217 640505 753137 741102 734956 648028 643781 704815 807288 859472 624192 776719
5114 776719 806939 645316 603515 727971 811228 621818 452469 282642 513547 680993
5104 680993 555384 485809 629466 678977 623297 761427 628355 513826 767222 769009 790031
5093 790031 742666 757603 570095 465657 497237 777112 698920 657144 632691 423365 588262
5082 588262 675102 588762 565804 735330 597994 542013 572414 635247 668609 599925 655722
5071 655722 841511 765336 699723 637311 660316 606919 561377 553613 557772 518885 628044 458878
5059 458878 451166 517785 568892 516610 449238 583510 647312 660860 792654 496523 281204
5048 281204 467006 530983 473537 494396 620918 598055 577135 528067 549705 611025 618396
5037 618396 490542 667556 673988 722061 728249 474759 621406 640232 866055 748406 439148
5026 439148 409041 560274 524203 517941 518257 668914 678295 730779 780682 580091 479072 555248
5014 555248 602150 541647 710328 416870 276147 432279 476077 627949 506503 617385
5004 617385 613072 633102 754427 719304 740302 698218 727408 534153 657793 548350 561129
4993 561129 436844 498210 578209 529276 358007 525524 631001 552282 728155 697418 424969
4982 424969 412229 482240 588624 474054 523822 661791 780665 800406 758191 920092 1073019
4971 1073019 1086332 1151772 1337528 1127827 1138627 1163046 1245599 1346220 1054524 1159262
4961 1159262 1255905 1054338 833613 720140 637877 699603 745416 636803 692126 707919 578397
4950 578397 531471 615740 623339 756518 710248 547501 454288 357814 620521 578525 496413
4939 496413 725689 639270 464550 420623 402746 538246 712226 644176 527952 712663
4929 712663 647683 655727 761740 645817 616820 645517 648567 586926 711427 659408 676610
4918 676610 680434 611441 522403 651387 765110 854136 823363 729469 646768 879873 873723
4907 873723 702350 662393 845947 710207 991956 992176 1029605 1158565 1086296 873543 778732
4896 778732 892871 904126 1010209 968827 989301 802418 785300 860396 910371 989187 924268
4885 924268 936951 1048557 1058518 1180665 1341928 1383241 1288368 1210218 1270762 1269045 1263633 1374945
4873 1374945 1462974 1331723 1274358 1376413 1308639 1543743 1386409 1501321 1381219 1363543
4863 1363543 1353767 1289351 1440129 1270198 1316764 1456852 1433742 1372334 1304026 1321837 1708483
4852 1708483 1736913 1867127 1862420 1652469 1704831 1723674 1648834 1463091 1564582 1608345 1574950
4841 1574950 1575260 1604449 1583333 1348962 1231237 1289426 1480866 1597862 1638683 1421071 1406944
4830 1406944 1346078 1167930 1507720 1548937 1571339 1538548 1628512 1591849 1522921 1529102 1684660
4819 1684660 1782621 1550317 1395726 1422931 1501641 1527485 1387358 1397511 1325693 1469966 1479683
4808 1479683 1350893 1474216 1507696 1381706 1436006 1546404 1616447 1643926 1585238 1531779 1554035
4797 1554035 1598156 1665383 1691062 1762246 1835984 1650528 1922765 1972656 2065442 2160748 2231360
4786 2231360 2143636 2173720 2019355 1881994 1930547 2000542 2150885 2088982 1962854 1763380
4776 1763380 1807335 1938901 2108854 2148577 2002241 2031688 2217522 2361547 2385786 2367391
4766 2367391 2359319 2321160 2203141 2405442 2340014 2330705 2519661 2646427 2890064 2799914 2749307
4755 2749307 3097755 3195707 3185274 3031345 2976317 3376408 3456107 3415231 3368439 3463260 3508935
4744 3508935 3320339 3411946 3648227 3629089 3791296 3902667 3787551 3746138 3732177 3885036
4734 3885036 3930340 4076589 4079769 4359389 4452002 4406416 4532601 4555467 4641518 4610546 4670241
4723 4670241 4846963 4950493 4944869 4962596 5122969 5136776 5178750 5297391 5421112 5465109 5525825
4712 5525825 5631076 5799540 5887835 5769933 5899473 6164442 6199088 6186926 6263904 6220532
4702 6220532 6300044 6331974 6312156 6844048 7111845 7304796 7289093 7371928 7580167 7545749 7833401
4691 7833401 7917395 8067823 8319370 8557946 8685713 8974581 9143740 9301526 9655064 10026582
4681 10026582 10505189 10702805 10575038 10818682 11210393 11626276 11844903 12002138 12299233
4672 12299233 12749733 13145841 13595096 13872541 14276307 14551145 14748175 14890191 15231027
4663 15231027 15503578 15781279 16031790 16630004 16988069 17460170 17721905 17919860 18513343
4654 18513343 19042196 19644625 20104347 20448583 21089573 21632138 22210265 22749434 23192574
4645 23192574 23860666 24395899 25030918 25405806 26026613 26850918 27479252 28185071 28877764
4636 28877764 29572053 30374053 31318871 32305888 33511764 34861661 36056712 37533609 38646245
4627 38646245 40067883 41860897 43347797 45071284 47031388 48682966 50370116 51972406
4619 51972406 53847023 55691291 57725204 59799397 61931849 64335834 66681726 69163121
4611 69163121 71746568 74369020 76988805 79783185 82284375 85059116 88090949 90804493
4603 90804493 93705263 96515846 100222073 104381684 108994256 114685855 121377400 129230563
4595 129230563 138515903 149029694 161573429 175693094 191732377 209694032 230127183
4588 230127183 253077482 279801268 312227063 349469414 386775426 419497717 444289439
4581 444289439 455504734 452346032 443817464 439114420 437532507 428098856 403098513 369971539
4573 369971539 338085134 310990626 289304836 272275336 259095756 248828064 240348240
4566 240348240 233416487 227623284 222969123 219037094 216144440 213702304 211399910 208732316
4558 208732316 204882064 199566715 191919456 182600559 171843459 160311721 149272432 139593723
4550 139593723 131540502 125519637 121295450 118873810 118316337 119187020 121214003 123309892
4542 123309892 124423726 122582590 117198822 109029599 99764340 90913230 82955662 76368830
4534 76368830 71053466 66552347 62851393 59567018 56702888 54149117 52074589 50220212
4526 50220212 48711131 47598922 46632107 45845883 45378612 44957046 44575894 44088064 43421578
4517 43421578 42334799 40965709 39110879 37418326 35679771 34022503 32694888 31361056
4509 31361056 30203556 29203121 28413925 27527870 26909228 26464990 25867287 25203722 24405895
4500 24405895 23501613 22230392 21075192 20078873 19199915 18508026 17971604 17283083 16800990
4491 16800990 16277464 15741507 15137083 14538419 14280408 13842781 13652557 13176451 12831607
4482 12831607 12548313 12458506 12172910 11827198 11752163 11713573 11480578 11308859 10891394 10583125
4472 10583125 10357265 10150621 10013379 9836365 9668784 9562772 9540284 9094087 8917315 8824168
4462 8824168 8825623 8937967 8803349 8852070 8623909 8349690 8197631 8133697 8137833 7918437 7805484
4451 7805484 7667120 7619615 7599893 7462311 7193301 7196792 7280774 6906185 6959435 6852227 6752263
4440 6752263 6724842 6797491 6718553 6502879 6739279 6696106 6557105 6481000 6451202 6429040 6255720
4429 6255720 6285270 6318037 6245047 6148657 6069600 6128073 6142784 6054712 6130719 6153464 6137025
4418 6137025 6331452 5953267 5912680 6069873 5731934 5833539 6067785 6139812 6017998 6051006
4408 6051006 6161934 6076638 6141564 6387847 6407983 6613533 6672475 6563105 6815560 6912275
4398 6912275 7038076 7300404 7555634 7503928 7563431 7726096 7943677 7877412 8196300 8415159
4388 8415159 8435769 8385755 8525867 8654477 8898551 9171303 9099696 9350186 9418165 9722544
4378 9722544 10006974 10081086 10265078 10547588 10480785 10718578 11085683 11089652 11078691 11578651
4368 11578651 11769678 11995905 12557251 12887370 13176042 13655642 13903369 14386118 14715671
4359 14715671 15007086 15599865 15884078 16763418 17176745 17633715 18441131 18959814 19579802
4350 19579802 20238020 20827327 21628162 22116752 23026469 23820336 24541701 25524450 26315162
4341 26315162 27055742 27568370 28424033 29377236 30336239 31392389 32704994 33975525 35011342
4332 35011342 35998846 36867621 38038268 39627785 41201420 43185799 44965740 46909092
4324 46909092 48856106 50946915 53677711 56953011 61154601 65953046 71482211 78070769
4316 78070769 85769171 94909917 105673622 118905847 135037837 154333922 177681696
4309 177681696 204687240 234681992 266962718 298209964 316497679 309456021 281179245
4302 281179245 244156484 207233360 174351697 147824909 127016494 110740688 97963859
4295 97963859 87896754 79626505 72513785 66489440 61010328 56250238 51620777 47813841
4287 47813841 44410398 41175916 38211187 35868158 33810409 32062775 30478083 29022330
4279 29022330 27755993 26654879 25556177 24649964 23542504 22577056 21807693 21193693 20386866
4270 20386866 19624328 18785801 18028428 17237355 16638245 16000137 15366731 15095025 14516642
4261 14516642 13974223 13668549 13291924 12819816 12666548 12379194 11813085 11419883 11123046
4252 11123046 10829094 10357810 10112181 9869287 9493474 8987478 8747303 8636405 8233311
4243 8233311 7988720 7957628 7989974 7734564 7437877 7321058 7210771 6859232 7044132 6920451
4233 6920451 6826420 6444160 6462784 6621276 6385006 6053068 5907372 5600771 5683215 5503100
4223 5503100 5110430 5053343 4818162 4732287 4492617 4583258 4359353 4408262 4616675 4527640
4213 4527640 4273606 4203696 4275942 4183992 3966478 3832065 3788259 3797258 3595285 3515101 3681440
4202 3681440 3660517 3534498 3278932 3228597 3133588 3050006 3029329 3156671 3114556 3065831 2981970
4191 2981970 2960257 3008212 2883945 2819265 2893396 2835321 2770449 2765502 2748817 2507892 2578906
4180 2578906 2717587 2520539 2584357 2502259 2231409 2251643 2270530 2317864 2154534 2083108 2298514
4169 2298514 2059705 1975551 1812245 1788197 1885658 1785581 1796972 1702001 1876053 1990447
4159 1990447 1927058 1938172 2086617 1934953 1977535 1792335 1773331 1997253 1781319 1633836
4149 1633836 1613706 1694124 1732353 1624442 1646035 1663344 1471874 1620529 1627357 1363471 1265421
4138 1265421 1354005 1218461 1273196 1286269 1296981 1182559 1107830 1181209 1455393 1561752 1354465
4127 1354465 1513653 1695132 1621739 1589503 1432485 1496779 1365698 1340349 1515533 1657154
4117 1657154 1583773 1731294 1566819 1682013 1641214 1465216 1544540 1381564 1382854 1425374 1412520
4106 1412520 1489327 1181101 1081444 1121413 1303817 1228370 1082833 1239783 1212950 1447684
4096 1447684 1150261 1080017 1165360 1164637 1130317 1176592 1032055 893700 1157235 1247871 1126930
4085 1126930 1354105 1322931 1313010 1216196 1185370 1079835 931748 913102 985927 1022426 940695
4074 940695 820949 946162 882565 716999 816866 1149831 968008 876429 852214 825794 851519
4063 851519 694593 767428 846605 950874 869999 839259 758358 659108 818476 902961 915989
4052 915989 896758 828002 775222 861956 813854 840581 895525 897607 818341 609276 704721 904903
4040 904903 919546 1024118 1029921 1216059 1128510 804758 957529 911769 985892 865037 984221
4029 984221 1108449 962152 845305 678451 730645 1154932 1165391 1004947 983506 933800
4019 933800 911008 939854 955218 987739 1011563 1046548 946222 1007854 1018108 1188735 1230484
4008 1230484 1208830 1450511 1330694 1478971 1774492 1844097 2175776 2280054 2043715 1951888
3998 1951888 1982639 1618640 1438173 1289700 1092497 1252991 1133969 765858 827136 837478
3988 837478 827491 818821 795287 760622 728420 780194 622985 646747 636726 517406 622615
3977 622615 454815 309986 519212 411154 429887 484121 626094 702261 626477 810242
3967 810242 769053 625642 661287 793396 790671 842969 741729 610513 515444 557144 976959
3956 976959 820309 763429 697545 639471 544047 532819 535071 555129 612121 630516 554881 482189
3944 482189 426405 425990 671211 301197 236704 540908 736304 655368 459170 273337 391218
3933 391218 619367 373039 251364 279151 241337 63113 360706 427327 344585 244464
3923 244464 353265 522001 321660 268734 293832 294995 360141 339440 712439 495000 345512
3912 345512 432445 451474 541705 680091 560092 211598 280497 327891 274725 202028 415071
3901 415071 481818 467861 496779 353245 481060 597793 582869 553291 388790 329400 406342
3890 406342 548004 496086 311378 260751 276402 118116 201100 304341 350777 439158 387133
3879 387133 338734 469501 589017 795997 668189 806175 545414 506527 486509 207636
3869 207636 316901 368128 271188 280432 291145 310976 502828 340967 403726 423015 481964
3858 481964 376075 404949 447577 587020 615466 661374 654281 644709 790908 863946 686120
3847 686120 716022 862312 635897 752055 694042 787046 726586 718008 749718 697632 611904
3836 611904 662155 800925 468705 502219 593297 377150 461474 374534 228820 380452 542139
3825 542139 393183 514277 677276 447734 287552 263612 526462 584458 474145 351816
3815 351816 281587 334112 455201 432942 223910 257960 213983 276281 287252 107311 248508
3804 248508 287452 208788 366507 87185 203030 129326 -11195 354767 520416 348717
3794 348717 392111 353381 474128 388850 493332 424305 142130 200067 220879 270328 251959
3783 251959 233343 227288 298795 394813 512926 356554 163477 64352 148907 209163 130157
3772 130157 94799 109286 28399 189363 72454 296188 384866 200932 213771 287180 215207
3761 215207 244534 129756 5135 231 -53779 92825 -40922 58525 412918 462914 590810
3750 590810 412122 66926 135288 266861 394194 316516 196442 354743 276726 137422
3740 137422 222630 341403 288267 179539 44405 99675 118576 350901 303988 148550 146929
3729 146929 220934 113414 -56937 27741 -52184 -164163 67388 357744 186765 63237
3719 63237 36413 23068 117200 62233 -23236 22362 250040 225215 336694 256589 281214
3708 281214 282881 67294 289205 320353 160155 151657 329239 384876 336185 192546 120701
3697 120701 16450 -116348 122980 155078 4357 -5572 48839 31415 75276 -53264 -65103
3686 -65103 189600 90239 218489 320717 194357 85951 90179 191614 379288 333950 418493
3675 418493 255144 231603 315385 138132 152992 365595 168613 17570 155615 330372
3665 330372 169832 -7284 94237 163954 118228 132035 38740 107889 41114 110744 207577
3654 207577 173349 118767 111048 149170 115213 190686 140433 193934 236577 149596 39354 130034
3642 130034 8245 70220 290903 296977 41361 151835 235645 81273 133631 152285 160624
3631 160624 157602 21819 9103 -112864 -136240 -31796 464 47074 180622 77844 81922
3620 81922 73879 191703 214600 142403 241049 300531 322473 316741 274218 253993 247754 169285
3608 169285 350907 215936 194297 267493 363744 300537 76945 255833 349729 175852 166104
3597 166104 328897 203197 216940 271262 99778 146454 101331 73819 68529 66848 107520
3586 107520 -62719 -131693 -151674 -123134 -3363 163495 222960 44793 347203 292369 232017
3575 232017 150807 69591 67745 100767 134490 212139 -73787 -63824 -6768 51962 32168 163970
3563 163970 334670 215636 284706 106415 61078 -35120 44639 43481 233942 241967 -88128
3552 -88128 -83904 -81140 -67424 73210 -89790 2669 -21824 -11229 318 182415 351238
3541 351238 274409 146595 45787 77249 266492 250525 80861 158018 84462 147523 198382
3530 198382 29783 120938 210396 103396 218021 294803 190181 117809 117362 184662 169186
3519 169186 99225 193624 255397 72052 95286 165393 102062 59439 60944 50920 -16938 160715
3507 160715 222733 182258 -141023 -38977 160428 195125 52038 -75998 -22240 151949
3497 151949 160609 -48642 -43910 -73986 46878 -9783 224068 350928 311038 152889 141903
3486 141903 -24646 -120677 -129306 99967 199091 28058 16789 47492 118291 289140 83793
3475 83793 38317 -77739 -160764 59009 113176 119358 89368 70161 310166 181439 121206
3464 121206 198358 177834 178100 234649 102136 171181 328299 182503 143558 -1418 236944
3453 236944 200186 137832 161692 -45305 -2899 36723 -7710 175110 223801 188494 114586
3442 114586 82074 138458 213399 162036 89440 131570 135941 143214 27854 71419 46848 -124520
3430 -124520 34683 101237 115854 71793 237081 97844 175460 164544 82134 130166 290620
3419 290620 239265 176526 115541 102735 211091 78807 215296 160034 -29600 181137 150232
3408 150232 148780 192794 64243 192224 187982 137008 228881 186828 19634 143403 258446
3397 258446 248764 377730 347268 249718 7387 -39210 234862 394566 134881 73949 312171
3386 312171 259214 185414 163437 12812 89647 188187 119985 150867 121231 390059 387993
3375 387993 207601 114339 598 122528 203705 159166 370745 470401 664334 522971
3365 522971 136047 139640 226045 314154 268280 420829 303030 355512 310489 118834 164935
3354 164935 223718 92950 184072 178686 170182 326043 558788 572982 434412 261797 237555
3343 237555 314039 277404 189113 241105 211606 173332 147964 299534 387533 -28711 -64434
3332 -64434 100446 166571 131610 10558 -70246 -20954 -25090 105074 123448 180637 134881
3321 134881 -47822 39511 -127802 50881 163815 210266 231473 32288 96205 197523
3311 197523 260352 379616 474598 250519 214156 245578 210852 31371 31790 -40888 166055
3300 166055 154729 -74119 -206537 -29568 44823 333859 158468 115259 5589 256707
3290 256707 288052 244621 72628 64077 24308 90608 221446 77620 391897 424618 288135
3279 288135 356448 221310 34627 151092 35851 299885 362156 368590 274759 97596 12087
3268 12087 186909 84334 205226 419773 238318 93792 175990 388739 402798 189413
3258 189413 233356 234481 294374 160644 -62072 20798 8400 44527 136462 157720 149647 268586
3246 268586 283986 375928 441689 578156 292038 165863 321264 360463 268700 307924 407281
3235 407281 410675 390224 258806 232551 321602 423022 408935 286051 326857 484452 346681
3224 346681 255306 414491 614241 248032 378065 213579 310203 499847 427138 395649
3214 395649 381404 294314 427584 636191 620290 711766 811831 686400 611266 716867 781637
3203 781637 658739 767446 518481 501342 734310 743869 893978 635412 569816 585767 766119
3192 766119 729770 668173 774091 769625 878957 800559 863359 991051 902325 929034 892623
3181 892623 832159 903494 1072082 1250537 1219646 1145588 1193087 1312341 1339825 1147967 1291787
3170 1291787 1353596 1265655 1254982 1231887 1171170 1367085 1517623 1389142 1362349 1576841 1685477
3159 1685477 1624816 1715145 1614573 1828492 1989401 2014730 2022342 1885770 1865477 1958939 2195889
3148 2195889 2239518 2472893 2746019 2728178 2644188 2849142 3172679 3550682 3869552 4157905
3138 4157905 4441503 4864984 5099704 5597968 6249528 6773935 7342923 7538705 7618933 7337864
3128 7337864 7261897 6852660 6322534 5777405 5127497 4608073 4282371 3698462 3466038 3274890
3118 3274890 3171966 2917033 2656265 2450981 2291940 2151156 2025169 1873261 1774904 1781425
3108 1781425 1798665 1985277 1849693 1766284 1577900 1472936 1570011 1354044 1337738 1469920
3098 1469920 1352668 1198145 1153049 1341270 1098690 953455 789665 1009998 901515 836310
3088 836310 921560 809909 772317 774567 689034 722311 548636 780141 768971 645443 568567
3077 568567 645130 602861 725899 664879 540839 688850 659502 592611 574466 625978 562056
3066 562056 478231 590065 570834 584377 439109 269200 377523 329701 419254 434596 391109
3055 391109 490729 427314 385594 406436 335208 547953 544898 258857 127471 331324 602377
3044 602377 510704 176344 120760 278537 268439 189465 231562 294247 443883 142114 223732
3033 223732 301334 440529 346737 321172 364353 306568 157736 59949 331579 217595 192871
3022 192871 275647 310313 393115 338317 46240 -105503 -85141 -114634 24504 199849 90820
3011 90820 131005 205169 65239 324333 420719 381804 490964 255597 35054 97966 34413
3000 34413 -36454 87660 315670 343589 345478 396241 276312 430535 217206 -5073 93410
2989 93410 109930 89514 71015 209297 70107 -9222 -92712 -29299 127594 141588 231935
2978 231935 127617 57042 18427 138346 170833 109494 229339 92859 141725 334897 184530
2967 184530 17210 -76650 -73838 -40950 8455 163671 209987 193210 156846 182131 140281
2956 140281 274476 113177 59843 153937 103035 119415 207297 226147 99018 -9533 -139459
2945 -139459 -42288 194718 161431 30799 24842 33586 146468 379468 230659 15578 -11914
2934 -11914 -66329 -36764 -24438 -36417 103642 -105213 -118055 27083 177213 140549 -46643
2923 -46643 -134660 -13672 130001 -55447 -62857 105956 102967 176756 216582 -7193 -91377
2912 -91377 53056 85806 29873 -29878 -14538 -75766 -63946 -155796 -317247 -164321 -52071
2901 -52071 -190129 -85942 100846 82342 80822 141456 40388 14984 149903 91479 3986
2890 3986 57671 202958 24102 -50866 -1702 -51812 -149563 -126909 -97881 104100 44495
2879 44495 62550 184996 125855 -187676 -26683 -244495 -301395 -73245 59054 110314 178160
2868 178160 -36017 -179683 19026 112541 140003 -34409 -62495 89885 62965 101573 326644
2857 326644 187933 84369 221607 29032 56677 236177 153006 164250 102382 -25728
2847 -25728 143846 276577 288247 179444 184884 291204 424897 221708 73894 147986 170326
2836 170326 404978 459991 292954 387884 446792 670366 366219 285894 186677 182950 212248
2825 212248 206279 245826 174403 254332 242027 428657 477434 521007 258533 266166 507202
2814 507202 425588 322467 343320 298437 426014 421197 458129 560536 581020 661537 427650
2803 427650 190267 473534 447021 585127 582379 610622 529752 568842 671377 630589 708821
2792 708821 570899 562267 772462 718709 662461 589279 570992 497176 527561 462835 483182
2781 483182 538417 625977 511978 421900 299815 412499 642470 725253 591230 426768
2771 426768 375944 378166 456742 363572 565480 590497 498256 563310 492085 501352 287167 248823
2759 248823 328537 491425 583800 465784 524861 553734 288406 304989 417221 459972 355283
2748 355283 347056 297796 150415 91289 237820 325093 399901 289815 330262 414584 94739
2737 94739 150208 293953 416316 362980 303713 111166 99105 168611 168272 205306 125546 179781
2725 179781 70057 -125045 14439 -19561 -23421 122994 201712 229767 350035 422347 421401
2714 421401 162547 96934 283163 205242 114790 166348 215441 270632 181381 122322 -91416
2703 -91416 -127783 30383 219393 89458 -49115 12619 18884 178278 -104140 -196589 2270
2692 2270 119040 202327 145987 13459 -150095 -3730 113675 -57920 -388157 -286681
2682 -286681 -166113 9501 -211366 -189340 -23825 92 48496 10731 -157963 -261499
2672 -261499 -163037 -113912 -218753 -96211 15980 41985 -12753 -76287 -36709 26833 -155847
2661 -155847 -138231 -206921 100170 99439 -61175 42138 95319 1916 -40777 -71368 -164171
2650 -164171 38990 200137 303388 113537 21080 -123419 28889 147424 73175 -976
2640 -976 79679 -15048 169982 68923 -134508 -156628 -148781 -53622 -73983 -126115 -33624 -77121
2628 -77121 28127 153360 53113 81080 61068 -101301 27596 46721 54094 -3495 201508
2617 201508 50058 -109579 -199500 -261558 -196183 -83671 -126193 -130535 -124339 -171382 -114159
2606 -114159 -158963 -132980 -47371 105604 47226 -69372 -314659 -243475 -311082 -105153 -28062
2595 -28062 -107914 -99928 -1834 -44290 67306 99205 -154036 -5473 174971 269448 -9378
2584 -9378 -351170 -234523 -51877 -41696 -125100 -212855 -139439 -111458 -224967 -421226 -122347
2573 -122347 -62287 -41080 64507 -22982 -106030 -243347 -46435 50522 446 52130 49512
2562 49512 102884 252182 84731 -189147 -128142 -25995 -113157 -14271 66779 181093 246444
2551 246444 -3244 -99374 -124392 -274220 -216082 -5367 -830 -143988 -110278 -317414 -230180
2540 -230180 -111154 -151703 -271871 -258343 -325515 -335054 -141975 -342264 -199536 -267175 -306379
2529 -306379 -109983 -109804 -238587 -198247 -127590 -166679 29098 54092 -98421 -335025 -364256
2518 -364256 -344060 -395343 -75172 -15766 116770 173166 178027 47167 -109137 -17106 26447
2507 26447 -34914 28686 51311 -61847 -83013 -132656 -274939 -39397 58585 -37535 -318372
2496 -318372 -441801 -252485 -139971 -12351 -126606 -132235 -66467 -68751 -89336 18723 50228
2485 50228 -41988 -108867 -60806 32339 -123030 -378075 -306927 -211805 -304592 -217936 17825
2474 17825 26217 -302691 -438718 -359254 -284542 -386309 -380152 2018 1254 -5862 -107199 -59756
2462 -59756 39 -68725 -27678 223828 47672 -14315 9833 -201588 -403575 -337313 -33867
2451 -33867 25022 -78264 -151236 -2288 23045 -45809 -192816 -241176 -56553 81445 81685
2440 81685 -93924 -248688 -217601 -253051 -263906 -130942 -61368 -95856 -99288 25252 -892
2429 -892 -115382 -212988 -217552 -169762 -220069 -241753 -127255 -36896 -95119 -67634 32872 -94874
2417 -94874 -92765 -110842 -268736 -235672 -46003 98351 137802 266500 71749 -121771 -139101
2406 -139101 -138116 -186757 -193401 -269352 -115673 -226221 -169923 -137796 21954 197447 94526
2395 94526 97107 35566 -119081 -175362 -28236 -156352 -212038 -116769 -162925 -81566 -109299
2384 -109299 -317711 -341789 -383625 -286499 -104059 -81147 -76618 104568 179585 146799 5899
2373 5899 -58347 -80864 -64012 -59911 -116815 -193031 -130347 -91073 -80936 64416 -18933 -210142
2361 -210142 -59022 102159 183079 192429 -3605 94454 -1390 62054 -52936 43418 266695
2350 266695 40214 4060 67343 -46676 -170029 -38387 -103183 33701 -91663 -260113
2340 -260113 -287166 -180061 -55559 7611 54170 -84710 -228308 -180824 -315317 -4590
2330 -4590 -177535 -285120 53176 -91159 -256525 -136469 -8948 -158334 -186411 -182132 -165332
2319 -165332 -138423 -72257 -200161 -380394 -173309 32097 18577 -90498 -166707 -137651 -139327
2308 -139327 14718 -158850 -258100 -163347 -148124 -169152 -75289 45103 -183696 -262760 -180087
2297 -180087 -239130 -50745 -67733 -156108 -215860 -86691 -202402 -96183 -6243 -219453 -223710
2286 -223710 -212164 -39400 114839 699 85870 30964 16842 -44029 -30802 -120167 -215470
2275 -215470 -33199 5649 -39778 -129354 -63444 161353 226333 282547 170329 206402 225029
2264 225029 18460 61135 44253 289367 334550 235113 142332 384266 231939 -3231 -22474
2253 -22474 -4386 -221505 -287173 -219248 -106617 42078 -38778 208087 123239 39101 28545
2242 28545 5421 -243045 -92384 78071 2122 -150220 -88038 -132133 -163618 -68616 -219196
2231 -219196 -176140 -87560 -112320 12680 125491 129852 -36683 -143743 -115140 -232966 -243354
2220 -243354 -287917 -255097 -95900 -80181 -246136 -272777 -141041 86296 -23448 35608 77801
2209 77801 -38427 -213673 -133302 -148077 43340 112927 263552 297165 97896 13949 -60196
2198 -60196 -31349 192724 159204 38022 177473 103755 -7020 28464 227850 134115 -104923
2187 -104923 -70947 -20902 -108922 27903 -247143 -206955 -164173 42331 230268 118895 -19403
2176 -19403 -50911 142937 61546 -71296 -59997 245131 235615 -359 -180736 -104126 -105261
2165 -105261 -196002 -115832 -13561 -105695 34975 127810 106520 29678 33181 244460 415935
2154 415935 321229 220738 87537 63009 -67873 -171825 -37768 116105 234916 123462
2144 123462 178904 77930 228091 332658 391738 440613 296980 374789 370917 394919 448645
2133 448645 260951 267121 211781 315426 191227 360346 344418 229044 297159 224980 45134
2122 45134 266010 452590 412919 665149 390766 206697 112752 214539 71640 193316
2112 193316 303706 349441 436982 563278 364370 163326 218157 402023 547670 368866
2102 368866 288468 328036 200648 224479 324447 176143 237800 435237 370342 558524 654293
2091 654293 764230 469813 219215 334316 475864 543854 676581 629672 847955 896755
2081 896755 809984 853565 876788 1017282 844169 807507 928782 997853 925931 1121660 1078607
2070 1078607 1056870 862109 861553 1148607 1271915 1432345 1560475 1427692 1488608 1410831 1616574
2059 1616574 1574700 1522592 1497894 1513550 1612868 1836319 1664940 1668909 1882364 1885377 1947640
2048 1947640 2017509 2318005 2456609 2298663 2573381 2708292 2826856 2720008 2763080 2947830
2038 2947830 3072060 3145584 3157387 3296623 3579378 3672330 3930035 3881293 4045424 4094337
2028 4094337 4195743 4427929 4525563 4755215 4928679 4967113 5331353 5527219 5952923 6022835
2018 6022835 6218895 6629344 7195059 7356219 7713739 7964503 8493169 8959600 9435366 10270377
2008 10270377 11376707 12392976 12928659 13552715 14868741 16651533 18519728 20969401
2000 20969401 24071289 28414886 33332732 40071422 47298316 55118970 66564088 78955447
1992 78955447 77033355 65307804 52678868 42124731 33293651 26860728 22650540 19493114
1984 19493114 17024112 15348544 13991292 12905346 12059783 11125710 10795515 10144043 9089022
1975 9089022 8248187 7459761 6688145 5959240 5527765 5346917 5153970 4955863 4617028 4551513
1965 4551513 4310703 4081490 3690264 3540146 3417834 3178841 2870359 2855038 2898958 2804645
1955 2804645 2814233 2578657 2305333 2193553 2065018 2140407 2251839 2238148 2018263 1900105
1945 1900105 1965608 1718240 1669238 1567736 1556735 1547807 1405051 1362616 1472386 1481427 1382683
1934 1382683 1497118 1347566 1260025 1164490 1207071 1306492 1315613 1191251 1092431 854122 879681
1923 879681 787648 645983 770727 873550 794641 931751 913035 991697 806550 709409 641951
1912 641951 615496 582754 738042 616138 691361 642271 651101 534841 364525 575216 511274
1901 511274 609997 600473 392784 380144 306873 215963 89821 165086 396725 410025 207783
1890 207783 385878 328399 372969 356173 278401 184376 293180 311903 260054 29526 -58517
1879 -58517 38578 -13855 20604 3106 59916 116376 44063 135784 214999 167896 442748 375944
1867 375944 291825 108933 62677 221965 173853 302511 373989 322514 119972 43598 42084
1856 42084 240393 215705 167738 73221 -290362 -125483 -169626 -2376 64697 92034 213055
1845 213055 120456 185272 346817 286548 164405 276580 356102 345436 169211 9974 101829
1834 101829 306538 247821 -124092 -145182 -24180 107284 -31895 -100882 -2067 131873
1824 131873 68162 67136 124831 225705 42035 -83253 -104390 -59505 -2479 65670 -216419
1813 -216419 -91789 102278 137153 70823 11686 14947 -59176 -87238 -187003 18519 46170
1802 46170 27363 23256 150787 249655 159424 149830 124511 -87002 -192371 -27518 59368
1791 59368 115607 16904 -139788 -158271 -43784 -69275 -151272 -170732 -127930 -137908 -45978 60576
1779 60576 -34318 151932 127426 77847 244351 87676 50402 -261338 -202180 -7071 146967
1768 146967 250422 -27143 211369 291917 205618 -203472 -154315 -75515 -298425 -286196 -164516
1757 -164516 17226 73365 83170 219254 259187 226753 109732 -3984 1995 109266 67123
1746 67123 -130378 -110939 -100573 -83046 -158190 147660 153296 10463 33462 -124039 -29521
1735 -29521 -33308 -163727 2694 -102130 -31343 172479 347277 205538 82320 183075
1725 183075 392723 390485 282369 389380 381010 190956 -126284 -73757 58926 139084 94047
1714 94047 82580 36699 -530 -145512 -238256 -117917 29066 -116458 -414396 -187719 -120361
1703 -120361 -187628 -57019 -126140 -170395 151644 -18355 -124259 -128655 -93962 -44716 -109719
1692 -109719 -3709 -121769 31684 -24718 42185 -66986 -5453 5947 -31841 -26766 -151252
1681 -151252 -155833 46394 28908 -112786 -135941 -217012 -164291 -42001 -57785 -109341 -113180
1670 -113180 -50932 -102466 -34551 167006 230908 184919 13131 22495 -42644 -60549 -9865
1659 -9865 -279712 -323756 -267251 -188602 -91191 11632 94272 72091 35008 131947 -118370
1648 -118370 -256689 -167957 -223473 -256880 -16078 239719 139074 -4318 -70062 -103267 -52568
1637 -52568 -14937 122732 -140478 -55921 109713 -107164 -95039 -60857 -196565 -67209 74140
1626 74140 112589 58354 155490 -91286 26880 -45401 -238418 -49309 7653 38435 -174601
1615 -174601 -152176 -87312 -37369 -148442 -72184 -34240 -39561 -7906 136773 -1373 13353
1604 13353 -77176 22063 -10046 -191253 -67532 -172787 -236912 -140119 -4398 10467 -68419
1593 -68419 -172054 -249716 -109632 -172088 -66913 -7706 124543 -59958 -223598 -232668 -302483
1582 -302483 -130848 -261643 -234515 -77552 -199245 -222329 -15903 -17044 -51775 -11045 -57553
1571 -57553 60326 110836 134984 -43176 92307 -30175 -193212 -203758 -121865 65341 -98711
1560 -98711 -204258 -64728 53417 198580 9760 -79623 -185133 -233008 -218531 -86592
1550 -86592 -101792 74249 -62310 -84309 -8189 -160562 -258158 -228091 -15795 119337 168958
1539 168958 67698 -179444 -36277 60776 -88891 13483 -149022 -282886 -179736 -65544
1529 -65544 -157887 -16686 30608 6807 25386 -59569 -216045 48292 132403 20370 -10113
1518 -10113 59034 29752 -94715 -145757 -118805 -201325 -225445 -111301 -140391 -272904 -71276
1507 -71276 75861 -95237 -70225 -125406 -273283 -186736 -195672 -282138 -330222 -255614 -278432
1496 -278432 -316768 -194962 -90664 -251941 -129081 -64312 18727 22342 -151098 -302783 -315477
1485 -315477 -284105 -329504 -275598 -261257 -291904 -236949 -365894 -279730 -178200 -402067 -336694
1474 -336694 -87723 -87478 -273843 -447146 -292761 -146165 -38960 -104702 -40532 -107716 -95537
1463 -95537 -3945 -121823 -70469 -66419 -82975 -49759 46899 -31016 -123349 -271581 -333690 -208831
1451 -208831 -265332 -111858 -68661 -40395 -169388 -326446 -307539 -112569 112227 98014 -101147
1440 -101147 -49764 -111534 -161602 27185 72805 41199 -195899 -66677 -104739 86372 113981
1429 113981 20999 -131615 -46412 119648 39274 54106 75642 -259609 -92470 146960 25707
1418 25707 -49230 -136089 -52052 -82055 2410 -12421 -48635 -77832 -158152 -35304 20221 -153331
1406 -153331 -139771 -89319 -240897 -144856 -93128 -60331 -102824 -110516 -273126 -419806 -272193
1395 -272193 -126270 -206417 -235321 -47156 -103796 -129166 -106040 -118841 -141214 -206955 -72125
1384 -72125 -33516 -42565 -102957 -153870 -110072 -101179 -240385 -343482 -270027 -329403 -294280 -381771
1372 -381771 -319814 -364640 -291142 -260751 -80999 -52962 -46404 39082 69757 -120992 -47030
1361 -47030 3959 -199062 49285 83618 -63574 11305 -61772 13718 -52558 103655 80862
1350 80862 -103253 -48017 16675 67559 -65252 -300921 -144004 -102684 -206974 -35779 -178500
1339 -178500 -9967 -130075 -84663 -117897 -62079 -103638 54121 -18006 -285532 -161084 156582
1328 156582 -6506 -34600 64460 48121 -704 -73754 -178 29096 14430 -55621 170013
1317 170013 129085 -46389 87088 -102777 -115927 -243180 -81764 -26248 -212783 7573
1307 7573 -24866 -135266 -183306 -51285 112406 72107 211728 64610 5991 137845 50308
1296 50308 -228907 -149636 -147598 -52351 -141921 -240445 -201760 -103110 26727 38913 -112848
1285 -112848 -33658 -2169 -767 -36716 -191284 -183429 -141437 -31384 -127576 -90863 -225755
1274 -225755 -66415 -123724 -129239 -134612 -83920 -6247 137506 317508 62510 -124508 31439
1263 31439 -39911 40648 -13445 -109419 -131614 -152285 3814 117560 21209 118798 22997
1252 22997 -46949 -81207 -54914 -91171 -15444 -157375 -176772 8560 -49076 -116209 -98719
1241 -98719 39315 54654 54859 -71029 -131572 31489 -126590 -42051 238186 117856 -64943
1230 -64943 30360 100581 98316 487 5905 30216 145937 27659 113531 99806 -32795 -138576
1218 -138576 -15774 -141472 -120674 9644 -107414 -181912 -62386 -132079 -195734 -58413
1208 -58413 -34979 46741 -59674 147880 227358 35242 66065 1966 -177368 -324272 -223918
1197 -223918 -149146 -127264 -49676 -104931 -149674 -122918 -124829 -245006 -168207 -283033 -249441
1186 -249441 -103284 -220540 -297822 -114503 -135489 -235006 -75108 -73474 -165443 -222814 -202148
1175 -202148 -114891 -280167 -137693 -25195 -51863 -106526 32130 154157 74536 120276 28051
1164 28051 82378 131476 -136702 -207756 -206222 -151484 -269731 -21130 160331 -46542 -4631
1153 -4631 44937 -249673 -330047 -193516 54060 86279 77858 14191 -145042 -113888 -118861 -52292
1141 -52292 76422 -20426 -267105 -19659 288315 1793 19682 94494 200843 55868
1131 55868 -29693 -147852 -236268 -392742 -87441 18435 -139525 -108824 -124147 -67308 19137
1120 19137 48245 192721 44055 -35499 -26861 -101307 -188370 -98509 -71840 -141501 -28767
1109 -28767 -186851 -329406 -168103 -2226 93014 -44939 -154825 -257704 -199106 -41917
1099 -41917 137203 100773 -46449 -120391 -39675 97777 151344 118562 53075 96442 -10861
1088 -10861 49457 10705 -168176 -58128 89975 -46555 -5045 -1738 137681 56858 -30604
1077 -30604 -138006 -258489 -377078 -134023 -106577 -207206 -202478 48370 41040 62309 197524
1066 197524 130861 -139717 -27983 -18058 -83495 45723 124936 -88872 -110626 -30011 -35928
1055 -35928 -52603 -58257 -246478 -286165 -168122 -32658 25242 137311 42557 86668 192652
1044 192652 -30594 96935 145681 122299 74204 25270 -29874 9847 65234 74647 116149
1033 116149 -17814 -74856 143010 222878 92144 222128 107995 -46717 59148 -11157
1023 -11157 -80159 221868 54570 137358 132890 93153 192264 -9594 -75766 40943 22832
1012 22832 -29661 86309 66717 -112383 -304636 -205199 -170256 -240264 -82846 -6515 -70740
1001 -70740 -41554 16476 79267 -84235 -124545 -4811 144154 -22873 -58079 171375 -24107
990 -24107 -301088 -179175 -185863 -282491 24200 68584 -157076 -5648 183269 391133 219098
979 219098 -78606 -14754 65880 -105324 -140567 -243617 -129820 102198 -102584 -25787 101494
968 101494 -710 191798 149332 25848 -9668 -58838 -91917 -73366 -60787 -32771 39214
957 39214 25073 -82690 85637 141920 45432 126822 268276 71463 117195 84726 -21524
946 -21524 76853 -39978 -72020 -21780 -120868 17198 -52015 -147524 139690 231662 172186
935 172186 47889 -113922 57859 49457 -39098 83007 77655 -207730 -311160 -300959 -374826
924 -374826 -175046 -53611 -21120 -126554 -109768 80901 59858 -42474 -84764 -7588 60008
913 60008 144205 46065 77173 208359 -126604 -11905 262410 139131 153308 103657 -19592
902 -19592 40552 -82594 27795 -41839 -180782 -74785 -71157 18440 65368 -105102 -70482
891 -70482 -86522 -193337 73793 61935 90412 28989 70950 -220998 35714 -12294 -20846
880 -20846 150550 51849 -41412 -193780 -184009 -215188 -81585 102119 110684 325663 118158
869 118158 214438 166541 -90873 18709 -56253 -147692 -229090 -43886 -48554 -78895 -40073
858 -40073 42078 -117473 -13564 -139256 -96361 11004 41418 -124373 -46477 -45048 -255776
847 -255776 -350183 -154523 -155316 -251581 -161788 -32705 5433 -24384 83863 66773 1650 52405
835 52405 99966 239014 42450 21313 -27674 37519 -46668 -102782 -163399 -322024 -346789
824 -346789 -139754 101723 195608 200956 248020 186507 37722 -55806 -89795 -51186 -102239
813 -102239 -5250 158740 65899 47939 -86179 243 62174 53789 -19961 -40967 167791
802 167791 71768 173905 275875 -14197 -45810 -149377 96728 191457 -43343 -27020 15605
791 15605 233335 285153 -35220 9332 -20950 -239770 -298402 -19506 117929 86905 82924
780 82924 -146312 -52803 111597 -115909 -207067 -37337 72509 22415 -6105 58347 -39935
769 -39935 112795 108418 108002 82639 58663 109104 45540 -42178 74344 -86177 -92361 -83074
757 -83074 -105287 -122415 -75237 -231408 -245804 -97317 -51372 -29049 104817 164113 262822
746 262822 90687 -177914 -133783 -225422 -99020 -158 -210409 -109623 65304 58164 -77986
735 -77986 -98167 -147029 142400 -11478 30335 309652 208873 90760 31733 -175922 -120415
724 -120415 -151228 -167633 -220755 -39856 -137471 -495318 -273927 83619 -83679 17315 181166
713 181166 214047 207400 75039 57905 119686 -62046 -144391 -3221 94490 83415 146795
702 146795 99539 15830 -50629 -206869 -218133 -252753 -142295 -100546 155743 328765 290805
691 290805 -109860 -128227 -20130 -20486 52514 197665 124167 40650 -92117 -16551 46599
680 46599 -148962 198208 263723 237446 228970 77891 -51805 -99903 -44979 75908 162852
669 162852 90030 99625 205695 99614 153140 250753 176643 222475 49265 79846 -8809
658 -8809 -15243 -123751 -22382 26850 122093 128947 106859 -116457 7926 1956 -37747 170165
646 170165 46408 113690 186022 30216 112619 70233 -33531 191257 38998 -92604 -18029
635 -18029 14346 98151 60177 54814 224016 134679 113159 125613 158266 298875 101722 -106471
623 -106471 -22859 261848 129547 -61697 48097 151536 164353 432795 75727 -19365
613 -19365 96966 178952 149665 13078 114604 149629 137733 -77112 74044 97289 -113984
602 -113984 -73125 71669 196504 15849 -82743 -51687 -125150 -28801 21875 -41119 -13958
591 -13958 5693 294092 177275 42664 236541 221745 136621 -38272 -233788 -150077 -106725
580 -106725 -34771 18189 -4823 -21102 35877 114148 -3458 18507 207943 262392 71374
569 71374 41479 60113 98752 155879 121397 -62298 -28478 104329 204629 170330 208977
558 208977 136285 113643 -28018 209330 50730 -133936 -33155 73847 224589 257878
548 257878 243459 260227 114537 39083 -93467 85937 120438 -18197 -16684 152895 234742
537 234742 29100 90033 146909 110717 -129098 -80498 -121454 49469 156589 133394 209979
526 209979 141270 183832 -51472 -10900 -41032 -130721 -78457 77886 158341 157055 -19440
515 -19440 33272 -75538 -244031 -86667 120984 180696 37469 28481 -26049 182386 328711
504 328711 251748 131671 -21034 69034 43180 -5207 29181 104835 169142 173612 199148 145635
492 145635 104041 -44213 157804 33318 -136523 136143 352857 229168 219527 167820 89146
481 89146 4216 33475 178789 145046 -19297 1897 208614 148836 182886 209813 57363
470 57363 -66561 133549 147882 129380 44087 45237 78730 32043 -46242 -93548 19872 207611
458 207611 13312 231094 175208 190412 71483 39445 168475 100557 7782 -1753 21219
447 21219 64038 75262 -13276 -54572 -283430 -206690 -113986 89548 -4683 141399 -23788
436 -23788 67554 140769 63694 -31354 48838 50411 -71305 -171967 -119989 -9234 91054
425 91054 -99650 36005 157138 246955 54366 24745 72082 160725 320489 357019 291938
414 291938 329010 181370 176829 26148 -110358 -133428 -284167 -17779 102253 159717 38609
403 38609 125099 79886 -64896 6539 123102 -115428 47370 -17786 -137243 88205 69949
392 69949 2803 15210 -200442 -26840 89592 -8707 6179 -14595 3250 -6263 -42622 346
380 346 124700 37881 -108062 -110534 9614 64195 175863 224815 134422 145430 122649 -78277
368 -78277 -116320 19752 184528 194557 176899 144695 38742 164671 184768 45026 31843
357 31843 37996 90646 -37697 -1424 283683 365477 129014 126711 228839 -61945 -268549
346 -268549 -194285 -152125 -22887 -250372 -313244 -190704 -183358 -193751 -86295 -39081 -532
335 -532 -37996 103902 97549 82878 123208 -122572 12808 -52632 -8241 -88043 130634 162389
323 162389 83742 136418 155065 120634 47421 -51610 -24370 76327 28180 -203880 -378450
312 -378450 -270322 -38469 -25568 -117068 -129677 -15472 36032 82045 81943 -54706 -83306
301 -83306 -167156 -66644 -51822 63919 204213 38048 -103925 38152 193839 244811 245389
290 245389 37494 98245 164325 210645 -103834 -107145 -102108 29480 140512 104948 -140277
279 -140277 31241 305824 236996 62913 152637 285671 238316 207104 251391 75656 26220
268 26220 177931 200131 45284 -43249 158943 135063 153810 119829 52450 3325 -55235
257 -55235 -121003 -183646 -132917 -231239 60442 105111 -54005 157384 181636 213058 -54810
246 -54810 -97271 -123320 14962 29551 94474 -18156 113736 171948 258561 121131 -25328
235 -25328 28652 -39726 4105 205901 304872 61768 26098 -55721 -112651 67708 92248
224 92248 132204 -44383 16354 54639 -46397 -70071 -97702 -5104 248539 207588 -80738
213 -80738 -56196 -201497 -16308 73824 40068 91612 -39897 166490 169182 27741 114327
202 114327 103196 181937 215711 -2852 43095 128782 75727 -29039 31451 -19941 65169
191 65169 57424 -16070 118828 251848 92219 -97758 -31662 -20075 -41301 -242251 -194655
180 -194655 18688 -59216 -80947 -180715 73899 117054 52737 39289 -18570 -119714 -74617
169 -74617 78301 157223 114901 32795 12916 46193 168335 76335 21355 94520 27661 -27165
157 -27165 226019 32433 150985 163655 165416 174204 222230 249380 229858 149582 194636 342031
145 342031 221229 87550 1296 169497 213310 129536 82515 241795 287623 122969 171270
134 171270 165521 68746 37170 10399 -106557 -112900 29724 74125 -26608 -669 84404 -30090
122 -30090 30626 120200 35790 42900 49647 -57167 -115457 -28046 52085 107365 144745 29019
110 29019 -60584 66705 92900 12130 -75624 25777 -74116 -11253 148831 221109 116810
99 116810 -4739 -106217 -38241 45170 -51587 90649 212065 195561 221032 178744 156615
88 156615 88615 32193 31250 -64357 -841 111599 23301 23580 244957 180370 76198 -1849
76 -1849 154516 135024 35001 77332 42669 38174 43919 159271 198573 139635 143734 175657
64 175657 11162 -37380 87249 9186 19264 155538 -5203 95509 101035 27502 60608
53 60608 262340 315360 264402 106837 26557 -193961 -155619 42401 150202 90498 -12149
42 -12149 200917 180525 220561 133617 162074 33353 24240 103609 81944 9072 99214 175001
30 175001 165121 111834 176620 191084 113097 27318 18244 120230 919 128646 126446 32692
18 32692 14688 88754 122865 -30462 -22545 212761 156545 72684 40612 26845 155358 81983
6 81983 45867 57542 7031 32632 115482 308739
0 308739
$$ Imaginary data points
##PAGE= N=2
##DATA TABLE= (X++(I..I)), XYDATA
16383 -840211 -850993 -728558 -628541 -667747 -594134 -585077 -740616 -889281 -829668 -771458 -650590
16372 -650590 -582586 -528170 -518669 -583274 -594657 -610800 -661630 -726810 -537731 -368441 -391846
16361 -391846 -295410 -447136 -571115 -526090 -570865 -552702 -398385 -397855 -463386 -438808 -315678
16350 -315678 -291994 -325075 -268122 -224378 -183059 -346746 -263280 -376903 -308336 -209418 -271054
16339 -271054 -255717 -231889 -230370 -95344 -107537 21876 -84236 -45620 4602 -33228 35752
16328 35752 -23394 -105348 -4995 174494 -27106 68710 42843 -19653 188600 126602 118028
16317 118028 137091 237254 261032 325075 290312 120079 165301 259158 319560 214709 209896
16306 209896 131764 301603 402888 236459 338900 181610 216579 231489 203882 181606
16296 181606 147305 123191 158452 149840 291054 341325 308180 315913 441514 622163 626786
16285 626786 542316 516020 404868 535249 555359 462105 492779 496707 445147 588250 672143
16274 672143 582875 442729 528198 644413 629108 605804 480381 578310 681913 675994 709212
16263 709212 785167 880226 928897 889416 818455 748180 707349 694904 523937 420480 556047
16252 556047 687389 702877 616332 580029 664187 819402 733085 773975 880966 820667 616231
16241 616231 866269 873992 866920 1088102 1147872 972976 1078868 982058 1043084 1061364 1117187
16230 1117187 1129178 1013766 1077882 1117244 1063043 1022430 1045327 1143506 1083919 1019613 945504
16219 945504 1032354 1001103 915450 901332 1097318 1000632 1089676 1005951 1085555 1071337 856315
16208 856315 884012 937859 1096117 986681 1214305 1387016 1281019 1049152 1022237 1157630
16198 1157630 1218768 1050401 1202937 1261788 1290806 1232239 1145988 1022869 1168272 1304700
16188 1304700 1361827 1276651 1448245 1547070 1502118 1536398 1554994 1487372 1185511 1120346 1295626
16177 1295626 1250355 1455574 1506021 1617960 1362942 1346104 1555126 1424656 1357170 1170248
16167 1170248 1263726 1336644 1379421 1310340 1318151 1294221 1238392 1280444 1419858 1470982 1489153
16156 1489153 1381857 1406718 1300350 1233807 1416250 1371028 1369746 1415982 1380185 1394101 1169243
16145 1169243 1319932 1396851 1504769 1458990 1361515 1551857 1372333 1347836 1240719 1284299
16135 1284299 1472522 1556301 1580270 1492614 1443377 1558837 1671306 1524586 1590874 1619725
16125 1619725 1498143 1331703 1409454 1357725 1502781 1621448 1567259 1671867 1575313 1549840
16115 1549840 1469288 1438886 1367519 1439969 1380044 1548746 1520686 1374782 1528724 1550744 1470600
16104 1470600 1570948 1652805 1579761 1675158 1498070 1423528 1401987 1335184 1734451 1638218 1576231
16093 1576231 1565822 1492143 1675711 1568729 1539183 1516737 1367190 1412720 1330517 1482168
16083 1482168 1549938 1562874 1670861 1484140 1361422 1376892 1561990 1596651 1522204 1407077
16073 1407077 1479389 1343401 1441588 1611499 1473232 1312957 1506810 1456538 1464005 1607086
16063 1607086 1617928 1539974 1534550 1683959 1584644 1538954 1383698 1366203 1444236 1505297 1556204
16052 1556204 1425318 1209687 1370158 1488329 1573160 1587699 1582083 1649012 1683119 1461926
16042 1461926 1415259 1517116 1490620 1440534 1423948 1465466 1467362 1295653 1286224 1281249 1393880
16031 1393880 1379496 1417274 1349817 1378743 1608673 1588405 1506187 1566140 1645787 1734349 1634201
16020 1634201 1687789 1678889 1510027 1499375 1677408 1762294 1378959 1480950 1612886 1523797
16010 1523797 1310670 1472698 1598547 1440312 1516732 1567839 1544978 1467780 1478876 1545849
16000 1545849 1677781 1650323 1582128 1702451 1565296 1458774 1325864 1491153 1440497 1251952
15990 1251952 1510297 1555885 1361413 1404337 1401266 1561108 1637108 1500253 1491222 1549166 1714350
15979 1714350 1754230 1681657 1470464 1552595 1545487 1449870 1585182 1654286 1464926 1377017 1310728
15968 1310728 1056293 1177726 1441024 1638707 1584626 1649888 1540528 1533335 1344217 1451814
15958 1451814 1428491 1411285 1315823 1484515 1530143 1459848 1542735 1457669 1385130 1418076 1621925
15947 1621925 1654724 1624558 1560793 1756141 1725494 1542618 1352987 1429843 1420491 1411784 1599012
15936 1599012 1532848 1682097 1715224 1644535 1462014 1340317 1426763 1509572 1414377 1449427 1452845
15925 1452845 1370937 1291014 1083071 1254026 1410524 1457158 1726935 1812647 1581115 1475474
15915 1475474 1558957 1783841 1806508 1743061 1701753 1690328 1697911 1663495 1557901 1587032 1538315
15904 1538315 1652902 1681161 1725762 1622564 1642154 1710473 1656200 1489275 1713997 1602366
15894 1602366 1505115 1621606 1691020 1572771 1434485 1265344 1642171 1531829 1736691 1904477
15884 1904477 1771257 1622371 1419219 1382069 1642656 1470351 1259092 1529524 1561623 1750759
15874 1750759 1467308 1284332 1174295 1400575 1503694 1616095 1721968 1739716 1435894 1521072
15864 1521072 1566178 1674221 1635634 1595873 1591561 1490369 1289209 1474882 1458987 1569637
15854 1569637 1774863 1843209 1866837 1679217 1539875 1375209 1355411 1497437 1535405 1379549
15844 1379549 1516217 1520486 1512976 1427025 1541309 1665855 1514780 1382390 1594253 1564417
15834 1564417 1523261 1556866 1406121 1670821 1706984 1366614 1293963 1653485 1691429 1679179
15824 1679179 1499401 1606089 1747632 1548358 1579952 1649436 1687340 1456175 1404751 1535806
15814 1535806 1737684 1617363 1393844 1267101 1537777 1343085 1333794 1497849 1579267 1697869
15804 1697869 1529420 1533137 1718058 1543553 1514550 1590662 1762042 1875871 1763621 1694120
15794 1694120 1669008 1695678 1508847 1422350 1663866 1631835 1389285 1360725 1549252 1560265
15784 1560265 1555654 1656331 1580863 1505568 1335805 1392759 1513867 1653991 1784531 1715749
15774 1715749 1299548 1278872 1372427 1675011 1745233 1933587 1716659 1724450 1672876 1624692 1802789
15763 1802789 1796636 1614095 1610299 1534221 1585326 1547150 1601021 1683666 1441402 1359015 1363517
15752 1363517 1407080 1457316 1485316 1537287 1780238 1794002 1717395 1594267 1585587 1520691 1537801
15741 1537801 1537008 1659092 1666808 1535985 1634407 1546715 1500947 1622570 1560678 1600659 1584114
15730 1584114 1509975 1444496 1664393 1567165 1443849 1448844 1511157 1628182 1487379 1421640 1224715
15719 1224715 1309391 1772088 1804412 1635530 1657782 1659372 1554635 1685769 1716194 1673451 1466926
15708 1466926 1484782 1510572 1347961 1554657 1599333 1544161 1481097 1361223 1436981 1508934 1711577
15697 1711577 1730111 1507106 1301867 1469568 1725627 1729755 1694611 1728357 1716870 1450621
15687 1450621 1649087 1633663 1467827 1589496 1498179 1501287 1614793 1554218 1591662 1418177
15677 1418177 1314395 1552709 1523027 1512844 1619267 1632105 1520895 1679366 1498758 1502082
15667 1502082 1616666 1607846 1458825 1513077 1508538 1331937 1430394 1522971 1512730 1575282 1572622
15656 1572622 1514964 1417939 1486085 1675537 1689724 1837018 1643211 1302522 1341462 1285649
15646 1285649 1460041 1710202 1788594 1686232 1711034 1674562 1707988 1669863 1456099 1764374
15636 1764374 1707387 1548158 1377560 1489212 1555981 1492944 1548942 1703638 1702284 1883081
15626 1883081 1743407 1675339 1642892 1672807 1763313 1511021 1599677 1658920 1609719 1827956 1861251
15615 1861251 1834370 1612636 1448915 1387041 1361944 1464021 1458692 1501706 1591149 1651624 1631922
15604 1631922 1559727 1485415 1567807 1589915 1620070 1525926 1443566 1450410 1423646 1564021 1451898
15593 1451898 1516144 1541786 1596955 1641541 1756257 1737562 1536321 1525057 1519083 1576478 1592894
15582 1592894 1685978 1741008 1636907 1409837 1381012 1409423 1477800 1710123 1559906 1492295
15572 1492295 1604592 1575302 1413948 1483763 1625573 1523204 1634773 1490745 1445587 1515414
15562 1515414 1650013 1726322 1684000 1552364 1769819 1638316 1451578 1401335 1296822 1495103
15552 1495103 1577391 1516263 1408017 1194293 1388186 1412615 1347714 1450823 1847130 1985223
15542 1985223 1778514 1628934 1503438 1609768 1584303 1611399 1473238 1666717 1904406 1910244
15532 1910244 1656590 1513717 1455812 1466870 1508037 1639677 1693253 1497732 1657407 1412888
15522 1412888 1567359 1724172 1867452 1953691 1859263 1754357 1608280 1669357 1557795 1708026
15512 1708026 1664438 1604997 1546777 1792404 1870914 1686178 1845315 1581105 1559079 1518306
15502 1518306 1564361 1557573 1474822 1575930 1568717 1527731 1518772 1678789 1590748 1579829 1584704 1737121
15490 1737121 1639248 1707195 1639799 1532505 1672019 1580566 1523943 1743124 1650460 1647440 1675913
15479 1675913 1792950 1720758 1665771 1687927 1452874 1429432 1517376 1618617 1737954 1732162 1679970
15468 1679970 1622518 1753646 1639449 1667457 1728973 1636167 1603077 1463835 1649587 1484437
15458 1484437 1468198 1507380 1556007 1591747 1578457 1518410 1618933 1476795 1374223 1497540
15448 1497540 1619976 1894142 1698399 1499337 1407230 1528661 1718366 1604674 1633817 1802199
15438 1802199 1640473 1782598 1653286 1511762 1696075 1660543 1679224 1805762 1810610 1769989
15428 1769989 1764988 1579283 1684323 1865972 1816791 1743880 1553082 1329105 1482076 1404252
$$ [...]
##END NTUPLES=NMR SPECTRUM
##END=
