##TITLE=1H_EC-2693(III)
 DMSO, 8 sc, 
 6.2.2019
##JCAMPDX= 6.0         $$ Bruker NMR JCAMP-DX V2.0
##DATA TYPE= NMR FID
##DATA CLASS= NTUPLES
##ORIGIN= UXNMR, Bruker Analytische Messtechnik GmbH
##OWNER= root
$$ XWIN-NMR		Version 3.5
$$ Wed Feb  6 14:25:52 2019 Russian Standard Time (UT+4h)  she@DPX200
##.OBSERVE FREQUENCY= 200.1313
##.OBSERVE NUCLEUS= ^1H
##.DELAY= (6, 6)
##.ACQUISITION MODE= SIMULTANEOUS
##.ACQUISITION SCHEME= undefined
##.AVERAGES= 8
##.DIGITISER RES= 18
##SPECTROMETER/DATA SYSTEM= spect
##.PULSE SEQUENCE= zg30
##.SOLVENT NAME= DMSO
##.SHIFT REFERENCE= (INTERNAL, DMSO, 0, 15.7039)
##AUDIT TRAIL= $$ (NUMBER, WHEN, WHO, WHERE, WHAT)
$$ ##TITLE= Audit trail, XWIN-NMR		Version 3.5
$$ ##JCAMPDX= 5.01
$$ ##ORIGIN= Bruker BioSpin GmbH
$$ ##OWNER= she
$$ F:/spectra/data/she/nmr/H-F/1/audita.txt
$$ ##AUDIT TRAIL=  $$ (NUMBER, WHEN, WHO, WHERE, WHAT)
(   1,<2019-02-06 14:24:40.90 +0400>,<she>,<DPX200>,
      <created by zg, POWCHK disabled, PULCHK disabled
       configuration hash MD5:
       00 E9 B6 7A A2 85 ED C7 34 08 36 98 17 FE 4E 26
       data hash MD5: 16K
       3C 30 68 AE DD C4 9D 11 7A 05 91 E3 2F 8C 29 55>)
$$ ##END=
$$ 
$$ hash MD5
$$ 6E 29 53 50 D6 9B DF D1 83 05 07 1C B1 A7 BD FF
##$RELAX= 
##$RELAX= 
##$RELAX= 
##$RELAX= 
##$RELAX= 
##$RELAX= 
$$ Bruker specific parameters
$$ --------------------------
##$DU= <F:/spectra>
##$EXPNO= 1
##$NAME= <H-F>
##$PROCNO= 1
##$TYPE= <nmr>
##$USER= <she>
##$AMP= (0..31)
100 100 100 100 100 100 100 100 100 100 100 100 100 100 100 100 100 100 
100 100 100 100 100 100 100 100 100 100 100 100 100 100 
##$AQSEQ= 0
##$AQ_mod= 1
##$AUNM= <au_zg>
##$AUTOPOS= <>
##$BF1= 200.13
##$BF2= 200.13
##$BF3= 200.13
##$BF4= 200.13
##$BF5= 200.13
##$BF6= 200.13
##$BF7= 200.13
##$BF8= 200.13
##$BYTORDA= 1
##$CFDGTYP= 0
##$CFRGTYP= 5
##$CHEMSTR= <none>
##$CNST= (0..31)
1 1 145 1 1 1 1 1 1 1 1 1 1 1 1 1 1 1 1 1 1 1 1 1 1 1 1 1 1 1 1 1 
##$CPDPRG= <>
##$CPDPRG1= <>
##$CPDPRG2= <>
##$CPDPRG3= <>
##$CPDPRG4= <mlev>
##$CPDPRG5= <mlev>
##$CPDPRG6= <mlev>
##$CPDPRG7= <mlev>
##$CPDPRG8= <mlev>
##$CPDPRGB= <>
##$CPDPRGT= <>
##$D= (0..31)
0 1.2 0 0 0 0 0 0 0 0 0 0.03 0 0 0 0 0 0 0 0 0 0 0 0 0 0 0 0 0 0 0 0 
##$DATE= 1549448680
##$DBL= (0..7)
120 120 120 120 120 120 120 120 
##$DBP= (0..7)
150 150 150 150 150 150 150 150 
##$DBP07= 0
##$DBPNAM0= <>
##$DBPNAM1= <>
##$DBPNAM2= <>
##$DBPNAM3= <>
##$DBPNAM4= <>
##$DBPNAM5= <>
##$DBPNAM6= <>
##$DBPNAM7= <>
##$DBPOAL= (0..7)
0.5 0.5 0.5 0.5 0.5 0.5 0.5 0.5 
##$DBPOFFS= (0..7)
0 0 0 0 0 0 0 0 
##$DE= 6
##$DECBNUC= <off>
##$DECIM= 32
##$DECNUC= <off>
##$DECSTAT= 4
##$DIGMOD= 1
##$DIGTYP= 9
##$DL= (0..7)
0 120 120 120 120 120 120 120 
##$DP= (0..7)
150 150 150 150 150 150 150 150 
##$DP07= 0
##$DPNAME0= <>
##$DPNAME1= <>
##$DPNAME2= <>
##$DPNAME3= <>
##$DPNAME4= <>
##$DPNAME5= <>
##$DPNAME6= <>
##$DPNAME7= <>
##$DPOAL= (0..7)
0.5 0.5 0.5 0.5 0.5 0.5 0.5 0.5 
##$DPOFFS= (0..7)
0 0 0 0 0 0 0 0 
##$DQDMODE= 0
##$DR= 18
##$DS= 0
##$DSLIST= <SSSSSSSSSSSSSSS>
##$DSPFIRM= 0
$$ [...]
##$SUBNAM2= <"">
##$SUBNAM3= <"">
##$SUBNAM4= <"">
##$SUBNAM5= <"">
##$SUBNAM6= <"">
##$SUBNAM7= <"">
##$SUBNAM8= <"">
##$SUBNAM9= <"">
##$SW= 20.0189088683792
##$SWIBOX= (0..15)
0 0 2 0 0 0 0 0 0 0 0 0 0 0 0 0 
##$SW_h= 4006.41025641026
##$TD= 16384
##$TD0= 1
##$TE= 0
##$TE2= 300
##$TE3= 300
##$TEG= 300
##$TL= (0..7)
0 120 120 120 120 120 120 120 
##$TP= (0..7)
150 150 150 150 150 150 150 150 
##$TP07= 0
##$TPNAME0= <>
##$TPNAME1= <>
##$TPNAME2= <>
##$TPNAME3= <>
##$TPNAME4= <>
##$TPNAME5= <>
##$TPNAME6= <>
##$TPNAME7= <>
##$TPOAL= (0..7)
0.5 0.5 0.5 0.5 0.5 0.5 0.5 0.5 
##$TPOFFS= (0..7)
0 0 0 0 0 0 0 0 
##$TUNHIN= 0
##$TUNHOUT= 0
##$TUNXOUT= 0
##$USERA1= <user>
##$USERA2= <user>
##$USERA3= <user>
##$USERA4= <user>
##$USERA5= <user>
##$V9= 5
##$VALIST= <valist>
##$VCLIST= <CCCCCCCCCCCCCCC>
##$VD= 0
##$VDLIST= <DDDDDDDDDDDDDDD>
##$VPLIST= <PPPPPPPPPPPPPPP>
##$VTLIST= <TTTTTTTTTTTTTTT>
##$WBST= 1024
##$WBSW= 4
##$XGAIN= (0..3)
0 0 0 0 
##$XL= 0
##$YL= 0
##$YMAX_a= 278998
##$YMIN_a= -276393
##$ZGOPTNS= <>
##$ZL1= 120
##$ZL2= 120
##$ZL3= 120
##$ZL4= 120
##$ABSF1= 10
##$ABSF2= 0
##$ABSG= 5
##$ABSL= 3
##$ALPHA= 0
##$AQORDER= 0
##$ASSFAC= 0
##$ASSFACI= 0
##$ASSFACX= 0
##$ASSWID= 0
##$AUNMP= <proc_1d>
##$AZFE= 0.1
##$AZFW= 0.1
##$BCFW= 1
##$BC_mod= 2
##$BYTORDP= 1
##$COROFFS= 0
##$CY= 11.3945322036743
##$DATMOD= 1
##$DC= 2
##$DFILT= <>
##$DTYPP= 0
##$F1P= 18.9103706918063
##$F2P= -1.10871071338519
##$FCOR= 0.5
##$FTSIZE= 0
##$FT_mod= 4
##$GAMMA= 1
##$GB= 0.15
##$INTBC= 1
##$INTSCL= 1
##$ISEN= 128
##$LB= 0.24
##$LEV0= 0
##$LPBIN= 0
##$MAXI= 10000
##$MC2= 0
##$MEAN= 0
##$ME_mod= 0
##$MI= 1.114404
##$NCOEF= 0
##$NC_proc= 0
##$NLEV= 6
##$NOISF1= 3.799351
##$NOISF2= 2.8
##$NSP= 1
##$NTH_PI= 0
##$NZP= 0
##$OFFSET= 15.70392
##$PC= 1
##$PHC0= -9039.591
##$PHC1= 9.400042
##$PH_mod= 1
##$PKNL= yes
##$PPARMOD= 0
##$PSCAL= 0
##$PSIGN= 0
##$REVERSE= no
##$SF= 200.130013532006
##$SI= 16384
##$SIGF1= 3
##$SIGF2= 2
##$SINO= 400
##$SIOLD= 16384
##$SREGLST= <1H.CDCl3>
##$SSB= 0
##$STSI= 0
##$STSR= 0
##$SW_p= 3612.71676300578
##$SYMM= 0
##$S_DEV= 0
##$TDeff= 0
##$TDoff= 0
##$TI= <>
##$TILT= no
##$TM1= 0
##$TM2= 0
##$TOPLEV= 0
##$USERP1= <user>
##$USERP2= <user>
##$USERP3= <user>
##$USERP4= <user>
##$USERP5= <user>
##$WDW= 1
##$XDIM= 8192
##$YMAX_p= 0
##$YMIN_p= 0
$$ End of Bruker specific parameters
$$ ---------------------------------
##NTUPLES= NMR FID
##VAR_NAME=  TIME,          FID/REAL,        FID/IMAG
##SYMBOL=    X,             R,               I
##VAR_TYPE=  INDEPENDENT,   DEPENDENT,       DEPENDENT
##VAR_FORM=  AFFN,          ASDF,            ASDF
##VAR_DIM=   8192,          8192,            8192
##UNITS=     SECONDS,       ARBITRARY UNITS, ARBITRARY UNITS
##FACTOR=    0.0002496,     1,               1
##FIRST=     0,             0,               0
##LAST=      2.0444736,     0,               0
##MIN=       0,             -276393,         0
##MAX=       2.0444736,     278998,          0
$$ Real data points
##PAGE= N=1
##DATA TABLE= (X++(R..R)), XYDATA
$$ [...]
1801a96L21k02l75j14M05M37k34k61n4O89M86n60j56Q2K31Qj96k41O4M8K88l88
$$ -196 125 -77 -452 -566 -161 276 42 -219 -273 416 902 342 186 268 499 507 311 70 134 182 470 82
1823H2l78R6L49Q2k90o10N25R8L70p16j21M29M76l13k55L8K54J44k55j04Q6J30
$$ 82 -296 -200 149 231 -59 -669 -144 -46 324 -392 -513 -84 392 79 -176 -138 116 260 5 -99 -13 117
1845A17k9j18m66J09K57J67k22M2l98K56L45o58J60n4L70K01j71k04LO20L13m35
$$ 117 88 -30 -496 -387 -130 37 -185 -143 -541 -285 60 -598 -438 -492 -122 79 -92 -296 -293 327 640 205
1867B05l71M82J47m0l93p1R9K85J72n78k91M06R8jj02l94L07L43j45l90JK82M05
$$ 205 -166 316 463 423 30 -41 58 343 515 -63 -354 52 150 149 47 -347 -40 303 158 -232 -231 51 456
1890D56l24k08K9L56k8j37o7l31O55k3k76m59K36L01k1j16n30J74q3L66q8j34
$$ 456 132 -76 -47 309 281 144 77 -254 401 378 102 -357 -121 180 159 43 -487 -313 -396 -30 -118 -252
1912b52L54j20L41m04j88J97L50J24m16q4O5L27M6l59k32K06K19L17m91m35J72
$$ -252 102 -18 323 -81 -269 -72 278 402 -14 -98 -33 294 340 -19 -251 -45 174 491 0 -435 -263
1933b63P6M46m67J15M8L00K13o33j31L76j74L24o24K12M08J40l04j10k36L13J63
$$ -263 -187 259 -208 -93 -45 255 468 -165 -296 80 -94 230 -394 -182 226 366 62 -48 -284 29 192
1954A92m8j54k19K59nJ46l32j88N45m9M3l09j43L72J53q7L2l49J66L68j80k46
$$ 192 144 -10 -229 30 25 171 -161 -349 196 147 190 -119 -262 110 263 176 208 -141 25 393 213 -33
1976c3k40M00kR3n20J94p7M55l52k4Q1k6J9j35j55J90M7R9l37L47J29J3J10l84
$$ -33 -273 127 125 218 -302 -108 -185 270 -82 -106 -25 -51 -32 -167 -322 -132 -85 14 -323 24 153 166 276 -108
2000a08j89L53J23k0j44K4p8J51O0k19O4j15J24j39j54K72j22K59r3j04k22L4
$$ -108 -297 56 179 159 15 39 -39 112 172 -47 17 -98 26 -113 -267 5 -117 142 49 -55 -277 -243
2022b43L19l26K42jj9J20M3p5R2Q1j12j76P6J82pl40O0j83J31J26N1K4j54j95
$$ -243 76 -250 -8 -9 -28 92 135 60 152 233 121 -55 21 203 196 -144 -84 -267 -136 -10 41 65 -89 -284
2046b84K14J34o8m8K5O2K58l54R6l0n9J00K30k52j4l4L8J34j08P6j83m0j79K28
$$ -284 -70 64 -4 -52 -27 35 293 -61 35 5 -54 46 276 24 10 -24 14 148 40 116 -67 -107 -286 -58
2070e8K32j8P1l30k13M05j02K3J8k45M12j06p6J39j23N3K3k88J40rM22n01N4o
$$ -58 174 156 227 -103 -316 89 -13 10 28 -217 195 89 13 152 29 82 105 -183 -43 -52 370 -131 -77 -83
2094h3J78l07L23J83m48L62k08J72l44j74M73o5j10m5j20K1M5K56k54j87L93l6
$$ -83 95 -212 111 294 -154 208 0 172 -172 -346 127 62 -48 -93 -213 -192 -147 109 -145 -332 61 25
2116B5j57j40M38m77O07n35K30J09J14k25j72M9K8K05j62J36j12r0K46oJ69m32
$$ 25 -132 -272 166 -311 296 -239 -9 100 214 -11 -183 -134 -106 99 -63 73 -39 -129 117 111 280 -152
2138a52K31J0j66k7J09L3p3q3L7R7K02j99k41J22Q1j61P2P5Q0o6J46j84j27J35
$$ -152 79 89 -77 -104 5 38 -35 -118 -81 16 218 19 -222 -100 -19 -180 -108 -33 47 -19 127 -57 -184 -49
2162d9J66Q7k75J02k08J28P7J28j13j19l1P6j02J2J38M5k10J24r6kK62j33q6J36
$$ -49 117 204 -71 31 -177 -49 28 156 43 -76 -107 -31 -133 -121 17 62 -148 -24 -120 -122 140 7 -79 57
2186E7N3j41J58k96K48q1j00J99k13J36o9q7K85m14J33j7M6O7j26L6N9J40mm7
$$ 57 110 -31 127 -169 79 -2 -102 97 -116 20 -49 -136 149 -265 -132 -149 -103 -36 -162 -126 -67 73 69 22
2210B2j9j3J31j0j80j78K21j80K06J12j35J38P6j07p9p3k56K88K25n5j21p7j29
$$ 22 3 -10 121 111 -69 -247 -26 -206 0 112 -23 115 191 84 5 -68 -324 -36 189 134 13 -64 -193
2233a93L64l26J60J1j98J09K90l09L61r6r3K6j59j34L74q6k26J61r2K62k61m9
$$ -193 171 -155 5 16 -182 -73 217 -92 269 173 80 106 -53 -187 187 101 -125 36 -56 206 -55 -104
2255a04K89j67J11K5j20O0K5k2Q2l96K41m8j18O5R5j25K09j84R3j29nK39m2k29
$$ -104 185 18 129 154 34 94 119 97 179 -217 24 -24 -142 -77 18 -107 102 -82 11 -118 -123 116 74 -155
2279a55m0J56om1j35K83l05R6J19R2k2o3J42o6l5J05k6J26o9k59Q1J21Q3k16o6
$$ -155 -195 -39 -45 -86 -221 62 -243 -147 -28 64 42 -21 121 55 20 125 99 225 156 -103 -22 99 182 -34 -100
2304a00N6N8k1N3j19K0J80k00J33j86m0J74j32P7j45R1K45j63l81L44K31p8j94
$$ -100 -44 14 -7 46 -73 -53 127 -73 60 -126 -166 8 -124 -47 -192 -101 144 -19 -400 -56 175 97 -97
2327i7r2K80J83oj88j35k66L84L9L8k84Q8QJ15j34NO6l3K07j84R6N6j53J18j73
$$ -97 -189 91 274 268 80 -55 -321 63 102 140 -144 -56 -48 67 -67 -62 4 -29 178 -6 90 146 -7 111 -62
2352f2J92l24L56J74j07m18%K30K32j67j3j93P9m1J59n%l4P7l72j91o6O32j2k25
$$ -62 130 -194 162 336 229 -189 -189 41 273 106 93 -100 -21 -62 97 92 92 58 135 -237 -428 -494 138 126 -99
2377i9R1L9j52M33n84Q3K81m6L5j94jM1K61m06J92j37K28l10L58r4q1j30J72R0
$$ -99 -8 31 -121 312 -272 -189 92 46 81 -113 -114 -73 188 -218 -26 -163 65 -245 113 19 -62 -192 -20 70
2401G0k4j4o2n9L24j52P9N3m9j19q6M1J36k17k9j96K58J6J28O7j1l21K11J32l54
$$ 70 46 32 -30 -89 235 83 162 215 166 47 -39 2 138 -79 -108 -304 -46 -30 98 165 154 -167 44 176 -178
2426a78J02k75L16K49k62m1J03J6Q6P6k52O1m8J2j25J93l43L88q5j10J9J69k19
$$ -178 -76 -351 -35 214 -48 -89 14 30 116 192 -60 1 -47 -35 -160 33 -310 78 -7 -117 -98 71 -148
2449a48K32p7r0Q6J18nP5j8k07J23oLl13O8J70J44k42R2o7L9J09k95PK31J0n9
$$ -148 84 7 -83 3 121 116 191 173 -34 89 83 86 -227 -159 11 155 -87 5 -62 -23 86 -209 -202 29 39 -20
2475b0Q2m9O4p8l8lJ4L67k29j41p2L42j30K44m18O0L1R1j35k71J44j21K80r7K19
$$ -20 62 13 77 -1 -39 -42 -28 339 110 -31 -103 239 109 353 -65 -5 26 117 -18 -289 -145 -266 14 -83 136
2500A36m94O57k69Pm4k6L37k77K12q7n6j38K5J27k08M0N7L04k59J20K4j14k42
$$ 136 -358 299 30 37 -7 -33 304 27 239 152 96 -42 -17 110 -98 -58 -1 303 44 164 188 74 -168
2523a68N8K76j98O9%k5r7k09N58k11p2j1l0J4m8m6Pq3R9L99l62R7j55J81N5P6
$$ -168 -110 166 -32 37 37 12 -85 -294 264 53 -19 -30 -60 -46 -94 -140 -133 -216 -117 282 -80 17 -138 43 98 174
2549A74j05O1Q2k03j56j18M93l06Q6N4Q9J5j75P5LL4m2O9Q5m45N4J27L75k55k78
$$ 174 69 130 212 9 -147 -265 228 -78 8 62 151 166 -9 66 69 103 61 130 215 -230 -176 -49 326 71 -207
2574b07O0J32m0J29q0r4L02K53n67O2oN7k8j02J80m12M68Q2k06j41J77m4k73L84
$$ -207 -147 -15 -55 74 -6 -100 202 455 -112 -50 -56 1 -27 -129 51 -361 107 189 -17 -158 19 -25 -298 86
2598H6k11K57j37j30J10Pj59M53L9j1j94k40Q8L1J17l17J98Q1j9L0p9r0L07n5
$$ 86 -125 132 -5 -135 -25 -18 -177 276 315 304 110 -130 -42 -11 106 -211 -13 68 49 79 0 -90 217 162
2622A62k46M3j01M73j78r9j86M4K48l61N1o8K22K97k80q2J1o2K39K03l21Q5P5
$$ 162 -84 -41 -142 331 153 54 -132 -88 160 -201 -150 -218 4 301 21 -61 -50 -112 127 330 9 94 169
2645A69j38j11J42N1j32J5N6l26Q8K74j0l70J63k3J20M0r7n7J32j0J28j47nj68
$$ 169 31 -80 62 113 -19 -4 52 -274 -186 88 78 -292 -129 -152 -32 8 -89 -146 -14 -24 104 -43 -48 -216
2669b16K56j1R9k81j86M73k15l9j77O8K16j17NJ44M1r2L22j95j57Q2K88k15k78
$$ -216 40 29 128 -153 -339 134 -81 -120 -297 -229 -13 -130 -125 19 60 -32 290 95 -62 20 308 93 -185
2692a85J31J13O6o2P9Q6j3k37K52n08L10m9j53L65k14j21K82j33q1Q1NO8J48K1
$$ -185 -54 59 125 63 142 228 215 -22 230 -278 32 -17 -170 195 -19 -140 142 9 -72 9 14 82 230 251
2716B51l58K55k64nK22j60r3N6K2n2J42k99M64k02l9k8JM58k00k58k4Q6K65r3
$$ 251 -107 148 -116 -121 101 -59 -152 -96 -74 -126 16 -283 181 -21 -60 -88 -87 371 171 -87 -111 -25 240 147
2740A47J0l91K44J18q3L6j08j43K34j90j3k8L15l41L01j75J48j65J95K20o54J80
$$ 147 157 -234 10 128 45 81 -27 -170 64 -126 -139 -167 148 -193 108 -67 81 -84 111 331 -323 -143
2762a43R7Q7N7k61J16m9O5l8RJ11j4Q5j37j15J93j69J52k34J25OJ41o4K6k9L8
$$ -143 -46 41 98 -163 -47 -96 -31 -69 -60 51 37 122 -15 -130 63 -106 46 -188 -63 -57 84 20 46 17 55
2787E5J49l13J04l4J31l7l6o6j84J77K39J18k77J3J04l09k2N5Q8r1K87j08j54
$$ 55 204 -109 -5 -39 92 55 19 -47 -231 -54 185 303 26 39 143 -166 -188 -133 -45 -136 151 43 -111
2810a11j93L79R8n5m5j34O5J36j57k30J06P1K40J09l34k02K45K71o9m64J94R8
$$ -111 -304 75 173 118 73 -61 4 140 -17 -247 -141 -70 170 279 -55 -257 -12 259 190 -274 -80 18
2832A8Q1K6j94J9K7O4J40n2j45J49r8k2L3l2O2J96m10K37j47J22j31K14k92j46
$$ 18 99 125 -69 -50 -23 41 181 129 -16 133 35 13 46 14 76 272 -138 99 -48 74 -57 157 -135 -281
2856b81M54o1q6j75J67R7m5j39k36J78K24j31j3j1J00J70k36Q9k34r4J60J07k27
$$ -281 173 112 26 -149 18 115 70 -69 -305 -127 97 -34 -47 -58 42 212 -24 65 -169 -263 -103 4 -223
2879b23K63k04J42O2k51M8J66J19j45m8k09J17J79j02R8l5j40J5j21K62L9K48
$$ -223 40 -164 -22 40 -211 -163 3 122 -23 -71 -280 -163 16 -86 12 -23 -163 -148 -269 -7 32 280
2901B80n5j20l0j85J65J69J6k02j00N4k30n3L06J75J20k60j57M0M4j56L14J33
$$ 280 225 105 75 -110 55 224 240 38 -62 -8 -238 -291 15 190 310 50 -107 -67 -23 -179 135 268
2923B68l48J21K40l06j29M7K2o1M69l09j6J11k64J24l7O7J00K3k35K15k16j08
$$ 268 -80 41 281 -25 -154 -107 -85 -146 323 14 -2 109 -155 -31 -68 -1 99 122 -113 102 -114 -222
2945b22L68K1l42L3J26r3L21k95j0J14R8o0j94j04NL46j13q9J82p6J5j10k15L71
$$ -222 146 167 -175 -142 -16 -109 212 -83 -93 21 119 59 -135 -239 -234 112 -1 -90 92 16 31 -79 -294 77
2969G7n6Kj99K11k8K66q4j79j36K37m5r0J61l51J07J84j70j37j6M98l39K15k53
$$ 77 21 23 -176 35 7 273 189 10 -126 111 66 -24 137 -214 -107 77 -93 -230 -246 252 -87 128 -125
2992a25j73K17N0L09jk82L8J29m9k78j07J35j25L41j97M9J72O1j48o4L5j99K01
$$ -125 -298 -81 -31 278 277 -5 33 162 113 -165 -272 -137 -262 79 -118 -69 103 164 16 -48 -13 -212 -11
3015a1O8l63L7N72j94p7l00J89L04r4r7m5k75K80L05k27J43k13J54j78K37k75
$$ -11 57 -306 -269 303 109 32 -268 -79 225 131 34 -11 -286 -6 299 72 215 2 156 -22 215 -60
3037f0P9j50K92k4l30j2K73Q3j43j57J58OJ49J3j98J17j72PO6Q0n3J00Qk96N3
$$ -60 19 -131 161 137 -193 -205 68 151 8 -149 9 15 164 177 -21 96 -76 -69 -3 77 24 124 132 -164 -111
3062a11L47j8l72L65l85K59J18m11J41J69O3p5r4k33L70j8J1o4o1N9p1o1Q1k5
$$ -111 236 218 -154 211 -174 85 203 -208 -67 102 165 90 -4 -237 133 115 126 62 1 60 -11 -72 9 -16
3086a6J7J64j30q3J30l27L96n2K16k36k72K49J16l27K15q1j48J08J23j5L3k62
$$ -16 1 165 35 -48 82 -245 151 99 315 79 -193 56 172 -155 60 -21 -169 -61 62 47 80 -182
3108a82NL7L2R9J56k37q4M12k05l0k8j1k28L50K34k49j41L09j68Q3j82J26l84
$$ -182 -177 -140 -108 -9 147 -90 -174 238 33 3 -25 -36 -264 86 320 71 -70 239 71 154 -28 98 -286
3131b86K6L25p4k25J32J06J26N5m94M19j13n5M9m1j90L66n5L8m2l13K11Ok0J38
$$ -286 -260 65 -9 -234 -102 4 130 185 -309 110 -3 -58 -9 -50 -240 126 71 109 67 -246 -35 -29 -49 89
3155H9j14l9j97K68m1K57k45J02j36K83m03L8J97j06J33Qk56P7L02k13j06k5L11
$$ 89 -25 -64 -261 7 -34 223 -22 80 -56 227 -176 -138 59 -47 86 94 -162 -85 217 4 -102 -127 184
3178A84l47P1K68k44k8J91k52Q6L06k35j87J14R4J98k86L12j54j33k05K17QQ8
$$ 184 -163 -92 176 -68 -96 95 -157 -71 235 0 -187 -73 21 219 -67 245 91 -42 -247 -30 -22 66
3200F6m6L88j55j50M7P6l33O6k79K50qR0J37k57Oj07K20jj15L05k30K41l1m79
$$ 66 20 408 253 103 150 226 -107 -41 -320 -70 -78 12 149 -108 -102 -209 11 10 -105 200 -30 211 180 -299
3224b99L27M0k08L56k55Q9K89l73q9j7J13J00lk75M9J82p6N3M4j32o6P9O9m1Q1
$$ -299 28 68 -140 216 -39 50 339 -34 -123 -140 -27 73 70 -205 -156 26 -50 3 47 -85 -151 -72 -3 -44 37
3249C7k17L79k58j69L57j70PQ3p1j95K21K91l13j05K38j78J31K0q2Q5J22j44j45
$$ 37 -180 199 -59 -228 129 -41 -34 49 -22 -217 4 295 -18 -123 115 -63 68 88 6 91 213 69 -76
3272g6K29K1j98J49j6j48M8k17J84q6Rm4J58Q7k90j7K58k05K83j94j11K13r6O2
$$ -76 153 174 -24 125 109 -39 9 -208 -24 -110 -101 -145 13 100 -190 -207 51 -154 129 -65 -176 37 -59 3
3296Cj50n7K47J83k67R1k02J45K7j41o4K0J48K0j12J52J5m7mJ21l60K91J42l4
$$ 3 -147 -204 43 226 -41 50 -152 -7 20 -121 -185 -165 -17 3 -109 43 58 11 7 128 -232 59 201 167
3320A67K09m71J50R4J59j90l28K31j25R8O4j03m8p5K79k34j06K23J99j29Q1K93
$$ 167 376 -95 55 149 308 118 -210 21 -104 -6 58 -45 -93 -168 111 -123 -229 -6 193 64 145 438
3342D38l95Q2m8k07K76q5j24J73l04J89r3K6J57j84J05k2m84O29j49j62L41j07
$$ 438 43 125 77 -130 146 61 -63 110 -194 -5 -98 -72 85 -99 6 -16 -500 129 -20 -182 159 52
3364E2j58M4J78l23K86n1q3L42m08K31p1j90n8K70l3m2j1%K24l21J05k09K86j98
$$ 52 -106 -62 116 -207 79 28 -55 287 -121 110 39 -151 -209 61 28 -14 -25 -25 199 -122 -17 -226 60 -138
3388a38R2K25k93K86k23K85j82k27K41J88k69j11n3p7L14p4j11K7m8J28P5m5K45
$$ -138 -46 179 -114 172 -51 234 52 -175 66 254 -15 -126 -179 -256 58 -16 -127 -100 -148 -20 55 10 255
3411B55j50Q5k11k94M52j78j85N19m36J31n8J42j71M68m65J41K07mm19J94j16
$$ 255 105 190 -21 -315 137 -41 -226 293 -143 -12 -70 72 -99 369 -96 45 252 248 -171 23 -93
3432i3L62j15k39J25M1J47l84J18J20k25K16K4l5j53J05p6J46j14l2K74J28j87
$$ -93 269 154 -85 40 81 228 -156 -38 82 -143 73 97 62 -91 14 -62 84 -30 -62 212 340 153
3454A53k61j02K33L30k13k11m9K23j00R4k24M19k28%K6j46J60r2J43k03o5K24
$$ 153 -108 -210 23 353 140 -71 -120 103 3 97 -127 292 64 64 90 -56 104 12 155 -48 -113 111
3476A11j66Q5J3j07J3K44l48J95K37m04M93m66J10J4l25N45K3l45J91k61K28O6
$$ 111 -55 30 43 -64 -51 193 -155 40 277 -127 366 -100 10 24 -301 244 267 -78 113 -148 80 146
3498A46j8l1j97K57J2k74K93j86K19K5k17j62n0K73k40K3N9J75j72J65q9L1J56
$$ 146 128 97 -100 157 169 -105 188 2 221 246 29 -133 -183 90 -150 -127 -68 107 -65 100 11 42 198
3521A98l15j64J93k0j14J62J79j32j76L61O8k36q9P0L18j47j84J36p6j22j33K33
$$ 198 -117 -281 -88 -108 -222 -60 119 -13 -189 172 240 4 -85 -15 303 156 -28 108 32 -90 -223 10
3543A0j94k3mL16l31K41l21L68j07q7j52L42j2QN5q1J32j54Q3j10K16l04N0J01
$$ 10 -184 -207 -211 105 -226 15 -306 62 -45 -132 -284 58 46 54 109 28 160 6 89 -21 195 -109 -59 42
3567D2j43J5K95j19L9j54p2J38j06J70j8lJ15k23j51K28j97M2K40l76N17l88J33
$$ 42 -101 -86 209 90 129 -25 -97 41 -65 105 87 84 199 -24 -175 53 -144 -102 138 -238 279 -109 24
3590B4%j48J26j19L50j09k00k54L32N8Qp1r8k2r8M28m93J95K00Q2r7p0o3J06J39
$$ 24 24 -124 2 -117 233 124 -76 -330 2 60 68 -3 -101 -123 -221 207 -286 -91 109 191 94 24 -39 67 206
3615B06k93Q9r6J15j6m4k8J69j59m6J51j30L3k5J49j3nj14m1j74M28k81K88j37
$$ 206 -87 2 -94 21 5 -39 -67 102 -57 -103 48 -82 -49 -74 75 62 57 -57 -98 -272 156 -125 163 26
3639B6j44n5K90q2p3J51l99K23K1J2K0J67q5M0K73m83J17l49K14J67J6p3%J4j15
$$ 26 -118 -173 117 35 -38 113 -286 -63 -42 -30 -10 157 72 112 385 -98 19 -330 -116 51 67 -6 -6 8 -107
3664a07J84N2j82j23k6J85Q7k4L2J5J5K18n19K06M1k13K62j57O9N5j29n7M22j87
$$ -107 77 129 -53 -176 -202 -17 70 46 78 93 108 326 -193 13 54 -159 103 -54 15 70 -59 -116 306 119
3688A19N9j8l48J32j82J50M0J96j11M42n33J01Rj06J50K2J00l82R9p3J64J4j2
$$ 119 178 160 -188 -56 -238 -88 -48 148 37 479 -54 47 56 -50 100 122 222 -160 -61 -134 30 44 32
3711C2J04j95j61K14pL4o3mJ79l08J28J40k00O9L3j79L27l38L21p7O5M1j56Q6
$$ 32 136 -59 -220 -6 -13 21 -42 -46 133 -175 -47 93 -107 -38 -5 -184 143 -195 126 49 114 155 -1 85
3735H5p4k33K04m2N4l0K6J21J01k49j69K36Q2k2p0o7N1J43O2m70K81k04K13K4
$$ 85 11 -222 -18 -60 -6 -36 -10 111 212 -37 -206 30 112 90 20 -47 4 147 209 -261 20 -184 29 53
3759E3O7j93k53L98k45L62k72j21L76j20m8J35j98K13k29J08j00K75n0%j74r8
$$ 53 120 -73 -326 72 -173 189 -83 -204 172 52 4 139 -59 154 -75 33 -67 208 158 158 -16 -114
3781a14K21n0J53j94m4O8j91j82K42L11j51p2j23K31j61L40j22j00j7L1QJ60m86
$$ -114 107 57 210 16 -28 40 -151 -333 -91 220 69 -3 -126 105 -56 284 162 62 45 76 84 244 -242
3804b42Q9K85Q5m72L97j53j08m4L71q2rNo4p8k84L58k4k02J08O3M5k11J53l8l52
$$ -242 -153 132 217 -255 142 -11 -119 -163 208 126 117 122 58 -20 -304 54 30 -172 -64 -1 44 -167 -14 -52 -404
3829d04J45K65K36l50K19j73p4J99O7l67L42j64L27k92J1M5J49kk60K93j24L2
$$ -404 -259 6 242 -108 111 -62 -136 63 130 -237 105 -59 268 -24 -13 32 181 179 -81 212 88 120
3851A20N7k59N5K61k98j39O1K33lq1K68k32o7J71l2J15j03j94J45J75Q1l11j51
$$ 120 177 -82 -27 234 -64 -203 -142 91 88 7 275 43 -24 147 115 230 127 -67 78 253 334 23 -128
3874a28p7J42J54J89l64J40k57K23k33K19R7l1K21m36R8j0J26p8J25l01M6K44
$$ -128 -205 -63 91 280 -84 56 -201 22 -211 8 105 74 295 -141 -43 -53 73 -5 120 -181 -135 109
3896A09j10r2L98k54R2q2K8j28O3J25k70j72J99J4L26k20l45L83o2j94J07L14
$$ 109 -1 -93 305 51 143 61 89 -39 24 149 -121 -293 -94 -80 246 26 -319 64 2 -192 -85 229
3918B29m13Q9j17L20L2k51R1o0J62j41J45k65L09k93j40J93K72O8l86j6J6J75
$$ 229 -184 -95 -212 108 140 -111 -20 -80 82 -59 86 -179 130 -163 -303 -110 162 230 -156 -172 -156 19
3940A9NQ6l5j42N0lK34m34K75n5K6J1O3r3P8j66q9K18J18k65K51l89K80l4K85
$$ 19 24 110 75 -67 -17 -20 214 -220 55 0 26 37 100 7 85 -81 -170 48 166 -99 152 -237 43 9 294
3965B94l03j8Q7J46j49j20N8lk54K60p1Q4K9J9k41P7K89k25L9K79j96O9k48J12
$$ 294 -9 -27 60 206 57 -63 -5 -8 -262 -2 -73 11 40 59 -182 -105 184 -41 -2 277 81 150 -98 14
3989A4j52J60P5q5K37k47j24K08l33L70J3N2j32n4J8K14o38L10N7O3l3J29k31
$$ 14 -138 22 97 12 249 2 -122 86 -247 123 136 188 56 2 20 234 -404 -94 -37 26 -7 122 -109
4012a09L0R7k46K25J9j00J48P0n8l79J76K31j69p2J09L9L7J14l03J46K2J72k41
$$ -109 -79 18 -228 -3 16 -84 64 134 76 -303 -127 104 -65 -137 -28 11 48 162 -141 5 27 199 -42
4035d2J30j80J51j00R0n1l9K5J26j54j5K27j63R9r2k36L30Mk48J68m3q3j03Q6
$$ -42 88 -92 59 -41 49 -2 -41 -16 110 -44 -59 168 5 104 12 -224 106 110 -138 30 -13 -96 -199 -113
4059a13J19J8J53j33M9j44J35M3k21J40l9J11r0P1j57k03K16J02L35k63j50LJ75
$$ -113 6 24 177 44 93 -51 84 127 -94 46 7 118 28 99 -58 -261 -45 57 392 129 -21 -18 157
4082A57j66n8K16j84J00l3pj40l3L56j19Nj30L74k44k1j36K5J72j80K67j69j04
$$ 157 -9 -67 149 -35 65 32 25 -115 -148 208 89 94 -36 338 94 73 -63 -38 134 -46 221 52 -52
4105e2k34L00R3J3L9j87j5L73n51K34J12j56J96k77K33j14P6k14j13K94k29K15
$$ -52 -286 14 107 120 159 -28 -43 330 -221 13 125 -31 165 -112 121 7 83 -131 -244 50 -179 36
4127C6J51k55J38j46J88j32K42l44J39J40k2l23mJ40q4J48K6P1k14M1J30q8l7
$$ 36 187 -68 70 -76 112 -20 222 -122 17 157 135 -188 -192 -52 -136 12 38 109 -105 -64 66 -22 -59
4150e9J28J30j68J8j56m7J29J14L7l4j59J48no7M9M2J09j63K27j50N3l14K73j33
$$ -59 69 199 31 49 -107 -154 -25 89 126 92 -67 81 76 9 58 100 209 46 273 123 176 -138 135 2
4174BNJ78m6j79LnK00j84M8R7j33o7j8J30L9n5Q4l30L35j85j0N1O8k39J35Q2j49
$$ 2 7 185 139 -40 -37 -42 158 -26 22 119 -14 -81 -99 31 70 15 99 -231 104 -81 -91 -40 28 -211 -76 6 -143
4201a43Q6RM2J25k97j30J33J00Q2k8k27j1M48l90J82K0M1K10l04K68k10j12j32
$$ -143 -57 -48 -6 119 -178 -308 -175 -75 7 -21 -248 -259 189 -201 -19 1 42 252 -52 216 6 -106 -238
4224b38R2J98j47K49r3L5j7m00L42K7j82L73Q6j76j83K6N4N3j63Q2K67k96J69
$$ -238 -146 52 -95 154 61 96 79 -321 21 48 -134 239 325 149 -34 -8 46 99 -64 18 285 -11 158
4247A58k33J66J13j54j79j32J98NK17m2l05M9q5J58m9Q9j4n4L34l64L46j93L8
$$ 158 -75 91 204 50 -129 -261 -63 -58 159 117 -188 -139 -224 -66 -115 -26 -40 -94 240 -124 222 29 67
4270F7j69J20N0k83K92l06J19J3K15j61j02M5K00n6J88l85K94j72p2K34m4k85
$$ 67 -102 18 68 -215 77 -229 -110 -97 118 -43 -145 -100 100 44 232 -153 141 -31 -103 131 87 -198
4292a98J71J79o5L0J4n6n27L94K96j54r6K9j03L1J99j41k44O6J00m5K19k70O6
$$ -198 -27 152 87 117 131 75 -452 -58 238 84 -12 17 -86 -55 144 3 -241 -175 -75 -120 99 -171 -105
4315a05N7P6R8J03j1l16q1L97l54M26k10k17J50kJ61k18j68L29k66j44K35p1K58
$$ -105 -48 28 126 229 218 -98 -179 218 -136 290 80 -137 13 11 172 -46 -214 115 -151 -295 -60 -131 127
4338A27q8nM8J76m29M6k7l0K7JK77J55m66O0j7J14pP2j25K90k09q2Pj70K76J99
$$ 127 39 34 82 258 -171 -125 -152 -182 -155 -154 123 278 -188 -128 -145 -31 -38 34 -91 199 -10 -92 -85 -255 21 220
4364B20q6J75k14m3q8kJ89j15k03K73o7R0j10k61K67l1J36k55N8J94l00N9M28
$$ 220 134 309 95 52 -36 -38 151 36 -167 106 39 129 19 -242 25 -6 130 -125 -67 127 -173 -114 314
4387C14m19n1K22J2k16J03J84L2o6k50L14k76J23qk1L7j79k80M81o5rNJ00J08
$$ 314 -105 -156 66 78 -138 -35 149 181 115 -135 179 -97 26 18 -3 34 -145 -425 56 -9 -18 -13 87 195
4411A95l41P5K12k49p4K17K50k33l42J59J33J73n1j64L6r2K37J15l57K37k32O7
$$ 195 -146 -71 141 -108 -182 35 285 52 -290 -131 2 175 124 -40 -4 -96 141 256 -101 136 -96 -29
4433b9j6k70N06J3l03J04k34L0M85l51j11L2J85j05K10N9o1k20L91l46r0K76j91
$$ -29 -45 -315 191 204 -99 5 -229 -199 286 -65 -176 -144 41 -64 146 205 144 -76 315 -31 -121 155 -36
4456c6J17K1j19J17J67l49M95k95j50j6l1oK4J34j28m9Q0j29P2J24J91j45j37
$$ -36 81 102 -17 100 267 -82 413 118 -32 -48 -79 -85 -61 73 -55 -104 -24 -153 -81 43 234 89 -48
4479d8p0J98r3k11N27k36m3k46J1PQ5P1j14l4L66j79J5o1K54j20m2p9n7j52K13
$$ -48 -118 80 -13 -224 303 67 24 -222 -211 -204 -119 -48 -162 -196 170 -9 6 -55 199 79 37 -42 -99 -251 -38
4504c8J29p3L9k61j0P0J89k07j83J35O7K80k86K37j27p6L01j28rj89L26K0j66
$$ -38 91 18 57 -204 -214 -144 45 -162 -345 -210 -143 137 -149 88 -39 -115 186 58 49 -140 186 206 40
4527D0k11J72J15j81P3k94O48k79QP1k83L0kK25j72J68k64k25M85k7P2j13k33
$$ 40 -171 1 116 -65 8 -286 362 83 91 162 -121 -91 -93 132 -40 128 -136 -361 124 97 169 56 -177
4550a77K77k26L04k32J00k52R9m0N1J07Q2l02O7o3J17K19l28P6K93J59k66k1j67
$$ -177 100 -126 178 -54 46 -206 -107 -147 -96 11 93 -209 -142 -205 -88 131 -197 -121 172 331 65 44 -123
4573a23K04k31q6K52j89J1J26K87o42L56J09J7j9j24P6k6j67J05J09j26j26L98
$$ -123 81 -150 -236 16 -173 -162 -36 251 -391 -35 74 91 72 -52 24 -2 -169 -64 45 -81 -207 191
4595A91k48J02k41J90O2j20J45j35J65n2n6K4l09L49l6N9nj80QJ47N2j63K8K05
$$ 191 -57 45 -196 -6 56 -64 81 -54 111 59 3 27 -282 67 31 90 85 -95 -87 60 112 -51 -23 182
4619A82l82J65rOJ0k12K15k32K52m5K6j48L18j90O8J60j35q8K13k67K63k92k06
$$ 182 -200 -35 -44 -38 -28 -240 -25 -257 -5 -50 -24 -172 146 -44 24 184 49 -39 174 -93 170 -122 -328
4642c28J49M34j19k01J01K90m17j18J70j4P6k15J91k54K65rj00J10R2Q3j81k29
$$ -328 -179 255 136 -65 36 326 -91 -209 -39 -53 23 -192 -1 -255 10 1 -99 11 103 186 5 -224
4664b24NJ52kJ37rQ7l9k32L37M7l91M46j62j54o2j95K23k05J25J87j24K27K4l45
$$ -224 -219 -67 -69 68 59 146 107 -125 212 259 -132 314 152 -2 -64 -259 -36 -241 -116 71 -53 174 198 -147
4688a47K86r6J08k5O3l0k00K9q8r5J71L10n43J46L10k85j54K80k20M04j83o8j0
$$ -147 139 43 151 126 189 159 -41 -12 -100 -195 -24 286 -257 -111 199 -86 -240 40 -180 224 41 -27 -37
4711c7J94K9j36l6KJ15M0k19j11K34j26J99l40R1M2j89N7R8J25R5n5j77J60J93
$$ -37 157 186 50 14 16 131 171 -48 -159 75 -51 148 -192 -101 -59 -248 -191 -93 32 127 72 -105 55 248
4735B48j94k62L11p5M9J97l97j82P9K11J72q9P4k39P5k1l2o0L25l39P3j01K08
$$ 248 54 -208 103 28 77 274 -123 -305 -226 -15 157 68 142 -97 -22 -43 -75 -135 190 -149 -76 -177 31
4758C1J56j55j07J54o5n6J72j51o6P9J64j61j49M80m91k9M05q2P7k89l2Q0qj44
$$ 31 187 32 -75 79 14 -42 130 -21 -87 -8 156 -5 -154 326 -165 -194 211 129 206 -83 -115 -35 -43 -187
4782a87M72k11k44l0M96k81m1J45m39M49l00L25K5j19L3j01J63l47J06R6j50J79
$$ -187 285 74 -170 -200 296 15 -26 119 -320 129 -171 154 179 60 93 -8 155 -192 -86 10 -140 39
4804C9n6Q4P0q6J0r6J20n0j1j30j55L82m4k70J09r3K18j04J80j47K33Q0l19p2
$$ 39 -17 67 137 51 61 -35 85 35 24 -106 -261 121 77 -193 -84 -177 41 -63 117 -30 203 283 -36 -108
4828a08L4J15k4j69J55J9l63L46o5O0L6j07J12k65K30j50Q1J21Rm46O65k23Pj16
$$ -108 -74 41 17 -152 3 22 -341 5 -60 0 36 -71 41 -224 6 -144 -63 58 67 -379 286 63 70 -46
4852d6o4J58k05K88j64p2J21Q2n0k60K49r5l7J60j83Q7j30M4J37k83O2J39J60
$$ -46 -110 48 -157 131 -33 -105 16 98 48 -212 37 -58 -95 65 -118 -31 -161 -117 20 -263 -201 -62 98
4875I8k31O6Q7j66Q0j12Q4k2q9K22O0K16j47m26M83L5k94L8Kj06K62l42J10M0
$$ 98 -133 -67 20 -146 -66 -178 -94 -116 -205 17 77 293 146 -280 203 238 -56 -18 -16 -122 140 -202 -92 -52
4899e2K11j12R8l32K58J6m62L89j81K90p5j66m0L06N6j85P6k56L39k23k64J63
$$ -52 159 47 145 -187 71 87 -375 14 -167 123 48 -118 -158 148 204 19 95 -161 178 -45 -309 -146
4921a46J2M04k80K05k5Rl19M15j10k22K2r5L71k06O3L7q0j30J98l26J61j8k03
$$ -146 -134 270 -10 195 170 179 -140 275 165 -57 -35 -130 241 35 98 135 55 -75 123 -203 -42 -60 -263
4944b63K81m0l4J1J28J22j49l0n7j97O2J27n2o9M13m34n0L12k50L58j37Q9J06
$$ -263 18 -22 -56 -45 83 205 56 26 -31 -228 -166 -39 -91 -160 253 -181 -231 81 -169 189 52 141 247
4967B47l24L60j4m95K68o2K58l20J77l27L70j77L7k88J27L60j82j96J07kj5K47
$$ 247 -77 283 269 -226 42 -20 238 -82 95 -232 138 -39 -2 -290 -163 197 15 -181 -74 -76 -91 156
4989A56l8q0q7m4J75q7j15K98k01K44l55K47J11o6j75QL02j83j46N6L6L7k2l32
$$ 156 118 38 -49 -93 82 -5 -120 178 -23 221 -134 113 224 158 -17 -9 293 110 -36 20 56 93 71 -261
5013b61K61lj6R0k5j52L38l72K21N1K09m62O2P6q3K38l51K40O7j60K03l73R7K77
$$ -261 0 -3 -19 71 46 -106 232 -140 81 132 341 -121 -59 17 -66 172 -179 61 128 -32 171 -202 -105 172
5037A72l21m1J43J3K3K4qo7K00L4r5j38j2J08K2j65Q0j62J11L6M1q1j43L33j37
$$ 172 -149 -190 -47 -34 -11 13 5 -62 138 172 77 -61 -73 35 57 -108 -28 -190 -79 -43 -2 -83 -226 107 -30
5062c0j96O8J74k4j24Q8Q5n8r1K9L8n3j35K19j4n1K9J73k91J52K96k17J98k75
$$ -30 -226 -158 16 -8 -132 -44 41 -17 -108 -79 -41 -94 -229 -10 -24 -75 -46 127 -164 -12 284 67 265 -10
5086a0R4O7j90j58J02k4L59l32K78l00Q7l8J50j04R7j79K20j07j01O8j06nL2m7
$$ -10 84 151 -39 -197 -95 -119 240 -92 186 -114 -27 -65 85 -19 78 -101 119 12 -89 -21 -127 -132 -100 -147
5110a47L3j1J24J43j28p4n5j17M28k14k75L72J94j82j37j58J96K42l51K76J25
$$ -147 -114 -125 -1 142 14 -60 -115 -232 196 -18 -293 79 273 91 -46 -204 -8 234 -117 159 284
5131B84l17P0J3K4K3K6j0k19K0m2N1J25L8q0l5o5J46j30J60p5j1K32k63K69j62
$$ 284 -33 37 50 74 97 123 113 -106 -86 -128 -77 48 86 6 -29 -94 52 -78 82 7 -4 228 -35 234 72
5156G2K24k40k93P7K19l04jL35j34P9P5J83l50l3L5m3J08Q4l2k7k35K28J84j94
$$ 72 296 56 -237 -160 59 -245 -246 89 -45 34 109 292 -58 -91 -56 -99 9 93 61 34 -201 27 211 17
5180A7K54%k95Q1k7j83K34j57P4L18k49R4J54j37m47L36j88J03k22L39k22K32
$$ 17 271 271 -24 57 30 -153 81 -76 -2 316 67 161 315 178 -269 67 -121 -18 -240 99 -123 109
5202A09j01j70J65r5L06j55k10R9Q8j7k12K76J82m70J83N2k51p9K72Q4k61J63
$$ 109 8 -162 3 -92 214 59 -151 -52 36 19 -193 83 265 -205 -22 30 -221 -300 -28 56 -205 -42
5224d2J80l42J21o6L06j54j34K98p9L1M5l13O01o14J83j71J07m4J30K3k48J90
$$ -42 138 -204 -83 -149 157 3 -131 167 88 119 164 -149 452 -162 21 -150 -43 -87 43 66 -182 8
5246HN4J6j40L4l5p5P7K1k21M19m62M51k10j58J57J62o6J87k42J01O1J10k45j35
$$ 8 62 78 -62 -28 -63 -138 -61 -40 -261 158 -304 147 -63 -221 -64 98 32 219 -23 78 139 249 4 -131
5270a31j26J71j3M2J43L27k71l15MK93j84r9J14m2J83J51l25j45K03M8l4m4J11
$$ -131 -257 -86 -99 -57 86 413 142 -173 -169 124 -60 -159 -45 -87 96 247 -78 -223 -20 28 -6 -50 61
5293F1l3j51K50jo4k07K19k52K54L0k31K74j34q5M03n98L45J07j76K10k49K70
$$ 61 28 -123 127 126 62 -145 74 -178 76 106 -125 149 15 -70 333 -265 80 187 11 221 -28 242
5315B42j2k61J82J5j19j71J49r9J85J26l08r4L00oQr4R4Jn0j21N9j59K30J08k66
$$ 242 230 -31 151 166 47 -124 25 -74 111 237 -71 -165 135 129 137 43 137 138 88 -33 26 -133 97 205 -61
5340f1mO9lQ7r0n5J81j63M95m89rK11j44k0M4j72K46r0o9q9J02j79N87j79k84
$$ -61 -65 4 1 88 -2 -57 124 -39 456 -33 -42 169 25 5 49 -123 123 33 -36 -125 -23 -202 385 206 -78
5365g8K4L17k42L5M8jk05J46J23m16L85m2j00M2K15m5j98k57J86J12K8j36R7J4
$$ -78 -54 263 21 56 104 103 -102 44 167 -249 136 94 -6 36 251 206 8 -249 -63 49 77 -59 38 52
5389E2o7n6j08L97k98p7K22o2J52j25l3K50l20K13j99N7k10J09K16k83L21l73
$$ 52 -15 -71 -179 218 -80 -157 65 3 155 30 -3 247 -73 140 -59 -2 -212 -103 113 -170 151 -222
5411b22J01N1nJ35j67L90J16m92j22l5O30l04Q4j23m2J35J66k21j53L1J23pN0
$$ -222 -121 -70 -75 60 -107 283 399 -93 -215 -250 380 76 160 37 -5 130 296 75 -78 -47 76 69 119
5434A19m1P1p7k72K29j46L7J26k09K73k6k04L88m46K76l24R6K29j84Q5L9J18j7
$$ 119 78 149 72 -200 29 -117 -80 46 -163 110 84 -120 268 -178 98 -226 -130 99 -85 0 39 157 140
5457A40j61j12K10n5nk47K48J54m3l03N2K72k20L9j43L48k08l2J5K86j50n1M4
$$ 140 -21 -133 77 22 17 -230 18 172 129 -174 -122 150 -70 -31 -174 174 -34 -66 -51 235 85 34 78
5480G8N3k9j02R6o6k48J56j18J37P7J22m8k34K19k19O0j95K07J5l45L26O9J3K60
$$ 78 131 102 0 96 30 -218 -62 -180 -43 34 156 108 -126 93 -126 -66 -261 -54 -39 -384 -58 11 24 284
5504B84m59K23j8j80N9l3n1L48k3j00O5N3j46J23ml24M71l48K76o8l83o5M11k16
$$ 284 -175 48 30 -150 -91 -124 -175 173 150 50 115 168 22 145 141 -183 288 -60 216 148 -235 -300 111 -105
5528a05J83j72L37j11m09J12K70k16K39j19J5J0r9J03M2j98Q2J49k48J74O6l2
$$ -105 78 -94 243 132 -277 -165 105 -111 128 9 24 34 -65 38 80 -118 -36 113 -135 39 105 73
5550G3L6l04J69m2Q1j89o8N49k46j54J92j87J73r1j8j5k1r7J03Jm7J33l3r5m8
$$ 73 109 -195 -26 -68 13 -176 -244 305 59 -95 97 -90 83 -8 -26 -41 -62 -159 -56 -55 -102 31 -2 -97 -145
5575a45J26R2L1L0O2k56Q3j00K78p3l7K20l18Q1j19R4J03l64J8J87J56j98K87
$$ -145 -19 73 104 134 196 -60 23 -77 201 128 91 311 -7 74 -45 49 152 -212 -194 -7 149 -49 238
5598B38j20n13K67o6M08p0o1l6Jj16R8K7k33J97k9j39J74L21m20j1L45l78O8J
$$ 238 118 -395 -128 -194 214 144 83 47 48 -68 30 57 -176 21 -8 -147 27 348 -72 -83 262 -116 -48 -47
5622d7j36J20J91k15O1j44J62K4o7P3Q1q5j45J04J43j68j1l2j70M57n57M68K14
$$ -47 -183 -63 128 -87 -26 -170 -8 16 -51 22 103 18 -127 -23 120 -48 -59 -91 -261 196 -361 107 321
5645C21m44O5m0K3j18K49j93J58o3J61k3R7n14L20L5q4p3K57Q5l76K95k67K11
$$ 321 -123 -58 -98 -75 -193 56 -137 21 -42 119 96 193 -321 -1 34 -50 -123 134 219 -157 138 -129 82
5668H2O2J4j63K10k28R8k51J38J45J34j44n4j00o9p1K64n1J64j08L8J13j23j27
$$ 82 144 158 -5 205 -23 75 -176 -38 107 241 97 43 -57 -126 -197 67 16 180 72 110 223 100 -27
5691b7J3J21J05m22P6K4K68l48L1J34PK6j16K54n9K86l69J4l7k2K4J29o5j50N29
$$ -27 -14 107 212 -210 -134 -110 158 -190 -159 -25 -18 8 -108 146 87 373 4 18 -19 -41 -17 112 47 -103 426
5716D26j29l91l3J82K19j91J74m40J66j48L62j5m86J72P2J4pJ23j43J80k29J42
$$ 426 297 -94 -127 55 274 83 257 -183 -17 -165 197 182 -304 -132 -60 -46 -53 70 -73 107 -122 20
5738B0pj61K03J02k82J14LJ65j55r4q3K76N1o4j20o4J97J21l61N3J88q5J89k98
$$ 20 13 -148 55 157 -125 -11 -8 157 2 -92 -175 101 152 88 -32 -96 101 222 -139 -86 102 17 206 -92
5762i2j6k45N60j76J22j24kl63J30J17L52j56j6m7k5o7k00K50L2m0J6J84j75N
$$ -92 -108 -353 207 31 153 29 27 -336 -206 -89 263 107 91 44 19 -48 -248 2 34 -6 10 194 19 24
5786B4J40j98J47J84Ll45j16Q8K8j57J72K4j46J7J62P5P7k95J65l40J95J64p1
$$ 24 164 -34 113 297 300 -45 -161 -73 -45 -202 -30 -6 -152 -135 27 102 179 -116 49 -291 -96 68 -3
5809cK58m18J00K6p8M3j69PM34m59L49k6O1j73j53M27j07k10K1J31j26J16k8l59
$$ -3 255 -163 -63 -37 -115 -72 -241 -234 200 -259 90 64 125 -48 -201 226 119 -91 -70 61 -65 51 23 -336
5833c36J52J38l7k59N01j50p5J57k35J38m3K07k00J44k0k53L34J56k46J09j13
$$ -336 -184 -46 -83 -342 159 9 -66 91 -144 -6 -49 158 -42 102 82 -171 163 319 73 182 69
5854F9lj41M6l9J85q1J09j44M8n8j84L74j8k05J57j84K91j97j71L48l81J54j39
$$ 69 66 -75 -29 -68 117 36 145 1 49 -9 -193 181 163 -42 115 -69 222 25 -146 202 -179 -25 -164
5877a64J94n6j25j8J07o7J77M6L0kj08M23o06J94k96J14L40l7k49K02j10K95k37
$$ -164 30 -26 -151 -169 -62 -129 48 94 124 122 14 437 -169 25 -271 -157 183 146 -103 99 -11 284 47
5900D7J85k01j60J49O2j29R1Q4N3k38j34K15K31O6m67K89R8k04j20N7n9K69k75
$$ 47 232 31 -129 20 82 -47 44 128 181 -57 -191 24 255 321 -146 143 241 37 -83 -26 -85 184 -91
5923i1J42j07J37k12L9K0N0K40k70O7J78k91K41j91J41J81l50p7J67j49K80j06
$$ -91 51 -56 81 -131 -92 -72 -22 218 -52 15 193 -98 143 -48 93 274 -76 -153 14 -135 145 39
5945C9k6o1j11P4K0l5K23Q2l05L15J35l69L03m44K7K58j51J37j64L8L4k26J59
$$ 39 13 -48 -159 -85 -65 -100 123 205 -100 215 350 -19 284 -160 -133 125 -26 111 -53 -15 19 -207 -48
5968d8J36m64N15j00o5J4R9K7l8r5J00M1Q8j56oj5J55n6J00l94J15J16J68j73
$$ -48 88 -376 139 39 -26 -12 87 114 76 -19 81 122 210 54 48 33 188 132 232 -162 -47 69 237 64
5992F4l3J06j70m8K73j63l81K75k38P6J42L02k81O1J79l2k68M79o03K98P0L25
$$ 64 31 137 -33 -81 192 29 -352 -77 -315 -239 -97 205 -76 -15 164 132 -136 343 -260 38 108 433
6014D33l76l01L63j94Q9j12J62J15j3k26j66Q6J62J5N4j00J15j9K0Q3j41R7m01
$$ 433 57 -244 119 -75 14 -98 64 179 166 -60 -226 -140 22 37 91 -9 106 87 107 190 49 146 -255
6037b55L61k49J04o7l8M24j87j83K27k26R5N1j72L3o1J17j63K80k88PJ54K6Pj25
$$ -255 106 -143 -39 -106 -144 280 93 -90 137 -89 6 57 -115 -82 -143 -26 -189 91 -197 -190 -36 -10 -3 -128
6061a28KJ93J07k58j18rq6M45l43J36J09j26O5k46l9M74k98K45j89L8j39N9R7
$$ -128 -126 67 174 -84 -202 -211 -297 148 -195 -59 50 -76 -11 -257 -296 178 -120 125 -64 -26 -165 -106 -9
6084ij4J21Q5j94P9O5k34J41k3J05j41R9j02k2O0J22k15J14L07k89Rn4Rj70O3
$$ -9 -23 98 183 -11 68 133 -101 40 17 122 -19 80 -22 -44 16 138 -77 37 344 55 64 10 19 -151 -88
6109h8q2K44M1j32L4k08L37m41N60m25J7j7K23j30N6j67M1L68l48l5J71K5n5R2
$$ -88 -170 74 115 -17 17 -191 146 -295 265 -160 -143 -160 63 -67 -11 -178 -137 231 -117 -152 19 44 -11 81
6133H1p8n8J12r2J5o2L57l13J13J28k5l10J38J61k40LJ46k7n2NM1N9j74N0L60
$$ 81 3 -55 57 -35 -20 -82 275 -38 75 203 178 -132 6 167 -73 -70 76 49 -3 2 43 102 -72 -22 338
6158C38j39j02J06k76P4J73n1r8j64L02r1j7j24JK65j83R2J96l87K34m00K37L87
$$ 338 199 97 203 -73 1 174 123 25 -139 163 72 55 -69 -68 197 14 106 302 -85 149 -251 -14 373
6181C73m76J25J16j36k3J87J6j26OO6l07J32K14j53J9k75R7K33r7R2J63l1j44
$$ 373 -103 22 138 2 -21 166 182 56 62 128 -179 -47 167 14 33 -242 -145 88 -9 83 246 215 71
6204G1j75N7J68j19M1L1j11J11j61n6J81r6N1J06j5k04K82k3l48J13L51J00l47
$$ 71 -104 -47 121 2 43 74 -37 74 -87 -143 38 -58 -7 99 84 -120 162 139 -209 -96 255 355 8
6227HK59m11J56J46k23%K96k38K60o4k47n2k2J1Q2K55k35j2j43L3K96m1J11j00
$$ 8 267 -144 12 158 -65 -65 231 -7 253 189 -58 -110 -132 -121 -39 216 -19 -31 -174 -141 155 114 225 125
6251A25k06K5K11j56J7nR3j09pK20P3o79N01j15J68j90L8J06l71K52j95K83Q2
$$ 125 -81 -56 155 -1 16 11 104 -5 -12 208 281 -398 103 -12 156 -34 4 110 -261 -9 -204 79 161
6274A61j94ML05k36j67J70j15O6K5j57n7M80j54J08l90l46O00j33o1L01l33L6
$$ 161 -33 -29 276 40 -127 43 -72 -6 19 -138 -195 285 131 239 -151 -497 103 -30 -91 210 -123 -87
6296h7K24k87J74j1K47p4m02L42J4p5j94J44m1%L16l55J6K36k82O0J1L20l45K09
$$ -87 137 -150 24 13 260 186 -216 126 140 65 -129 15 -26 -26 290 -65 -49 187 -95 -35 -24 296 -49 160
6320A60k23n5J38o7L33m57J55J85k65J99k50K10p3R4k10L6K24k11J29k96J58K31
$$ 160 -63 -118 20 -47 286 -171 -16 169 -96 103 -147 63 -10 84 -126 -90 134 -77 52 -244 -86 145
6342A45J88j89k07qJ04J50j11m3k15K19Q6p5j56J54J44j64k31J40L7K17j44m8
$$ 145 333 144 -63 -71 33 183 72 29 -186 33 119 44 -112 42 186 22 -209 -69 -32 185 41 -7
6364gJ29o3R0k06R2R6l33K90k01K7K30j57l1j50K70k02J95Mn0OK20l70k0R4P8
$$ -7 122 59 149 -57 35 131 -202 88 -113 -86 144 -13 -44 -194 76 -126 69 73 23 29 249 -121 -141 -47 31
6389C1j49p1J47Pj03K46j08K52j42J39k73j90P7J03pk33J14l8Q8J34L9L7j4k50
$$ 31 -118 -189 -42 -35 -138 108 0 252 110 249 -24 -214 -137 -34 -41 -274 -160 -198 -110 24 63 100 86 -164
6413a64J99j49J93q0J79p2j35N4J30p5k75L75k32K82j98M6Lk45J21j46K26k05
$$ -164 35 -114 79 -1 178 106 -29 25 155 80 -195 180 -52 230 32 78 81 -164 -43 -189 37 -168
6435a68R7lJ15J37k68L92j25j92Q7j62J25k21J10p6J15j58R9j04Q3J46Q7m7j85
$$ -168 -71 -74 41 178 -90 302 177 -15 72 -90 35 -186 -76 -152 -37 -195 -96 -200 -117 29 116 69 -116
6458a16Q1k3j72M72l89J47p1N7J83j50P8j72J10J66k43j32L34l13L5J7J50k46
$$ -116 -35 -58 -230 242 -147 0 -71 -14 169 19 97 -75 35 201 -42 -174 160 -153 -118 -101 49 -197
6480a97j01J19j5K71J53j88l67L22l57N68k19K77k02J07R7l21m2j41P4j7J33p0
$$ -197 -298 -179 -194 77 230 42 -325 -3 -360 208 -11 266 64 171 268 -53 -95 -236 -162 -179 -46 -116
6502a16K84pl69L9R8K0J43J46l13k22J79J75k04P3j35qL44K6j42J81l73J17J21
$$ -116 168 161 -208 -169 -71 -51 92 238 -75 -297 -118 57 -147 -74 -209 -217 127 153 11 192 -181 -64 57
6525E7r9J53j06J17k57J45K06k16O4k9J55k1K72n27L5j64K63l2l60M21o4j35K23
$$ 57 -42 111 5 122 -135 10 216 0 64 35 190 169 441 -86 -51 -215 48 16 -344 77 13 -122 101
6548A01J3m13J78L10k42J45j38k01K36R0m0q4j35L60k26J13L1N5J36m00J37r5
$$ 101 114 -299 -121 189 -53 92 -46 -247 -11 79 39 -45 -180 180 -46 67 98 153 289 -111 26 -69
6570f9K72o9%j81J28n5o5N6n2K6J87j55J66k68m1k7q4J92N2J66j83K52k76o7P4
$$ -69 203 134 134 -47 81 26 -39 17 -35 -9 178 23 189 -79 -120 -147 -231 -39 13 179 -4 248 -28 -95 -21
6595b1R9Mj54n2J44j57K23j87M0J34l2l20J04K35k92J71K9L38j42j10J43M2%m16
$$ -21 78 82 -72 -124 20 -137 86 -101 -61 73 41 -279 -175 60 -232 -61 -32 306 164 54 197 239 239 -177
6619a77J1L0N4P5m1L16l02j35J98k2j47P3QJ4O6J2J2Q1k7J13k89J39m0P6J16k57
$$ -177 -166 -136 -82 -7 -48 268 -34 -169 29 7 -140 -67 -59 -45 21 33 45 126 99 212 -77 62 22 98 214 -43
6645d3J11m8k9R2N2k40Q9J54k42j36J61j17O8K72P6m0p3m61J62J5K42O8O7k16
$$ -43 68 20 -9 83 135 -105 -16 138 -104 -240 -79 -196 -128 144 220 180 107 -354 -192 -177 65 133 200 -16
6669a6q5J05q2k93N74k91lJ78k31J84m1k01K40O5r7J91j47O4j41k5k33L84N2k40
$$ -16 -101 4 -78 -371 203 -88 -91 87 -144 40 -1 -202 38 103 6 197 50 114 -27 -52 -285 99 151 -89
6693h9K54j62n9k70J72O1J25M6K1J20l38K38l11K84j96J38K04k34o6K23k40K1
$$ -89 165 3 -56 -326 -154 -93 32 78 99 219 -119 119 -192 92 -104 34 238 4 -62 161 -79 -58
6715e8m4K46j15p0m6J10N9J58j73M5j29k29K75l1J31M4m9J19k65J71l05J35mP2
$$ -58 -102 144 29 -41 -87 23 82 240 67 112 -17 -246 29 -2 129 173 124 243 -22 149 -156 -21 -25 47
6739D7j22J91n7j28K33j94o3K04m4J14k66M0K24k49j65R9K56pk18L33k90j45J74
$$ 47 -75 116 59 -69 164 -30 -93 111 67 181 -85 -45 179 -70 -235 -136 120 113 -105 228 -62 -207 -33
6762c3j29K12k4R7l5j24o7K8j17L28l85PK05J20j05J11n3k92M98l12j02P0J83
$$ -33 -162 50 26 123 88 -36 -103 -75 -192 136 -249 -242 -37 83 -22 89 36 -256 242 -70 -172 -102 81
6785H1J57j87J74o2k41K54q0r6j23N2M4j97M49j38j70J97k96K21j03M0J71r4J6
$$ 81 238 51 225 163 -78 176 96 0 -123 -71 -27 -224 225 87 -83 114 -182 39 -64 -24 147 53 69
6808F9l36K28%n6J81m1J28r7n5r2K21k89K66r5J31l04K63m48L10k38K80k13K37
$$ 69 -267 -39 -39 -95 86 45 173 76 21 -71 150 -139 127 32 163 -141 122 -326 -16 -254 26 -187 50
6831E0j65K26J54n49M11l32M14j98pK01n54O55o5m50K84o7j05M8M3nJ02q0j41
$$ 50 -115 111 265 -284 127 -205 209 11 4 205 -349 306 241 -209 75 8 -97 -49 -6 -11 91 11 -130
6854a30J78j03K44k30J73J24m3l19M1j03L27l87J81K34R0l49k5J26lK32j66r8
$$ -130 48 -55 189 -41 132 256 213 -106 -65 -168 159 -228 -47 187 277 -72 -97 29 26 258 92 -6
6876fj34Q9Rn4K02k79J58Oj02o8L01j79j05K15N0J3Mr9j04k5j0j06K67P2p9J9
$$ -6 -140 -51 -42 -96 106 -173 -15 -9 -111 -179 122 -57 -162 53 103 116 120 21 -83 -108 -118 -224 43 115 36 55
6902E5J51l58J50j02K97k88K31J82q5l63L22j85M8j82k02M56NJ31l24J46k33L09
$$ 55 206 -152 -2 -104 193 -95 136 318 233 -130 192 7 55 -127 -329 127 132 263 -61 85 -148 161
6924A61n8l05K79j2j00o5K5R0R4j84q2K72P8j84n4K3r4RJ03L5K5mk62J76j9L1
$$ 161 103 -202 77 65 -35 -100 -75 15 109 -75 -157 115 193 9 -45 -22 -116 -107 -4 31 56 52 -210 -34 -53 -22
6950b2J03j52k24N14J7m42J86Q6j26Jl5Q1L5r1K76J50k86M8j76n0K14p4j44P3
$$ -22 81 -71 -295 219 236 -206 -20 66 -60 -59 -94 -13 22 -69 207 357 71 119 -57 -107 107 33 -111 -38
6974c8j56J40j68J71Q5k31L06k37K86k71J27Ql12J62K56k69p5J39J20j7p8j10
$$ -38 -194 -54 -222 -51 34 -197 109 -128 158 -113 14 22 -290 -128 128 -141 -216 -77 43 26 -52 -162
6996a62J84K9K20l33L77p3l16L47k28j06Q8j71M16j25p6j1j34L51l54R0j70j3
$$ -162 22 51 271 -62 315 242 -74 273 45 -61 27 -144 272 147 71 60 -74 277 -77 13 -157 -170
7018a70L02k75M57l05l4J92k30J13N7k16K68P6k82L7j37L61m34P9J69r7r0O1K37
$$ -170 132 -143 314 9 -25 167 -63 50 107 -109 159 235 -47 -10 -147 214 -220 -141 28 -69 -159 -98 139
7041A39j72R0J22j62J99k13l29L95k01J23j02K10L8K9l78M46r9j27J10j87Q3r1
$$ 139 -33 57 179 17 216 3 -326 69 -132 -9 -111 99 137 166 -212 234 135 8 118 -69 14 -77
7063g7P7q7j1O9N2k9O8q8K80k05J07rL0r2j90J00m7J13j04n6j77K94q6K00j3l05
$$ -77 0 -87 -98 -29 23 -6 62 -26 254 49 156 147 177 85 -105 -5 -52 61 -43 -99 -276 18 -68 132 119 -186
7089a86K47L8q8N9m35M12N9p4R4o7m60N44j78J49l06L97l86M3L63k31Pq6K8j5
$$ -186 61 99 11 70 -365 47 106 32 126 59 -401 143 -35 114 -192 205 -181 -138 225 -6 1 -85 -57 -72
7113g2O9k01L38l67J10M9K7j08K18m5p8J50j54N9l5K75k04l0j3r5K84j55K3N1
$$ -72 -3 -204 134 -233 -123 -74 -47 -155 63 18 -60 90 -64 -5 -40 235 31 1 -12 -107 177 22 45 96
7137I6l2n0J93r5j15j77K42O2j5j1j35n7K08j9k04M06m44K10K9n0k60J02L05j92
$$ 96 64 14 207 112 -3 -180 62 124 109 98 -37 -94 114 95 -109 297 -147 63 92 42 -218 -116 189 -3
7161cl7j31K48j8p%M1j32L5j36M02l61K03q9mK2r3J22q4o9K11k54J29j19K31j44
$$ -3 -40 -171 77 59 52 52 93 -39 -4 -140 262 -99 104 15 11 33 -60 62 -22 -91 120 -134 -5 -124 107 -37
7187c7k81J50J03k32R9L49j25O4k76K51J37j07K38j56k10J91j86P3LK01q1k37
$$ -37 -318 -168 -65 -297 -198 151 26 90 -186 65 202 95 333 177 -33 158 -28 45 48 249 168 -69
7209f9L89k02k34N4j2o1M21j29m6J60j63k00J32j28J56q8rL3m8J03j32n2J82j42
$$ -69 320 118 -116 -62 -74 -135 286 157 111 271 108 -92 40 -88 68 -20 -29 4 -44 59 -73 -125 57 -85
7233h5K40j00k84K19r8J07Q3R7q6l25J41M83k92K22k83M3m4k01J90j85L57l04
$$ -85 155 55 -229 -10 -108 -1 82 179 93 -232 -91 392 100 322 39 82 38 -163 27 -158 199 -105
7255a05K70k8j19J65k20O7J0k04QQ5K4J69K3l64n7L34k48J33M2k14K75m6j60Q5
$$ -105 165 137 18 183 -37 30 40 -164 -156 -71 -47 122 145 -219 -276 58 -190 -57 -15 -229 46 0 -160 -75
7279g5J43k52J43J48l30J99m5J4Q6j40k11K31j1K18q6k3R5j20N0N0j88K21l24
$$ -75 68 -184 -41 107 -223 -24 -69 -55 31 -109 -320 -89 -100 118 32 9 104 -16 34 84 -104 117 -207
7302b07M66k11J32m3j76K76l91M10l18O1P1k33K24l69M00Q8q6l15k5L35r3j12
$$ -207 259 48 180 137 -39 237 -154 256 -62 -1 70 -163 61 -308 92 180 94 -221 -246 89 -4 -116
7324a16O8K14j33j16J93m17K34K19k50K49j71L01l72n8M4J02pK39k96J11j0k06
$$ -116 -48 166 33 -83 110 -307 -73 146 -104 145 -26 275 -97 -155 -111 -9 -16 223 -73 38 28 -178
7346a78J57j80K68j90J89j1J91l93K4J89L5O1l02K19j25P5p5j07J5q3R5K27p2
$$ -178 -21 -201 67 -123 66 55 246 -147 -123 66 101 162 -140 79 -46 29 -46 -153 -138 -221 -126 101 29
7369B9J68k25j85K85K74rn12K75J35n3J18j59j96m4J50k43J85J13J68l36K17K
$$ 29 197 -28 -213 72 346 337 -175 100 235 182 300 141 -55 -99 51 -192 -7 106 274 -62 155 157
7391A57k0k6l9K00n07K88m20N20m22K60j25J98J21k46L8K8j61J55NN2J9j85J71
$$ 157 137 111 72 272 -235 53 -367 153 -269 -9 -134 64 185 -61 -23 5 -156 -1 4 56 75 -110 61
7414F1J31j6Qj85l29L48k75K46j01L67l29L1P4j08R3l9K39m06K23K58l87j52K09
$$ 61 192 176 184 -1 -330 18 -257 -11 -112 255 -74 -43 31 -77 16 -23 216 -190 33 291 -96 -248 -39
7437c9P2J13k65R3R5l33L56M2l8n9J18j03m8K74m85P1r7J52L18l26Q6q5L23l27
$$ -39 33 146 -119 -26 69 -264 92 134 96 37 155 52 4 278 -207 -136 -233 -81 237 -89 -3 -88 235 -92
7461i2Q7J65j3j52p8K06K5k76K39j20K06k08J58J31m00M7J20N9j27J15n1j54q3
$$ -92 -5 160 147 -5 -83 123 148 -128 111 -9 197 -11 147 278 -122 -75 45 104 -23 92 41 -113 -196
7484a96K86R9j43r2p8m5K52j40O5O9M5k13l5J31j15J68K2o0P4j3J07j46O5j24
$$ -196 90 189 46 -46 -124 -169 83 -57 8 77 122 -91 -126 5 -110 58 80 20 94 81 188 42 107 -17
7508a7J42k85J00M1k3k42J85M14l34K78m58M64j29j77L5Q6l8rq4L34j66r5K53
$$ -17 125 -160 -60 -19 -42 -284 -99 315 -19 259 -199 265 136 -41 -6 80 42 33 -51 283 117 22 275
7531B75o8j44j01K25p4m8j99J87k69K77j6M9N7Q1k00j9N4P2j89n8M0o4Q9R2o6
$$ 275 207 63 -38 187 113 65 -134 53 -216 61 45 94 151 232 32 13 67 139 -50 -108 -68 -132 -43 49 -17
7556a7mL7J00j18J59j99rJ24n9L5K2l4k79J52J43l33M8K75j70M6l3K48q9m9j03
$$ -17 -21 16 116 -2 157 -42 -51 73 14 49 71 37 -242 -90 53 -280 -232 43 -127 -81 -114 134 45 -4 -107
7581a07o2%J75j95M24j27pj09K5o8RK47j77J3n6j4l37L73J19k42q2o2K06k10K11
$$ -107 -169 -169 6 -189 235 108 101 -8 17 -51 -42 205 28 41 -15 -29 -366 7 126 -116 -198 -260 -54 -264 -53
7606e3J22nJ01J53l17j78J01K79j80M2o1j8j07lJ84l13K95j89k45M95k45J88q7
$$ -53 69 64 165 318 1 -177 -76 203 23 65 4 -14 -121 -124 60 -253 42 -147 -392 103 -142 46 -41
7629d1pR4k80L61L0k10M0J31r1r4j42O6K42n8Q8n8j50J56j40K79j64n2j11J25
$$ -41 -48 46 -234 127 157 -53 -13 118 27 -67 -209 -143 99 41 129 71 -79 77 -63 216 52 0 -111 14
7653A4jn7n3J28j10l4K1L07k28j52K52nJ09k84L09k00J09k38J39Q9J4j67j92J11
$$ 14 13 -44 -97 31 -79 -113 -92 215 -13 -165 87 82 191 -93 216 16 125 -113 26 115 129 -38 -230 -119
7677a19J24l6q5K48p2L1o1j71M3M13k30j1j7N1o8o8l9R9j54J83j53J78m1N9k26
$$ -119 5 -31 -116 132 60 91 30 -141 -98 315 85 74 57 108 40 -28 -67 32 -122 61 -92 86 45 104 -122
7702a22m3J07J40j38q5K95j41L6N7mj59J42k36L48l37K58n5N3J25k52K60j66O3
$$ -122 -165 -58 82 -56 -141 154 13 49 106 102 -57 85 -151 197 -140 118 63 116 241 -11 249 83 146
7725A46J08Ok60K80j44k50J34K13j59k67P3K4O1J66l52K47n0J85k83j25O01m68
$$ 146 254 260 0 280 136 -114 20 233 74 -193 -120 -96 -35 131 -221 26 -24 161 -122 -247 354 -114
7747a14J3N4k17K99r5J01R3j32p6O5K08P1l28O4J57N2l26n2J61p3K11k86K54Q5
$$ -114 -101 -47 -264 35 -60 41 134 2 -74 -9 199 270 -58 6 163 215 -111 -163 -2 -75 136 -150 104 189
7771A89l28R9K11j67J16l20Q6K50p1M1j97J56k9m9OK33n8n04L22n4P2L5j59O8
$$ 189 -139 -40 171 4 120 -200 -114 136 65 106 -91 65 36 -13 -7 226 168 -336 -14 -68 4 39 -120 -52
7795e2M3j07K20j29L03k15L2P1k18J3J88P9l7k24m8j23O8J78r4J0nk3N7J10k28
$$ -52 -9 -116 104 -25 278 63 95 166 -52 -39 149 228 191 -33 -81 -204 -136 42 -52 -42 -47 -70 -13 97 -131
7820a31k0L00j12k11K38r7R5j61J80Pp9M9p7j63J53Kqj76J27l0L34r3j58R7j52
$$ -131 -151 149 37 -174 64 -33 62 -99 81 88 9 58 -19 -182 -29 -27 -35 -211 -84 -114 220 127 -31 66 -86
7845h6N4j67L89k17j4n6O3J37L1nl8j14Q1P2k06J22K83k97J19k55j94N53j94j61
$$ -86 -32 -199 190 -27 -41 -97 -34 103 134 129 91 -23 58 130 -76 46 329 32 151 -104 -298 255 61 -100
7869a00k0J56j8J33k92n9K21k13J14K43j72l39O9K96o9J8k4K15j10K11l15n3k52
$$ -100 -120 36 18 151 -141 -200 21 -192 -78 165 -7 -346 -277 19 -50 -32 -56 159 49 260 -55 -108 -360
7892c60M18M7q2J4J59k36L1j85J07nN6j73K34k5po1J17j0l3K08k99q9K37Rk52
$$ -360 58 105 23 37 196 -40 -9 -194 -87 -92 -36 -209 25 0 -7 -68 49 39 6 214 -85 -174 63 72 -180
7917a80K66J05J06l99PK08p4K96l76j63L43q1J27j33o9J50j88J40j83K57O0k67
$$ -180 86 191 297 -102 -95 113 39 335 -41 -204 139 58 185 52 -17 133 -55 85 -98 159 219 -48
7939d8J51o8N0k69K23M3j55K88m3m8k64J55J11j54j9k64K31M9J16P9j60L4J7J18
$$ -48 103 35 85 -184 39 82 -73 215 172 124 -140 15 126 -28 -47 -311 -80 -31 85 164 4 38 55 173
7963A73j8j86L2J5K90k86j97K99l25J95j80L22j90j5m40M35j11K02M1M7j0k74
$$ 173 155 -31 1 16 306 20 -177 122 -203 -8 -188 134 -56 -71 -511 -76 -187 15 56 103 93 -181
7985a81L12o1R6j98P5M3j39j60K11n3K8J64j36J57j76K7jj15K23j99K18j64P9
$$ -181 131 70 166 -32 43 86 -53 -213 -2 -55 -27 137 1 158 -18 9 8 -107 116 -83 135 -29 50
8008E0k48K92J66l31O6M9J47j3k06Q3j61J88l28K71Q4J98l75R8j13J70J70n03
$$ 50 -198 94 260 -71 -5 44 191 178 -28 55 -106 82 -246 25 109 307 -68 30 -83 87 257 -246
8030b46M35j37p6J85m63K66P5J73o5j03r3n4J82j72P9J60L2k81J56l85M11j62
$$ -246 189 52 -24 161 -302 -36 39 212 147 44 -49 -103 79 -93 -14 146 178 -103 53 -332 79 -83
8052h3P2J19m6J12p6k47J97j62OJ27o6J63j59L4j0L06l59Q4Q9ol92J82l9K76k41
$$ -83 -11 108 62 174 98 -149 48 -114 -108 19 -47 116 -43 -9 -19 287 -72 12 101 95 -297 -115 -154 122 -119
8077a19mJ23k1N6j06j20J13K36m04J61L9l7L14k58K2O0J49k60p3r3Q3J19K64j80
$$ -119 -123 0 -21 35 -71 -191 -78 158 -246 -85 -46 -83 231 -27 -5 55 204 -56 -129 -222 -139 -20 244 64
8101F4j25L07l07L05l76J71j48K64l0j05l6N0M9j3k1j69K8K47j32n8L6j79J92
$$ 64 -61 246 -61 244 -132 39 -109 155 125 20 -16 34 83 70 49 -120 -92 155 23 -35 1 -178 14
8124A4M8j05N0k29M75j9k07%L6r9j09L75l72j19L50J26j14J05j34j50K82j99k29
$$ 14 62 -43 7 -222 253 234 27 27 63 -36 -145 230 -142 -261 89 215 101 206 72 -78 204 5 -224
8147b24M00K1j8k01p6L63k24k6j04K7j29K51O5j20J03Qj72m2j51K46J62j96K3
$$ -224 176 197 179 -22 -98 265 41 15 -89 -62 -191 60 125 5 108 116 -56 -98 -249 -3 159 -37 -14
8170a4p1J45L2k72l4O8Q4Q5j24M61l11n0%K03N6k51m0k23K29L5L2
$$ -14 -85 60 92 -180 -214 -146 -62 23 -101 360 49 -1 -1 202 258 7 -33 -256 -27 8 40
8191D0
$$ Imaginary data points
##PAGE= N=2
##DATA TABLE= (X++(I..I)), XYDATA
0@%%%%%%%%%%%%%qJ6j6J6j6K2l0L2m0M8n6O4p2Q8j04J20j36J55j77K01k28K58
$$ 0 0 0 0 0 0 0 0 0 0 0 0 0 0 -8 8 -8 8 -8 14 -16 16 -24 24 -32 32 -40 48 -56 64 -72 83 -94 107 -121 137
35A37k92L26l64M10m58N07n64O28o94P66q47R37j032J135j250J378j521J676j847
$$ 137 -155 171 -193 217 -241 266 -298 330 -364 402 -445 492 -540 595 -655 723 -798 878 -969
54i69K040k258K508k794L123l511L978m548N265o200P473r316J2238j7605L0682
$$ -969 1071 -1187 1321 -1473 1650 -1861 2117 -2431 2834 -3366 4107 -5209 7029 -10576 20106
69B0106j23928j72571K08964K21339M0090j76531j35648M5895J67457O0614q1873
$$ 20106 -103822 -276393 -67429 153910 194000 17469 -118179 -72284 95173 155787 73914
80G3914r4619K7976Q9262J6017j07292q1132O1578J29351J3393j32771j35447
$$ 73914 -20705 7271 96533 112550 5258 -75874 -14296 115055 128448 -4323 -139770
91a39770K2981J50379R1598p2475j27200l8056O6398P5871J6859k2456j2232j4155
$$ -139770 -116789 33590 125188 52713 -74487 -112543 -46145 29726 46585 24129 11897 -2258
103b258l3748n320O1822O7548j0626q9043o6806M0194Q9750J1050p3753m5323
$$ -2258 -36006 -41326 20496 88044 77418 -11625 -78431 -38237 51513 62563 -11190 -56513
115e6513L6674M5435l1041p5498J028J01471O3910p6177j28652j7909J26762J27607
$$ -56513 -19839 25596 -5445 -80943 -79915 21556 85466 9289 -119363 -137272 -10510 117097
127A17097k7059j45762p9708P4622J25708L3056q1507q4525J4694P6836K7719
$$ 117097 90038 -55724 -135432 -60810 64898 97954 16447 -68078 -53384 23452 51171
138E1171m5820m4549K0368O0796J3265o5068n5641L7894Q8941L3437o0976q2205
$$ 51171 5351 -39198 -18830 41966 55231 -9837 -65478 -27584 61357 94794 33818 -48387
150d8387p22Q1708N8456k7989o0473j9503K6960K3318j2677j8239J2790J0528
$$ -48387 -49109 32599 91055 63066 2593 -16910 10050 33368 20691 2452 15242 25770
162B5770l0061l8914J656L7987K3144k6991m4695p67L5255J0238k1769o526K9426
$$ 25770 -4291 -43205 -41549 -3562 19582 -7409 -52104 -52871 -17616 -7378 -29147 -35673 -6247
175f247K7957j9489m6862Q21O4883M7940k6979o1990k0518M4323M9429r088m5342
$$ -6247 21710 2221 -44641 -43820 21063 69003 42024 -19966 -40484 3839 53268 44180 -1162
188a162j4375K0912R283k0025k1974J2362L5002K073m6083l6184J8937N1171K7710
$$ -1162 -15537 5375 14658 -5367 -27341 -14979 20023 22096 -23987 -60171 -41234 9937 37647
201C7647k5738m7154n567L9011K9636n945j9363N31K0600N276l0481k0829L2480
$$ 37647 11909 -35245 -40812 -1801 27835 21890 2527 3058 23658 28934 -1547 -22376 10104
214A0104N0519k95o4271o0199K3035Q3607L4624o0400p6276k625O2967M0882l2363
$$ 10104 60623 60328 -3943 -64142 -41107 42500 77124 16724 -59552 -62177 790 41672 9309
227I309m9038J2215M6836K47n0551k4565M9202O8621q321q4385m9439N0120Q3068
$$ 9309 -39729 -27514 19322 19569 -30982 -55547 -6345 62276 53955 -30430 -79869 -29749 53319
240E3319J6835o0236n8103J0437M8580J4869k1530q981J4421L181k8046k8246
$$ 53319 70154 9918 -48185 -37748 10832 25701 4171 -4810 9611 12792 -15254 -43500
252d3500K1161N9259K0512n0254o1064q16N9468N1668j6086n6144k1284K7959
$$ -43500 -22339 36920 57432 7178 -53886 -54702 4766 56434 40348 -15796 -37080 -9121
264i121K7677o775j9925O026K9662Q20m9631l8049L5347P5767K3567o8305q7268
$$ -9121 18556 11781 -8144 -2118 27544 28364 -21267 -59316 -23969 51798 75365 7060 -80208
277h0208M339R4812O4779m0797q6431k5599N7688N6330j9105n2976M02M8458J5694
$$ -80208 -75869 18943 83722 42925 -43506 -69105 -11417 44913 25808 -27168 -26766 21692 37386
290C7386m7731m7603K9485Q0830K4121p2622p6178J4018Q2933N1972l6501p2125
$$ 37386 -10345 -57948 -28463 52367 76488 3866 -72312 -58294 24639 76611 40110 -32015
302c2015j7100M2545L4210q615k1987j268J4196n682k8875p140L5478L4295j2021
$$ -32015 -49115 -6570 27640 19025 -2962 -4230 9966 4284 -24591 -31731 3747 38042 26021
315B6021m7451l0512K3229N0147J6089l0109l1165l24K1043J2834o382l490J5348
$$ 26021 -21430 -51942 -28713 21434 37523 7414 -23751 -24075 -3032 9802 3420 -70 15278
328A5278P065k3778k7470R544M3545L0940k6815n9027j7489M5860M7952p239m7659
$$ 15278 22343 -1435 -28905 -19361 24184 55124 28309 -30718 -48207 -2347 45605 38366 -9293
341i293k7814K3323L3440p975l0202j063K8954J3852k8567l8142R057N2647K6024
$$ -9293 -37107 -13784 19656 11681 -18521 -19584 9370 23222 -5345 -43487 -34430 18217 44241
354D4241l5012m9095m266M3026L5876j2477l6200q858K0318J3070o974r708P047
$$ 44241 9229 -39866 -44132 -1106 34770 22293 -13907 -22765 -2447 10623 3649 -6059 988
367I88J6078k775k4083j1267J9271K4671J478k1932k0125N659J9778N705q989
$$ 988 17066 14291 -9792 -21059 -1788 22883 24361 2429 -17696 -12037 7741 13446 4457
380D457n971K276J893o327j0138N613K0963O987k0165k3470R12K6740K2240j0575
$$ 4457 -1514 762 2655 -3672 -13810 -8197 12766 19753 -412 -23882 -22970 3770 26010 15435
394A5435k8533o063K1469J6595q038j7350J226K2871Q463k5245k4336J3265L5143
$$ 15435 -13098 -19161 2308 18903 10865 -6485 -5259 17612 26075 830 -23506 -10241 24902
407B4902J1296l1043l8445M110L8225J7292k3160k9989p60K2609R386j8821j4765
$$ 24902 36198 5155 -33290 -29180 9045 26337 3177 -26812 -27572 -4963 4423 -14398 -29163
420b9163J6673K2916o628k7622j2274K5055L5241J032l1627j9402J6393K7914
$$ -29163 -12490 10426 3798 -23824 -36098 -11043 24198 25230 -6397 -25799 -9406 18508
432A8508Q070j5074j2787Q489J1354q404j3321N291K0179Q272k1190l1103m57
$$ 18508 26578 11504 -1283 7206 18560 10156 -3165 2126 22305 30577 9387 -21716 -22173
445b2173L2071K3127j4888l4215j3731J9762K5746l244k1987m860J5003Q562j3467
$$ -22173 9898 33025 18137 -16078 -29809 -10047 15699 12455 -9532 -14392 611 9173 -4294
458d294j7413J0394L2487R953l2564l4009Q771M3021K5933k3969m3853o553L2324
$$ -4294 -21707 -11313 21174 31127 -1437 -35446 -26675 16346 42279 18310 -25543 -32096 228
471B28K4004j2252k4651k284J8725N691k2329j5090J9281K9308j861l5437k6999
$$ 228 24232 11980 -12671 -14955 3770 9461 -12868 -27958 -8677 20631 18770 -16667 -43666
484d3666J8149M2959J2684k9350l0075L463K6911J6382j0178j3514N710J1767
$$ -43666 -25517 17442 30126 776 -29299 -25836 1075 17457 7279 -6235 -525 11242
496A1242m180j4538P84K1863J9208j1596l3100j1601K5244L0506J46k8743k3319
$$ 11242 7062 -7476 -6692 15171 34379 22783 -10317 -21918 3326 33832 33978 5235 -18084
509a8084P995K3377M144j5517q833O974P259j0001j8345L185K6868J3996k1314
$$ -18084 -10089 13288 17432 1915 -6918 56 7315 -2686 -21031 -17846 9022 23018 1704
522A704l2106l959L1268K9549r621l3352j2533K0113K1641k955j6604l803J5578
$$ 1704 -30402 -34361 -3093 26456 16835 -16517 -29050 -8937 12704 9749 -6855 -10658 4920
535D920O851j6682j4683J1767K4888O190k3401k6988N739L0821J5572j6046k2923
$$ 4920 11771 -4911 -19594 -7827 17061 23251 -150 -27138 -21399 9422 24994 8948 -13975
548a3975l640J6187J2048o257r574M348Q625l260j2042m350J3949J7556l485k2909
$$ -13975 -17615 -1428 10620 4363 -5211 -863 7762 4502 -7540 -11890 2059 19615 16130 -6779
562f779j1032J2805J9541L831j4622j3313N337J2661m95r060j715J0197O806j0062
$$ -6779 -17811 -5006 14535 18366 3744 -9569 -4232 8429 7934 -1126 -2841 7356 14162 4100
576D100j7715R80K1732J3033j3464k3296o512J9173J8775p600k2181n540J4686
$$ 4100 -13615 -12635 9097 22130 8666 -14630 -21142 -1969 16806 9206 -12975 -18515 -3829
589c829J1979q187j6857J823J9724R009j6538j8606N324K3453J3489j3547k2224
$$ -3829 8150 -37 -16894 -15071 4653 13662 -2876 -21482 -16158 7295 20784 7237 -14987
602a4987m6K0659J2353q412j4060j284J2184N016j0106q889O526J1187l33j2927
$$ -14987 -15033 5626 17979 9567 -4493 -5777 6407 11423 1317 -7572 -1046 10141 9808 -3119
616c119j0816O707J4873K226j2434q212M386Q847J555o934j744Q861N504q382
$$ -3119 -13935 -7228 7645 9871 -2563 -10775 -6389 2458 4013 -2921 -4665 4196 9700 1318
630A318j0378K572J4844J0047j0225j9879j976J8146J2637q603j7627m128J4105
$$ 1318 -9060 -6488 8356 18403 8178 -11701 -13677 4469 17106 8503 -9124 -13252 853
643H53J0745j0279j6011L187J8138Q074j5476k0988M495K6896J4226j6840k4516
$$ 853 11598 1319 -14692 -11505 6633 14707 -769 -21757 -17262 9634 23860 7020 -17496
656a7496k183K2609J8599q818k1377m166J5013J0079p405j3024J015J4118M764
$$ -17496 -19679 2930 21529 12711 -8666 -12832 2181 12260 4855 -8169 -7154 6964 11728
669A1728j4213j3314N431J6864P929j1433j6603l30J4672R425m895p746j363L878
$$ 11728 -2485 -15799 -10368 6496 14425 2992 -13611 -13941 731 10156 5261 -2485 -3848 30
683C0K213l958K10Q573L868q175j1675j071J3094J2048n837j7463n557J0831J0674
$$ 30 2243 -1715 -1505 7068 10936 2761 -8914 -9985 3109 15157 9320 -8143 -13700 -2869 7805
698G805k265j0673l051R470N845r137j1026O013J7034O655j5494j9955L458K4180
$$ 7805 5540 -5133 -8184 1286 7131 -2006 -13032 -7019 10015 16670 1176 -18779 -15321 8859
712H859J3727j2925k2418m393J7265J6234o696j6925k202J2042O768q382j1673
$$ 8859 22586 9661 -12757 -17150 115 16349 9653 -7272 -9474 2568 9336 954 -10719
725a0719L577J6521M378j5120j4772M400J7942J0156j0161j7755j871J3715Q957
$$ -10719 -7142 9379 13757 -1363 -16135 -11735 6207 16363 6202 -11553 -13424 291 9248
738I248l253q952k002N958K490o168l292P307P058k610j0890o430Q390J3357J29
$$ 9248 5995 -2957 -4959 999 3489 -2679 -5971 1336 8394 5784 -5106 -11536 -3146 10211 10340
753A0340j2339p155M737Q998J714p102l619O047M416n823q437K167J1317O738
$$ 10340 -1999 -9154 -4417 4581 6295 -807 -4426 1621 6037 214 -8223 -6056 5261 11999
767A1999r354j5270O69J5515R558o937j3765k978J1204R193o571j0095J573J0254
$$ 11999 2645 -12625 -11956 3559 13117 6180 -7585 -10563 641 9834 3263 -6832 -5259 4995
781D995L373r324j0411M942J5243L850j3549j2514L857J4751P772j0328j3143
$$ 4995 8368 -956 -11367 -6425 8818 12668 -881 -13395 -9538 5213 12985 2657 -10486
794a0486K010J2642M816p454q277K852J1127J964j0581p768O304J1459K246j1116
$$ -10486 -8476 4166 8982 1528 -6749 -3897 7230 9194 -1387 -9155 -2851 8608 10854 -262
808b62j0503M050J2742K703r278q402K615Q933K190p858n359N830P737j590p512
$$ -262 -10765 -6715 6027 8730 -548 -8950 -6335 2598 4788 -3070 -8429 -2599 5138 3548 -3964
823c964l921O973R322j720r230l270P109O055j788p122k113O722L632o306p369
$$ -3964 -7885 -912 8410 6690 -2540 -5810 1299 7354 5566 -1556 -3669 3053 6685 379 -6990
838f990K738Q221K354q065r685L332J1719L735q614q175K929J0553L654q099o818
$$ -6990 -4252 3969 6323 -1742 -11427 -8095 3624 7359 -1255 -9430 -6501 4052 7706 -393 -7211
853g211N880J0350L51j0208p556O511J2933J706j3786j0196N197J2281M067j0685
$$ -7211 -1331 9019 9370 -838 -8394 -1883 11050 12756 -1030 -11226 -6029 6252 10319 -366
867c66j1168L375J0640K662p835o957M081J0025J943r519o004P078J0637J493
$$ -366 -11534 -8159 2481 5143 -2692 -9649 -5568 4457 6400 -3119 -9123 -2045 8592 10085
881A0085r054p733L840J0468K391p539o334J551N030K88n111k096M237K441m490
$$ 10085 1031 -6702 -2862 7606 9997 2458 -3876 -2325 2705 2993 -2118 -4214 23 2464 -2026
896b026n723J271O842M995m652p761J015Q387M085l255m936J321O546P97o557
$$ -2026 -7749 -6478 364 5359 707 -7054 -6039 2348 6433 3178 -1758 -437 6109 6906 349
911C49l826N377P290j739j0823p470O502J1444K18j2239q871M572J0921L709q058
$$ 349 -3477 1900 9190 7451 -3372 -10842 -4340 7104 7322 -4917 -13788 -9216 1705 5414 -2644
926b644q200M232R976J647o618m671N293J0312O84j0281o631O876J0413J654r750
$$ -2644 -10844 -6612 3364 5011 -1607 -6278 -985 9327 10011 -270 -6901 -25 10388 12042 2292
941B292r793K754R945K378p101o924R79N425J650n201k600M382M342j636m915
$$ 2292 -7501 -4747 5198 7576 475 -6449 -5470 -45 1605 -3596 -6196 -1814 2528 892 -4023
956d023j268N857O248j729o246j279M900L817j405m559q39L410O57n195l387L412
$$ -4023 -5291 566 6814 5085 -1161 -2440 2460 6277 4872 313 -526 2884 3541 -1654 -5041 -1629
972a629M945p90p512n260M313R188N71p349n413L867Q637K214o227m800M394P383
$$ -1629 3316 2526 -4986 -10246 -5933 3255 3826 -3523 -8936 -5069 3568 5782 -445 -5245 -851 6532
988F532M54o759m978M564Q428m15r518o052M657Q157J212q356p434L933Q266J688
$$ 6532 6986 227 -4751 -187 8241 7826 -1692 -7744 -3087 5070 6282 -2074 -9508 -5575 2691 4379
1004D379o470m404K706P214J504n968k768M767N642k13n438l589M033N445p06
$$ 4379 -2091 -6495 -3789 3425 4929 -1039 -3807 960 6602 6389 951 -2638 1395 6840 6134
1019F134o694k394K969L011j491m763j618L860J701l480l236J253M392K472l888
$$ 6134 -560 -2954 15 3026 1535 -3228 -4846 -986 715 -2765 -6001 -4748 -356 2116 -1772
1034a772l775K352O161J374l884l024K199N495R10n596l590L424N284p68n686
$$ -1772 -5547 -3195 2966 4340 456 -2568 -369 5126 6036 440 -3150 274 5558 4790 -896
1049h96n060L399O540m88o993l892L722O010N57n799l376M380O145k99n233l127
$$ -896 -5956 -2557 3983 3495 -3498 -7390 -3668 2342 2899 -2900 -6276 -1896 4249 3950 -1283 -4410
1065d410M522O538l83p054l390M784N420o53n981m245L653N193j414n538k045
$$ -4410 112 6650 6267 -787 -4177 607 6027 5374 -607 -4852 -1199 3994 2580 -2958 -5003
1080e003L544L662j308n449p31N124L766k297m339j004M647M168j603m403l54
$$ -5003 -1459 2203 895 -4554 -5285 -161 3605 1308 -3031 -4035 612 4780 3177 -1226 -1580
1095a580L745J675j974k921J79L726P16m629l103J957M472N80m423m313K188N346
$$ -1580 2165 3840 1866 -1055 -876 2850 3566 -1063 -4166 -2209 2263 2843 -1580 -5893 -3705 1641
1111A641P46l695k486J661M352Q90m101j899L532L850r68m557k692L911N595j225
$$ 1641 2387 -1308 -3794 -2133 2219 3109 -992 -2891 641 4491 3523 -1034 -3726 185 5780 4555
1127D555o672k829M250M626l14n471l189L565M207j300m257j521L864M121k047
$$ 4555 -2117 -4946 -696 3930 3616 -1855 -5044 -1479 2728 1428 -2829 -4350 -486 3635 1588
1142A588n149p79M961M186k183m970j591M072M666j666m775j067L226K832j157
$$ 1588 -3561 -4340 621 4807 2624 -2346 -3937 135 4801 3135 -1640 -2707 519 3351 2194
1157B194l726l40L409J428k679l048O97L773J916k860l906L46M239J558k670k464
$$ 2194 -1532 -1872 1537 2965 286 -2762 -2065 1708 3624 764 -3142 -2796 1443 3001 331 -2133
1173b133J71L154O94l072j582J688L009p46l080k286L149L928n98m125j807K728
$$ -2133 -1962 1192 1886 -1186 -2768 -1080 1929 1183 -1897 -4183 -1034 2894 2296 -1829 -3636 -908
1189i08L534J72l593k080K848L420j330l087j190L103L065j655m773o36L968K698
$$ -908 2626 2798 -795 -2875 -27 3393 2063 -1024 -2214 889 3954 2299 -2474 -3110 858 3556
1205C556j741m110j533L386L296j781l679q27K982K726j694l431K72L313J760
$$ 3556 1815 -2295 -3828 -442 2854 1073 -2606 -3433 -451 2275 581 -2850 -2578 735 2495
1220B495k125k658K5L633K019k175l331O16L060J499j808k695K01K961P33k516
$$ 2495 370 -2288 -2263 1370 3389 1214 -2117 -1501 1559 3058 1250 -1445 -1244 1717 2450 -66
1236f6j512Q69K278N93k747k220J598L034o02k751j195J480K790j98l182q84K546
$$ -66 -1578 -709 1569 2162 -585 -2805 -1207 1827 1225 -1526 -2721 -1241 1549 1351 -1831 -2715 -169
1253a69K356n18k785q97K113K937q86l704J1K342K470j443k921q51K471K328j825
$$ -169 2187 1669 -1116 -2013 100 3037 2151 -1553 -1542 800 3270 1827 -1094 -1945 526 2854 1029
1270A029l130l48K752J575j817l681K04L241J818k209k347k65K906J838j803k299
$$ 1029 -2101 -2449 303 1878 61 -3620 -3416 -175 1643 -566 -2913 -3178 -272 1566 -237 -2536
1286b536P89K834J327j726k398J027K939J170k506k104J264K228J148k404k458
$$ -2536 -1747 1087 2414 688 -1710 -683 2256 3426 920 -1184 80 2308 3456 1052 -1406
1301a406J007K363K43k156j676R88K184Kk616j171J750K141o17k382j404K022
$$ -1406 -399 1964 2207 51 -1625 -637 1547 1549 -1067 -2238 -488 1653 1036 -1346 -2750 -728
1317g28K433n19k378q58J372K209o15k102o10K303J352j518k019j1K198J519j461
$$ -728 1705 1186 -1192 -2050 -678 1531 916 -1186 -1796 507 1859 341 -1678 -1689 509 2028 567
1334E67k852j13K663J597j549k288k74K153J772j975j903N45J845J085j361k161
$$ 567 -2285 -2398 265 1862 313 -1975 -2249 -96 1676 -299 -2202 -1657 188 1273 -88 -2249
1350b249Q01K833P81k011j946Q37K555J325j890k150R56K191M81j494j630R83
$$ -2249 -1448 1385 2166 155 -1791 -954 1601 2926 1036 -1114 -158 2033 2514 1020 -610 373
1366C73J925J12k314j408J492J786k76k225j427J177J977k82k001j012P46J872
$$ 373 2298 2410 96 -1312 180 1966 1690 -535 -1962 -785 1192 910 -1091 -2103 -1357 515
1382E15m8k094m40J456J315o20j813j95J477J951j041k242Q5J908J130o55j791
$$ 515 467 -1627 -2067 -611 704 84 -1729 -1924 -447 1504 463 -1779 -1694 214 1344 689 -1102
1399a102m34J729J440j096j662J60J395J199j482j556N69K216L02j596j290M64
$$ -1102 -1536 193 1633 537 -1125 -965 430 1629 147 -1409 -840 1376 1678 82 -1208 -744
1415g44J956J006j553j769P21J792L23j240j759Q77K024j59j748q45J273J324
$$ -744 1212 2218 665 -1104 -383 1409 1732 492 -1267 -390 1634 1475 -273 -1118 155 1479
1431A479L04k099j031J076J406J95j429j261J090J455j87j984o66J135J389o28
$$ 1479 1783 -316 -1347 -271 1135 1330 -99 -1360 -270 1185 998 -986 -1652 -517 872 244
1447B44j703n46J309J530n55j486l40J160Q32m3j572J5J367J068j061p02k28J261
$$ 244 -1459 -2005 -696 834 279 -1207 -1547 -387 445 402 -1170 -1155 212 1280 219 -483 -711 550
1465E50R29r28j184K32J389J00n51j296K08J010Q88j344j055N37J108M59j053
$$ 550 1479 551 -633 -401 988 1088 537 -759 -551 459 1347 3 -1052 -515 593 1052 -1
1482aj452Q55J726k14r96p07N86J090L09j421p99R70J250k09j368p58O76J479
$$ -1 -1453 -598 1128 914 -82 -789 -203 887 1196 -225 -1024 -54 1196 987 -381 -1139 -463 1016
1500A016k10j804p82J184J636m97j247q94J082J722n32j223m3P76J163l95j376
$$ 1016 806 -998 -1780 -596 1040 543 -704 -1598 -516 1206 674 -549 -592 184 1347 952 -424
1517d24j28J095Q46m50j154m29Q31Q93l48j521l29J059M64m72j054K3O92P96o05
$$ -424 -552 543 1389 939 -215 -644 187 1080 732 -789 -1118 -59 405 -67 -1121 -1098 -406 390 -215
1536b15p30K73Q93P55j045n85L07J059O13j115p53L85R64K14r49o98O69O95J3
$$ -215 -945 -672 221 976 -69 -654 -347 712 1325 210 -543 -158 806 1020 71 -627 42 737 750
1555G50j108n19P35R99j68j589l09J198O03J5j058n75J185R93n72q77o16Q56J259
$$ 750 -358 -877 -142 857 689 -900 -1209 -11 592 607 -451 -1026 159 1152 580 -297 -913 -57 1202
1574A202o60j083J27R32O29l97j297m39Q37J381q87q53m03R11O49l92p57J2M35
$$ 1202 542 -541 -414 518 1147 750 -547 -986 -149 1232 345 -508 -911 0 649 257 -500 -488 -53
1593e3P88n99q70L8O55R41r15r16j01J184K78n78m53j52P75M07o34n32N78O56
$$ -53 735 136 -734 -696 -41 900 -15 -931 -1032 152 430 -148 -601 -753 22 429 -205 -737 -159 497
1613D97J55q62k26N76P68j86q35j76O59N44n7r40m90P65L57m89m07l40N49P69
$$ 497 652 -210 -436 140 908 722 -113 -289 370 914 857 -83 -573 192 549 60 -347 -687 -138 631
1633F31k81j605M54R26M64l47j000k94J338O40o48q05q8P05O33J21j166r8J103
$$ 631 350 -1255 -801 125 589 242 -758 -1052 286 926 278 -527 -615 90 723 844 -322 -420 683
1652F83L10n24o70k67M69Q64o80q11J57L81O70n00p77J58O82p1o23m9j9N99N67
$$ 683 993 469 -201 -468 1 865 185 -626 -469 -88 582 82 -695 -537 145 74 -549 -598 -617 -18 549
1673E49q61k89N08N18O2o47k71L17P87k37n39j12M13L95J8n55m60M18R91q13m22
$$ 549 -312 -601 -93 425 487 -160 -431 -114 673 436 -103 -215 198 593 611 56 -404 14 1005 192 -230
1694b30m91N72L63l25n58r5P26K05l49k25j89N74N55p25m41J77J037M4l72m70
$$ -230 -721 -149 214 -111 -669 -764 -38 167 -182 -407 -596 -22 533 -192 -633 -456 581 625 253 -217
1714b17j18P32R19o02r99K14N94M09p75l80N4O87Q8n57n41m1O17N08p54o67L33
$$ -217 -335 397 1316 714 -285 -71 523 932 157 -223 -169 518 606 49 -492 -533 84 592 -162 -829 -496
1735d96O96j0k03m54P6P86m1n78k29M02K94k31j07m36M44L72o1o02K7K97K96P4
$$ -496 200 190 -13 -467 -391 395 354 -224 -453 -51 243 12 -95 -531 -87 285 224 -378 -351 -54 242 316
1757C16q42L2N31K45j11m78J39L59J95l03m46N04l5N96m13m81n6N85J47p0q49
$$ 316 -526 -494 37 282 171 -307 -168 191 386 83 -363 141 106 702 289 -192 -248 337 484 414 -435
1778d35lJ037r8l84n96O6P56J96l96l08o4N88K17l74q83M98N00K90m53j78l4K24
$$ -435 -438 599 501 117 -479 -413 343 539 143 -165 -229 359 576 202 -681 -183 317 607 154 -24 -58 166
1800A66J68n15k23K80J62j64j17m55L7N75N8k30l91L23M33L93l86k52J39L05K25
$$ 166 334 -181 -404 -124 38 -126 -243 -698 -661 -86 -28 -258 -649 -326 107 500 114 -138 1 306 531
1821E31m39nL33L8l69R7j74K38J14j73l54j92J28M91m69k28K67K57N14m95k32
$$ 531 92 87 420 458 89 186 12 250 364 191 -163 -355 -227 264 -205 -433 -166 91 605 110 -122
1842a22J96K49J64l34m01M07K71P3k91l09p8N75o4l74l14O5K61k0p1k57l1L57
$$ -122 74 323 487 153 -248 159 430 503 212 -97 -175 400 336 -38 -352 -287 -26 -46 -117 -374 -405 -48
1864d8j8m80n7M14N48l40L6l71M21K3J38k66l08M37k3J53k85p1J0N48o74k45J70
$$ -48 -66 -546 -603 -189 359 19 55 -316 105 128 266 0 -308 129 106 259 -26 -97 -87 461 -213 -458 -288
1887b88L60J14k26j53K08o4J69m0l03L46K73k32K8r1R3J46p7j83n50L14N61k3
$$ -288 72 186 -40 -193 15 -49 120 80 -223 123 396 164 192 101 194 340 263 80 -470 -156 405 382
1909C82p97K54K04j64K32k84k03L45K06L6m32j66K08N14k72l40k26L81J65R6k69
$$ 382 -415 -161 43 -121 111 -173 -376 -31 175 211 -221 -387 -179 335 63 -277 -503 -122 43 139 -130
1930a30J4O8L21p9l71r2K99L61l24n32M6N51L4j06l27N1N9N09j18m74J19J20J85
$$ -130 -116 -48 273 194 -177 -269 30 391 67 -465 -419 132 166 60 -267 -216 -157 352 234 -240 -121 -1 184
1953A84J3m93J58L51K24l14l12j21M04j32j23k42J84K74J59o0l15J72J59r0k0
$$ 184 197 -296 -138 213 437 123 -189 -310 94 -38 -161 -403 -219 55 214 154 -161 11 170 80 60
1974F0j58R4M45l34j66n7MO38j01l69k59L62k06M91p05K77m6P0P7j55l63K95J4
$$ 60 -98 -4 441 107 -59 -116 -112 526 425 56 -203 159 -47 444 -261 16 -30 40 117 -38 -401 -106 -92
1997i2K38l07l40L45K14J93l82J86j19O5R7j55k12K30K75K5m37J56J01q5n7r8
$$ -92 146 -161 -501 -156 58 251 -131 55 -64 1 98 -57 -269 -39 236 261 -176 -20 81 -4 -61 -159
2019a59J60j33Q9p1l64J58K90RJ39j71J3j95M29j03k29K10J41k60l5J15J1K55
$$ -159 1 -132 -43 -114 -478 -320 -30 -21 118 -53 -40 -235 194 91 -138 72 213 -47 -82 33 44 299
2041B99j42j74j80K2J07R3K42m78M60J08k57j3J0P1J33j08m85j18L78L50m84J76
$$ 299 157 -17 -197 -175 -68 25 267 -211 249 357 100 87 97 168 301 193 -292 -410 -32 318 -166 10
2063A0j17L28j47r4r0n4P9K1K36l98L93q2n5j16j03K61j73K51J27n50J63j1L7
$$ 10 -107 221 74 -20 -110 -164 -85 -64 172 -226 167 85 30 -86 -189 72 -101 150 277 -273 -110 -121 -84
2086h4R8M8J54m20P9j7q3K37P2j33L8M2j69N08j61m93L47R2Pl48K68K59j44j02
$$ -84 14 62 216 -204 -125 -142 -225 12 84 -49 -11 31 -138 370 209 -284 63 155 162 -186 82 341 197 95
2110I5j30kK14k67N7l11M07j8j93K97j75J9k7j71J43J18n9R6k24p6K25k19K34
$$ 95 -35 -37 177 -90 -33 -344 63 45 -148 149 -26 -7 -34 -205 -62 56 -3 93 -131 -207 18 -201 33
2133C3j09m3M4O8O4j49J05n7l3M5J13p5P9j98O6J69O4j85o2m1K25j61J12o2RP7
$$ 33 -76 -119 -75 -7 57 -92 13 -44 -77 -32 81 6 85 -113 -47 122 186 1 -61 -102 123 -38 74 12 21 98
2159I8j90jN4J65j86L33k57J49rJ15k79J62l97L34k02Q8R3k0jL02l71m7m6K94
$$ 98 -92 -93 -39 126 -60 273 16 165 156 271 -8 154 -243 91 -111 -23 70 50 49 351 -20 -67 -113 181
2183A81j70j51J44K10pk21j68j7K70M9n6k51K93m2N7k05oL31j87k1Q8j41j00K39
$$ 181 11 -140 4 214 207 -14 -182 -199 71 120 64 -187 106 64 121 -84 -90 241 54 33 121 -20 -120 119
2207A19k5q0j47J1J97P8K69l08Q2m72M56k43o9P2N4K22l21k1K11j31J7n0m0N6
$$ 119 94 14 -133 -122 75 153 422 114 196 -276 180 -63 -132 -60 -6 216 -105 -126 85 -46 -29 -79 -119 -63
2231f3J40j3o1k11L22k20K2q9j17L28O7j32P2m47M98N4q8j06l3K57k9m05J55R7
$$ -63 77 64 3 -208 114 -106 -84 -173 -290 38 105 -27 45 -402 96 150 62 -44 -77 180 151 -254 -99 -2
2255bK36l24R3O9K20l5j11rl51L65j84J65M4l29K63j38Q4P1k04K30m2k42P2J60
$$ -2 234 -90 3 72 292 257 146 137 -214 151 -33 132 176 -153 110 -28 56 127 -77 153 111 -131 -59 101
2279A01j11J5J91k53n9J30O8j22Q5j24N3j17j28J38K19pj22j95M72l35M0J68%
$$ 101 -10 5 196 -57 -116 14 82 -40 45 -79 -26 -143 -271 -133 86 79 -43 -238 234 -101 -61 107 107
2302A07k51J19L59k18Rk46K95m7J53j83j70j2K56j31J19k26j00K36k1Jj81K32
$$ 107 -144 -25 334 116 125 -121 174 127 280 97 -73 -85 171 40 159 -67 -167 69 48 49 -132 100
2324A00J2k8k7J05k42O3J69k59j51N27j75l38M34k40O1j70j01JM34p9o6r9K25
$$ 100 112 84 57 162 -80 -17 152 -107 -258 269 94 -244 190 -50 11 -159 -260 -259 175 96 30 -69 156
2347A56n3j70K36l21q6q9M76O6l41p0L26J25r1j63L1K27k81O0l95L19R7J85l74
$$ 156 103 -67 169 -152 -238 -327 149 215 -126 -196 130 255 164 1 32 259 -22 38 -357 -38 59 244 -130
2370a30O6M1NJ35n0j96p2J93K32l61j4n5L70j98p8K23k37M06R3k17q9J58l45L31
$$ -130 -64 -23 -18 117 67 -129 -201 -8 224 -137 -151 -206 164 -34 -112 111 -126 280 373 156 67 225 -120 211
2394B11k99M0l5K09j75K78l22J26Q5P9j05l90J80J65K64k52k39rL78J67k08P8
$$ 211 -88 -48 -83 126 -49 229 -93 33 118 197 92 -298 -118 47 311 59 -180 -189 189 356 148 226
2416B26J20k68j65J87J11k15q8L65j91l82L50M8L5k30k31L39k0J30J34nk52J31
$$ 226 346 78 -87 100 211 -4 -92 273 82 -300 50 98 133 -97 -328 11 -9 121 255 250 -2 129
2438A29J55k34k02J00K17jl86J39L3K01j98n7J42O4J25k75j72J74j82K44P9k76
$$ 129 284 50 -152 -52 165 164 -222 -83 -50 151 -47 -104 38 102 227 -48 -220 -46 -228 16 95 -181
2460a81J10l0K27k47K17n4J8j7j17O8J92q8J32r5j86N1J44l15J9P1k6K05j51j62
$$ -181 -71 -101 126 -121 96 42 60 43 -74 -6 186 98 230 135 -51 0 144 -171 -152 -81 -107 98 -53 -215
2484b15K32N7R8k08k76K87L4k4k74L04k87R3L40k48J29j9J56k65j08N8K40k20
$$ -215 17 74 172 -36 -312 -25 9 -15 -289 15 -272 -179 161 -87 42 23 179 -86 -194 -136 104 -116
2506a16K02k0j18o3J71p4K1j04K2r0R5r2K29j89K05J37L4r4N3k76K3N9p1L15j52
$$ -116 86 66 -52 -115 56 -18 3 -101 -79 -169 -74 -166 63 -126 79 216 250 156 209 -67 -44 15 -56 259 107
2531A07Q4k26l0n1J48L9O2n07L02J11J86k57o9m0L55k32n9J18m0J45j71j52m0
$$ 107 191 -35 -65 -116 32 71 133 -374 -72 39 225 -32 -101 -141 214 -18 -77 41 1 146 -25 -177 -217
2554b17L06j07J41j10K0J59r3p7j01J4K03J8k52K3j58R1K81L2j66j83K90j86j2
$$ -217 89 -18 123 13 33 192 99 22 -79 -65 138 156 -96 -73 -231 -140 141 173 7 -176 114 -72 -84
2577h4oL54k37nk3j93M33k49J12r0k25J45%p9J59k26J27N1J2n1J24j34K50l03
$$ -84 -90 264 27 22 -1 -194 239 -10 102 12 -213 -68 -68 -147 12 -214 -87 -36 -24 -75 49 -85 165 -138
2601a38K64j02q7J21P6k01o9L30l11L35n31M25J50l24R5k90pK53j1K97m45O0r6
$$ -138 126 24 -63 58 134 -67 -136 194 -117 218 -313 112 262 -62 33 -257 -264 -11 -22 275 -170 -110 -206
2624b06L87L1j37k64p5L92Qk45L07k31J59m9k95J12K78M1L5n80J97L65J01l11
$$ -206 181 212 75 -189 -264 128 136 -109 198 -33 126 77 -218 -106 172 213 248 -332 -135 230 331 20
2646B0r4M9J78n8Jj54J7J15k1J69j95L5j61L28k06j11o2J80M3r4j93J09K77p2
$$ 20 -74 -25 153 95 96 -58 -41 74 53 222 27 62 -99 229 23 -88 -150 30 73 -21 -214 -105 172 100
2670A00j38o2J35J38j91j3j62N8R2J5Lo3L1k41J86J11q3K67j82K1L9rN3k0k40
$$ 100 -38 -100 35 173 -18 -31 -193 -135 -43 -28 -25 -88 -57 -298 -112 -1 -84 183 1 22 61 52 105 85 -155
2695a55K34j61J21J46p4k24J11J56J4l33j56j6K22J57r5o4o9J0K47k07J86K29
$$ -155 79 -82 39 185 111 -113 -2 154 168 -165 -321 -337 -115 42 -53 -117 -186 -176 71 -136 50 279
2717B79k09K43k73N7R6n7l52K64k83K11n4R4k17J31K37J00l16N5MJ30l59J51j43
$$ 279 70 313 40 97 193 136 -216 48 -235 -24 -78 16 -201 -70 167 267 -49 6 10 140 -219 -68 -211
2740b11K43j8j08K19k03jJ66J0J26j91j32J45J10j88O8o8R8r8j66K54l74L35N1
$$ -211 32 14 -94 125 -78 -79 87 97 223 32 -100 45 155 -33 35 -33 65 -33 -199 55 -319 16 67
2763F7P4J9m0m6o1O1k04J49j25L18k19K58q7J51m30p6L66k09J46q6N7k69l1K89
$$ 67 141 160 120 74 13 74 -130 19 -106 212 -7 251 164 315 -115 -191 175 -34 112 26 83 -186 -217 72
2787G2l18K86m22J83M33l36K42n86O40M2m02M7K15Knj31L02k18l39O3J10K93k91
$$ 72 -246 40 -382 -199 234 -102 140 -446 194 236 -166 -119 96 98 93 -38 264 46 -293 -230 -120 173 -118
2810a18J34l9J51l61M05j11J26j84R0o6k7L27l07k67L11Q9m8n8j37K84k97J54
$$ -118 16 -23 128 -233 172 61 187 3 93 27 0 327 20 -247 64 153 105 47 -90 194 -103 51
2832E1n6pj9J92j11Mj66N8o6R4k47L32j88J25J79j57M0q3M9L6j86j96M84j7j41
$$ 51 -5 -12 -31 161 50 54 -112 -54 -120 -26 -273 59 -129 -4 175 18 58 -25 24 60 -126 -322 162 145 4
2857Dq8l2J06M7j1Nk40O46o27R0j8K28r7L61n58j63K39J00J73l6l34K40o3K55
$$ 4 -84 -116 -10 37 26 31 -209 437 -190 -100 -118 110 13 374 -184 -347 -108 -8 165 129 -205 35 -28 227
2881B27k14k7Kj56M33l00j0j43J63j86K02k74K66k18K83q0o7L6K18l40p9P0j22
$$ 227 13 -14 -12 -168 265 -35 -45 -188 -25 -211 -9 -283 -17 -235 48 -32 -99 -63 155 -185 -264 -194 -316
2904c16O11j72l80k12P86m24K37j14p2k2L13j77R9l5j04nJ9j63r0K57J20M1k35
$$ -316 295 123 -257 -469 317 -107 130 16 -56 -78 235 58 157 122 18 13 32 -131 -221 36 156 197 -38
2927c8j17J72K22k59K1j11Q8o2P8m0K4J94j44n1kJ11j38K46R3j72k12J23J14k71
$$ -38 -155 17 239 -20 1 -110 -22 -84 -6 -46 -22 172 28 -23 -25 86 -52 194 287 115 -97 26 140 -131
2951a31K08l03M38j39lm66L36J36R1r3j52N2M9J58l17J31n6J69j03J16k71L55
$$ -131 77 -226 212 73 70 -396 -60 76 167 74 -78 -26 23 181 -136 -5 -61 108 5 121 -150 205
2973B05k10K50l87L68l60L80j52p5r9K49m0k38L15l26K28o2q1J64j84j8J52j56
$$ 205 -5 245 -142 226 -134 246 94 19 -80 169 129 -109 206 -120 108 46 -35 129 -55 -73 79 -77
2995g7J27q4J48k36l3K64o5p9mJ4m18M02J16ml3l24J40J27Q9Q6j56n5J98o7j6
$$ -77 50 -34 114 -122 -155 109 44 -35 -39 -25 -443 -41 75 71 38 -286 -146 -19 70 156 0 -55 143 76 60
3020F0J16l29M76j99j07j35J21k2J77J73n72L72j25r5L10k81L31n6k91q2J39K98
$$ 60 176 -153 323 124 17 -118 3 -19 158 331 -241 131 6 -89 221 -60 271 215 -76 -158 -19 279
3042B79j51J51l30k9M8j51L18j07k75J83J29J32m15J13K26l17j31M00k83J60K14
$$ 279 128 279 -51 -80 -32 -183 135 28 -247 -64 65 197 -218 -105 121 -196 -327 73 -210 -50 164
3063A64r4j08j42J32J06qj28J00J12j36j52k0j4J71J39j55j79o3K63K17l74J32
$$ 164 70 -38 -180 -48 58 50 -78 22 134 -2 -154 -174 -188 -17 122 -33 -212 -275 -12 205 -169 -37
3085c7J23l06K03M1j27J37q2q6j16K05p3K19j09j51o0J56K52N5Ro00L00L66m54
$$ -37 86 -220 -17 24 -103 34 -48 -134 -250 -45 -118 101 -8 -159 -219 -63 189 244 253 -347 -47 319 -135
3108a35Q4j89J40R7r0l2K11j88J65J79n50J66J18L2l0j4P4Q5q5%K2j04J21p5q1
$$ -135 -51 -240 -100 -3 -93 -125 86 -102 63 242 -308 -142 -24 8 -22 -36 38 123 38 38 60 -44 77 2 -79
3133g9J85j54J92k31j52J48p6L76k95p0J31OJ50j71J6o0J21J08Lk00J31J61l20
$$ -79 106 -48 144 -87 -239 -91 -167 209 -86 -156 -25 -19 131 -40 -24 -84 37 145 148 -52 79 240 -80
3156h0P0K8m9L85l40r9k8oJ05J72Jk71j70L41j33J79j5j56j18L12M9r3k67N34
$$ -80 -10 18 -31 354 14 -85 -113 -119 -14 158 159 -112 -282 59 -74 105 90 -66 -184 128 177 84 -183 351
3180C51l81J75l19K21r5K02j31k64O0K6K74m28L28j37M73j69l08J47J07J0j66
$$ 351 -30 145 -174 47 -48 154 23 -241 -181 -155 119 -309 19 -118 355 186 -122 25 132 142 -24
3201b4o0J5J05r7J15P1%p2L2pj92J22n1l1L11l99L15j34Q2j04O3nJ09k20m9J29
$$ -24 -84 -69 36 -61 54 125 125 53 85 78 -114 8 -43 -74 237 -162 153 19 101 -3 60 55 164 -56 -105 24
3227B4k90J16L6L66m61n5K07Q0j13l06M61k32J28N1P9l62K58N6j64q8pL62p0M0
$$ 24 -266 -150 -114 252 -209 -264 -57 23 -90 -396 65 -167 -39 12 91 -271 -13 43 -121 -209 -216 146 76 116
3251A16k44M4j3K74k35j19k6L08k36L2J12l8N1P3l06K02L3j52L47m29K24k0J73
$$ 116 -128 -84 -97 177 -58 -177 -203 105 -131 -99 13 -25 26 99 -207 -5 28 -124 223 -206 18 -2 171
3274A71J72j10l68J17J48k6j3k71L36m6j04n6j03J94j50K09k78J59p6K13j68J66
$$ 171 343 233 -135 -18 130 104 91 -180 156 110 6 -50 -153 41 -109 100 -178 -19 -95 118 -50 116
3296A16n40L21O6J34jj28J14k09O5L4J10j26L55l99J07J26Oj45n4j14J6J91j43
$$ 116 -424 -103 -37 97 96 -32 82 -127 -62 -28 82 -44 311 -88 19 145 151 6 -48 -162 -146 45 -98
3319i8j37K27l04L29K4n3K10l91L89j14j98q1J99R4k4m9j04K8J96l02J5J84j30
$$ -98 -235 -8 -312 17 41 -12 198 -193 196 82 -116 -197 2 96 72 23 -81 -53 143 -159 -144 40 -90
3342i0J56K64l18j01L77l15J0j39L61P3l86J87J86k16j06L41j97l17P1K17j36
$$ -90 66 330 12 -89 288 -27 -17 -156 205 278 -108 79 265 49 -57 284 87 -230 -159 58 -78
3363g8J54k27N4J11K7Q7n02L95k49q5K33N4J58j56O0M6k01M2K30k12k57J69K5
$$ -78 76 -151 -97 14 41 128 -374 21 -228 -313 -80 -26 132 -24 36 82 -119 -77 153 -59 -316 -147 -122
3386a22P2r7j16R3R8J10j6r9J21l8J7J30J50j20k03K5Rj32N9J05M07l81m4R8j30
$$ -122 -50 -147 -263 -170 -72 38 22 -77 44 6 23 153 303 183 -20 5 14 -118 -59 46 453 72 28 126 -4
3411dK12k47j16J58o3J2L95m74K08kj92n1L44l11M14j79J6Rj66R8M13n29K66k94
$$ -4 208 -39 -155 3 -60 -48 347 -127 81 79 -113 -164 180 -131 283 104 120 129 -37 61 474 -55 211 -83
3435h3k40N07j63k20J8L95l83L41k90K31k09L4O4p8j36K69n3Lj50l0JJ06o5J56
$$ -83 -323 184 21 -199 -181 214 -169 172 -118 113 -96 -62 2 -76 -212 57 4 7 -143 -173 -172 -66 -131 25
3459B5N3k42K15j71M8P8M6K68j70j65j77L94m95J28j0k0N37j94j70kk10M18k45
$$ 25 78 -164 51 -120 -72 6 52 320 150 -15 -192 202 -293 -165 -175 -195 342 148 -22 -24 -234 184 -61
3482f1k8j50J79k04M38j27j39J17o1J86k33J43J7j89J22J01m6j30j7L24k60K90
$$ -61 -89 -239 -60 -264 174 47 -92 25 -36 150 -83 60 77 -112 10 111 65 -65 -82 242 -18 272
3504B72m43L49mo2k04pP4J4j16K66K7j75j88J93J45k84J95j69j07K66p3J83j44
$$ 272 -171 178 174 112 -92 -99 -25 -11 -127 139 166 -9 -197 -4 141 -143 52 -117 -224 42 -31 152 8
3527Hj84K57j87J25J67k37k88L72Q3j79J79k00J14Nj88n5L32L6k15k02J13Q6J76
$$ 8 -176 81 -106 19 186 -51 -339 33 116 -63 116 -84 30 35 -153 -208 124 160 -55 -257 -144 -58 118
3550A18j74j30R1MK22q7j8J14k80O3q8n9L39p3K52l07r9L61k17nM9m9PoK52k35
$$ 118 -56 -186 -95 -91 131 44 26 140 -140 -77 -165 -224 115 42 294 -13 -112 249 32 27 76 27 34 28 280 45
3576D5j71Q2n0J24M4n4k01k11L58J67l10J98o6K10j37P6k65K32jp5n7K15n5J03
$$ 45 -126 -44 -94 30 74 20 -181 -392 -34 133 -177 21 -45 165 28 104 -161 71 70 -5 -62 153 98 201
3600B01k87K73l63J86p0jO0J46N9o7k47n9O24m41k1p0R9P9l19L56n65N15k94M80
$$ 201 -86 187 -176 10 -60 -61 -1 145 204 137 -110 -169 455 14 -7 -77 22 101 -218 138 -427 88 -206 274
3624B74k56J06P4j74K35j85k80P5k1O1O4j13R0P7j18r3K23K14Ql79O7QJ06Rl9
$$ 274 18 124 198 24 259 74 -206 -131 -152 -91 -27 -140 -50 27 -91 -184 39 253 261 -118 -51 -43 63 72 33
3649C3J09k38J81j37L76l16j33J70l79L16j85K57k19J5J39N6m8j76O3J68mk15
$$ 33 142 -96 85 -52 324 8 -125 45 -334 -18 -203 54 -165 -150 -11 45 -3 -179 -116 52 48 -167
3671a67K78q4o8k26N36k97J03q9j64J22J14J42j18j20j88J08O8j0J32N8k35j23
$$ -167 111 27 -41 -267 269 -28 75 -14 -178 -56 58 200 82 -38 -226 -118 -50 -60 72 130 -105 -228
3693b28M39l98M57j20n4M4n0O9j5M2l64K03o7Q3O1j80R5J92Pl12o8J81Q4N7r8
$$ -228 211 -187 270 150 96 140 90 159 144 186 -178 25 -42 41 102 -78 17 209 216 -96 -164 17 101 158 60
3718F0o0j43O8j18J34n9j41J95n1p6K78r6J82k0J7j95K96m29L53k0k56k5L2J2
$$ 60 0 -143 -75 -193 -59 -118 -259 -64 -115 -191 87 -9 173 153 170 -25 271 -158 195 175 -81 -106 -74 -62
3742f2j6Q0q3K18R5k17m52K93J84L6j46K79l68M96k99P8j78K46k54J43j5p4n3
$$ -62 -78 2 -81 137 232 15 -437 -144 40 76 -70 209 -159 337 38 116 -62 184 -70 73 58 -16 -69
3765f9K62k6l86L54M7M5j36j65K56k41j4PRr1N0N15l23r4l0j19mK82n53L46j6
$$ -69 193 167 -219 135 182 227 91 -74 182 -59 -73 -66 -57 -148 -98 417 94 0 -30 -149 -153 129 -424 -78 -94
3790i4J14l7J9J04m5Q3j54P9O3k33L03k02p8L1q6m4K05n0k38K78K00P3l84K08
$$ -94 20 -17 2 106 61 144 -10 69 132 -101 202 0 -78 -47 -133 -177 28 -22 -260 18 218 291 -93 115
3814A15k08rJ9o5J29K25r1N1l82L59Q9o11M31n4J39J59k57k3m4p0K00j13J24k17
$$ 115 -93 -102 -83 -148 -19 206 115 166 -216 143 232 -379 52 -2 137 296 39 16 -28 -98 102 -11 113 -104
3838a04J10k4J88j79J08m8m0K32o00M49j94L47l11j1r5P6J26Q6j31k38L32N2k85
$$ -104 6 -18 170 -9 99 51 11 243 -357 92 -102 245 -66 -77 -172 -96 30 116 -15 -253 79 131 -154
3861a54J58P0k21L33%j84M0l3J00N3k81k13K43Q0R2j26k6J80J69j46q6j27J19
$$ -154 4 74 -147 186 186 2 42 9 109 162 -119 -332 -89 -9 83 -43 -69 111 280 134 48 -79 40
3884D0J53k25k19J85J32j56N7R2k23K15RK1l68r2M07J86n07L13k5Mj40J49j08
$$ 40 193 -32 -251 -66 66 -90 -33 59 -164 51 60 81 -287 -379 28 214 -293 20 -5 -1 -141 8 -100
3907a00K4N8jk4J05j31O0J82j32R3m08N40k41K6j88K26j24q4J08J96k77O8R3J13
$$ -100 -76 -18 -19 -43 62 -69 -9 173 41 134 -274 266 25 51 -137 89 -35 -119 -11 185 -92 -24 69 182
3931A82r5J44k25q3J0Q4k12q6K95l73L39K33j38j85M0K20k40J04n8j4J20p9K72
$$ 182 87 231 6 -77 -67 17 -195 -281 14 -359 -20 213 75 -110 -70 150 -90 14 -44 -58 62 -17 255
3954B55m35M7J23k21L64j84j41j52Q3K21l2K04n1j92J42O5q6N9j37J01J01k98
$$ 255 -180 -133 -10 -231 133 -51 -192 -344 -261 -40 -72 132 81 -111 31 96 10 69 -68 33 134 -164
3976a64K13l6JrK0j12Q2j72K65k18o9J44M1Q4M2p5p6r4M29k50j70O3jJ76j09K19
$$ -164 49 13 14 5 25 -87 -5 -177 88 -130 -199 -55 -14 70 112 37 -39 -133 296 46 -124 -61 -62 114 5 224
4002B24k27K95k59M9j52n6J65Q6n2M8KJ9j67j31J70j86PJ13J53J7q3j00K66j24
$$ 224 -3 292 33 82 -70 -126 39 125 73 121 123 142 -25 -156 14 -172 -165 -52 101 118 35 -65 201 77
4026G7J6O3k30J5J35L1J50N4k58J90l80N6N6Pk41M85o2kJ17n28L34j31K21k84
$$ 77 93 156 -74 -59 76 107 257 311 53 243 -137 -81 -25 -18 -259 226 164 162 279 -249 85 -46 175 -109
4050a09K1j5pj50K15J05J2j57N7J06j47q8R6k23K95Kq8J23J00k11J6K10j4j46
$$ -109 -88 -103 -110 -260 -45 60 72 -85 -28 78 -69 -157 -61 -284 11 13 -75 48 148 -63 -47 163 149 3
4074Ck69J66K35M9q3k97J06J94J0R4k34O1O3j34j94L26j38K7k28K80OQ4j13J02
$$ 3 -266 -100 135 184 101 -196 -90 104 114 208 -26 35 98 -36 -230 96 -42 -15 -243 37 43 127 14 116
4098A16j87K33l4J26l46L56j8o1k84K00j1p7N8j74O6Pk70L37m3j89K11N5r5n4
$$ 116 -71 162 128 254 -92 264 246 185 -99 101 90 13 71 -103 -37 -30 -300 37 -6 -195 16 71 -24 -78
4122g8J30n1P4k56M7L66O6m78J67J37l29m2J71K43l02o9L65k49O7J0k10R7J86
$$ -78 52 1 75 -181 -134 232 298 -180 -13 124 -205 -247 -76 167 -135 -204 161 -88 -21 -11 -221 -124 62
4145F2l9k4m1M8j77L97j12k05P9mLk43K64k76j5M40j80qK16j40j33J84J13j78
$$ 62 23 -1 -42 6 -171 226 114 -91 -12 -16 -13 -256 8 -268 -283 157 -23 -31 185 45 -88 96 209 31
4169C1N2j55L94l84J87o6J32o0k43k7K0L5j08M56k85k16J71k25k8M82k27j33J47
$$ 31 83 -72 322 -62 125 59 191 131 -112 -139 -119 -84 -192 264 -21 -237 -66 -291 -319 163 -64 -197 -50
4192e0J03j49L57l62K07J17j62K90m36J88n01M44q2pJ7n4J31j1j87l1M83k04j47
$$ -50 53 -96 261 -101 106 223 61 351 -85 103 -398 46 -36 -43 -26 -80 51 40 -147 -178 305 101 -46
4215d6l7J72J38o5k27J34k90M48l96N3K56j73O8k47Q2j53K57l2K08J9j65k19N03
$$ -46 -83 89 227 162 -65 69 -221 227 -169 -116 140 -33 35 -212 -130 -283 -26 -58 150 169 4 -215 288
4238B88n1l47J39K86l46M5j4j99J90K13m74K43j3j80N29k18p9k8J41j45R8J0o5
$$ 288 237 -110 29 315 -31 14 0 -199 -9 204 -270 -27 -40 -220 309 91 12 -16 125 -20 78 88 23
4261B3%jk84K43K03j22J5j62J94k35J45K8j01j06J9K04jp1K33k90j45L48k27J29
$$ 23 23 22 -262 -19 184 62 77 -85 109 -126 19 47 -54 -160 -141 63 62 -9 224 -66 -211 137 -90 39
4285C9k50K64r0O0j8r4o2j91J34J20L1k99L54k3j8J55k47J29N0R7Qj58KM8p9r5
$$ 39 -211 53 -37 23 5 -89 -151 -342 -208 -88 -57 -356 -2 -25 -43 112 -135 -6 44 141 149 -9 -7 41 -38 -133
4311a33mK49p5lk05J34L34l65l6K9J06j18n5K10j45p4J92j14L11k09np7m7J32
$$ -133 -137 112 37 34 -171 -37 297 -68 -104 -75 31 -87 -142 68 -77 -151 41 -73 238 29 24 -53 -100 32
4335C2j54q2Q3k59K71J00K09m33L2n6J00j1K63R1j61k64M39j28k28K06j32J66
$$ 32 -122 -204 -121 -380 -109 -9 200 -233 -201 -257 -157 -168 95 186 25 -239 200 72 -156 50 -82 84
4357H4n3L1k34L34k37J96k63K1J42ml7j7q0K23J1j73j2j37L66Q6j39j45J20k53
$$ 84 31 62 -172 162 -75 121 -142 -121 21 17 -20 -37 -117 106 117 -56 -68 -205 161 247 108 -37 83 -170
4381a70L73j81N5J54j20j61j59J89J9j02Q4j92J86pMq7K09j84o2P1J23L3r9L1
$$ -170 203 22 77 231 111 -50 -209 -20 -1 -103 -19 -211 -25 -32 -28 -115 94 -90 -152 -81 42 75 -24 7
4405GL31n24N02l00N0r5k67J0L55J02j96L7q5K70r7r2j08J41k8J5O2K06l77J41
$$ 7 338 -186 316 16 66 -29 -296 -286 69 171 -25 12 -73 197 100 8 -100 41 13 28 90 296 -81 60
4429F0q7J91k3l48K7M8J52k7J5R5r5k14M01l73j56M38j14J0P2l0M7kj19l55K87
$$ 60 -27 164 141 -207 -180 -132 20 -7 8 103 8 -206 195 -178 -334 104 -10 0 72 42 89 87 -32 -387 -100
4454a00J87K4J93l49j27L24O3k12k53M8L84j96L6J03j94K5J71p6j95K88j00L7
$$ -100 87 111 304 -45 -172 152 215 3 -250 -202 182 -14 22 125 -69 -44 127 51 -144 144 44 81
4476H1j39N5J87o0J1l86R1K72l1Pk51J54J98K46m30k5o5J09M4K21k52M9p4j40
$$ 81 -58 -3 184 124 135 -251 -160 112 81 88 -163 -9 189 435 5 -20 -85 24 68 289 37 86 12 -128
4500a28M74n7j18r1k12L27k58j99M05n0J6k36K94R1j62k37J4j59J40K74r9l5J66
$$ -128 346 289 171 80 -132 195 -63 -262 143 93 109 -127 167 258 96 -141 -127 -286 -146 128 29 -6 160
4523A60J06l15K69q0j50j3j63J95k28J58J61r8J07N8k18k2j33L89r4n8ko3P4j70
$$ 160 266 -49 220 140 -10 -23 -186 9 -219 -61 100 2 109 167 -51 -73 -206 183 89 31 29 -34 40 -130
4547a30J75J54k03J25k89L11o6O7k54p4N8oQ9K20m32J48J60k9P8j11m9P0l9M0
$$ -130 45 199 -4 121 -168 143 77 144 -110 -184 -126 -132 -43 177 -255 -107 53 24 102 -9 -58 12 -27 13
4571A3k23J78J1l9J3p3L20n5j88J38k9%q2j12J43m40K29L66P0l63J03Q3k98J84
$$ 13 -210 -32 -21 -60 -47 -120 200 145 -43 95 66 66 -16 -128 15 -425 -196 170 240 -123 -20 63 -235 -51
4595e1o1J02l8R1K44k81o6J09J82j20j15J38L3p6n3j78J10J3j49LK14J1O3k21
$$ -51 -112 -10 -48 43 287 6 -60 49 231 111 -4 134 167 91 38 -140 -30 -17 -166 -163 51 62 125 -96
4619i6k74N41j10J0j27J8p9J43oj49L16p6q2N9j73K3k3L5L4J04L9m64N51j9J34
$$ -96 -370 171 61 71 -56 -38 -117 26 20 -129 187 111 29 88 -85 -62 -85 -50 -16 88 127 -337 214 195 329
4644C29l63J06l6j16lL21R2m57L4KL57j14j32n6k8J63pQ6j25K9k3j07L04j35l4
$$ 329 -34 72 36 -80 -83 238 330 -127 -93 -91 266 152 20 -36 -64 99 92 178 53 82 59 -48 256 121 87
4669H7j00j08N09n88K06P7p1n8K02j61L75l74R4k3j73R0o2L22m57N2K20j2r4J
$$ 87 -13 -121 388 -200 6 83 12 -46 156 -5 370 -4 90 67 -106 -16 -78 244 -213 -161 59 47 -47 -46
4693d6J15J46k08j74l1J48K8l8%N0K57k97o7K42j73K9J94L50m81l39L42J50l10
$$ -46 69 215 7 -167 -198 -50 -22 -60 -60 -10 247 -50 -117 125 -48 -19 175 525 44 -295 47 197 -113
4716a13K65l6l62L65k2K0k08K38m37J41L61l36Q6J02J22j41J92j51k73R1o1K22
$$ -113 152 116 -246 119 97 117 -91 147 -290 -149 212 -124 -38 64 186 45 237 86 -187 -96 -157 65
4738F5o0J47k70M0j58J93L07k09N0j60m6l3J63l3o2J12j07J75r7j58N5J06k49
$$ 65 5 152 -118 -78 -236 -43 264 55 105 -55 -101 -134 29 -4 -66 46 -61 114 17 -141 -86 20 -229
4761b29M88k28M8k5K08j85l17J2L09r7k39K95J00l58K66K6j18KR8P1l09K9O5K60
$$ -229 259 31 79 54 262 77 -240 -228 81 -16 -255 40 140 -218 48 74 -44 -42 56 127 -182 -153 -88 172
4785A72k09P0N8k12M8J39k26M15m46J93r1k5K26k63N0K62m51L00J69o48N54Ok75
$$ 172 -37 33 91 -121 -73 66 -160 255 -191 2 -89 -114 112 -151 -101 161 -290 10 179 -469 85 91 -184
4808a84L25j45j42J05j28O2O9J6p3R8K02k36N1J81r5J05r5K36l76O0LJ60k24K88
$$ -184 141 -4 -146 -41 -169 -107 -38 -22 -95 3 205 -31 20 201 106 211 116 352 -24 36 39 199 -25 263
4832B63mk94l12L83o9O9q4q3L00j34j31K33j52J28k00K75n3l65O1O4K19j26M7
$$ 263 259 -35 -347 36 -33 36 -48 -131 169 35 -96 137 -15 113 -87 188 135 -230 -169 -105 114 -12 35
4855C5n0j90J33K66j83J44j69k8j21K36o7K78k90J11k31P4n4pM29j84O6j02l5
$$ 35 -15 -205 -72 194 11 155 -14 -42 -163 73 6 284 -6 105 -126 -52 -106 -113 316 132 198 96 61
4878F1j12j00l7J18q0L27K0j74Q2j76K21p5R2q3J0K17k26J1K1j02Nl82J12oL60
$$ 61 -51 -151 -188 -70 -150 177 197 23 105 -71 150 75 167 84 94 311 85 96 117 15 20 -362 -250 -256 104
4903A04k49k3K24J62l42J17J13j48J07l60K29j53R7J82l7%q8J35J83j52j86j06
$$ 104 -145 -168 56 218 -124 -7 106 -42 65 -295 -66 -219 -122 60 23 23 -65 70 253 101 -85 -191
4925a91L77p5J23m85qJ40J5K50j22M6Q2j25J45k52L4q5p9jM12l53K1J52q7L14
$$ -191 186 111 234 -251 -259 -119 -104 146 24 70 152 27 172 -80 -46 -131 -210 -211 201 -152 -131 21 -66 248
4949B48k38j09J76l08K41L2n4K6J27P1k33K15k29k18K84K5n06M85Q1J47l77J40
$$ 248 10 -99 77 -231 10 42 -12 14 141 212 -21 194 -35 -253 31 56 -450 35 116 263 -114 26
4971B6J77j24k98K65J24l16J76oRJ99l39J42oj24J13Lk33O14m63q6J94J5j46P3
$$ 26 203 79 -219 46 170 -146 30 24 33 232 -107 35 29 -95 18 21 -212 402 -61 -147 47 62 -84 -11
4995a1L5j71K63q8J96m10L54l14K38r4m0K38k49k4l60L42K06p8J5L9%K6k02l09
$$ -11 24 -147 116 28 224 -186 168 -146 92 -2 -42 196 -53 -77 -437 -95 111 33 48 87 87 113 -89 -398
5019c98L98JJ33Jk79M7m4qJ55K05k65J0L42k98J14k32p3N9K78K47l87j3m04L62
$$ -398 0 1 134 135 -144 -97 -141 -149 6 211 -54 -44 298 0 114 -118 -191 -132 146 393 6 -7 -411 -49
5043d9L2q9K86j24j23k77K15J7J75K10l71jJ04QP5qj04j20j30K48j08K82N2l33
$$ -49 -17 -106 180 56 -67 -344 -129 -112 63 273 -98 -99 5 13 88 80 -24 -144 -274 -26 -134 148 200 -133
5067a33M41q0j92q4J63JR1k99l6j80L16R8j80L9NR3j42K44Rm46K24J7j4j73K17
$$ -133 308 228 36 -48 115 116 207 -92 -128 -308 8 106 -74 -35 -30 63 -79 165 174 -272 -48 -31 -45 -218 -1
5092aJ37k96J98lj3L6p3k13O5J40j06J19q4J66l6J50j64o8o0N65m85O4K86l79
$$ -1 136 -160 38 35 22 58 -15 -228 -163 -23 -129 -10 -94 72 36 186 22 -46 -106 459 -26 38 324 -55
5116e5J82p6J58Jk64n4N1j6O3L32m53P0p9j86L50o2R8j7j20n7L49m24K09mq1l4
$$ -55 127 51 209 210 -54 -108 -57 -73 -10 322 -131 -61 -140 -326 24 -38 60 43 -77 -134 215 -209 0 -4 -85 -119
5142a19L31q7j94J08j86J63J2J1j02J64J46q0j75K48m18J50J31M9k37j21K98p4
$$ -119 212 125 -69 39 -147 16 28 39 -63 101 247 167 -8 240 -178 -28 103 152 -85 -206 92 18
5164A8k91M47k51R0n4J92j70K7P1Jj21J23J38r0k64l6J55R3k53Q3J87P8k14q8
$$ 18 -273 174 -77 13 -41 151 -19 8 79 80 -41 82 220 130 -134 -170 -15 78 -175 -92 95 173 -41 -129
5188a29Q4%k04K67L09k93k55P4L45l29j17J88K11k31L5qL93q11L81K87k47J29
$$ -129 -45 -45 -249 18 327 34 -221 -147 198 -131 -248 -60 151 -80 -45 -53 340 -471 -90 197 -50 79
5210G9j95K31Q5k33RJ94j65n0l0M4NO1N0q9J44j98L7k09M35j20j42J26j91R2J58
$$ 79 -116 115 200 -33 -24 170 5 -45 -75 -31 -26 35 85 -4 140 -58 -21 -230 205 85 -57 69 -122 -30 128
5235A28qj89o0J33l9j22J85j67K62j28j64O9J52M1k34Qj19N75k39j75J17Q9or5
$$ 128 120 -69 -129 4 -35 -157 28 -139 123 -5 -169 -100 52 93 -141 -133 -252 323 84 -91 26 115 109 14
5259A4j92K62J46j23r2J94jj95J93j66m8j72j24Q6K56K54l81K63j9j34l2k8j18
$$ 14 -178 84 230 107 15 209 208 13 206 40 -8 -180 -304 -218 38 292 -89 174 155 21 -11 -39 -157
5282a57K62j66J73l63K10j8j3K43p5m5m15J56K43j40J99j74j71J93o5R1l2M8N3
$$ -157 105 -61 112 -251 -41 -59 -72 171 96 51 -364 -208 35 -105 94 -80 -251 -58 -123 -32 -64 -16 37
5305C7n5j85J36J56K0k46nK28j14m3K8M31m23L4K5J26lk05K55l03K20k90K04o9
$$ 37 -18 -203 -67 89 109 -137 -142 86 -28 -71 -43 388 -35 -1 24 150 147 -58 197 -106 114 -176 28 -41
5329d1q0p9J74J38j94N9J79l23OJ54J58p7J64l34O1k4J79l9j39Q2j64K07j06k42
$$ -41 -121 -200 -26 112 -82 -23 156 -167 -161 -7 151 74 238 -96 -35 -59 120 81 -58 24 -140 67 -39 -281
5353b81N79j15j81L11m95K51K7j13Pk90K90j34L25k03J30k08p0PJ13K9j52K43
$$ -281 298 183 2 313 -182 69 96 -17 -10 -300 -10 -144 181 -22 108 -100 -170 -163 -50 -21 -173 70
5375G0N8k03J44pJj94o2K39j13j92L65j34Q7p0J95o8j91P0j68K07q8P3J4l6l25
$$ 70 128 -75 69 62 63 -131 -193 46 -67 -259 106 -28 59 -11 184 116 -75 -5 -173 34 -54 19 33 -3 -328
5400c28M45j94J73M7j56j92M18k60J37O1j7o3k6n6J57k00j09L4P3K20o9j85J58
$$ -328 117 -77 96 143 -13 -205 213 -47 90 151 134 71 45 -11 146 -54 -163 -129 -56 164 95 -90 68
5423F8J60k44n6J6j75K15k6J7j37L62k12O9j87L8l1R2k1R1J9k72J48J12j73J41
$$ 68 228 -16 -72 -56 -231 -16 -42 -25 -162 200 -12 57 -130 -92 -123 -31 -52 39 58 -214 -66 46 -127 14
5447A4J81l44L87k44K1J49r5J80k59O1L0j43M6O5No8N8j85K47j40J21o4L6k02
$$ 14 195 -149 238 -6 15 164 69 249 -10 51 81 -62 -16 49 54 -14 44 -141 106 -34 87 23 59 -143
5471a43K17k1j12Q8l2J72l05L0P6j25K30k61K91O3k00k01J86M4j12K1J40o0%J44
$$ -143 74 53 -59 29 -3 169 -136 -106 -30 -155 75 -186 105 168 -32 -233 -47 -3 -115 -94 46 -14 -14 130
5495A30k48K22k30K7J50o5K84k23L1M2J56l87J56m4l1k10N29j82j30k70L19M4
$$ 130 -118 104 -126 -99 51 -14 270 47 78 120 276 -111 45 1 -30 -240 289 107 -23 -293 26 70
5517G0Pk05J46j06L67l12j1q3j8K98o6k54l4R9K97k66J50k0k4J99k55j92KK88
$$ 70 77 -128 18 -88 279 -33 -44 -127 -145 153 87 -167 -201 -102 195 -71 79 59 35 234 -21 -213 -211 77
5541G7k48K58L7j56J59j68J75j55K02j33l23K47r1q7J58K34l36pJ83j97K03q7
$$ 77 -171 87 124 -32 127 -41 134 -21 181 48 -275 -28 -119 -206 -48 186 -150 -157 26 -171 32 -55
5563e5j16M13j91J94l26j64K50J61J00k99l4J41k54J49K34l19Q2J53k2o8k67J29
$$ -55 -171 242 51 245 -81 -245 5 166 266 -33 -67 74 -180 -31 203 -116 -34 119 97 29 -238 -109
5585a09N4M0n0k3K55j5J2k19K56k07J15J88l79m50N78K04k16j82K28j10K90k75
$$ -109 -55 -15 -65 -88 167 152 164 -55 201 -6 109 297 -82 -532 46 250 34 -148 80 -30 260 -15
5607a5K5j04pn0K17r6o7L45j89r1M5j16l9J34rJ27k35j45K76K13j93R4Pk24R9
$$ -15 10 -94 -101 -151 66 -30 -97 248 59 -32 13 -103 -142 -8 -17 110 -125 -270 6 219 26 120 127 -97 2
5632BR8j61JNK34j02p7j51J0K61k39K38k07J69j76O6L3J06J86k69j84L14k54j48
$$ 2 100 -61 -60 -55 179 77 0 -151 -141 120 -119 119 -88 81 -95 -29 4 110 296 27 -157 157 -97 -245
5656b45L81J34l10J21K2j24l3J69j09o9R0Nl03M2K28R0k33j52K24J18j93mj19
$$ -245 136 270 -40 81 103 -21 -54 115 6 -63 27 32 -271 -229 -1 89 -144 -296 -72 46 -147 -151 -270
5679b70J17K79L7k15K09r7k46J75qrK13j38J87j44r4Q2J20K6j60n5J7K38j32J22
$$ -270 -153 126 163 -52 157 60 -186 -11 -19 -28 185 47 234 90 -4 78 198 224 64 9 26 264 132 254
5703B54m56J86J29o8j66J10k86L66l02Q8J49J03q9j4k39M4m2J63k18J41Q8m7J44
$$ 254 -202 -16 113 45 -121 -11 -297 69 -233 -145 4 107 18 4 -235 -191 -233 -70 -288 -147 -59 -106 38
5726C8j50J21j39K09P6K5j23o8k91J66J49q3J52p0K64k39J07n1p2j44P0r8O5J55
$$ 38 -112 9 -130 79 155 180 57 -11 -302 -136 13 -70 82 12 276 37 144 93 21 -123 -53 -151 -86 69
5750F9n0j25J28j89K24j13J80l04J42o2J87K06m02n7J32J99k44J60K03m39K03
$$ 69 19 -106 22 -167 57 -56 124 -180 -38 -100 87 293 -109 -166 -34 165 -79 81 284 -155 48
$$ [...]
8191a2
##END NTUPLES=NMR FID
##END=
