##TITLE=1H_EC-2693(II)
 CDCl3, 8 sc, 
 5.2.2019
##JCAMPDX= 6.0         $$ Bruker NMR JCAMP-DX V2.0
##DATA TYPE= NMR FID
##DATA CLASS= NTUPLES
##ORIGIN= UXNMR, Bruker Analytische Messtechnik GmbH
##OWNER= root
$$ XWIN-NMR		Version 3.5
$$ Tue Feb  5 14:00:08 2019 Russian Standard Time (UT+4h)  she@DPX200
##.OBSERVE FREQUENCY= 200.1313
##.OBSERVE NUCLEUS= ^1H
##.DELAY= (6, 6)
##.ACQUISITION MODE= SIMULTANEOUS
##.ACQUISITION SCHEME= undefined
##.AVERAGES= 8
##.DIGITISER RES= 18
##SPECTROMETER/DATA SYSTEM= spect
##.PULSE SEQUENCE= zg30
##.SOLVENT NAME= CDCl3
##.SHIFT REFERENCE= (INTERNAL, CDCl3, 0, 15.7039)
##AUDIT TRAIL= $$ (NUMBER, WHEN, WHO, WHERE, WHAT)
$$ ##TITLE= Audit trail, XWIN-NMR		Version 3.5
$$ ##JCAMPDX= 5.01
$$ ##ORIGIN= Bruker BioSpin GmbH
$$ ##OWNER= she
$$ F:/spectra/data/she/nmr/H-F/1/audita.txt
$$ ##AUDIT TRAIL=  $$ (NUMBER, WHEN, WHO, WHERE, WHAT)
(   1,<2019-02-05 13:58:45.03 +0400>,<she>,<DPX200>,
      <created by zg, POWCHK disabled, PULCHK disabled
       configuration hash MD5:
       00 E9 B6 7A A2 85 ED C7 34 08 36 98 17 FE 4E 26
       data hash MD5: 16K
       23 C5 37 AD 0A 10 C7 ED 92 83 43 CB 6A A3 6B CB>)
$$ ##END=
$$ 
$$ hash MD5
$$ 9F BD 65 61 84 4A E2 A4 BD 17 FE 89 0A 39 B1 F8
##$RELAX= 
##$RELAX= 
##$RELAX= 
##$RELAX= 
##$RELAX= 
##$RELAX= 
$$ Bruker specific parameters
$$ --------------------------
##$DU= <F:/spectra>
##$EXPNO= 1
##$NAME= <H-F>
##$PROCNO= 1
##$TYPE= <nmr>
##$USER= <she>
##$AMP= (0..31)
100 100 100 100 100 100 100 100 100 100 100 100 100 100 100 100 100 100 
100 100 100 100 100 100 100 100 100 100 100 100 100 100 
##$AQSEQ= 0
##$AQ_mod= 1
##$AUNM= <au_zg>
##$AUTOPOS= <>
##$BF1= 200.13
##$BF2= 200.13
##$BF3= 200.13
##$BF4= 200.13
##$BF5= 200.13
##$BF6= 200.13
##$BF7= 200.13
##$BF8= 200.13
##$BYTORDA= 1
##$CFDGTYP= 0
##$CFRGTYP= 5
##$CHEMSTR= <none>
##$CNST= (0..31)
1 1 145 1 1 1 1 1 1 1 1 1 1 1 1 1 1 1 1 1 1 1 1 1 1 1 1 1 1 1 1 1 
##$CPDPRG= <>
##$CPDPRG1= <>
##$CPDPRG2= <>
##$CPDPRG3= <>
##$CPDPRG4= <mlev>
##$CPDPRG5= <mlev>
##$CPDPRG6= <mlev>
##$CPDPRG7= <mlev>
##$CPDPRG8= <mlev>
##$CPDPRGB= <>
##$CPDPRGT= <>
##$D= (0..31)
0 1.2 0 0 0 0 0 0 0 0 0 0.03 0 0 0 0 0 0 0 0 0 0 0 0 0 0 0 0 0 0 0 0 
##$DATE= 1549360724
##$DBL= (0..7)
120 120 120 120 120 120 120 120 
##$DBP= (0..7)
150 150 150 150 150 150 150 150 
##$DBP07= 0
##$DBPNAM0= <>
##$DBPNAM1= <>
##$DBPNAM2= <>
##$DBPNAM3= <>
##$DBPNAM4= <>
##$DBPNAM5= <>
##$DBPNAM6= <>
##$DBPNAM7= <>
##$DBPOAL= (0..7)
0.5 0.5 0.5 0.5 0.5 0.5 0.5 0.5 
##$DBPOFFS= (0..7)
0 0 0 0 0 0 0 0 
##$DE= 6
##$DECBNUC= <off>
##$DECIM= 32
##$DECNUC= <off>
##$DECSTAT= 4
##$DIGMOD= 1
##$DIGTYP= 9
##$DL= (0..7)
0 120 120 120 120 120 120 120 
##$DP= (0..7)
150 150 150 150 150 150 150 150 
##$DP07= 0
##$DPNAME0= <>
##$DPNAME1= <>
##$DPNAME2= <>
##$DPNAME3= <>
##$DPNAME4= <>
##$DPNAME5= <>
##$DPNAME6= <>
##$DPNAME7= <>
##$DPOAL= (0..7)
0.5 0.5 0.5 0.5 0.5 0.5 0.5 0.5 
##$DPOFFS= (0..7)
0 0 0 0 0 0 0 0 
##$DQDMODE= 0
##$DR= 18
##$DS= 0
##$DSLIST= <SSSSSSSSSSSSSSS>
##$DSPFIRM= 0
$$ [...]
##$SUBNAM2= <"">
##$SUBNAM3= <"">
##$SUBNAM4= <"">
##$SUBNAM5= <"">
##$SUBNAM6= <"">
##$SUBNAM7= <"">
##$SUBNAM8= <"">
##$SUBNAM9= <"">
##$SW= 20.0189088683792
##$SWIBOX= (0..15)
0 0 2 0 0 0 0 0 0 0 0 0 0 0 0 0 
##$SW_h= 4006.41025641026
##$TD= 16384
##$TD0= 1
##$TE= 0
##$TE2= 300
##$TE3= 300
##$TEG= 300
##$TL= (0..7)
0 120 120 120 120 120 120 120 
##$TP= (0..7)
150 150 150 150 150 150 150 150 
##$TP07= 0
##$TPNAME0= <>
##$TPNAME1= <>
##$TPNAME2= <>
##$TPNAME3= <>
##$TPNAME4= <>
##$TPNAME5= <>
##$TPNAME6= <>
##$TPNAME7= <>
##$TPOAL= (0..7)
0.5 0.5 0.5 0.5 0.5 0.5 0.5 0.5 
##$TPOFFS= (0..7)
0 0 0 0 0 0 0 0 
##$TUNHIN= 0
##$TUNHOUT= 0
##$TUNXOUT= 0
##$USERA1= <user>
##$USERA2= <user>
##$USERA3= <user>
##$USERA4= <user>
##$USERA5= <user>
##$V9= 5
##$VALIST= <valist>
##$VCLIST= <CCCCCCCCCCCCCCC>
##$VD= 0
##$VDLIST= <DDDDDDDDDDDDDDD>
##$VPLIST= <PPPPPPPPPPPPPPP>
##$VTLIST= <TTTTTTTTTTTTTTT>
##$WBST= 1024
##$WBSW= 4
##$XGAIN= (0..3)
0 0 0 0 
##$XL= 0
##$YL= 0
##$YMAX_a= 240167
##$YMIN_a= -272194
##$ZGOPTNS= <>
##$ZL1= 120
##$ZL2= 120
##$ZL3= 120
##$ZL4= 120
##$ABSF1= 10
##$ABSF2= 0
##$ABSG= 5
##$ABSL= 3
##$ALPHA= 0
##$AQORDER= 0
##$ASSFAC= 0
##$ASSFACI= 0
##$ASSFACX= 0
##$ASSWID= 0
##$AUNMP= <proc_1d>
##$AZFE= 0.1
##$AZFW= 0.1
##$BCFW= 1
##$BC_mod= 2
##$BYTORDP= 1
##$COROFFS= 0
##$CY= 11.3945322036743
##$DATMOD= 1
##$DC= 2
##$DFILT= <>
##$DTYPP= 0
##$F1P= 18.9103706918063
##$F2P= -1.10871071338519
##$FCOR= 0.5
##$FTSIZE= 0
##$FT_mod= 4
##$GAMMA= 1
##$GB= 0.15
##$INTBC= 1
##$INTSCL= 1
##$ISEN= 128
##$LB= 0.24
##$LEV0= 0
##$LPBIN= 0
##$MAXI= 10000
##$MC2= 0
##$MEAN= 0
##$ME_mod= 0
##$MI= 1.114404
##$NCOEF= 0
##$NC_proc= 0
##$NLEV= 6
##$NOISF1= 3.799351
##$NOISF2= 2.8
##$NSP= 1
##$NTH_PI= 0
##$NZP= 0
##$OFFSET= 15.70392
##$PC= 1
##$PHC0= -9036.633
##$PHC1= 11.80004
##$PH_mod= 1
##$PKNL= yes
##$PPARMOD= 0
##$PSCAL= 0
##$PSIGN= 0
##$REVERSE= no
##$SF= 200.130013532006
##$SI= 16384
##$SIGF1= 3
##$SIGF2= 2
##$SINO= 400
##$SIOLD= 16384
##$SREGLST= <1H.CDCl3>
##$SSB= 0
##$STSI= 0
##$STSR= 0
##$SW_p= 3612.71676300578
##$SYMM= 0
##$S_DEV= 0
##$TDeff= 0
##$TDoff= 0
##$TI= <>
##$TILT= no
##$TM1= 0
##$TM2= 0
##$TOPLEV= 0
##$USERP1= <user>
##$USERP2= <user>
##$USERP3= <user>
##$USERP4= <user>
##$USERP5= <user>
##$WDW= 1
##$XDIM= 8192
##$YMAX_p= 0
##$YMIN_p= 0
$$ End of Bruker specific parameters
$$ ---------------------------------
##NTUPLES= NMR FID
##VAR_NAME=  TIME,          FID/REAL,        FID/IMAG
##SYMBOL=    X,             R,               I
##VAR_TYPE=  INDEPENDENT,   DEPENDENT,       DEPENDENT
##VAR_FORM=  AFFN,          ASDF,            ASDF
##VAR_DIM=   8192,          8192,            8192
##UNITS=     SECONDS,       ARBITRARY UNITS, ARBITRARY UNITS
##FACTOR=    0.0002496,     1,               1
##FIRST=     0,             0,               0
##LAST=      2.0444736,     0,               0
##MIN=       0,             -272194,         0
##MAX=       2.0444736,     240167,          0
$$ Real data points
##PAGE= N=1
##DATA TABLE= (X++(R..R)), XYDATA
$$ [...]
$$ plain form
1920 449 513 -345 -1462 -217 908 264 -532 -349 -67 848 979 -305 -554 862 783 12 108 -149 35
1939 35 906 48 -887 -208 581 -103 -622 -865 -940 269 131 -890 -828 152 264 208 -402 -658 320 1398
1959 1398 146 -626 153 501 1149 611 -608 -494 1293 907 -598 -744 -157 192 910 -363 -1347 -197
1977 -197 933 449 -489 -978 -285 1012 728 -1241 -1498 221 502 424 -763 -1585 -250 1105 -38 -1177
1995 -1177 -762 71 826 698 -785 -1001 825 1331 162 -63 -45 355 1305 612 -304 41 1247 1001 305
2014 305 -134 -379 859 895 -804 -920 149 66 -15 -510 -1010 -635 606 -457 -1178 -818 -148 226 102
2033 102 -1026 -1235 491 629 -25 -441 -104 393 963 294 -964 341 1225 724 91 -316 -73 895 1544
2052 1544 -428 -751 550 858 638 88 -1029 -279 1133 244 -1152 -802 -479 42 341 -1304 -1907 -212
$$ packed form
1920D49O4q58j117J245J125o44p96J83K82R15J31j284k49J416p9p71R6k57J84
1939C5Q71q58r35O79P89o84n19k43p5J209j38j021O2R80J12n6o10k56R78J078
1959A398j252p72P79L48O48n38j219J14J787l86j505j46N87L49P18j273r84J150
1977a97J130m84r38m89O93J297k84j969k57J719K81p8j187q22J335J355j143j139
1995a177M15Q33P55j28j483k16J826N06j169k25J8M00R50o93r16L45J206k46o96
2014C05m39k45J238L6j699j16J069q3q1m95n00L75J241j063p21L60O70L74j24
2033A02j128k09J726J38o54m16L37M97N70o69j258J305Q84n01o33m07K43R68O49
2052A544j972l23J301L08k20n50j117P50J412q89j396L50L23N21K99j645o03J695
$$ plain form
2070 -212 284 -417 -903 -1051 -360 791 547 -1213 -546 860 1156 315 -213 -340 1299 1735 81 -605
2088 -605 403 849 987 246 -570 -343 1048 986 -549 -780 -37 407 575 -1136 -1585 -46 823 34 -957
2107 -957 -1331 -758 459 367 -1228 -1187 140 560 74 -479 -1247 199 1238 -30 -938 -28 930 1142 772
2126 772 -376 -197 1183 1439 326 -494 -96 745 1215 -7 -1052 -224 910 193 -797 -1058 -694 400
2144 400 529 -1220 -1340 -106 98 -186 -765 -1506 -678 900 -126 -848 -334 320 920 457 -426 -424 842
2163 842 1122 275 -306 -7 466 918 480 -738 181 1037 622 -141 -261 -344 807 546 -602 -769 102
2182 102 504 -5 -625 -1144 -442 399 -57 -1162 -1057 -229 141 -1 -794 -949 231 835 -3 -440 -316
2201 -316 280 1149 924 -548 110 1405 718 326 -290 -255 841 1255 -10 -906 -15 408 287 -187 -932
$$ packed form
2070b12M96p01m86j48O91J151k44j760O67J406K96q41n28j27J639M36j654o86
2088f05J008M46J38p41q16K27J391o2j535k31P43M44J68j711m49J539Q69p89r91
2107i57l74N73J217r2j595M1J327M20m86n53p68J446J039j268r08R10R58K12l70
2126G72j148J79J380K56j113q20L98Q41M70j222j045Q28J134p17r90k61L64J094
2144D00J29j749j20J234K04k84n79p41Q28J578j026p22N14O54O00m63q83KJ266
2163H42K80q47n81K99M73M52m38j218R19Q56m15p63j20q3J151k61j148j67Q71
2182A02M02n09o20n19P02Q41m56j105J05Q28L70j42p93j55J180O04q38m37J24
2201c16N96Q69k25j472O58J295o87l92o16L5J096M14j265q96Q91M23j21m74p45
$$ plain form
2220 -932 -606 438 169 -743 -774 -238 13 462 -692 -1149 -280 500 0 -583 -210 -321 441 315 -363 -241
2240 -241 465 467 164 76 -189 406 856 290 -306 476 760 417 304 -334 -69 530 344 -526 -296 -102 261
2261 261 359 -324 -947 244 381 -297 -605 -744 -228 346 149 -721 -651 238 284 82 -447 -160 696 970 9
2282 9 -237 283 623 820 390 -9 -496 842 846 -181 -343 -68 238 420 -516 -777 -197 278 -48 -112 -445
2303 -445 -197 143 317 -789 -527 274 241 237 -464 -690 -254 427 273 -578 -210 273 80 570 97 -131 334
2324 334 826 147 -209 199 194 736 137 -275 74 335 -160 30 -104 -114 81 137 -542 -442 -135 -143 -498 -322
2346 -322 -392 -406 440 -61 -437 -245 25 108 48 -268 -452 578 630 37 131 -38 131 744 55 -252 62 882
2368 882 255 -161 -216 170 410 220 -432 -421 212 -123 85 53 -84 -38 213 -227 -394 -155 153 104 -193 -192
$$ packed form
2220i32L26J044k69r12l1N36K51M49j154m57Q69P80n00n83L73j11P62j26o78J22
2240b41P06Kl03q8k65N95M50n66n96P82K84l43j13o38K65N99j86q70K30J94L63
2261B61R8o83o23J191J37o78l08j39N16N74j97q70P0Q89M6k02n29K87Q56K74r61
2282Ik46N20L40J97m30l99m87J338Mj027j62K75L06J82r36k61N80M75l26o4l33
2303d45K48L40J74j106K62Q01l3mp01k26M36O81j54q51L68M83j93M90m73k28M65
2324C34M92o79l56M08nN42n99m12L49K61m95J90j34j0J95N6o79J00L07ql55J76
2346c22p0j4Q46n01l76J92K70Q3o0l16j84J030N2n93R4j69J69O13o89l07L14Q20
2368H82o27m16n5L86K40j90o52J1O33l35K08l2j37M6K51m40j67K39L08m9k97J
$$ plain form
2390 -192 -252 392 306 -487 -312 300 281 460 156 -193 134 587 267 105 -127 98 432 549 -333 -195 476
2411 476 299 -327 -369 -343 -145 170 -148 -556 -340 101 -29 -398 -468 -437 499 717 -465 -255 -72 245 259
2432 259 135 -203 -245 399 304 29 -162 -24 214 442 -428 -434 586 293 177 -45 -433 122 331 371 -450
2453 -450 -217 124 187 -101 -410 -512 -111 54 -234 -471 -191 -178 -70 11 -583 -592 266 -33 -138 -89 22 344
2475 344 519 -88 -177 410 462 -13 -17 -61 147 619 429 -225 -144 279 174 -388 -560 -475 320 557 -166 -674
2497 -674 -125 11 177 44 -469 -451 36 353 -324 -346 -308 347 580 -48 -380 170 262 228 -104 -207 -76 657
2519 657 559 -136 -245 164 526 425 144 -287 235 307 278 -95 -422 185 309 99 -613 -310 83 118 -275
2540 -275 -283 -490 -43 213 144 -561 -84 73 108 150 -201 -214 224 483 -67 -108 335 240 398 50 -215 192 641
$$ packed form
2390a92o0O44q6p93J75O12j9J79l04l49L27M53l20j62k32K25L34J17q82J38O71
2411D76j77o26m2K6J98L15l18m08K16M41j30l69p0L1R36K18j182K10J83L17J4
2432B59j24l38m2O44r5k75j91J38K38K28q70oJ020k93j16k22l88N55K09M0q21
2453d50K33L41O3k88l09j02M01J65k88k37K80J3J08Q1n94rQ58k99j05M9J11L22
2475C44J75o07q9N87N2m75mm4K08M72j90o54Q1M23j05n62j72Q5P95K37p23n08
2497f74N49J36J66j33n13J8M87L17o77k2L8O55K33o28l32N50R2l4l32j03J31P33
2519F57r8o95j09M09L62j01k81m31N22P2k9l73l27O07J24k10p12L03L93L5l93
2540b75qk07M47K56o9p05M77J57L5M2l51j3M38K59n50m1M43r5J58l48k65M07M49
$$ plain form
2563 641 -48 -136 -184 49 61 172 -157 -488 50 134 3 -71 -280 -323 311 105 -482 -354 85 -48 89 -251
2585 -251 -253 58 93 -273 -306 -322 122 327 -98 -187 101 617 496 12 -228 -100 398 370 -228 -178 121 188 380
2608 380 40 113 50 291 141 -467 -112 74 22 75 -503 -482 158 268 -102 -167 -379 -217 226 -128 -364 -309
2630 -309 289 0 93 -428 -60 111 100 -33 -239 -92 479 78 98 -295 26 229 388 39 -23 208 472
2651 472 420 -203 -397 261 582 -50 -217 -276 -157 70 -11 -667 -379 -135 453 -405 -116 -288 118 311 212
2672 212 -310 -172 117 245 -219 65 -131 217 506 -162 -117 -65 345 249 340 -119 -65 365 31 -138 -252 28
2694 28 77 488 -284 -275 -43 107 64 -309 -214 -18 91 56 -361 -118 -3 -277 4 -294 -61 96 184 152 50
2717 50 199 310 -47 100 5 252 234 3 -45 -182 234 246 -177 -67 -477 90 288 -119 -24 -236 170 -14
$$ packed form
2563F41o89q8m8K33J2J11l29l31N38Q4j31p4k09m3O34k06n87J28M39j33J37l40
2585b51kL11L5l66l3j6M44K05m25q9K88N16j21m84k40J28M98k8n98N0K99O7J92
2608C80l40P3o3K41j50o08L55J86n2N3n78K1O40J10l70o5k12J62M43l54k36N5
2630c09N98k89R3n21L68J71j1j33k06J47N71m01K0l93L21K03J59l49o2K31K64
2651D72n2o23j94O58L21o32j67n9J19K27q1o56K88K44N88q58K89j72M06J93r9
2672B12n22J38K89J28m64K84j96L48K89o68M5N2M10r6R1m59N4M30l34j69j14K80
2694B8M9M11p72RK32J50m3l73R5J96J09l5m17K43J15k74K81k98K33J57Q8l2j02
2717E0J49J11l57J47r5K47j8k31m8j37M16J2m23J10m10N67J98m07R5k12M06j84
$$ plain form
2739 -14 226 -307 -329 189 154 147 -135 -281 43 131 -159 -252 69 267 202 20 33 30 142 326 59 -129 -38 273
2763 273 -28 -20 -383 136 189 12 -284 -271 140 330 243 -233 -419 -126 -13 -133 -18 -57 -56 138 30 -175 17
2786 17 -127 -125 -71 -70 -173 195 362 -145 45 110 -96 126 11 -199 -66 22 14 -156 -52 -108 239 -239 24 -149
2810 -149 380 65 -88 -314 -206 61 226 19 -128 -173 -122 4 65 -248 -150 -41 29 43 118 -52 -59 48 139
2833 139 -311 -87 -30 95 -79 -149 121 73 85 133 -292 95 311 121 127 -118 -108 256 233 -188 169 7 -231
2856 -231 123 -217 -33 -47 152 -147 -191 194 -135 -4 -77 -130 48 222 108 4 83 14 76 -154 -226 -255 2
2879 2 380 66 -317 -8 146 250 276 -503 -120 -32 382 400 -120 -122 42 161 -50 153 -34 98 113 157 -306
2902 -306 -350 83 432 -58 -66 -75 250 300 -206 -421 -136 187 161 51 -387 -264 -65 188 10 -92 -93 -8 397
$$ packed form
2739a4K40n33k2N18l5pk82j46L24Q8k90r3L21J98o5j82J3lJ12J84k67j88R1L11
2763B73l01Ql63N19N3j77k96J3M11J90q7m76j86K93J13j20J15l9JJ94j08k05J92
2786A7j44KN4Jj03L68J67n07J90O5k06K22j15k10J33Q8qj70J04n6L47m78K63j73
2810a49N29l15j53k26J08K67J65k07j47m5N1J26O1l13R8J09P0J4P5j70pJ07R1
2833A39m50K24N7J25j74p0K70m8J2M8m25L87K16j90Ok45J0L64k3m21L57j62k38
2856b31L54l40J84j4J99k99m4L85l29J31p3n3J78J74j14j04P9o9O2k30p2k9K57
2879BL78l14l83L09J54J04K6p79L83Q8M14J8n20kJ64J19k11K03j87J32J5M4m63
2902c06m4M33L49m90qrL25N0n06k15K85L23k6j10m38J23J99K53j78j02jQ5M05
$$ plain form
2925 397 -59 -160 -242 182 27 166 63 139 112 357 68 -69 392 39 41 -86 33 36 374 -168 -238 -26 135
2948 135 32 62 -97 -226 3 21 -280 147 -73 -27 -12 1 -306 122 303 -113 -343 -97 -329 -22 18 -162
2970 -162 -396 -218 390 69 -77 -78 -163 324 -249 -313 -50 28 229 47 -125 -40 129 4 60 -283 -132 22
2992 22 -30 -103 -315 180 86 57 -84 -161 34 271 288 -172 -351 -155 36 148 39 -320 189 291 14 4 -174
3015 -174 46 86 32 -66 0 75 297 -104 -139 -304 135 155 -6 -97 102 172 186 -3 -299 40 203 115 -158 -158
3039 -158 -163 165 -102 -21 -81 11 39 107 -21 -237 -249 74 81 26 15 31 181 74 207 -154 -111 227 -143 -191 105
3064 105 -88 150 -49 95 -226 124 155 238 -134 0 -141 275 119 -73 54 108 220 -232 -145 200 112 -40
3086 -40 -19 -252 -121 94 -212 -108 103 153 265 119 130 -295 24 30 -140 -15 -308 164 178 -171 -293 -301 163
$$ packed form
2925C97m56j01q2M24j55J39j03P6k7K45k89j37M61l53Kj27J19LL38n42p0K12J61
2948A35j03L0j59j29K29J8l01M27k20M6J5J3l07M28J81m16k30K46k32L07M0j80
2970a62k34J78O08l21j46jq5M87n73o4K63P8K01j82j72Q5J69j25N6l43J51J54
2992B2n2p3k12M95r4k9j41p7J95K37J7m60j79J96J91J12j09l59N09J02k77j0j78
3015a74K20M0n4r8O6P5K22m01l5j65M39K0j61r1J99P0J4j89k96L39J63q8k73%
3039a58nL28k67Q1o0R2K8O8j28k16j2L23Pn5j1J6J50j07J33l61M3L38l70m8K96
3064A05j93K38j99J44l21L50L1Q3l72J34j41M16j56j92J27N4J12m52Q7L45q8j52
3086d0K1k33J31K15l06J04K11N0J12j46J1m25L19Oj70J25k93M72J4l49j22qM64
$$ plain form
3109 163 -238 -29 -157 -107 289 73 -394 -259 13 249 78 -168 -247 14 258 191 -518 -163 38 42 289 -255
3131 -255 -155 145 501 -143 -17 -412 -190 245 -44 -205 -188 -198 440 118 65 -182 56 93 15 -285 -268 264
3153 264 187 245 -214 -75 -77 247 -202 -192 -89 285 91 -120 -330 33 41 -48 45 20 88 166 -15 -98 194 82
3177 82 4 -11 160 -53 144 -97 -356 -168 20 -58 -30 342 127 202 -50 141 -18 76 224 132 113 7 -208
3200 -208 75 275 172 -61 -68 -93 164 30 -189 -195 162 159 89 -60 -299 98 129 34 -107 -138 -27 -121 176 -259
3224 -259 94 253 -50 -264 6 -292 6 403 37 -274 3 288 -43 -47 -47 -124 -65 -11 137 -139 363 112
3246 112 -105 -142 -86 200 89 83 -419 125 145 197 -188 -281 -28 72 36 0 -132 192 186 -88 70 -96 195 258
3270 258 26 -270 36 -29 -158 23 -129 -57 109 290 156 -130 -174 289 206 110 -131 -131 -32 77 318 -161 -170
$$ packed form
3109A63m01K09j28N0L96k16m67J35K72K36j71k46p9K61K44o7p09L55K01MK47n44
3131b55J00L00L56o44J26l95K22M35k89j61J7j0O38l22n3k47K38L7p8l00J7N32
3153B64p7N8m59J39kL24m49J0J03L74j94k11k10L63Qq9R3k5O8P8j81q3K92j12
3177H2p8j5J71k13J97k41k59J88J88p8K8L72k15P5k52J91j59R4J48r2j9j06k15
3200b08K83K00j03k33pk5K57j34k19oL57lp0j49k39L97L1r5j41l1J11r4K97m35
3224b59L53J59l03k14K70k98K98L97l66l11K77K85l31m%p7N9N4J48k76N02k51
3246A12k17l7N6K86j11on02N44K0N2l85r3K53J00l6l6j32L24ok74J58j66K91O3
3270B58k32k96L06o5j29J81j52P2J66J81j34k86m4M63q3r6k41%R9J09K41m79r
$$ plain form
3293 -170 190 432 13 -157 37 335 2 84 -229 -54 267 88 -189 93 -111 128 119 -47 -13 153 22
3314 22 43 413 -88 50 293 93 -244 20 40 -33 3 -103 -92 11 354 -237 -248 -123 208 235 15 -248 45
3337 45 115 225 -62 -356 65 -68 -29 151 86 214 -194 84 -268 -112 -18 267 -89 -316 -29 219 231 49
3359 49 -190 -476 314 -155 -28 -99 17 105 223 151 49 -164 284 215 -151 -51 9 107 -37 -254 -274 211 230
3382 230 102 -33 -112 -80 315 -11 -184 -206 46 290 -30 138 -215 183 152 -85 -215 50 -50 153 222 -116
3404 -116 167 190 -109 32 -38 -231 125 341 2 -76 56 110 21 15 -225 -9 273 -10 -276 203 -67 74
3426 74 103 205 -359 239 143 -196 -240 -96 264 292 -70 -216 -23 -10 330 -19 -68 -110 -15 321 265 -254 40
3449 40 134 50 6 -58 -173 203 67 89 107 -124 133 203 -12 121 71 354 210 -6 -76 -60 205 133 -75 -265
$$ packed form
3293a70L60K42m19j70J94K98l33Q2l13J75L21j79k77K82k04K39rj66L4J66j31
3314B2K1L70n01J38K43k00l37K64K0p3L6j06J1J03L43n91j1J25L31K7k20k63K93
3337D5P0J10k87k94M21j33L9J80o5J28m08K78l52J56R4K85l56k27K87K48J2j82
3359D9k39k86P90m69J27p1J16Q8J18p2j02k13M48o9l66J00O0R8j44k17k0M85J9
3382B30j28j35p9L2L95l26j73k2K52K44l20J68l53L98l1k37j30K65j00K03O9l38
3404a16K83K3k99J41p0j93L56K16l39p8J32N4q9ok40K16K82k83k66M79k70J41
3426G4K9J02n64N98r6l39m4J44L60K8l62j46J93J3L40l49m9m2R5L36n6n19K94
3449D0R4q4m4o4j15L76j36K2J8k31K57P0k15J33n0K83j44k16p0J6K65p2k08j90
$$ plain form
3473 -265 6 24 -25 -118 -216 -184 344 55 -391 1 86 1 -344 -147 239 -37 177 -194 61 -29 96 -2 -5 -103
3497 -103 -15 165 -225 -96 82 83 186 -105 161 -288 204 215 -113 -72 -22 121 -156 -53 -317 -174 250 32
3519 32 -222 -209 -76 22 200 -31 77 197 -188 76 -30 -309 -77 -5 -1 -105 -185 -229 -201 183 -248 54 -50
3542 -50 371 -111 149 -246 -134 82 -77 3 -87 125 150 69 -135 -99 141 266 -23 -346 51 85 47 14 -132
3565 -132 -21 193 276 -132 138 -127 -252 -225 -107 -13 -131 -52 -5 53 39 -15 -136 336 -137 -120 46 -284 -21
3588 -21 80 118 58 283 -120 -13 -25 -105 -292 -90 -145 -144 5 168 -268 -198 -83 30 -155 96 -290 30 136
3611 136 -17 -111 -216 4 17 -204 -34 -117 24 128 228 63 -334 41 -54 -119 -100 142 -14 155 183 41
3633 41 69 -41 -29 -271 5 71 69 -156 -287 -199 327 357 284 -82 -109 130 306 -19 -43 -137 180 -193 -106 -205 -168
$$ packed form
3473b65K71J8m9r3r8L2N28k89m46L92Q5q5l45J97L86k76K14l71K55r0J25r8lr8
3497a03Q8J80l90J29J78JJ03k91K66m49M92J1l28M1N0J43k77J03k64J43M24k18
3519C2k54J3J33R8J78k31J08J20l85K64j06k79K32P2Mj04q0m4K8L84m31L02j04
3542e0M21m82K60l95J12K16j59Q0r0K12K5q1k04L6K40J25k89l23L97L4l8l3j46
3565a32J11K14Q3m08K70k65j25K7J18R4j18P9M7N8j4n4j21M72m73J7J66l30K63
3588b1J01L8o0K25m03J07j2q0j87K02n5JJ49J63m36P0J15J13j85K51l86L20J06
3611A36j53r4j05K20J3k21J70q3J41J04J00j65l97L75r5o5J9K42j56J69K8j42
3633D1K8j10J2k42K76O6kk25j31Q8N26L0p3l66k7K39J76l25k4r4L17l73Q7r9L7
$$ plain form
3658 -168 78 228 98 -150 -2 20 622 57 -186 81 343 275 -244 -28 50 -210 87 -280 -81 117 164
3679 164 92 -40 -88 -87 -11 20 -170 -344 51 61 63 -69 -9 -148 53 285 -263 155 -29 187 127 -21 -264 60
3703 60 210 -110 48 52 265 67 131 -157 -62 161 123 147 -142 -248 77 379 -52 -267 207 194 -66 -219 -273
3726 -273 -138 228 -3 -7 -245 -110 91 -141 -206 -178 301 128 101 -122 142 -3 -221 135 -335 60 231 96
3748 96 -44 175 -249 289 303 -368 -339 -144 4 212 10 -208 -112 310 20 -145 129 -132 307 319 -175 -360
3770 -360 -208 290 -3 -245 329 -36 216 -99 -132 -6 173 62 2 103 18 -51 226 -3 107 -185 156
3791 156 80 113 33 173 452 -20 93 -186 -3 -18 -6 -170 -122 -100 290 64 -76 -227 46 -18 121 -21 -379
3814 -379 -204 -91 -91 -203 121 619 288 -168 -61 -154 114 -1 -12 -141 -212 398 269 -250 -96 146 7 19
$$ packed form
3658a68K46J50j30k48J48K2O02n65k43K67K62o8n19K16P8k60K97l67J99J98M7
3679A64p2j32m8JP6L1j90j74L95J0Kj32O0j39K01K32n48M18j84K16o0j48k43L24
3703F0J50l20J58MK13j98O4k88R5K23l8K4k89j06L25L02m31k15M74j3k60j53n4
3726b73J35L66k31mk38J35K01k32o5K8M79j73k7k23K64j45k18L56m70L95J71j35
3748I6j40K19m24N38J4o71K9J95J48K08k02k18R6M22k90j65K74k61M39J2m94j85
3770c60J52M98k93k42N74l65K52l15l3J26J79j11o0J01q5o9K77k29J10k92L41
3791A56p6L3q0J40K79m72J13k79J83j5J2j64M8K2L90k26j40j51K73o4J39j42l58
3814c79J75J13%j12L24M98l31m56J07r3K68j15j1j29p1O10j29n19J54K42j39J2
$$ plain form
3836 19 -249 -195 -315 120 -215 11 143 -275 174 62 9 15 307 -120 19 54 -203 163 163 33 113 -28 -39
3859 -39 12 -67 -66 -252 37 86 57 -89 -53 122 242 319 -113 -40 281 -96 -182 -40 -64 94 99 -287 -198 369 -47
3884 -47 -65 -155 -150 -11 75 172 -124 -208 48 94 -40 26 -173 -54 401 -64 -230 -130 331 138 10 -243 76
3907 76 360 -135 20 -106 -20 153 14 -107 -17 -79 89 -169 -272 -88 -108 132 -189 14 -71 10 -23 270 153
3930 153 -316 53 228 364 -154 -93 171 67 19 209 224 277 280 -145 39 -114 -76 133 -115 -134 -58 83 -5
3953 -5 -70 97 -53 298 189 -450 -263 -41 29 -37 -222 -205 78 67 -37 -1 -44 84 155 -13 -135 -151 -78 224
3977 224 -74 -234 86 -45 311 -232 -152 -279 144 82 13 64 109 187 -47 -444 -10 -9 -163 299 -119 -205 -1
4000 -1 165 -219 148 -150 -29 -79 14 -254 111 29 318 390 159 -80 115 163 -8 51 136 -95 14 369 -357
$$ packed form
3836A9k68N4j20M35l35K26J32m18M49j12n3OK92m27J39L5k57L66%j30Q0j41j1
3859c9N1p9Jj86K89M9k9j46L6J75J20P7m32P3L21l77q6J42k4J58Nl86Q9N67m16
3884d7j8r0NJ39Q6R7k96q4K56M6j34O6j99J19M55m65j66J00M61j93j28k53L19
3907G6K84m95J55j26Q6J73j39j21R0o2J68k58j03J84k0K40l21K03q5Q1l3K93j17
3930A53m69L69J75J36n18O1K64j04m8J90J5N3Lm25J84j53L8K09k48j9P6J41q8
3953eo5J67j50L51j09o39J87K22P0o6j85J7K83j1j04L6m3J28P1j68j22j6P3L02
3977B24k98j60L20j31L56n43Q0j27M23o2o9N1M5P8k34l97M34Jj54M62m18q6K04
4000aJ66l84L67k98J21n0R3k68L65q2K89P2k31k39J95M8j71N9Q5k31J09L55p26
$$ plain form
4023 -357 60 -99 -80 -114 -64 168 -183 -77 -98 -396 -167 128 -272 225 -29 256 2 -153 -153 -20 445 -105
4045 -105 1 -110 -59 33 49 -5 -353 126 125 50 -6 -195 -151 235 106 -220 47 143 -20 92 -303 -190 -10
4068 -10 151 91 -90 -355 63 235 49 -260 51 145 -242 -117 104 -157 -105 86 303 -103 219 127 56 -267
4090 -267 67 -169 579 27 -71 14 121 187 249 20 -282 105 149 -41 -46 -82 117 33 -2 -57 -130 231 48 -329
4114 -329 -60 96 127 -137 13 -324 203 167 112 -108 -353 57 32 248 -350 -136 212 84 220 -9 -136
4135 -136 106 242 -68 61 -31 237 210 86 -169 -143 257 75 -43 -478 165 259 159 -32 -356 -43 57
4156 57 -87 26 -66 78 386 35 -75 -286 38 83 105 -337 -316 57 216 7 -113 48 -153 -52 3 -70
4178 -70 -477 296 122 -262 -61 -10 28 265 88 -236 -107 69 144 29 -240 -115 397 13 -113 -38 154 244
$$ packed form
4023c57M17j59J9l4N0K32l51J06k1k98K29K95m00M97k54K85k54j55%J33M65n50
4045a05J06j11N1R2J6n4l48M79jp5n6j89M4L86j29l26K67R6j63J12l95J13J80
4068a0J61o0j81k65M18J72j86l09L11R4l87J25K21k61N2J91K17m06L22r2p1l23
4090b67L34k36P48n52r8Q5J07O6O2k29l02L87M4j90nl6J99q4l5n5p3L61j83l77
4114c29K69J56L1k64J50l37N27l6n5k20k45M10k5K16n98K14L48j28J36k29j27
4135a36K42J36l10J29r2K68k7j24k55K6M00j82j18m35O43R4j00j91l24L13J00
4156E7j44J13r2J44L08l51j10k11L24M5K2m42K1L73J59k09j20J61k01J01N5p3
4178g0m07P73j74l84K01N1L8K37j77l24J29J76P5j15k69J25N12l84j26P5J92R0
$$ plain form
4200 244 -93 -449 -271 -236 160 54 -262 -145 -147 118 197 -137 -372 237 273 128 -193 44 144 160 204 -312
4222 -312 2 -92 99 -35 -31 -188 43 145 -120 -121 -10 -120 111 -145 -121 -128 41 71 44 -306 -436 85 -14 14
4246 14 -216 170 -203 -201 -285 -269 54 277 -171 -317 -337 -226 430 20 -48 -177 131 236 38 -289 141 -4
4268 -4 225 -73 -60 113 195 263 -5 21 44 -305 4 -203 -178 7 92 192 54 -86 -118 -75 115 -359 -152 59
4292 59 193 104 -49 -297 -91 113 46 -452 176 50 -66 91 86 -137 -70 253 -143 -128 35 111 214 -7 -314
4315 -314 -172 37 83 162 -168 -50 -75 105 -220 -141 -29 -262 30 -175 -135 -162 317 165 4 -9 -259 -37
4337 -37 -104 -264 -162 333 -45 190 -33 -110 103 604 206 -304 -126 68 8 181 -163 -199 -135 374 -179 -128
4359 -128 -100 -153 -57 89 -27 -92 90 -204 -74 10 -245 171 22 -288 -179 314 59 -57 -133 74 -25 -40 187
$$ packed form
4200B44l37l56J78L5L96j06l16J17kK65P9l34k35O09L6j45l21K37J00J6M4n16
4222c12L14r4J91j34Mj57K31J02k65jJ11j10K31k56K4pJ69L0k7l50j30N21r9K8
4246A4k30L86l73Kq4J6L23K23m48j46k0J11O56m10o8j29L08J05j98l27M30j45
4268dK29k98J3J73Q2O8k68K6K3l49L09k07K5J85Q5J00j38j40l2M3J90m74K07K11
4292E9J34q9j53k48K06K04o7m98O28j26j16J57nk23O7L23l96J5J63P6J03k21l07
4315c14J42K09M6P9l30J18k5J80l25P9J12k33K92k05M0k7M79j52j61j3k50K22
4337c7o7j60J02M95l78K35k23p7K13N01l98n10J78J94o0J73l44l6O4N09n53N1
4359a28K8n3R6J46j16o5J82k94J30Q4k55M16j49l10J09M93k55j16p6K07r9j5K27
$$ plain form
4382 187 -132 -12 25 38 -92 191 -157 161 138 178 -83 -87 -42 -126 -25 -177 -44 47 174 -317 145 100 284
4405 284 161 -201 -169 479 77 -300 260 117 85 308 344 -401 169 470 -96 -517 -31 44 71 158 -66 -104
4427 -104 49 -123 -233 256 -160 -109 148 48 -298 -129 -29 21 -11 167 -340 36 -99 -63 64 -165 -146 201
4449 201 -33 -312 -178 -124 160 221 -159 -21 -54 264 -126 -124 -50 138 128 -78 158 -189 8 -32 41 245 62
4472 62 -90 57 -246 -188 -17 161 -63 -122 -325 -107 -12 224 -397 -21 284 141 121 -86 7 56 155 -10 176
4495 176 10 91 -26 -258 144 115 128 -2 -23 -184 -76 175 148 -146 -289 90 105 -193 159 327 114 177
4517 177 -36 -261 -143 202 254 -47 213 57 -116 -15 -40 -157 -28 -236 -23 113 -227 -343 240 232 -143
4538 -143 -27 74 -2 96 -123 -212 48 218 422 -111 80 -169 59 157 -51 -94 381 17 -8 -204 -55 -51 311
$$ packed form
4382A87l19J20L7J3j30K83l48L18k3M0k61mM5q4J01j52J33R1J27m91M62m5J84
4405B84j23l62L2O48m02l77N60j43l2K23L6p45N70L01n66m21M86P5K7Q7k24l8
4427a04J53j72j10M89m16N1K57j00l46J69J00N0l2J78n07L76j35L6J27k29J9L47
4449B01k34k79J34N4K84O1l80J38l3L18l90KP4J88j0k06K36l47J97m0P3K04j83
4472F2j52J47l03N8J71J78k24n9k03K18R5K36o21L76L05j43k0k07R3M9R9j65J86
4495A76j66Q1j17k32M02k9J3j30k1j61J08K51k7k94j43L79J5k98L52J68k13O3
4517A77k13k25J18L45N2l01K60j56j73J01k5j17J29k08K13J36l40j16N83ql75
4538a43J16J01p6R8k19q9K60J70K04n33J91k49K28R8k08m3M75l64k5j96J49ML62
$$ plain form
4561 311 -251 -173 154 64 99 -277 -127 -293 444 -8 -105 -243 -233 6 -125 -184 -180 136 314 -67 -96 -96 34 52
4585 52 222 205 -375 103 416 65 -203 -343 -61 421 58 -295 -125 203 77 -135 -405 -277 214 137 -321
4606 -321 -175 -120 140 27 -139 -358 -24 234 152 -22 -279 -189 -10 142 -228 -356 -13 118 -70 -26 39 -145
4628 -145 102 150 -161 -249 -8 150 -89 -260 -227 -50 238 -109 -7 181 73 296 92 -68 -103 167 -121
4649 -121 -219 -122 -176 286 130 -360 6 154 403 83 -3 -132 -140 198 352 -419 -215 -6 51 -150 -318 -97
4671 -97 -60 137 -261 120 108 66 309 58 -82 31 216 143 -135 1 -62 -16 80 -25 -196 46 -142 -104 298
4694 298 -160 -214 147 165 -353 -240 -13 238 -76 200 -123 81 288 85 44 -222 139 238 230 -170 -110 -81 215
4717 215 -98 -204 -16 151 55 66 -210 -150 90 220 -80 -268 -4 173 52 -8 -205 103 350 188 -117
$$ packed form
4561C11n62P8L27r0L5l76J50j66P37m52r7j38J0K39j31n9ML16J78l81k9%J30J8
4585E2J70j7n80M78L13l51k68j40K82M82l63l53J70L28j26k12k70J28M91p7m58
4606c21J46N5K60j13j66k19L34K58q2j74k57R0J79J52l70j28L43J31j88M4O5j84
4628a45K47M8l11q8K41J58k39j71L3J77K88l47J02J88j08K23k04j60l5K70k88
4649a21r8R7n4M62j56m90L66J48K49l20q6j29qL38J54p71K04K09N7k01j68K21
4671i7L7J97l98L81j2m2K43k51j40J13J85p3k78J36o3M6R6j05j71K42j88L8M02
4694B98m58n4L61J8n18J13K27K51l14K76l23K04K07k03m1k66L61R9qm00O0K9K96
4717B15l13j06J88J67r6J1k76O0K40J30l00j88K64J77j21o0j97L08K47j62l05
$$ plain form
4738 -117 -198 208 208 71 -23 -61 90 344 237 -73 -8 147 -11 77 -138 -304 37 242 12 -132 78 216
4760 216 -81 -73 56 -23 142 57 -165 -278 -179 -96 179 -220 -206 -218 -148 156 -141 -359 -27 43 365 -146 -1
4783 -1 226 329 60 54 -104 193 82 137 -185 -27 227 136 -104 55 55 -74 376 -395 -171 74 -93 -173 108
4806 108 -59 -23 217 54 -153 -60 105 -67 -73 -223 104 -13 -233 -177 75 -53 -54 180 -75 -124 16 -71 138
4829 138 471 49 -320 195 397 -94 54 16 99 211 133 163 27 18 82 -248 -72 97 33 99 3 90 -69 108
4853 108 10 208 -83 2 -125 139 47 199 335 42 -28 -54 -63 62 98 -8 -101 189 249 -102 -146 -55 -142 139
4877 139 562 -90 126 -73 28 220 -299 -243 38 18 80 -116 -267 8 -184 59 -84 -75 -82 185 -191 -37
4899 -37 -40 235 186 143 267 -105 -99 289 -121 -397 -87 -52 4 -223 153 -70 67 105 127 -47 -68 21 -203 -263 -274
$$ packed form
4738a17q1M06%j37r4l8J51K54j07l10O5J55j58Q8k15j66L41K05k30j44K10J38
4760B16k97QJ29p9J65q5k22j13R9Q3K75l99J4j2P0L04k97k18L32P0L22n11J45
4783aK27J03k69oj58K97j11N5l22J58K54r1k40J59%j29M50p71K24K45j67q0K81
4806A08j67L6K40j63k07R3J65j72oj50L27j17k20N6K52j28jK34k55m9J40q7K09
4829A38L33m22l69N15K02m91J48l8Q3J12p8L0j36rO4l30J76J69o4O6r6Q7j59J77
4853A08r8J98k91Q5j27K64r2J52J36k93p0k6rJ25L6j06r3K90O0l51m4R1q7K81
4877A39M23o52K16j99J01J92n19N6K81k0O2j96j51K75j92K43j43RpK67l76J54
4899c7lK75m9m3J24l72OL88m10k76L10L5N6k27L76k23J37L8K2j74k1Q9k24o0j1
$$ plain form
4924 -274 -68 82 73 2 42 -138 -94 159 -257 -87 -87 -27 -72 -251 -164 -15 159 163 -166 82 63 227 -228 -146 -157
4949 -157 -113 400 55 -312 47 235 158 -232 -153 -263 -28 297 -286 -23 158 175 -29 279 49 68 181 337
4971 337 -32 16 170 73 -278 -103 -149 311 95 60 123 0 304 211 206 -152 19 118 215 -131 -136 -16 145 70
4995 70 -211 -260 403 51 -106 93 29 48 101 -52 -111 43 25 -146 -46 -314 -366 103 241 -278 -113 -12 -28
5018 -28 203 -89 -441 -149 350 -66 -44 64 -22 130 206 -110 -206 87 51 208 67 -115 -79 161 258 -348 -202
5041 -202 235 105 93 -69 -284 -93 335 -175 -274 380 58 184 -142 -95 47 293 258 165 -55 110 248 161
5063 161 32 0 -130 243 109 12 -92 -168 239 218 73 124 80 153 299 -120 -222 -183 15 77 78 -373 1 10
5087 10 -81 -325 14 397 92 45 14 -216 -85 138 -140 -29 -100 12 -51 -57 -490 -200 -4 229 -312 -96 -189
$$ packed form
4924b74K06J50rp1M0j80M4K53m16J70%O0m5j79Q7J49J74Ml29K48j9J64m55Q2j1
4949a57M4N13l45l67L59J88p7l90P9j10K35L25n83K63J81J7k04L08k30J9J13J56
4971C37l69M8J54r7l51J75m6M60k16l5O3j23L04r3nl58J71R9R7l46nJ20J61p5
4995G0k81m9O63l52j57J99o4J9N3j53n9J54j8j71J00k68n2M69J38n19J65J01j6
5018b8K31k92l52K92M99m16K2J08q6J52P6l16r6K93l6J57j41j82L6K40R7o06J46
5041b02M37j30j2j62k15J91M28n10r9O54l22J26l26M7J42K46l5r3k20J65J38q7
5063A61j29l2j30L73j34r7j04p6M07k1j45N1m4P3J46m19j02L9J98O2Jm51L74R
5087A0r1k44L39L83l05m7l1k30J31K23k78J11p1J12o3om33K90J96K33n41K16r3
$$ plain form
5110 -189 114 314 -191 -227 -101 19 -9 30 -29 -227 330 66 -111 19 180 135 -41 44 -308 -224 219 257 -391
5133 -391 249 -162 281 169 -236 -22 82 118 63 -75 128 113 257 -178 -438 2 74 144 -129 36 -13 76
5155 76 160 -304 -167 104 36 15 77 -23 -51 -71 177 -156 -94 141 -74 393 183 -237 245 -107 37 86 -131
5178 -131 -122 248 167 27 -103 116 -161 106 196 -203 -11 34 -102 83 18 61 -74 134 -79 -61 18 -8 -164
5201 -164 2 23 -203 -22 42 -239 159 113 -149 147 209 99 -102 93 -213 3 116 207 119 3 32 -231
5223 -231 -130 -28 -216 80 220 56 -31 113 10 118 192 -237 -114 224 -2 55 -45 -291 40 233 -74
5244 -74 -124 -46 -379 320 17 -242 -49 114 -17 7 -54 -1 297 290 -192 -130 289 -202 62 155 42 -143 64
5267 64 84 -280 85 -30 -165 230 -141 -414 127 198 171 36 19 4 -20 -22 115 114 295 -83 10 -67 -42 164 23
$$ packed form
5110a89L03K00n05l6J26J20k8L9n9j98N57k64j77J30J61m5j76Q5l52Q4M43L8o48
5133c91O40m11M43j12m05K14J04L6n5j38K03j5J44m35k60M40P2P0k73J65m9Q9
5155G6Q4m64J37K71o8k1O2j00k8k0K48l33O2K35k15M67k10m20M82l52J44M9k17
5178a31RL70q1j40j30K19k77K67R0l99J92M5j36J85o5M3j35K08k13J8P9k6j56
5201a64J66K1k26J81O4k81L98m6k62K96O2j10k01J95l06K16J13R1q8j16K9k63
5223b31J01J02j88K96J40j64q7J44j03J08P4m29J23L38k26N7j00k46L31J93l07
5244g4n0P8l33O99l03k59J93J63j31K4o1N3K98pm82O2M19m91K64R3j13j85K07
5267F4K0l64L65j15j35L95l71k73N41P1k7j35j7j5k4kJ37jJ81l78R3p7K5K06j41
$$ plain form
5292 23 18 -98 37 76 -115 -81 183 -14 98 -20 -78 -43 33 -17 -119 -133 58 -18 -99 -149 40 139 -141 -3 142
5317 142 142 -7 207 99 -152 12 -95 -82 110 -185 22 12 7 70 96 -186 -90 299 17 224 -211 -55 -35
5340 -35 -56 -185 -214 -168 230 -47 -125 -5 -130 40 5 0 -110 97 2 173 -114 17 -47 283 -26 94 56 244
5364 244 213 134 128 -246 -52 -23 -271 -312 99 -95 123 -47 -20 -91 283 -168 -204 -110 -273 197 272 -398 -82 29
5388 29 149 -67 -152 -75 -149 188 61 -120 156 -17 -45 -31 -130 -2 -22 -18 -362 -134 71 205 177 -186 76 -203
5412 -203 346 302 -243 -36 -98 93 32 -144 -305 58 0 -315 -20 -177 56 370 8 215 -83 89 116 -24
5434 -24 47 130 182 65 -81 -278 -68 -77 175 134 -300 -116 78 74 -117 89 -90 105 79 -3 -290 274 72 -60
5458 -60 22 -199 -64 103 263 -16 49 -2 90 -216 -192 -140 -35 384 -69 147 96 224 18 33 -125 141 147 -83
$$ packed form
5292B3nj16J35L9j91L4K64j97J12j18n8L5P6n0j02j4J91p6q1n0J89R9k80J38J45
5317A42%j49K14j08k51J64j07J3J92k95K07j0nO3K6k82R6L89k82K07m35J56K0
5340c5k1j29k9M6L98k77p8J20j25J70l5nj10K07r5J71k87J31o4L30l09J20l8J88
5364B44l1p9ol74J94K9k48m1M11j94K18j70K7p1L74m51l6R4j63M70P5o70L16J11
5388B9J20k16q5P7p4L37j27j81K76j73k8J4r9J28k0Ml44K28K05J34k8l63K62k79
5412b03N49m4n45K07o2J91o1j76j61L63n8l15K95j57K33L14l62K07k98J72K7j40
5434b4P1Q3N2j17j46j97K10rK52m1m34J84J94mj91K06j79J95k6q2k87N64k02j32
5458f0Q2k21J35J67J60k79O5n1R2l06K4N2J05M19m53K16n1J28k06J5j58K66Ok30
$$ plain form
5482 -83 -231 -44 23 341 190 -120 -237 -106 172 -316 -52 -315 68 138 167 -249 -11 288 57 94 -166 -254
5504 -254 -107 -8 56 -92 91 307 106 157 -183 48 182 96 -197 81 -31 92 -12 -36 73 225 -58 79
5526 79 -27 -225 76 -90 76 -204 -103 -174 42 -104 156 -231 -151 98 21 -332 -16 15 -156 27 -188 -104
5548 -104 316 -72 78 29 -4 -61 65 141 -219 71 133 84 256 97 123 220 309 40 2 234 48 10 -113 -135
5572 -135 -64 220 -168 -74 150 -43 51 165 -10 -191 -282 365 -108 -186 61 -103 101 330 -207 -93 -21 -73
5594 -73 -46 -75 -99 -71 269 60 -239 86 -172 78 99 -189 69 140 -76 -12 -198 -36 -147 -20 -32 -94 99
5617 99 36 231 -33 2 -124 -110 -34 -88 71 287 43 -130 -54 -273 -69 161 -226 -18 38 68 42 208 -172
5640 -172 -33 -22 178 -348 237 4 -102 -194 -4 35 -19 184 -152 107 145 -100 4 44 -342 -246 135 -76
$$ packed form
5482h3j48J87O7L18j51l10j17J31K78m88K64k63L83P0K9m16K38K99k31L7k60q8
5504b54J47R9O4j48J83K16k01N1l40K31J34q6k93K78j12J23j04k4J09J52k83J37
5526G9j06j98L01j66J66k80J01p1K16j46K60l87Q0K49p7l53L16L1j71J83k15Q4
5548a04M20l88J50m9l3n7J26P6l60K90O2m9J72j59K6R7Q9k69l8K32j86l8j23k2
5572a35P1K84l88R4K24j93R4J14j75j81r1O47m73p8K47j64K04K29n37J14P2n2
5594g3K7k9k4K8L40k09k99L25k58K50K1k88K58P1k16O4j86J62j11J27j2o2J93
5617I9o3J95k64L5j26J4P6n4J59K16k44j73P6k19K04K30l87K08N6L0k6J66l80
5640a72J39J1K00n26N85k33j06r2J90L9n4K03l36K59L8k45J04M0l86R6L81k11
$$ plain form
5662 -76 -173 -52 198 -58 204 -405 -111 30 -120 140 -47 156 -44 19 71 -266 249 81 142 66 22 124
5684 124 3 99 -30 -72 -324 -215 -54 175 -10 -53 287 -191 -49 124 196 39 -246 -267 -238 64 -112 36
5706 36 -56 -183 -307 201 5 -84 -190 -3 -22 69 10 -54 151 54 -205 108 30 -172 -151 184 22 82 201 -330
5730 -330 -6 39 -34 -91 98 140 -300 43 -15 -104 -24 40 113 57 -2 -34 -188 105 -69 198 143 -49 -47 149 -52
5755 -52 -47 366 -240 96 -59 -323 -9 156 100 -211 -367 -38 58 232 -266 44 219 -3 328 -98 14 -402
5777 -402 24 170 -337 -174 271 132 -80 9 -185 -99 136 -97 26 -274 -140 206 -152 -167 -253 297 -122
5798 -122 60 -24 -56 83 145 -144 -83 -54 105 39 71 128 3 121 -143 -162 -28 114 58 96 -176 -174 125 162 13
5823 13 73 -40 47 -138 164 -68 -6 185 9 45 -34 -139 -63 81 -247 -392 -11 131 414 13 83 3 90
$$ packed form
5662g6r7J21K50k56K62o09K94J41j50K60j87K03k00O3N2l37N15j68O1p6m4J02
5684A24j21R6j29m2k52J09J61K29j85m3L40m78J42J73P2j57k85k1K9L02j76J48
5706C6r2j27j24N08j96q9j06J87j9R1n9o4K05r7k59L13p8k02K1L35j62O0J19n31
5730c30L24M5p3n7J89M2m40L43n8q9Q0O4P3n6n9l2j54K93j74K67n5j92KJ96k01
5755e2NM13o06L36j55k64L14J65n6l11j56L29R6J74m98L10J75k22L31m26J12m16
5777d02M26J46n07J63M45j39k12Q9j94Q6K35k33J23l00J34L46l58j5q6N50m19
5798a22J82q4l2J39O2k89O1K9J59o6L2N7j25J18k64j9J34J42n6L8k72KK99L7j49
5823A3O0j13Q7j85L02k32O2J91j76L6p9j05P6J44l28j45L81J42K83m01P0q0Q7
$$ plain form
5846 90 246 -150 103 87 256 250 296 41 205 13 -141 136 186 205 135 -68 112 -251 84 -20 -56 144 161
5869 161 -8 158 -46 187 191 46 14 198 -140 -129 -46 110 57 -76 -9 62 150 65 -135 108 9 -37 64 -95
5893 -95 169 81 -86 69 -92 240 246 43 324 -285 -251 108 187 -176 -109 98 -23 185 -152 -246 45 173 -138
5916 -138 -2 155 -81 81 198 158 -115 37 93 -95 72 95 -115 -42 188 -218 280 -58 8 71 -152 -116
5938 -116 40 165 386 101 88 6 105 126 -55 -71 287 -104 101 194 61 -133 164 -198 -55 -9 -67 37 121
5961 121 -351 -1 76 -199 61 190 78 -114 -44 132 148 85 51 55 -73 138 -151 147 183 184 126 67 172 52
5985 52 126 28 -177 125 108 -68 -35 45 152 274 24 -9 -6 -28 125 -28 40 -80 101 -18 -128 185 59 -224
6009 -224 249 47 -143 130 135 -126 -192 -87 138 118 -107 -120 -32 -44 206 -114 23 -202 -52 31 -194 28 -63
$$ packed form
5846I0J56l96K53j6J69oM6k55J64j92j54K77N0J9p0k03J80l63L35j04l6K00J7
5869A61j69J66k04K33Mj45l2J84l38J1Q3J56n3j33O7P1Q8q5k00K43r9m6J01j59
5893i5K64q8j67J55j61L32Ok03K81o09L4L59P9l63O7K07j21K08l37r4K91J28l11
5916a38J36J57k36J62J17m0k73J52N6j88J67K3k10P3K30m06M98l38O6O3k23L6
5938a16J56J25K21k85j3q2R9K1j81j6L58l91K05R3j33j94K97l62J43M6n8J04Q4
5961A21m72L50P7k75K60J29j12j92P0J76J6o3l4Mj28K11k89K98L6Jn8n9J05j20
5985E2P4r8k05L02j7j76L3Q0J07J22k50l3Lk2J53j53O8j20J81j19j10L13j26k83
6009b24M73k02j90K73Nk61o6J05K25k0k25j3Q8j2K50l20J37k25J50Q3k25K22r1
$$ plain form
6032 -63 -6 -71 -13 35 -252 65 61 -240 82 -73 -115 98 20 -80 13 250 -144 -13 218 -79 287 -123 110
6055 110 -89 351 -84 -203 277 -43 -283 -134 254 157 254 301 -189 10 -194 -58 -143 -118 52 2 12 -183
6077 -183 -129 -66 54 -128 -2 68 205 83 116 -112 -163 -119 -2 195 116 -113 45 274 285 -126 -51 9 154
6100 154 -16 -77 -158 69 -133 255 175 -17 85 -29 -85 -63 -147 -86 -222 126 -61 -200 168 185 -126 152 254
6123 254 -88 75 185 -117 370 -129 -146 33 120 150 96 -196 -31 2 -327 -20 -179 154 -42 -74 140 -230
6145 -230 -15 128 -83 68 84 52 -42 -85 -54 -185 -76 -201 54 18 -150 -168 10 96 49 -175 -61 83 -110
6168 -110 110 -154 -276 123 25 -63 324 -178 146 128 -66 -106 -39 178 -11 3 8 136 9 -260 -260 -50 32 -188
6192 -188 152 -200 161 74 -121 125 44 -242 -313 143 348 136 -230 205 86 100 -4 1 21 57 94 -139 -97
$$ packed form
6032f3N7o5N8M8k87L17ml01L22j55m2K13p8j00R3K37l94J31K31k97L66m10K33
6055A10j99M40m35j19M80l20k40J49L88r7R7M7m90J99k04J36q5K5J70n0J0j95
6077a83N4O3J20j82J26P0J37j22L3k28n1M4J17J97p9k29J58K29J1m11P5O0J45
6100A54j70o1q1K27k02L88q0j92J02j14n6K2q4O1j36L48j87j39L68J7l11K78J02
6123B54l42J63J10l02M87m99j7J79Q7L0n4k92J65L3l29L07j59L33j96l2K14l70
6145b30K15J43k11J51J6l2r4m3L1j31J09j25K55l6j68j8J78Q6m7k24J14J44j93
6168a10K20k64j22L99r8q8L87n02L24j8j94m0O7K17j89J4NJ28j27k69%K10Q2k20
6192a88L40l52L61q7j95K46q1k86p1M56K05k12l66M35j19J4j04NK0L6L7k33M2
$$ plain form
6215 -97 -16 4 134 -154 -129 152 151 102 71 -85 -91 -149 -103 -277 -129 270 -86 -203 83 112 -88 253 -47 37 11
6240 11 -367 -335 20 -27 -114 135 -118 -10 -67 16 137 28 214 -209 9 71 10 -156 235 119 -167 -43 -387
6263 -387 -159 200 -63 -80 186 -65 137 -123 -301 -118 -46 2 65 126 -16 72 232 77 -43 -109 -23 -163 116
6286 116 -8 -309 -84 -33 -71 -20 -145 271 30 107 20 122 9 46 141 -231 18 146 -46 77 -57 196
6308 196 78 317 188 -15 41 -128 77 29 94 -23 -139 404 -60 -271 180 89 12 -34 138 -247 21 80
6330 80 -135 45 -37 -117 -133 -11 116 -37 -2 172 134 171 50 -110 -147 -163 -77 185 -17 66 -19 142 -25 47
6354 47 84 -347 105 389 -15 -135 73 20 163 177 -184 -133 -128 -7 -13 -27 -17 12 303 282 -123 -97 129 149 -193
6379 -193 -186 -186 87 20 100 -41 -8 21 142 27 -303 -47 -139 1 38 18 145 357 85 40 92 -211 -30 31 193
$$ packed form
6215i7Q1K0J30k88K5K81jm9l1j56on8M6j74J48L99l56j17K86K9k00L41l00Q4k6
6240A1l78L2L55m7q7K49k53J08n7Q3J21j09J86m23K18O2o1j66L91j16k86J24l44
6263c87K28L59k63j7K66k51K02k60j78J83P2M8O3O1j42Q8J60j55j20o6Q6j40K79
6286A16j24l01K25N1l8N1j25M16k41P7q7J02j13L7R5l72K49J28j92J23j34K53
6308A96j18K39j29k03N6j69K05m8O5j17j16N43m64k11M51r1p7m6J72l85K68N9
6330H0k15J80q2q0j6J22J27j53L5J74l8L7j21j60l7j6Q6K62k02Q3q5J61j67P2
6354D7L7m31M52K84m04j20K08n3J43J4l61N1NJ21oj4J0K9K91k1m05K6K26K0l42
6379a93P%K73o7Q0j41L3K9J21j15l30K56r2J40L7k0J27K12k72m5N2l03J81O1J62
$$ plain form
6404 193 -363 -165 207 65 -18 -38 101 5 143 -58 133 219 93 152 246 -7 -27 157 130 -83 -20 -204 117
6427 117 -142 -88 -162 22 -95 -275 -102 -157 -311 -207 -95 40 144 93 -230 -113 -96 -94 159 -19 14 -156 -7
6450 -7 10 -99 22 -7 -71 -283 198 -56 135 -57 -45 214 16 166 -40 70 -170 -213 -36 149 -348 3
6472 3 38 -94 187 75 -139 -8 -161 -189 184 47 -116 244 315 -86 32 -14 -194 287 268 -92 329 11
6494 11 -102 -70 -243 116 209 6 -239 23 144 115 -75 -58 51 -22 38 49 -260 -29 450 -177 -58 10 -195
6517 -195 152 187 11 -12 406 159 -74 367 46 -45 96 -267 105 -163 54 12 -4 -62 -91 -76 -9 236 -128
6540 -128 -121 19 21 -173 -63 -30 215 -28 37 -33 30 35 -127 81 -104 114 123 201 -138 -107 1 54 136 -30 -252
6565 -252 -120 -102 16 -80 -32 159 100 -44 57 -111 99 159 27 -47 179 130 90 208 72 -227 23 245 -319
$$ packed form
6404A93n56J98L72j42q3k0J39r6J38k01J91Q6j26N9R4k53k0J84k7k13O3j84L21
6427A17k59N4p4J84j17j80J73n5j54J04J12J35J04n1l23J17J7KK53j78L3j70J49
6450gJ7j09J21k9o4k12M81k54J91j92J2K59j98J50k06J10k40m3J77J85m97L51
6472CL5j32K81j12k14J31j53k8L73j37j63L60P1m01J18m6j80M81j9l60M21l18
6494A1j13L2j73L59R3k03k45K62J21k9j90J7J09p3O0J1l09K31M79o27J19O8k05
6517a95L47L5j76k3M18k47k33M41l21r1J41l63L72k68K17m2j6n8k9J5O7K45l64
6540a28PJ40Kj94J10L3K45k43O5p0O3Nj62K08j85K18RP8l39L1J08N3Q2j66k22
6565b52J32J8J18r6M8J91n9j44J01j68K10O0j32p4K26m9m0J18j36k99K50K22n64
$$ plain form
6588 -319 -78 28 78 148 -104 72 -185 170 75 109 -23 45 -9 -2 -17 258 57 -231 35 -62 1 1 102 11 61
6613 61 -12 142 15 71 -165 -47 53 256 -26 -254 70 43 192 232 -67 45 -149 -7 -315 18 90 -49
6635 -49 42 -16 -76 -50 42 0 247 6 124 -13 -227 -71 21 -131 -56 -147 -184 -131 -195 -123 155 -212 117 267 81
6660 81 171 -89 24 67 144 -188 -52 51 129 159 -72 11 -154 69 252 -124 -16 -22 365 91 -301 -11 -33
6683 -33 -20 147 -57 -268 103 -22 -94 -120 -336 -134 -88 5 -34 219 -213 -256 -230 -264 118 34 115 -101 -162 -73 -18
6708 -18 -6 64 -5 -45 97 -93 124 10 17 31 153 -21 142 159 96 186 45 14 46 105 67 -36 -136 226 -45
6733 -45 38 15 -135 134 139 52 295 14 -121 9 288 -167 -178 -61 96 -113 82 217 -212 -120 -3 -70 27
6756 27 473 361 -84 40 35 35 97 -46 97 -134 61 -50 107 39 -233 -59 29 -295 -17 -39 102 69 -104
$$ packed form
6588c19K41J06N0P0k52J76k57L55r5L4j32O8n4Pj5K75k01k88K66r7O3%J01r1N0
6613F1p3J54j27N6k36J18J00K03k82k28L24k7J49M0k99J12j94J42l08L33P2j39
6635d9R1n8o0K6R2m2K47k41J18j37k14J56R2j52P5r1l7N3o4P2K78l67L29J50j86
6660H1R0k60J13M3P7l32J36J03P8L0k31Q3j65K23J83l76J08oL87k74l92K90k2
6683c3J3J67k04k11L71j25p2k6k16K02M6R3l9K53m32m3K6l4L82q4Q1k16o1Q9N5
6708a8J2P0o9m0J42j90K17j14PJ4J22j74J63J7o3R0j41l1L2N9l8j03j00L62k71
6733d5Q3k3j50K69Nq7K43k81j35J30K79m55j1J17J57k09J95J35m29R2J17o7R7
6756B7M46j12m45J24n%O2j43J43k31J95j11J57o8k72J74Q8l24K78k2J41l3j73
$$ plain form
6779 -104 -165 -161 97 150 -238 53 208 -68 -1 14 -25 -29 -158 36 -36 -208 64 -164 -87 -45 -7 -404 -193 -56
6803 -56 69 -183 86 151 -316 -238 -89 -99 -4 61 190 -55 -4 19 -162 -52 -289 -201 -65 -147 -448 -77 -71 -95
6827 -95 96 -56 -242 -85 -116 -15 44 -37 32 -191 40 39 -34 -45 -42 -21 13 275 103 -96 -496 55 -64 -134 -5
6852 -5 -34 73 0 48 81 254 -145 106 -104 -63 -58 36 -145 72 42 -316 47 -139 12 -58 77 -24 68 45 -80
6877 -80 12 148 -84 -72 163 -47 -61 117 -288 -18 -18 -54 -48 -70 -87 -93 352 -196 82 -78 -127 -209 -5 -94 -184 -53
6903 -53 2 -194 -13 -234 6 121 -99 65 115 18 -214 293 -126 229 -70 202 -87 58 -49 52 185
6924 185 65 12 -58 -11 -52 140 -110 73 252 -13 -45 11 102 -120 24 6 -14 154 -14 37 -49 -25 133 72
6948 72 370 -271 -225 308 165 93 339 172 -65 -64 25 -243 88 286 220 -37 47 384 145 20 110 -52 -102
$$ packed form
6779a04o1MK58N3l88K91J55k76O7J5l9mj29J94p2j72K72k28P7M2L8l97K11J37
6803e6J25k52K69O5m67P8J49j0R5O5J29k45N1K3j81J10k37Q8J36q2l01L71Ok4
6827i5J91j52j86J57l1J01N9q1O9k23K31jp3j1LK1L4K62j72j99m00N51j19p0J29
6852ek9J07p3M8L3J73l99K51k10M1NR4j81K17l0l58L63j86J51p0J35j01R2k3j25
6877h0R2J36k32J2K35k10j4J78m05K70%l6Ok2j7oM45n48K78j60m9q2K04q9r0J31
6903e3N5j96J81k21K40J15k20J64N0r7k32N07m19L55k99K72k89J45j07J01J33
6924A85j20n3p0M7m1J92k50J83J79k65l2N6R1k22J44j8k0J68j68N1q6K4J58o1
6948G2K98o41M6N33j43p2K46j67k37JQ9k68L31J98o6k57Q4L37k39j25R0j62n0
$$ plain form
6971 -102 80 -87 -204 -174 148 47 -51 -162 -16 -274 245 131 20 15 245 -91 230 73 -6 33 -42 -103 196
6994 196 -8 73 -3 -87 -196 84 -305 -71 76 -19 219 405 -181 -94 -124 175 49 -131 121 -101 -56 -52 31
7017 31 -249 -114 307 61 -214 -95 7 245 -12 91 72 -5 44 -64 -1 292 50 38 -41 45 15 -251 17
7040 17 -182 302 -40 -13 -66 -344 -96 -265 65 -22 -158 58 -24 159 -118 14 131 152 58 18 49 -238 226
7063 226 130 130 -138 45 -148 74 182 -135 216 57 166 -9 38 71 191 1 95 -309 -49 16 146 0
7085 0 -46 -89 200 33 -64 41 -156 170 -77 40 -42 -7 141 -81 -58 -306 -52 -86 98 -303 -3 -6 292 -44
7109 -44 59 12 -148 124 -301 79 58 -135 63 36 -69 -114 -2 -182 60 -153 -314 117 11 -1 48 -266
7131 -266 149 -18 -81 -35 -182 225 -137 36 114 61 100 25 -134 -319 27 -135 107 -162 134 -12 135 34
$$ packed form
6971a02J82j67j17L0L22j01r8j11J46k58N19j14j11nK30l36L21j57p9L9p5o1K99
6994A96k04Q1p6q4j09K80l89K34J47r5K38J86n86Q7l0K99j26j80K52k22M5MQ3
7017C1k80J35M21k46k75J19J02K38k57J03j9p7M9j08O3K93k42j2p9Q6l0k66K68
7040A7j99M84l42K7n3k78K48j69L30q7j36K16q2J83k77J32J17K1r4m0L1k87M64
7063B26r6%k68J83j93K22J08l17L51j59J09j75M7L3J20j90R4m04K60O5J30j46
7085@m6m3K89j67r7J05j97L26k47J17q2L5J48k22K3k48K54l4J84m01L00lK98l36
7109d4J03m7j60K72m25L80k1j93J98k7j05m5J12j80K42k13j61M31j06j2M9l14
7131b66M15j67o3M6j47M07l62J73P8n3L9p5j59j85L46j62K42k69K96j46J47j01
$$ plain form
7153 34 -75 6 239 316 -172 -135 -65 228 44 14 -117 -138 -228 9 -123 165 -363 37 31 -154 194 20 68 155
7177 155 -73 238 -63 -95 -105 295 66 -349 73 29 -207 90 -118 104 240 -175 231 -17 157 152 90 -167
7199 -167 11 -28 289 54 2 30 -34 -133 -188 -252 -42 -232 -144 -85 29 51 -171 193 383 -192 292 154 133 -118
7223 -118 -31 -97 -164 -65 -80 161 61 191 -37 -297 87 -123 45 179 63 -115 -73 78 -205 86 366 322
7245 322 -167 -89 -107 57 323 -127 -95 -339 -139 93 -154 27 -129 32 -295 -107 -29 -506 -203 94 -87
7266 -87 -90 169 -3 92 -67 -104 -44 -99 91 180 34 -15 -248 75 -122 -24 216 302 29 46 -3 -64 143 196 -350
7291 -350 -28 119 176 -45 96 12 27 -150 -111 -214 216 -183 -8 -147 -245 -280 52 -100 -10 56 -41 -47 151 -21
7315 -21 -167 -168 99 -72 164 27 -65 60 67 -256 -6 6 -140 -70 -19 -245 414 435 -159 -81 -267 37 120 355
$$ packed form
7153C4j09Q1K33P7m88L7P0K93j84l0j31k1r0K37j32K88n28M00oj85L48j74M8Q7
7177A55k28L11l01l2j0M00k29m15M22m4k36K97k08K22J36m15M06k48J74no2k57
7199a67J78l9L17k35n2K8o4r9n5o4K10j90Q8N9J14K2k22L64J90n75M84j38k1k51
7223a18Q7o6o7R9j5K41j00J30k28k60L84k10J68J34j16j78M2J51k83K91K80m4
7245C22m89P8j8J64K66m50L2k44K00K32k47J81j56J61l27J88P8m77L03K97j81
7266h7lK59j72R5j59l7O0n5J90Q9j46m9k33L23j97R8K40Q6k73J7m9o1K07N3n46
7291c50L22J47N7k21J41q4J5j77L9j03M30l99J75j39r8l5L32j52R0O6r7oJ98j72
7315b1j46jK67j71K36j37r2J25Pl23K50J2j46P0N1k26O59K1n94P8j86L04Q3K35
$$ plain form
7339 355 -42 25 259 -77 49 146 194 -66 135 105 -54 17 137 152 77 -215 -277 -68 178 -232 -205 -9 165
7362 165 47 -195 379 -17 200 119 -431 -94 42 -56 -110 -135 -26 108 -77 -94 244 -197 -2 -443 -151 -142
7384 -142 5 -165 -332 -105 62 -62 -274 -128 -136 -17 89 180 68 -66 63 32 -198 -132 0 54 -157 -82
7406 -82 -39 -208 -13 31 -19 33 38 16 163 -109 13 -120 137 -52 -236 -1 73 54 184 13 52 216 -63 -30
7430 -30 235 172 81 27 212 175 -11 -96 72 96 -26 281 177 -178 -108 -57 238 77 -66 -124 -56 137 -192 -131
7454 -131 -74 21 203 -98 -213 123 -68 56 -183 -234 78 224 -75 -29 67 -3 -173 104 29 -97 -57 200 79
7477 79 9 108 -136 -250 197 38 -92 49 34 254 513 145 -111 11 -215 -27 -106 -189 145 -101 -37 -97 69
7500 69 -65 31 -295 -145 -159 -75 -89 -78 -14 -109 -6 -66 -154 -78 -13 -140 109 -174 0 -119 -114 172 -95 137 47
$$ packed form
7339C55l97O7K34l36J26R7M8k60K01l0j59P1J20J5p5k92o2K09K46m10K7J96J74
7362A65j18k42N74l96K17q1n50L37J36r8n4k5J09J34j85j7L38m41J95m41K92R
7384a42J47j70j67K27J67j24k12J46qJ19J06R1j12j34J29l1k30O6J32N4k11P5
7406h2M3j69J95M4n0N2Nk2J47k72J22j33K57j89j84K35P4j9J30j71L9J64k79L3
7430c0K65o3r1n4J85l7j86q5J68K4j22L07j04l55P0N1K95j61j43n8O8J93l29O1
7454a31N7R5J82l01j15L36j91J24k39n1L12J46k99M6R6p0j70K77p5j26M0K57j21
7477G9p0R9k44j14M47j59j30J41j5K20K59l68k56J22k26J88p9q3L34k46O4o0J66
7500F9j34R6l26J50j4Q4j4J1O4r5J03o0q8P6O5j27K49k83J74j19NK86k67K32r0
$$ plain form
7525 47 240 134 14 -287 -49 167 -107 131 161 65 -74 -31 -51 -289 415 199 -21 -212 -198 -19 -29 -91 -39
7548 -39 -127 18 50 501 113 21 66 -107 182 52 6 -4 -231 -167 0 168 96 -244 87 -86 -89 -297 57 -41
7572 -41 -245 70 9 -145 1 -265 -350 -199 -55 -126 -77 -41 98 -68 -69 -129 58 -55 167 -186 117 42 12 301
7596 301 -118 -26 1 97 140 -149 -24 -99 174 -121 -93 -247 -76 138 -272 81 208 -30 -101 51 266 -72
7618 -72 -57 328 385 -171 62 -73 75 -80 16 121 -115 70 -357 -193 133 -90 -77 -108 -86 -203 57 -134
7640 -134 -9 133 7 11 -44 -186 -96 -182 65 -12 143 -13 16 46 1 36 156 -25 -25 99 249 -46 43 -8 -45
7665 -45 83 -124 174 119 128 -48 57 -176 -37 140 59 -3 95 -175 -62 -224 -179 -82 41 33 123 16 -124 76
7689 76 122 12 219 -67 -32 -24 -170 44 144 -110 -313 38 59 76 58 27 -128 104 181 262 -148 14 -178 156
$$ packed form
7525D7J93j06j20l01K38K16k74K38L0r6j39M3k0k38P04k16k20j91J4J79j0o2N2
7548c9q8J45L2M51l88r2M5j73K89j30m6j0k27O4J67J68p2l40L31j73lk08L54r8
7572d1k04L15o1j54J46k66q5J51J44p1M9L6J39j66jo0J87j13K22l53L03p5l0K89
7596C01m19R2K7R6M3k89J25p5K73k95K8j54J71K14m10L53J27k38p1J52K15l38
7618g2J5L85N7n56K33j35J48j55R6J05k36J85m27J64L26k23J3l1K2j17K60j91
7640a34J25J42j26Mn5j42R0q6K47p7J55j56K9L0m5L5J20j81%J24J50k95Q9n1l7
7665d5J28k07K98n5Rj76J05k33J39J77q1o2R8k70J13j62M5R7J23qR0j07j40K00
7689G6M6j10K07k86L5Qj46K14J00k54k03L51K1J7j8l1j55K32P7Q1m10J62j92L34
$$ plain form
7713 156 -1 -83 66 -44 24 82 5 -67 77 -33 263 -172 -110 -320 -118 14 64 -95 -91 122 -8 208 -91
7736 -91 -96 28 38 -44 43 -64 -212 -123 193 -110 96 211 69 84 -448 -143 -8 25 -44 -22 73 -136 326 55
7760 55 -131 96 -328 -9 210 221 -163 14 -51 -28 -108 -40 264 81 -66 127 -245 -153 -36 35 -102 265 -129
7783 -129 20 -193 35 174 64 -23 -127 283 46 -220 6 -95 131 -384 -35 -122 -61 -55 35 -137 -86 -130 178
7806 178 -292 21 -113 -90 0 287 218 126 133 105 88 129 238 168 145 26 -39 -110 78 13 -132 -144 110 -187 -103
7831 -103 -169 10 -74 178 -59 -221 164 130 -51 173 47 271 273 -316 -199 330 57 10 -16 -178 126 200 -248
7854 -248 -143 -10 -59 155 244 -28 120 402 -163 -215 -51 134 105 122 30 -87 157 -162 -38 -50 -37 18 -149
7877 -149 229 -132 5 -32 126 3 -141 -91 -97 124 -9 70 -100 55 23 370 -140 24 -5 -26 -71 156 58
$$ packed form
7713A56j57q2J49j10O8N8p7p2J44j10K96m35O2k10K02J32N0j59MK13j30K16k99
7736i1nJ24J0q2Q7j07j48Q9L16l03K06J15j42J5n32L05J35L3o9K2R5k09M62k71
7760E5j86K27m24L19K19J1l84J77o5K3q0O8L04j83j47J93l72R2J17P1j37L67l94
7783a29J49k13K28J39j10q7j04M10k37k66K26j01K26n15L49q7O1OR0j72N1m4L08
7806A78m70L13j34K3R0K87o9r2Pk8j7M1J09p0k3j19o5p1J88o5j45j2K54k97Q4
7831a03o6J79q4K52k37j62L85l4j81K24j26K24Kn89J17N29k73m7k6j62L04P4m48
7854b48J05J33m9K14Q9k72J48K82n65n2J64J85k9J7r2j17K44l19J24j2J3N5j67
7877a49L78l61J37l7J58j23j44N0oK21j33P9j70J55l2L47n10J64k9k1m5K27r8
$$ plain form
7900 58 -64 -33 -102 -111 -5 90 -93 31 46 -97 -10 204 211 76 -248 10 19 150 112 39 314 -118 -228 -86 -5
7925 -5 -102 -167 70 131 200 -232 284 -45 -41 250 -23 -191 -44 223 79 -132 81 -62 65 303 294 -179 -15
7948 -15 21 226 -80 5 174 126 188 -237 153 -28 70 -118 138 31 138 52 119 63 -14 -81 250 351 109 -52
7972 -52 10 -69 -392 -128 187 23 152 -198 115 -64 29 -6 -105 67 169 107 88 282 -82 370 231 -396 27
7995 27 -218 -178 -53 -10 45 125 26 71 3 -52 -18 -179 -137 48 -51 -51 154 78 -13 -58 -91 169 -7 179 -6 210
8021 210 -65 68 -53 57 -30 95 5 -77 251 -123 -96 255 -36 -13 102 -253 57 34 -188 -91 133 99 -157
8044 -157 -33 40 -59 -71 -114 -103 -111 -39 449 68 98 82 -86 62 176 33 8 -162 -76 68 -167 -331 -13 89
8068 89 -41 -55 137 42 -196 168 19 325 -24 -8 -183 36 70 79 -112 -73 182 48 -110 -193 -286 10 -45 -119
$$ packed form
7900E8j22L1o9rJ06R5j83J24J5j43Q7K14Pj35l24K58RJ31l8p3K75m32j10J42Q1
7925er7o5K37O1O9m32N16l29MK91k73j68J47K67j44k11K13j43J27K38rm73J64
7948a5L6K05l06Q5J69m8O2m25L90j81R8j88K56j07J07q6O7n6p7o7L31J01k42j61
7972e2O2p9l23K64L15j64J29l50L13j79R3l5r9J72J02o2j9J94l64M52j39o27M23
7995B7k45M0J25M3N5Q0r9M5o8n5L4j61M2J85r9%K05p6r1m5l3K60j76J86j85K16
8021B10k75J33j21J10q7J25r0q2L28l74K7L51k91K3J15l55L10k3k22R7K24l4k56
8044a57J24P3r9j2m3J1qP2M88l81L0j6j68J48J14j43k5j70Q6J44k35j64L18J02
8068H9j30j4J92r5k38L64j49L06l49J6j75K19L4Rj91L9K55j34j58q3r3K96n5p4
$$ plain form
8092 -119 -114 -85 205 31 -16 6 337 16 -111 -60 211 -143 181 -52 221 87 -36 146 241 -249 -36 -168
8114 -168 -178 284 26 -119 30 -77 136 30 -16 30 3 -195 -236 292 4 -268 106 -210 -82 151 26 45
8136 45 -272 -5 87 14 -10 108 107 46 -19 13 198 42 -147 -129 252 -227 71 223 70 146 212 6 151 -28
8160 -28 75 266 245 119 170 9 235 28 86 0 161 -65 -404 -39 36 -24 -35 -112 10 -109 -181 48 32 82
8184 82 17 -108 -195 69 168 -163 -123
$$ packed form
8092a19NK9K90j74m7K2L31l21j27N1K71l54L24k33K73j34j23J82R5m90K13j32
8114a68j0M62k58j45J49j07K13j06m6M6k7j98m1N28k88k72L74l16J28K33j25J9
8136D5l17K67R2p3k4J18jo1o5L2J85j56j89J8L81m79K98J52j53P6O6k06J45j79
8160b8J03J91k1j26N1j61K26k07N8q6J61k26l39L65P5o0j1p7J22j19p2K29j6N0
8184H2o5j25q7K64R9l31M0
8191a23
$$ Imaginary data points
##PAGE= N=2
##DATA TABLE= (X++(I..I)), XYDATA
$$ plain form
0 0 0 0 0 0 0 0 0 0 0 0 0 0 0 -8 8 -8 8 -8 8 -16 16 -17 24 -29 32 -40 45 -48 56 -65 77 -85 97 -109 125 -141
36 -141 157 -174 197 -221 245 -270 300 -331 366 -404 446 -492 542 -598 658 -726 800 -883 976
55 976 -1082 1204 -1341 1506 -1698 1934 -2225 2593 -3087 3772 -4799 6501 -9837 18858 -96415
70 -96415 -272194 -52762 163826 168682 -15546 -118247 -9285 189383 193758 26559 -77610
81 -77610 10328 162039 184268 23035 -94924 -3976 144065 132901 2222 -94200 -51992
92 -51992 66254 80559 -46459 -125543 -67894 21048 30677 -50509 -129530 -84047 24489 34151
104 34151 -51868 -104117 -68905 13324 42008 -27331 -84455 -41122 26166 41513 7988 -41525
116 -41525 -31367 52849 92379 40548 -2487 8020 40318 69986 62823 20442 4322 23664
$$ packed form
0@%%%%%%%%%%%%%qJ6j6J6j6J6k4L2l3M1n3O1p2Q5r3J04j21J42j62J82k06K34k66
36a41K98l31L71m18M66n15N70o31O97p70Q50r38J034j140J256j384J526j683J859
55I76k058K286k545K847l204L632m159M818n680O859q571J1300j6338K8695j15273
70i6415j75779K19432K16588M856j84228j02701J08962J98668M375j67199j04169
81g7610Q7938J51711K2229j61233j17959R0948J48041j1164j30679r6422M2208
92e1992J18246J4305j27018p9084N7649Q8942R629q1186p9021M5483J08536R662
104C4151q6019n2249L5212Q2229K8684o9339n7124M3333O7288J5347l3525m9513
116d1525J0158Q4216L9530n1831m3035J0507L2298K9668p163m2381j6120J9342
$$ plain form
128 23664 41973 47379 21243 -19157 -6996 32005 21045 -13556 -29499 -37118 -20559 6935
140 6935 -14688 -58935 -60652 -36878 -14424 -9203 -39778 -57730 -18450 13259 -6709 -32718 -33758
153 -33758 -3714 38934 31393 -19473 -23283 22194 51270 46657 12556 -15264 24625 81233 58282
166 58282 -3303 -13928 24277 64207 52434 -17778 -52199 -3198 46219 30271 -25954 -66529
178 -66529 -37053 28484 19844 -53174 -74890 -31332 10321 11645 -35301 -75464 -38359 23448
190 23448 22256 -17807 -37663 -17976 27643 39167 -3627 -19870 17413 40420 28637 5524
202 5524 -7670 16880 51045 30995 -7679 -1664 21879 29881 21085 -7243 -18028 15901 31002
215 31002 -4655 -31923 -23316 452 16163 -4231 -37929 -27574 1696 -2097 -16971 -22725 -22909
$$ packed form
128B3664J8309N406k6136m0400J2161L9001j0960l4601j5943p619J6559K7494
140F935k1623m4247j717K3774K2454N221l0575j7952L9280L1709j9968k6009j040
153c3758L0044M2648p541n0866l810M5477K9076m613l4101k7820L9889N6608k2951
166E8282o1585j0625L8205L9930j1773p0212l4421M9001M9417j5948n6225m0575
178f6529K9476O5537q640p3018k1716M3558M1653J324m6946m0163L7105O1807
190B3448j192m0063j9856J9687M5619J1524m2794j6243L7283K3007j1783k3113
202E524j3194K4550L4165k0050l8674O015K3543Q002q796k8328j0785L3929J5101
215C1002l5657k7268Q607K3768J5711k0394l3698J0355K9270l793j4874n754j84
$$ plain form
228 -22909 -3176 8699 -17991 -32085 -5321 12073 3994 -6788 -11849 2178 22822 10614
240 10614 -8283 7534 25378 21801 11085 -4697 -4273 27534 38041 7492 -10144 -519 12233
253 12233 20741 6403 -19384 -9995 13371 1980 -17290 -16939 -12342 -2909 -308 -18786 -23404 -2994
267 -2994 34 -12283 -14183 -10740 2301 15691 -3419 -24988 -2488 23594 16835 811 -10285
280 -10285 -4766 22678 27273 -4132 -16115 4743 23344 24773 -354 -27742 -8860 27743 21101
293 21101 -6970 -15469 -9410 8546 17346 -5729 -20885 -2067 10293 877 -10325 -17163 -6598
306 -6598 15679 5866 -21468 -16456 3610 5713 -1072 -11718 -11856 9928 16814 -6817 -15650 3
320 3 12064 16950 7841 -13050 -6717 18257 14921 -2207 -4219 102 8427 11171 -5776 -12730 5281
$$ packed form
228b2909J9733J1875k6690j4094K6764J7394q079j0782n061J4027K0644j2208
240A0614j8897J5817J7844l577j0716j5782M24L1807J0507l0549j7636R625J2752
253A2233Q508j4338k5787R389K3366j1391j9270L51M597R433K601j8478m618K0410
267b994L028j2317j900L443J3041J3390j9110k1569K2500K6082o759j6024j1096
280a0285N519K7444M595l1405j1983K0858J8601J429k5127k7388J8882L6603o642
293B1101k8071q499O059J7956Q800k3075j5156J8818J2360r416j1202o838J0565
306f598K2277r813k7334N012K0066K103o785j0646j38K1784O886k3631q833J5653
320CJ2061M886r109k0891O333K4974l336j7128k012M321Q325K744j6947o954J8011
$$ plain form
335 5281 9308 -4309 -7769 -6748 -2298 8039 -2248 -19623 -5071 15746 8293 -8028 -16825
348 -16825 -9122 17821 23029 -7399 -21070 -1911 15094 16335 -682 -22665 -9128 23842 18276
361 18276 -12314 -22047 -6796 17092 22425 -7831 -28027 -4087 18086 8965 -6365 -14128 -4627
374 -4627 16815 11638 -16587 -16439 7235 16761 7259 -13177 -21328 4697 24625 2543 -19343
387 -19343 -9026 9086 18235 7307 -17921 -15513 16016 23515 3064 -11711 -11338 6180 21463
400 21463 4061 -18470 -6263 10629 5487 -5246 -13829 -10725 7818 8471 -14144 -17307 -2656
413 -2656 2566 527 -7377 -12696 3147 15142 -2515 -15678 -1071 15120 17144 5870 -12969
426 -12969 -5565 22076 22707 -876 -10124 -2183 13692 21417 -48 -21335 -4043 19072 12079
$$ packed form
335E281M027j3617l460J021M450J0337j0287j7375J4552K0817p453j6321q797
348a6825P703K6943N208l0428j3671J9159J7005J241j7017k1983J3537L2970n566
361A8276l0590r733J5251K3888N333l0256k0196K3940K2173r121j5330p763R501
374d627K1442n177k8225J48K3674R526r502k0436q151K6025J9928k2082k1886
387a9343J0317J8112R149j0928k5228K408L1529P499k0451j4775L73J7518J5283
400B1463j7402k2531J2207J6892n142j0733q583L104J8543O53k2615l163J4651
413b656N222k039p904n319J5843J1995j7657j3163J4607J6191K024j1274j8839
426a2969P404K7641O31k3583r248P941J5875P725k1465k1287J7292K3115o993
$$ plain form
439 12079 -6248 -16669 -9312 12131 11140 -14446 -18756 737 9180 1440 -14105 -22903 -2710
452 -2710 18809 2004 -22584 -17921 296 12327 5722 -17913 -18239 10528 19340 -984 -13670
465 -13670 -7964 11738 26927 10775 -15058 -5892 19002 23440 12062 -3981 -6759 13055 21702
478 21702 723 -10108 83 7213 6051 -2976 -15809 -9565 6388 -509 -15433 -13434 -5098
491 -5098 1241 -1465 -17548 -18232 4851 11349 -6086 -15171 -9921 3359 15268 4459 -14903 -5950
505 -5950 13967 14551 2898 -7174 -4676 14909 22115 -102 -11869 1811 14087 13883 3527
518 3527 -8949 -724 17678 10511 -7973 -8307 1577 10330 8566 -11821 -22028 -1719 11839 -2756
532 -2756 -17486 -17911 -5709 7905 -669 -21783 -17097 3683 9369 1045 -12207 -15654 4961 21097
$$ packed form
439A2079j8327j0421P357K1443r91k5586m310J9493Q443p740j5545q798K0193
452b710K1519j6805k4588M663J8217J2031o605k3635l26K8767Q812k0324j2686
465a3670N706J9702J5189j6152k5833R166K4894M438j1378j6043k778J9814Q647
478B1702k0979j0831J0191P130j162r027j2833O244J5953o897j4924J999Q336
491e098O339k706j6083o84K3083O498j7435r085N250J3280J1909j0809j9362Q953
505e950J9917N84j1653j0072K498J9585P206k2217j1767J3680J2276k04j0356
518C527j2476Q225J8402p167j8484l34R884Q753j764k0387j0207K0309J3558j4595
532b756j4730m25J2202J3614q574k1114M686K0780N686q324j3252l447K0615J6136
$$ plain form
546 21097 5771 -9533 -211 12407 16518 10059 -2962 336 18320 16415 25 -3892 1723
559 1723 9536 11802 -3673 -14775 14 11065 -730 -12905 -13632 -4043 8872 1612 -20543
572 -20543 -18787 1000 6341 -1963 -12755 -16484 -304 12995 -194 -14574 -6124 7971 12605
585 12605 3954 -10812 -6324 15378 16367 51 -4153 2771 11418 15637 1983 -10102 4250 19062
599 19062 8429 -7263 -10825 -342 14571 8129 -15668 -18373 1168 9244 1607 -13347 -20762
612 -20762 -3618 15386 2798 -18032 -15614 -593 10716 7988 -9750 -15088 4056 14372 4517
625 4517 -4621 -4708 4024 14733 6956 -8366 -3971 9018 9110 3332 -2612 -5503 4534 10023 -1973
640 -1973 -6873 2082 5048 2261 -2040 -7368 -2574 7796 2054 -7728 -5277 -977 439 957 -6489
$$ packed form
546B1097j5326j5304R322J2618M111o459j3021L298J7984j905j6390l917N615
559A723P813K266j5475j1102J4789J1051j1795j2175p27R589J2915p260k2155
572b0543J756J9787N341q304j0792l729J6180J3299j3189j4380Q450J4095M634
585A2605q651j4766M488K1702R89j6316m204O924Q647M219j3654j2085J4352J4812
599A9062j0633j5692l562J0483J4913o442k3797k705J9541Q076p637j4954p415
612b0762J7144J9004j2588k0830K418J5021J1309k728j7738n338J9144J0316r855
625D517r138q7Q732J0709p777j5322M395J2989R2n778n944k891J0037N489j1996
640a973m900Q955K966k787m301n328M794J0370n742r782K451M300J416N18p446
$$ plain form
655 -6489 -7975 3033 3878 -6638 -6720 -774 2114 4804 -873 -8711 504 11257 3855 -4705 -2976
670 -2976 3711 12179 9987 -6350 -8400 6518 12274 5844 -4106 -11003 -922 13313 4297 -12502
684 -12502 -9793 1052 5846 3601 -9101 -14550 -452 9465 1315 -6452 -7267 -2133 7503 4844
698 4844 -6445 -3669 5809 3723 353 -625 -2320 3299 8063 -892 -5115 2821 4556 1259 -423
713 -423 -3308 994 8186 1637 -7627 -2973 4194 4281 1644 -5714 -7236 3983 6804 -3945 -6999
728 -6999 -2216 1057 3739 -964 -10825 -4713 7331 2982 -5868 -5097 -441 6196 6073 -5152 -6369
743 -6369 6910 10826 3575 -3058 -5770 2959 14490 6192 -9588 -6044 5713 7284 1741 -8220
757 -8220 -9833 3694 8928 -3817 -11862 -7106 1664 6933 -73 -13121 -7598 7892 6593 -3625
$$ packed form
655f489j486J1008Q45j0516q2N946K888K690n677p838R215J0753p402q560J729
670b976O687Q468k192j6337k050J4918N756o430r950o897J0081J4235r016j6799
684a2502K709J0845M794k245j2702n449J4098R917q150p767q15N134R636k659
698D844j1289K776R478k086l370r78j695N619M764q955m223P936J735l297j682
713d23k885M302P192o549r264M654P167Q7k637p358j522J1219K821j0749l054
728f999M783L273K682m703r861O112J2044m349q850P71M656O637j23j1225j217
743f369J3279L916p251o633k712Q729J1531q298j5780L544J1757J571n543r961
757h220j613J3527N234j2745q045M756Q770N269p006j3048N523J5490j299j0218
$$ plain form
771 -3625 -6847 -2748 7528 10640 -3545 -10702 2245 11933 6769 -2260 -8672 -1340 13027 9001
785 9001 -8029 -9231 2726 10148 7587 -5883 -13189 1211 13571 4018 -8028 -8637 -2366 7069
799 7069 5915 -8869 -11165 1713 5634 -1476 -7572 -8069 343 7655 -1154 -9554 -2826 4834 4757
814 4757 1535 -4664 -2613 9433 9531 -2183 -3494 4109 8524 8695 327 -7364 1513 11285 4326
829 4326 -5744 -6050 -1560 5486 3346 -9130 -11539 248 4413 -864 -6545 -9725 -3229 6323 429
844 429 -8910 -4585 2176 2241 516 -3911 -4269 4792 7121 -1126 -2967 1495 3801 5700 2975 -3038
860 -3038 2400 8048 2477 -1429 2086 3714 4779 4396 -2349 -1859 6311 3776 -3469 -3048 -1382 1158
876 1158 633 -7447 -11699 -1455 3787 -4467 -10111 -9863 -2955 6424 880 -12753 -9064 5707 9538
$$ packed form
771c625l222M099J0276L112j4185p157J2947R688n164r029o412P332J4367m026
785I001j7030j202J1957P422k561j3470p306J4400J2360r553j2046o09O271R435
799G069j154j4784k296J2878L921p110o096m97Q412P312q809q400O728P660p7
814D757l222o199K051J2046R8j1714j311P603M415J71q368p691Q877R772o959
829D326j0070l06M490P046k140j2476k409J1787M165n277n681l180O496R552n894
844D29r339M325O761O5j725m427l58R061K329q247j841M462K306J899k725o013
860c038N438N648n571l906L515J628J065l83o745M90Q170k535p245M21J666K540
876A158n25q080m252J0244N242q254n644K48O908R379n544j3633L689J4771L831
$$ plain form
891 9538 2290 -7102 -8057 7958 18936 6155 -8393 -3353 10571 17995 9091 -9091 -7595 11915
905 11915 16748 1134 -11803 -9850 5007 15359 717 -18117 -11713 6904 9855 -1897 -15809
918 -15809 -13718 6248 12717 -5640 -18347 -9330 6173 11662 -1661 -18369 -10047 11862 13736
931 13736 -2229 -12456 -6735 10370 17487 140 -14463 -2530 14224 14583 2340 -10218 -4887
944 -4887 14240 16603 -307 -9676 -2633 8490 12029 -182 -14011 -6154 7649 5041 -5687
957 -5687 -11203 -8574 2391 5862 -6085 -12503 -4635 2043 1915 -2557 -8384 -4679 5665 4375 -3507
972 -3507 -3233 351 3774 6611 2461 -2508 2098 6263 3492 3093 2310 53 2664 5165 1194 1042
988 1042 1836 -1398 403 4181 1021 -2115 -2203 -3034 476 3637 -3092 -8845 -3543 682 559 -1960
$$ packed form
891I538p248r392r55J6015J0978j2781j4548N040J3924P424q904j8182J496J9510
905A1915M833j5614j2937J953J4857J0352j4642j8834O404J8617K951j1752j3912
918a5809K091J9966O469j8357j2707R017J5503N489j3323j6708Q322K1909J874
931A3736j5965j0227N721J7105P117j7347j4603J1933J6754L59j2243j2558N331
944d887J9127K363j6910r369P043J1123L539j2211j3829P857J3803k608j0728
957e687n516K629J0965L471j1947o418P868O678j28m472n827L705J0344j290p882
972c507K74L584L423K837m150m969M606M165k771l99p83k257K611K501l971j52
988A042P94l234J801L778l160l136q8q31L510L161o729n753N302M225j23k519
$$ plain form
1004 -1960 -8003 -7549 2758 5109 -4090 -7958 -4314 2819 8040 1379 -8865 -3236 7771 8193 1641
1019 1641 -3953 -3100 7788 12337 730 -7112 -212 7826 8619 971 -9221 -4970 9192 8585 -3884
1034 -3884 -9476 -4737 4740 8345 -3046 -13600 -4770 6651 5752 -3509 -10742 -7377 6063 8516
1048 8516 -5056 -10959 -3416 4896 6566 -996 -10224 -4089 7939 7063 -1951 -5360 -1901 6142 9639
1063 9639 243 -5487 1743 7463 5422 1618 -2370 -635 7052 5671 -3069 -3836 196 1677 1958
1078 1958 -1937 -6401 -2639 1707 -2336 -4182 -3206 -3250 -907 58 -3777 -2964 1266 -298 -1613 982
1094 982 470 -293 1412 194 419 4492 2697 -2284 -133 2782 3429 3409 -1017 -3877 2343 6521 1053
1111 1053 -3144 -2435 706 5636 3502 -5409 -5239 2972 5041 959 -4248 -6574 369 6590 61
$$ packed form
1004a960o043M54J0307K351r199l868L644P133N221o661j0244N629J1007M22o552
1019A641n594Q53J0888M549j1607p842O900Q038P93p648j0192M251J4162o07j2469
1034c884n592M739R477L605j1391j0554Q830J1421q99r261p233L365J3440K453
1048H516j3572n903P543Q312J670p562r228O135J2028q76r014l409L459Q043L497
1063I639r396n730P230N720k041l804l988J735P687j381q740p67M032J481K81
1078A958l895m464L762M346m043j846R76m4K343R65l835Q13M230j564j315K595
1094I82n12p63J705j218K25M073j795m981K151K915O47k0m426k860O220M178n468
1111A053m197P09L141M930k134q911J70Q211K069m082n207k326O943O221o529
$$ plain form
1126 61 -8342 -5703 603 3939 1157 -7194 -8220 2072 5995 -528 -5182 -3592 1607 6989 2787
1141 2787 -6091 -2541 6422 6717 1848 -2770 -2972 5022 8488 640 -4688 -760 2840 4560 1628
1156 1628 -5199 -4226 3930 3215 -3079 -3946 -2224 495 3106 -902 -5570 -1462 1652 -98 -1425 -2030
1172 -2030 -2303 1481 1324 -3348 -1541 1599 -48 -1018 -334 -1068 1211 2606 -1715 -2016 3367 3028 893
1189 893 283 -1008 1681 5848 2212 -3065 55 3783 3392 1061 -3279 -3098 3994 4056 -3370 -5147
1205 -5147 -1845 1031 2693 -1683 -8358 -3296 5055 2403 -3930 -6112 -2777 4712 5422 -3833 -7489
1220 -7489 499 6059 4296 -1277 -6095 -1641 7626 5642 -4034 -5025 940 5846 5685 -2239 -6759
1235 -6759 800 7830 3433 -2795 -4271 -238 6313 4886 -4255 -5155 2195 4414 1200 -3367 -5917
$$ packed form
1126F1q403K639O306L336k782q351j026J0292L923o523m654J590N199N382m202
1141B787q878L550Q963K95m869m618k02P994L466p848n328L928L600J720k932
1156A628o827R73Q156p15o294q67J722K719K611m008m668M108L114j750j327o05
1172b030k73L784j57m672J807L140j647r70O84p34K279J395m321l01N383l39k135
1189H93o10j291K689M167l636n277L120L728l91k331m340J81P092O2p426j777
1205e147L302K876J662m376o675N062Q351k652o333k182L335P489P10r255l656
1220g489P988N560j763n573m818M454R267j984r676r91N965M906j61p924m520
1235f759P559P030m397o228j476M033O551j427r141r00P350K219l214m567k550
$$ plain form
1250 -5917 -531 5706 -178 -6626 -4266 590 1986 340 -5090 -5227 2222 3948 -1746 -3541 -1591
1265 -1591 2116 4768 988 -4193 -30 5504 3230 -21 -1270 -583 3916 4808 -1935 -3334 1939
1280 1939 3340 1016 -1740 -3079 315 4297 119 -4282 -1751 1407 1762 812 -3444 -3869 2243 3110
1296 3110 -2228 -3265 -1155 506 2229 -872 -4701 -941 3451 711 -2282 -2332 -713 2986 2634 -2534
1312 -2534 -2847 2540 3554 1179 -415 -1537 1824 5498 1030 -4037 -458 3367 2967 313 -3980
1327 -3980 -3209 3349 3760 -2614 -4969 -1666 2035 3169 -1160 -6346 -2059 4526 2449 -2403 -3605
1342 -3605 -1426 3889 4453 -2377 -4784 1292 5044 2344 -1411 -4131 -411 5369 2124 -4086 -3423
1357 -3423 700 2776 2233 -3088 -4717 1725 5203 -152 -3389 -2169 960 4128 1308 -4749 -3344
$$ packed form
1250e917N386O237n884o448K360M856J396j646n430j37P449J726n694j795J950
1265a591L707K652l780n181M163N534k274l251j249O87M499Q92o743j399N273
1280A939J401k324k756j339L394L982m178m401K531L158L55r50m256m25O112Q67
1296C110n338j037K110J661J723l101l829L760M392k740k993n0J619L699l52n168
1312b534l13N387J014k375j594j122L361L674m468n067L579L825m00k654m293
1327c980P71O558M11o374k355L303L701J134m329n186M287O585k077m852j202
1342c605K179N315N64o830k407O076L752k700l755k720L720N780l245o210O63
1357c423M123K076n43n321j629O442L478n355l237J220L129L168k820o057J405
$$ plain form
1372 -3344 2824 3202 -357 -2888 -3126 1646 4264 -885 -4471 -696 2587 2414 78 -3400 -2082 3893
1388 3893 3318 -1488 -2280 659 2679 3124 -411 -3468 742 3896 869 -1697 -2008 -533 2007 1582
1404 1582 -3362 -3037 1289 1144 -607 -1477 -2494 194 2852 -760 -3682 -346 1336 788 -41 -2098
1420 -2098 -1112 2777 1778 -1967 -1004 1004 1737 1470 -800 -2962 1560 3850 112 -2096 -317 1178
1436 1178 3467 1675 -3025 -1834 3069 3021 -473 -2373 -2369 1328 3353 -1150 -5046 -1682 1524 1178
1452 1178 -1134 -4169 -3195 2232 2369 -2381 -3337 -547 1615 2726 182 -2776 361 4400 2297 -297
1468 -297 -507 802 3700 3421 -1173 -2019 1425 2397 423 -1229 -2541 -642 2578 -446 -3488 -1720
1484 -1720 452 -43 -649 -2861 -3051 1075 1830 -1929 -2290 -270 437 1584 -208 -2601 59 2714
$$ packed form
1372c344O168L78l559k531k38M772K618n149l586L775L283j73k336l478J318N975
1388C893n75m806p92K939K020M45l535l057M210L154l027k566l11J475K540m25
1404A582m944L25M326j45j751q70j017K688K658l612k922L336J682n48q29k057
1420b098R86L889r99l745R63K008P33k67k270k162M522K290l738k208J779J495
1436A178K289j792m700J191M903m8l494j900ML697K025m503l896L364L206l46
1452A178k312l035R74N427J37m750r56K790K162J111k544k958L137M039k103k594
1468b97k10J309K898k79m594q46L444R72j974j652j312J899L220l024l042J768
1484a720K172m95o06k212j90M126P55l759l61K020P07J147j792k393K660K655
$$ plain form
1500 2714 805 -1306 -641 313 2323 2079 -930 -1565 2460 2864 1176 -63 -309 1213 3607 1334
1516 1334 -1587 -47 1883 1174 309 -1770 -2401 920 1299 -2409 -2954 -1183 -850 -523 -1429 -3827 -1904
1533 -1904 768 -596 -2078 -1353 -572 968 1643 -919 -792 1898 2634 1449 1077 310 1187 3228 1818
1550 1818 -1136 476 2079 1728 686 -427 -1023 1488 1917 -1291 -1378 -153 -19 110 -876 -2890 -1133
1567 -1133 1134 -805 -2637 -1487 -663 78 -107 -2758 -2732 992 828 -858 -1410 -758 758 2526 515
1584 515 -1874 752 3028 1955 1125 79 378 3607 3470 -105 -1130 1137 2425 1680 -281 -2389
1600 -2389 -489 2013 358 -2856 -2783 -1195 839 164 -3063 -3798 -2 1251 -1211 -2710 -2274 -59
1616 -59 2235 560 -3164 -1259 2020 1944 500 -1205 -944 2645 3377 -304 -1561 613 2210 2714 589
$$ packed form
1500B714j909k111O65R54K010k44l009o35M025M04j688j239k46J522K394k273
1516A334k921J540J930p09q65k079o31L321L79l708n45J771L33L27r06k398J923
1533a904K672j364j482P25P81J540O75k562J27K690P36j185l72p67Q77K041j410
1550A818k954J612J603l51j042j113n96K511M29l208q7J225J34J29r86k014J757
1567a133K267j939j832J150Q24P41j85k651K6L724j64j686n52O52J516J768k011
1584E15k389K626K276j073q30j046K99L229j37l575j025K267J288p45j961k108
1600b389J900K502j655l214P3J588K034o75l227p35L796J253k462j499M36K215
1616e9K294j675l724J905L279p6j444j705K61L589P32l681j257K174J597N04k125
$$ plain form
1633 589 -1535 -105 3367 2309 -718 -1043 352 1886 1847 -1750 -2881 405 1899 -310 -2073 -2897
1649 -2897 -1105 1500 -144 -3822 -2676 370 409 -437 -2420 -2715 653 2471 -270 -1891 -39 1662
1665 1662 2765 1268 -1019 -269 3339 3065 312 -519 334 1773 2747 -250 -1864 299 2325 602
1681 602 -730 -1661 -809 1483 910 -2471 -2208 -123 388 -451 -1842 -2677 -428 1076 -995 -2450 -718
1698 -718 289 620 -184 -1827 -1557 1765 1546 -757 -544 210 1408 2350 418 -1043 1679 2916 1309
1715 1309 217 -64 1070 2557 1457 -1707 -1437 1119 934 -395 -1940 -2304 -11 1747 -1201 -3373
1731 -3373 -1808 314 618 -673 -3087 -2242 1434 1627 -1427 -2175 -719 1825 2707 -109 -2679 45
1747 45 2678 1779 -210 -1591 -529 2720 2444 -1010 -2037 801 2693 1872 -354 -2091 181 3067
$$ packed form
1633E89k124J430L472j058l027l25J395J534l9l597j131L286J494k209j763q24
1649b897J792K605j644l678J146L046L9q46j983k95L368J818k741j621J852J701
1665A662J103j497k287P50L608k74k753q31Q53J439R74k997j614K163K026j723
1681F02j332r31Q52K292n73l381K63K085N11q39j391q35K249J504k071j455J732
1698g18J007L31q04j643K70L322k19k303K13P54J198R42j932j461K722J237j607
1715A309j092k81J134J487j100l164K70K556j85j329j545l64K293J758k948k172
1731c373J565K122L04j291k414Q45L676J93l054p48J456K544Q82k816k570K724
1747D5K633q99j989j381J062L249k76l454j027K838J892q21k226j737K272K886
$$ plain form
1763 3067 1143 -1916 -1830 -296 1362 1218 -1966 -3255 352 1960 -460 -2116 -2248 -180 1835 -20
1779 -20 -2834 -2136 627 1186 -13 -1505 -1624 1270 2673 187 -1300 642 1645 2147 799 -949
1795 -949 -55 2535 1711 -671 -1021 28 1083 1364 -661 -2075 304 1286 -52 -1248 -1627 -365 1088
1812 1088 10 -2138 -1354 396 405 -112 -1134 -1383 322 1605 -521 -1771 -269 840 894 183 -1415
1829 -1415 -505 1641 1099 -226 -360 218 1130 1836 -104 -942 626 1563 531 -52 -602 -153 1325 943
1847 943 -1398 -984 487 249 -139 -540 -1708 -284 1003 -722 -1269 -209 129 299 -110 -890 -653 1026
1865 1026 738 -1094 -604 -112 539 773 -201 -1304 250 1225 261 -650 -349 231 1394 968 -1224 -511
1883 -511 1252 1254 415 -395 -798 570 1724 -40 -1206 -302 875 862 277 -1271 -1076 917 884 -817
$$ packed form
1763C067j924l059Q6J534J658j44l184j289L607J608k420j656j32K068K015j855
1779b0k814O98K763N59j199j492j19K894J403k486j487J942J003N02j348j748
1795i49Q94K590q24k382l50J049J055K81k025j414K379R82j338j196l79J262J453
1812A088j078k148P84J750Rn17j022k49J705J283k126j250J502J109N4p11j598
1829a415R10K146n42j325j34N78R12P06j940q38J568R37j032n83n50M49J478l82
1847I43k341M14J471k38l88m01j168J424J287j725n47J060L38J70m09p80K37J679
1865A026k88j832M90M92O51K34r74j103J554R75r64r11L01N80J163m26k192P13
1883e11J763Kq39q10m03J368J154j764j166R04J177j3n85j548J95J993l3j701
$$ plain form
1901 -817 -1079 -743 461 1055 -375 -1571 -15 1256 823 -457 -609 -477 955 1400 -626 -958 282
1918 282 767 413 -461 -1398 -104 1326 148 -1037 -701 -277 387 399 -836 -1049 459 837 -145 -452
1936 -452 141 431 865 460 -565 348 1188 313 -40 49 136 563 490 -947 -745 570 112 -642 -800 -904
1956 -904 2 509 -522 -1533 -304 791 141 -293 -722 -215 1298 949 -916 -357 111 977 813 -111
1974 -111 -1086 270 1466 567 -552 -384 263 900 834 -1015 -874 869 1065 105 -498 -873 -39 1241
1992 1241 -64 -1577 -505 334 376 -9 -1294 -1289 254 695 -589 -997 -232 -16 625 49 -1194 -243
2010 -243 1217 718 166 -4 -10 934 1101 -190 -474 981 854 302 -144 -414 120 938 176 -825 -338
2029 -338 92 71 146 -862 -1001 336 471 -783 -1315 -317 -61 75 -402 -1360 -657 815 49 -690 -761 -76
$$ packed form
1901h17k62L36J204N94j430j196J556J271m33j280j52J32J432M45k026l32J240
1918B82M85l54q74r37J294J430j178j185L36M24O64J2j235k13J508L78r82l07
1936d52N93K90M34m05j025R13Q40q75l53Q9Q7M27p3j437K02J315m58p54j58j04
1956i04R06N07j031j011J229J095o50m34m29N07J513l49j865N59M68Q66j64r24
1974a11r75J356J196q99j119J68O47O37o6j849J41J743J96r60o03l75Q34J280
1992A241j305j513J072Q39M2l85j285NJ543M41j284m08P65K16O41n76j243R51
2010b43J460m99n52j70oR44J67j291k84J455j27n52m46k70N34Q18p62j001M87
2029c38M30k1P5j008j39J337J35j254n32R98K56J36m77r58P03J472p66p39p1O85
$$ plain form
2049 -76 868 722 -474 -1068 702 1320 426 180 -365 385 1408 1017 -816 99 807 771 693 -398 -728
2068 -728 398 1146 -587 -1101 -676 -229 365 -214 -1881 -1093 738 -172 -868 -908 -967 292 923 -408 -1254
2087 -1254 88 1244 583 27 -511 -50 1648 1143 -660 -192 618 979 695 -428 -932 697 1362 71
2105 71 -720 -648 142 832 375 -1136 -1211 644 419 -717 -952 -1058 -128 827 -910 -1673 -763 148 -50 -134
2125 -134 -1249 -798 677 660 -509 -680 280 612 1068 297 -517 673 1665 803 -151 -15 343 977 834
2144 834 -866 -1101 593 847 -104 -599 -989 -212 619 -351 -1293 -789 244 138 -251 -1157 -1092 222 477
2163 477 -573 -1218 -145 474 395 39 -695 124 779 624 -66 -168 290 631 1161 -321 -358 661 1159
2182 1159 414 -281 -392 128 986 296 -722 -507 622 318 -129 -944 -1121 73 506 -444 -1133 -508 122
$$ packed form
2049g6R44j46j196n94J770O18q94k46n45P50J023l91j833R15P08l6p8j091l30
2068g28J126P48j733n14M25M47N94n79j667P88J831r10o96m0n9J259O31j331q46
2087a254J342J156o61n56n38M61J698n05j803M68Q10L61k84j123n04J629O65j291
2105G1p91P2P90O90m57j511p5J855k25j136k35j06R30R55j737p63R10R11j98q4
2125a34j115M51J475j7j169j71R60L32M56p71q14J190R92q62r54J36L58O34j43
2144H34j700k35J694K54r51m95l90P77Q31r70r42N04J033j06l89r06O5J314K55
2163D77j050o45J073O19p9l56p34Q19O55j55o90j02M58L41N30j482l7J019M98
2182A159p45o95j11N20Q58o90j018K15J129l04m47q15j77J194M33r50o89O25O30
$$ plain form
2201 122 404 -394 -1073 -394 787 466 -127 -211 391 822 1195 -37 -414 751 1312 706 164 -369 4
2220 4 1282 974 -333 -561 500 419 441 -387 -855 271 717 -221 -887 -666 -90 -44 10 -919 -690 392
2240 392 44 -707 -450 -651 74 582 -289 -598 262 331 274 185 -193 38 730 859 -129 68 378 661 431
2261 431 144 -233 304 800 90 -325 -8 53 318 5 -764 -638 186 365 -667 -512 -673 -178 224 -443
2281 -443 -1004 -323 532 317 -120 -323 -175 668 511 -319 -272 545 646 393 -87 -510 347 1007 8 -266
2301 -266 -341 144 342 626 -472 -848 411 339 -10 -196 -515 -39 369 295 -647 -393 123 -75 -77 -510 -483
2322 -483 294 174 -311 -361 316 19 217 319 -68 303 582 -23 223 335 449 537 691 97 -88 673 313
2343 313 -394 -131 -63 -25 381 49 -778 -420 278 -14 -145 -518 -426 205 140 -635 -476 236 266 72 -84 -486
$$ packed form
2201A22K82p98o79O79J181l21n93q4O02M31L73j232l77J165N61o06n42n33L73
2220DJ278l08j307k28J061q1K2q28m68J126M46r38o66K21N76M6N4r29K29J082
2240C92l48p51K57k01P25N08q71l09Q60O9n7q9l78K31O92J29r88J97L10K83k30
2261D31k87l77N37M96p10m15L17O1K65l13p69J26Q24J79j032J55j61M95M02o67
2281d43n61O81Q55k15m37k03J48Q43j57q30M7Q17J01k53m80m23Q57O60r99k74
2301b66p5M85J98K84j098l76J259p2l49j86l19M76M08p4r42K54N16j98km33K7
2322d83P77j20m85n0O77k97J98J02l87L71K79o05K46J12J14Q8J54n94j85P61l60
2343C13p07K63O8L8M06l32q27L58O98k92j31l73R2O31o5p75J59P12L0j94j56m02
$$ plain form
2365 -486 356 751 176 -361 21 312 214 528 -34 -207 620 745 63 -54 -224 173 307 144 -536 -213
2385 -213 144 124 -109 -471 -372 278 -17 -659 -412 -26 -208 21 -246 -317 -90 459 38 -464 -76 324 220
2406 220 409 -271 -431 455 305 112 44 299 341 532 199 -366 -140 516 198 -394 -433 -70 200 356 -660
2427 -660 -786 -63 193 -139 -247 -589 137 472 172 -704 -376 284 146 274 -471 -269 387 619 243 -259
2447 -259 -24 210 470 205 -286 -202 356 221 187 118 97 557 638 -17 -311 55 160 237 215 -271 -665 53
2469 53 -435 -662 -555 -78 -140 68 -388 -494 280 160 -247 -229 -199 177 370 209 -167 -51 638 319 133
2490 133 205 -152 471 739 156 -396 -17 244 198 31 -671 -193 333 251 -596 -345 -27 49 7 -373 -591 -50
2512 -50 238 -130 -416 -284 -111 442 461 -435 -458 140 405 59 -98 23 173 566 207 -238 -264 227 270 191
$$ packed form
2365d86Q42L95n75n37L82K91r8L14n62j73Q27J25o82j17j70L97J34j63o80L23
2385b13L57k0k33l62R9O50k95o42K47L86j82K29k67p1K27N49m21n02L88M00j04
2406B20J89o80j60Q86j50j93o8K55M2J91l33n65K26O56l18n92l9L63K70J56j016
2427f60j26P23K56l32j08l42P26L35l00q76L28O60j38J28p45K02O56K32l76n02
2447b59K35K34K60k65m91Q4N58j35l4o9k1M60Q1o55k94L66J05P7k2m86l94P18
2469E3m88k27J07M77o2K08m56j06P74j20m07J8L0L76J93j61l76J16O89l19j86
2490A33P2l57O23K68n83n52L79K61m6j67p02M78N26q2q47K51L18P6m2l80k18N41
2512e0K88l68k86J32J73N53J9q96k3N98K65l46j57J21J50L93l59m45k6M91M3p9
$$ plain form
2534 191 166 -190 536 604 -165 75 -300 88 112 -136 -740 -235 262 86 -133 -234 -291 66 44 -369 -325 -345
2556 -345 161 28 -39 -522 -102 433 30 -414 0 266 331 285 -16 34 163 282 -173 -104 -131 184 150 328
2578 328 -498 -205 365 26 -295 -252 -303 100 618 -232 -151 275 100 48 -50 -409 -182 155 20 -335 -218 52
2600 52 21 297 -155 -448 45 427 221 34 -28 106 354 185 -395 -25 290 65 186 -145 -24 -20 178 -155
2622 -155 -364 -251 107 -80 37 -120 -112 113 28 -345 -214 62 -101 23 -308 -383 -185 262 -55 -39 -220 81
2644 81 49 85 -432 -196 20 195 -162 15 181 209 522 129 -429 -68 347 286 245 -308 -187 377 56 -12
2666 -12 -294 -344 -285 175 -136 -385 -173 7 87 -189 -329 -105 182 15 -243 -338 305 123 264 157 -217 -178
2688 -178 356 195 -207 -58 225 203 -17 -223 -315 82 235 9 -39 274 10 313 124 22 -72 167 -74
$$ packed form
2534A91k5l56P26O8p69K40l75L88K4k48o04N05M97j76k19j01n7L57k2m13M4k0
2556c45N06j33o7m83M20N35m03m44M14K66O5m6l01N0J29J19m55O9k7L15l4J78
2578C28q26K93N70l39l21M3n1M03N18q50Q1M26j75n2r8l59K27L37j35l55J17K70
2600E2l1K76m52k93M93L82k06j87o2J34K48j69n80L70L15k25J21l31J21MJ98l33
2622a55k09J13L58j87J17j57QK25q5l73J31K76j63J24l31p5J98M47l17J6j81L01
2644H1l2L6n17K36K16J75l57J77J66K8L13l93n58L61M15o1m1n53J21N64l21o8
2666a2k82n0N9M60l11k49K12J80Q0k76j40K24K87j67k58r5O43j82J41j07l74L9
2688a78N34j61m02J49K83k2k20k06r2L97J53k26m8L13k64L03j89j02r4K39k41
$$ plain form
2709 -74 -282 -208 -23 -49 102 -395 -120 393 -47 -35 -153 -55 -113 170 181 -287 -255 42 55 68 -338 -143 249
2732 249 598 121 -155 107 -58 9 -134 -125 139 198 49 -330 -257 -24 -28 52 -354 -136 146 328 -10 91 -84
2755 -84 58 397 217 -160 -241 143 41 187 85 -327 348 369 -26 -345 37 187 131 -34 107 -53 250
2776 250 26 6 160 -125 136 351 -52 -139 -71 -93 -131 234 80 -89 47 -243 -279 -224 -9 141 -98 -122 -107
2799 -107 124 423 -30 16 -402 62 213 17 -285 114 -134 34 -202 -239 39 68 217 284 -271 -64 133
2820 133 111 202 -204 53 315 325 69 -200 67 -30 81 -257 -44 -80 383 99 -188 227 98 153 -110 -213
2842 -213 -203 -10 199 106 -151 53 138 125 254 -142 109 3 43 -166 60 -123 194 287 -264 40 91 -68
2864 -68 156 63 -217 68 16 47 -147 -273 -38 -90 134 -101 83 166 302 -186 -201 -65 -225 334 -232 -229 -117
$$ packed form
2709g4k08P4J85k6J51m97K75N13m40J2j18R8n8K83J1m68L2K97J3J3m06J95L92
2732B49L49m77k76K62j65O7j43RK64N9j49l79P3K33mQ0m06K18K82J82l38J01j75
2755h4J42L39j80l77q1L84j02J46j02m12O75K1l95l19L82J50n6j65J41j60L03
2776B50k24k0J54k85K61K15m03q7O8k2l8L65j54j69J36k90l6N5K15J50k39k4J5
2799a07K31K99m53M6m18M64J51j96l02L99k48J68k36l7K78K9J49O7n55K07J97
2820A33k2R1m06K57K62J0k56k69K67r7J11l38K13l6M63k84k87M15j29N5k63j03
2842b13J0J93K09r3k57K04Q5j3J29l96K51j06M0k09K26j83L17R3n51L04N1j59
2864f8K24r3k80K85n2L1j94j26K35n2K24k35J84Q3J36m88j5J36j60N59n66LJ12
$$ plain form
2887 -117 -12 147 -184 -88 41 88 -1 -164 -267 -215 166 122 104 191 90 201 230 233 -146 115 157 198 -97 -240
2911 -240 -160 319 -100 208 -1 -88 371 27 -223 -226 18 -9 -55 -60 -218 123 556 444 28 118 -124 -94 297
2934 297 -160 -438 80 -10 -143 -91 -152 168 107 222 -449 -6 88 89 78 28 -304 -163 -162 -9 -153 174 205 148
2958 148 30 -139 111 313 -196 -116 -273 -39 164 189 -384 -341 156 199 209 -297 -207 -72 -8 70 -274 -198 257
2981 257 56 36 -351 59 208 350 -450 -285 16 320 362 -22 -151 -173 242 61 -123 -254 -197 170 118 -49
3003 -49 -318 65 271 -162 -148 -35 120 152 29 -91 -49 245 141 38 231 -91 401 32 -274 -229 269 189
3025 189 -102 -52 -213 4 98 227 146 106 -142 381 73 -188 -18 100 155 -109 190 -186 -161 179 247 -172
3047 -172 -177 166 76 239 -217 -235 55 231 200 248 -255 -61 115 -305 -126 -270 44 19 -215 8 103 -35 151
$$ packed form
2887a17J05J59l31R6J29M7q9j63j03N2L81m4j8Q7j01J11K9Ll79K61M2M1k95j43
2911b40Q0M79m19L08k09q7M59l44k50lK44k7m6nj58L41M33j12m16R0k42L0L91
2934B97m57k78N18r0j33N2o1L20o1J15o71M43R4Jj1n0l32J41JJ53j44L27L1n7
2958A48j18j69K50K02n09Q0j57K34K03K5n73M3M97M3J0n06R0J35O4P8l44P6M55
2981B57k01k0l87M10J49J42q00J65L01L04M2l84j29k2M15j81j84j31N7L67n2j67
3003d9k69L83K06m33J4J13J55L2j23j20M2K94j04j03J93l22M92l69l06M5M98q0
3025A89k91N0j61K17R4J29q1m0k48N23l08k61J70J18N5k64K99l76K5L40O8m19
3047a72nL43r0J63m56j8K90J76l1M8n03J94J76m20J79j44L14k5k34K23R5j38J86
$$ plain form
3070 151 317 -242 -78 -158 105 -23 -113 -252 39 379 -162 -63 160 -143 70 155 -191 72 74 213 -47 39
3092 39 120 -52 -108 -62 -155 57 -153 -243 -137 -51 165 267 -119 57 -33 207 -26 -115 -55 121 175 339 -155 -219
3116 -219 86 276 97 -175 -180 142 225 -63 -236 -84 -32 229 -122 147 22 -5 536 -150 -451 -28 3 25
3138 25 152 -169 77 264 286 -32 -171 -30 24 144 -242 -271 -217 -52 92 103 -204 -99 55 461 -77 -319
3160 -319 298 238 270 7 -229 184 50 -65 144 74 117 -98 -25 -125 -146 5 44 -71 -86 -142 150 54 42 43
3184 43 58 65 130 -129 -212 -33 67 123 -17 -84 317 149 89 178 -230 14 337 -376 -140 -70 167 423 -123 78
3208 78 -126 -41 103 15 -164 -354 152 214 -250 -198 228 2 218 -39 -19 -58 317 47 -294 -41 41 -89 230
3231 230 1 -246 23 131 8 -30 -101 81 19 23 -81 -203 -135 62 -395 127 50 49 132 -153 -232 40 145 96
$$ packed form
3070A51J66n59J64q0K63j28r0j39K91L40n41R9K23l03K13Q5l46K63KJ39k60Q6
3092C9Q1j72n6M6r3K12k10r0J06Q6K16J02l86J76r0K40k33q9O0J76N4J64m94o4
3116b19L05J90j79k72nL22Q3k88j73J52N2K61l51K69j25k7N41o86l01M23L1K2
3138B5J27l21K46J87K2l18j39J41N4J20l86k9N4J65J44J1l07J05J54M06n38k42
3160c19O17o0L2k63k36M13j34j15K09p0M3k15P3j00k1J51L9j15j5n6K92r6j2J
3184D3J5PO5k59q3J79J00N6j40o7M01j68o0Q9m08K44L23p13K36P0K37K56n46K01
3208G8k04Q5J44q8j79j90N06O2m64N2M26k26K16k57K0l9L75k70l41K53Q2j30L19
3231B30k29k47K69J08j23l8p1J82o2Mj04j22O8J97m57N22p7jQ3k85p9K72J05m9
$$ plain form
3255 96 -48 38 28 147 -293 -298 -77 268 54 12 166 -13 294 465 93 -348 -144 -76 -66 -180 -423 -73 35
3278 35 267 49 -34 -158 142 135 202 -319 41 142 317 62 -226 47 94 191 -428 -129 39 230 -27 -61 -82
3301 -82 -90 346 -9 -196 -64 1 105 138 -91 -344 135 353 41 -209 54 188 188 -260 -116 -185 387 111 184
3324 184 -161 -186 359 48 -221 -61 195 91 -252 -223 -141 -36 31 -102 -44 -157 123 104 -22 196 -203 47
3346 47 66 2 -8 -73 -28 -13 -102 -79 -228 9 -45 12 -280 -101 242 231 95 -170 -174 52 113 -57 -79 -103 371 172
3372 172 -142 -249 49 136 407 -167 -137 66 83 -152 -138 -242 42 -68 65 -134 -166 -206 -49 43 -76 -163 388
3395 388 262 -312 3 -95 -184 -50 81 -2 59 299 41 -43 101 -274 180 64 -52 -284 -93 302 340 -18
3417 -18 -26 145 304 93 -254 -330 230 189 -13 -383 -249 199 222 53 -66 -89 38 100 22 61 -431 127 316
$$ packed form
3255I6j44Q6j0J19m40nK21L45k14m2J54j79L07J71l72m41K04O8J0j14k43L50J08
3278C5K32k18q3j24L00pO7n21L60J01J75k55k88K73M7R7o19K99J68J91k57l4k1
3301h2qM36l55j87J32O5J04L3k29k53M79K18l12k50K63J34%m48J44o9N72k76P3
3324A84l45k5N45l11k69J60K56j04l43K9Q2J05O7j33N8j13K80j9j26K18l99K50
3346D7J9o4j0o5M5J5q9K3j49K37n4N7k92J79L43j1j36k65mK26O1j70k2k4M74j99
3372A72l14j07K98Q7K71n74L0K03J7k35J4j04K84j10J33j99l2m0J57R2j19q7N51
3395C88j26n74L15r8q9J34J31q3O1K40k58q4J44l75M54j16j16k32J91L95L8l58
3417a8qJ71J59k11l47p6N60m1k02l70J34M48K3j69j19k3J27O2p8L9m92N58J89
$$ plain form
3440 316 11 -520 -192 -51 121 134 -295 76 -12 213 40 87 7 168 521 160 -243 -118 -128 193 109 -268
3462 -268 -164 169 28 -203 -67 -52 100 65 -214 59 210 329 242 124 134 -76 271 183 -238 -84 -34 -195
3484 -195 154 -279 12 35 -14 -108 -27 126 59 94 -92 154 -128 104 -152 135 -52 -1 115 113 12 -207 159
3507 159 162 -126 -408 -257 -90 11 -17 -158 -219 251 -17 -220 -89 -7 58 144 -124 -198 -80 -180 43 -39 -382
3530 -382 -153 140 168 -135 -72 136 164 189 159 -97 472 380 -64 -89 -182 154 219 119 -68 -149 162 143 28 -17
3554 -17 -61 -109 328 103 -13 -51 256 169 53 -172 -301 36 130 196 -26 150 -54 33 -146 78 -102 177 -140
3577 -140 14 -46 -123 158 188 -190 -37 -33 22 37 -140 -261 76 204 -185 -135 -89 402 10 -140 -364 41 269
3600 269 29 -105 132 171 -54 198 -40 -255 189 -108 47 -51 60 -101 294 39 -102 -47 118 408 69
$$ packed form
3440C16l05n31L28J41J72J3m29L71q8K25j73M7q0J61L53l61m03J25j0L21q4l77
3462b68J04L33j41k31J36J5J52l5k79K73J51J19q7j18J0k10L47q8m21J54N0j61
3484a95L49m33K91K3m9r4Q1J53o7L5j86K46k82K32k56K87j87N1J16kj01k19L66
3507A59Lk88k82J51J67J01k8j41o1M70k68k03J31Q2O5Q6k68p4J18j00K23q2l43
3530c82K29K93K8l03O3K08K8K5l0k56N69r2m44k5r3L36O5j00j87q1L11j9j15m5
3554a7m4m8M37k25j16l8L07q7j16k25j29L37R4O6k22J76k04Q7j79K24j80K79l17
3577a40J54o0p7K81L0l78J53MN5J5j77j21L37J28l89N0M6M91l92j50k24M05K28
3600B69k40j34K37L9k25K52k38k15M44k97J55r8J11j61L95k55j41N5J65K90l39
$$ plain form
3621 69 91 -86 177 136 3 -132 281 -118 -128 -82 -86 52 -165 113 -107 -242 155 33 3 -54 -207 -79 220
3644 220 -84 -97 -107 182 235 -78 -166 -146 144 -96 30 -102 -165 -95 80 20 -337 -16 112 -9 -8 -113 -27 87
3668 87 169 -95 -195 33 108 235 161 -187 192 239 91 -443 -187 183 217 -261 -254 45 154 -35 -2 -177 -105
3691 -105 63 103 162 -226 -199 78 -52 -100 25 12 16 179 -94 -176 19 -86 46 148 -289 -53 209 64 -318
3714 -318 -113 158 313 -387 -123 -122 161 148 -176 -44 -303 174 234 354 -231 -174 -16 235 -109 -74 -95 80
3736 80 114 -130 89 1 48 -69 38 -263 -23 229 182 10 -309 -102 -17 244 -1 -379 -35 503 77 -15
3758 -15 -9 -55 213 -41 -312 2 196 270 29 30 -82 91 -150 -6 -285 13 -194 -112 163 -26 -243 256 104
3781 104 26 -200 25 14 412 -59 64 259 34 -124 -82 40 -232 337 272 129 -280 123 42 -56 -34 -172
$$ packed form
3621F9K2j77K63m1j33j35M13l99j0M6mJ38k17K78k20j35L97j22l0n7j53J28K99
3644B20l04j3j0K89N3l13q8K0K90k40J26j32o3P0J75o0l57L21J28j21Jj05Q6J14
3668H7Q2k64j00K28P5J27p4l48L79M7j48n34K56L70L4m78PK99J09j89L3j75P2
3691a05J68M0N9l88K7K77j30m8J25j3MJ63k73q2J95j05J32J02m37K36K62j45l82
3714c18K05K71J55p00K64JK83j3l24J32k59M77O0J20n85N7J58K51l44L5k1J75
3736H0L4k44K19q8M7j17J07l01K40K52m7j72l19K07Q5K61k45l78L44N38m26r2
3758a5Om6K68k54k71L14J94P4k41Jj12J73k41J44k79K98k07Q2K75j89k17M99j52
3781A04p8k26K25j1L98m71J23J95k25j58M2J22k72N69o5j43m09M03q1r8K2j38
$$ plain form
3803 -172 109 266 -199 -139 -187 369 153 146 -210 -35 383 -79 -230 -126 -45 236 152 -120 -242 330 160 291
3825 291 87 -128 -159 179 -78 -5 -166 -80 -31 -136 -174 -616 85 172 63 -60 -45 316 166 78 -22 48 292
3848 292 274 232 -182 102 33 243 0 9 -36 21 229 96 49 -102 204 68 -11 -246 22 45 216 -88 -360
3871 -360 -134 76 5 -163 93 85 183 44 -23 -61 202 -36 -45 -132 -230 321 130 0 -175 37 -49 251 211 86
3895 86 -100 205 156 39 -207 -89 58 147 -122 -233 186 160 -144 -122 -157 22 168 314 -35 25 -129 241
3917 241 -36 90 -166 473 187 118 0 70 6 -8 -201 -225 122 89 321 105 -205 -100 -15 159 15 -569
3939 -569 129 96 111 -1 -15 212 36 136 167 -115 -25 131 -27 -15 23 -139 119 361 -279 -190 41 13 -103
3962 -103 -55 33 204 457 -220 -229 109 138 71 209 -179 -111 188 51 62 52 108 85 -13 129 -33 -87 389 104
$$ packed form
3803a72K81J57m65O0m8N56k16pl56J75M18m62j51J04Q1K81q4k72j22N72j70J31
3825B91k04k15l1L38k57P3j61Q6M9j05l8m42P01Q7j09j23J5L61j50q8j00P0K44
3848B92j8m2m14K84o9K10k43Rm5N7K08j33m7j51L06j36p9k35K68K3J71l04k72
3871c60K26K10p1j68K56qR8j39o7l8K63k38rq7r8N51j91j30j75K12q6L00m0j25
3895H6j86L05m9j17k46J18J47Q9k69j11M19k6l04K2l5J79J46J46l49O0j54L70
3917B41k77J26k56O39k86o9j18P0o4j4j93k4L47l3K32k16l10J05Q5J74j44n84
3939e69O98l3J5j12j4K27j76J00L1k82R0J56j58J2L8j62K58K42o40Q9K31k8j16
3962a03M8Q8J71K53o77rL38K9o7J38l88O8K99j37J1j0N6k3r8J42j62n4M76k85
$$ plain form
3986 104 145 36 -74 128 154 -197 14 249 -201 254 226 55 104 108 -57 -150 -38 -7 -166 -154 -124 -176 40 237
4010 237 -296 241 -97 173 -20 -292 -150 63 326 -162 -104 94 64 134 131 -34 52 156 -131 13 -282 38
4032 38 -3 70 -130 112 -108 164 15 -92 -286 -237 113 -31 11 20 40 31 189 -149 -89 -191 -7 38 -181 102
4056 102 205 -53 158 -36 -121 294 123 101 -35 -143 153 344 -65 24 6 -63 147 -17 101 -78 198 192
4078 192 -282 -172 54 -135 240 -35 -378 229 189 -368 -274 -212 -163 -18 97 -502 -127 149 137 -129 -1 -155
4100 -155 95 496 73 -157 436 330 176 91 -23 102 397 30 -71 70 -54 280 141 133 -188 13 -62
4121 -62 17 -236 -81 189 109 -72 -106 -263 163 -275 -22 -243 -401 -17 283 -185 -7 229 78 -147 210
4142 210 -9 9 242 -44 -207 -113 -143 200 183 -270 -2 168 411 -27 -186 -131 51 493 -172 -427 -83 300
$$ packed form
3986A04M1j09j10K02K6l51K11K35m50M55k8j71M9Mj65r3J12L1j59J2L0n2K16J97
4010B37n33N37l38K70j93k72J42K13K63m88N8J98l0P0lj65Q6J04k87J44k95L20
4032C8m1P3k00K42k20K72j49j07j94M9L50j44M2RK0rJ58l38O0j02J84M5k19K83
4056A02J03k58K11j94q5M15j71k2j36j08K96J91m09Q9j8o9K10j64J18j79K76o
4078A92m74J10K26j89L75k75l43O07m0n57R4O2M9J45J15n99L75K76j2k66J28j54
4100a55K50M01m23k30N93j06j54q5j14J25K95l67j01J41j24L34j39ql21K01p5
4121f2P9k53J55K70q0j81l4j57M26m38K53k21j58L84L00m68J78K36j51k25L57
4142B10k19J8K33k86j63R4l0L43j7m53K68J70K43m38j59N5J82M42o65k55L44L83
$$ plain form
4164 300 85 148 -256 -176 169 330 63 38 -6 81 362 179 -24 -169 93 228 -180 -160 -133 -118 65 -200 -139
4187 -139 144 360 39 -221 -121 -114 411 427 104 -36 199 370 273 -56 -193 49 180 13 -178 64 -191
4208 -191 170 123 -88 -9 240 425 -213 -448 -119 35 227 4 -360 8 89 4 -45 -129 -178 124 338 -14
4230 -14 -233 140 197 388 93 19 -91 319 12 -182 -27 154 -40 -115 -6 -167 57 82 21 -240 -71 165
4252 165 255 -116 -76 -131 267 67 -210 -51 7 51 312 -366 -153 -149 -58 253 97 -195 -353 371 315 -204 -100
4275 -100 -19 247 209 -217 -173 279 218 15 -278 -100 -119 157 133 -267 51 23 11 109 19 -350 -201 107 -119
4298 -119 -238 143 185 86 -94 -387 -220 -86 115 83 -70 -202 233 391 -29 -114 111 433 368 -243 -79 -29
4320 -29 109 157 -148 31 14 293 82 293 -6 -75 188 -172 -246 -115 53 44 164 24 -147 -244 129 153 51
$$ packed form
4164C00k15O3m04Q0L45J61k67k5m4Q7K81j83k03j45K62J35m08K0K7J5J83k65O1
4187a39K83K16l21k60J00PN25J6l23j40K35J71r7l29j37K42J31j67j91K42k55
4208a91L61m7k11P9K49J85o38k35L29J54J92k23l64L68Q1q5m9q4m9L02K14l52
4230a4k19L73N7J91k95p4j10M10l07j94J55J81j94p5J09j61K24K5o1k61J69K36
4252A65R0l71M0n5L98k00k77J59N8M4K61o78K13MR1L11j56k92j58P24n6n19J04
4275a00Q1K66l8m26M4M52o1k03k93J78j9K76k4m00L18k8j2R8r0l69J49L08k26
4298a19j19L81M2r9j80k93J67J34K01l2j53j32M35J58m20q5K25L22o5o11J64N0
4320b9J38M8l05J79j7K79k11K11k99o9K63l60p4J31J68rJ20j40j71r7L73K4j02
$$ plain form
4343 51 5 150 206 65 -290 -30 -70 223 -145 -40 -96 26 138 -197 -72 -160 201 -58 -194 -100 98 200
4365 200 38 162 204 -116 -212 -29 185 -293 221 282 -81 -204 -50 22 26 199 -396 58 125 -113 -84 10 -46
4388 -46 193 244 162 -118 -33 25 -243 72 -143 -91 -123 427 45 12 369 113 239 35 -108 217 21 -44 -84
4411 -84 -170 196 132 -222 -12 144 272 258 -362 -121 -138 306 447 -125 70 15 83 46 31 44 -87 89 279
4434 279 -251 -136 79 238 117 -56 -154 -36 188 -94 -51 34 -170 97 48 -12 140 60 -50 -84 -92 -117 17
4457 17 93 -162 -135 120 447 -151 115 -110 -241 -52 56 -154 -49 151 129 -260 -50 -357 -42 -41 -50 -155 -8
4480 -8 190 287 -46 -162 167 141 83 -224 86 -78 208 -57 119 -157 -22 262 -60 -130 -117 -6 26 154 -479
4503 -479 -47 259 -225 198 -238 -86 102 275 -88 -8 123 63 264 60 41 -149 55 22 -218 -117 96
$$ packed form
4343E1m6J45N6j41l55K60m0K93l68J05n6J22J12l35J25q8L61k59j36R4J98J02
4365B00j62J24M2l20r6J83K14m78N14O1l63j23J54P2MJ73n95M54O7k38K9R4n6
4388d6K39N1q2k80Q5N8k68L15k15N2l2N50l82l3L57k56J26k04j43L25j96o5m0
4411h4q6L66o4l54K10J56J28j4o20K41j7M44J41n72J95n5O8l7j5J3j31J76J90
4434B79n30J15K15J59j21j73r8J18K24k82M3Q5k04K67m9o0J52q0j10l4qk5J34
4457A7P6k55K7K55L27n98K66k25j31J89J08k10J05K00k2l89K10l07L15Jrj05J47
4480hJ98R7l33j16L29k6n8l07L10j64K86k65J76k76J35K84l22p0J3J11L2J28o33
4503d79M32L06m84M23m36J52J88J73l63Q0J31o0K01k04j9j90K04l3k40J01K13
$$ plain form
4524 96 80 230 -285 -300 408 119 9 139 -138 180 110 51 -238 -88 -24 -7 77 -142 108 108 308 -328 167
4547 167 55 487 -24 17 -165 -16 311 141 16 181 39 5 273 -299 -6 -86 22 36 -43 -65 -37 14 133
4570 133 -262 -126 -27 133 -19 -105 -319 57 278 -89 29 -48 296 110 83 -55 -243 223 171 -209 -181 -319
4592 -319 -13 139 -49 -253 123 8 84 155 -101 -98 302 333 -103 -293 -265 181 -98 -99 -332 -7 392 -219 70
4615 70 -86 -108 233 213 -149 -213 134 400 1 -17 -263 33 220 304 -298 -199 194 -141 59 41 31 80 147 55
4639 55 -378 -5 144 -159 -32 -82 -44 357 -6 -49 110 -49 235 -41 13 -274 -95 36 -87 -89 -56 323 223
4662 223 -121 -260 -240 -32 13 -307 27 98 242 270 -444 -196 -197 186 176 -77 123 -82 266 -38 -235 -105
4684 -105 -236 73 358 -265 -60 -6 219 64 -70 -111 -74 240 4 -346 -117 96 39 -39 -411 37 135 489
$$ packed form
4524I6j6J50n15j5P08k89j10J30k77L18p0n9k89J50O4J7Q4k19K50%K00o36M95
4547A67j12M32n11M1j82J49L27j70j25J65j42l4K68n72K93q0J08J4p9k2K8N1J19
4570A33l95J36R9J60j52q6k14L76K21l67J18p7L44j86k7j38j88M66n2l80K8j38
4592c19L06J52j88k04L76j15P6P1k56LM00L1m36j90K8M46k79jk33L25L99o11K89
4615G0j56k2L41k0l62o4L47K66l99j8k46K96J87Q4o02R9L93l35K00j8j0M9O7r2
4639E5m33L73J49l03J27n0L8M01l63m3J59j59K84k76N4k87J79J31j23kL3L79j00
4662B23l44j39K0K08M5l20L34P1J44K8p14K48jL83j0k53K00k05L48l04j97J30
4684a05j31L09K85o23K05N4K25j55j34m1L7L14k36l50K29K13n7p8l72M48R8L54
$$ plain form
4706 489 -4 -175 191 -17 37 14 -263 -55 -29 132 -106 -8 -193 -25 347 76 -90 153 -20 -66 61 48
4728 48 4 -3 -7 -232 -34 103 -154 11 -55 89 -65 147 -170 146 88 -80 55 172 -108 -145 261 339 -50
4751 -50 82 261 64 262 66 -274 74 170 -285 165 208 -114 304 293 -19 140 -2 23 -113 -98 -63 -10 358
4774 358 146 -189 46 73 192 -85 -89 35 57 35 -88 -146 179 1 359 139 -152 -257 -36 -50 -234 -56
4796 -56 -238 291 293 -420 -141 29 154 -43 115 89 -113 312 -10 209 -48 100 -98 -8 -418 -198 65 152
4818 152 -257 13 -153 -80 -83 113 -263 -104 172 148 201 -37 37 -233 313 -52 -328 221 156 209 107 -215 24
4841 24 335 -102 -323 -186 89 18 18 22 -279 97 156 72 -54 26 -180 109 30 182 72 182 45 -115 -138 201
4865 201 164 2 41 -223 77 320 1 65 -34 -99 43 -95 -156 -53 111 -81 67 66 33 140 131 93 -26 88
$$ packed form
4706D89m93j71L66k08N4k3k77K08K6J61k38R8j85J68L72k71j66K43j73m6J27j3
4728D8m4pmk25J98J37k57J65o6J44j54K12l17L16n8j68J35J17k80l7M06P8l89
4751e0J32J79j97J98j96l40L48R6m55M50M3l22M18j1l12J59j42K5j36J5L5N3L68
4774C58k12l35K35K7J19k77mJ24K2k2j23n8L25j78L58k20k91j05K21j4j84J78
4796e6j82N29Kp13K79J70J25j97J58k6k02M25l22K19k57J48j98R0m10K20K63Q7
4818A52m09K70j66P3lJ96l76J59K76k4N3k38P4k70N46l65k76N49o5N3j02l22K39
4841B4L11m37k21J37K75p1%Ml01L76N9q4j26Q0k06K89p9J52j10J10j37j60k3L39
4865B01l7j62L9k64L00K43l19O4r9o5J42j38o1J03J64j92J48jl3J07rl8j19J14
$$ plain form
4889 88 -118 223 -69 -142 -147 232 -73 -137 -37 -242 300 -29 10 3 197 112 18 -14 -126 -48 160 193 -132 0
4913 0 52 230 -93 -7 -232 -85 300 -218 32 -127 26 72 -9 -130 7 78 -451 -110 16 32 95 278 91
4936 91 -316 254 114 -129 120 -170 202 202 -21 -69 -62 -98 -76 -87 135 179 152 95 -275 -6 17 100 211 333 -137
4961 -137 -147 597 -3 81 -158 115 152 4 -72 -47 -42 165 -85 -120 -494 -36 120 269 -147 -123 -5 242 238 146
4985 146 -243 8 278 -80 -109 250 -146 254 277 -176 -220 312 10 321 -16 -160 220 223 25 0 195 24
5007 24 -11 74 -123 -74 129 -37 -174 -126 -99 -143 478 91 12 -286 34 360 -307 -131 -268 33 -77 -32 -224
5030 -224 109 144 -113 -211 -143 -144 298 102 -266 -75 162 134 -84 -92 -427 226 415 -184 -135 -23 -10 132 -87
5053 -87 -575 17 653 -88 -104 39 -20 124 53 -53 -310 -35 163 230 250 -188 28 143 100 -216 -98 -205
$$ packed form
4889H8k06L41k92p3nL79l05o4J00k05N42l29L9pJ94q5r4l2j12P8K08L3l25J32
4913@N2J78l23Q6k25J47L85n18K50j59J53M6q1j21J37P1n29L41J26J6O3J83j87
4936I1m07N70j40k43K49k90L72%k23m8Pl6K2j1K22M4k7n7l70K69K3Q3J11J22m70
4961a37j0P44o00Q4k39K73L7j48p6K5NK07k50l5l74M58J56J49m16K4J18K47mr2
4985A46l89K51K70l58k9L59l96M00K3m53m4N32l02L11l37j44L80Lj98k5J95j71
5007B4l5Q5j97M9K03j66j37M8K7m4O21l87p9k98L20L26o67J76j37L01j10M5j92
5030b24L33L5k57r8O8jM42j96l68J91K37k8k18ql35O53J89n99M9J12J3J42k19
5053h7m88N92O36p41j6J43n9J44p1j06k57K75J98O7K0m38K16J15m3l16J18j07
$$ plain form
5075 -205 294 -80 -304 -428 -120 85 -207 104 46 186 -108 121 -133 -54 5 165 40 325 -146 -105 -183 -28
5097 -28 -378 132 80 -102 -58 -149 -81 184 -68 -320 -70 101 177 413 12 -137 256 281 -18 42 -315 23 192
5120 192 179 -312 -279 131 -8 -50 -29 -158 -94 41 15 -243 -49 81 211 18 -192 -134 -56 212 -112 -59 62
5143 62 -103 241 -55 -320 -101 -103 154 -198 -59 -122 -158 88 -260 -122 307 108 147 -8 -16 180 291 115 -157
5166 -157 152 -196 33 124 13 -213 430 243 25 -184 -89 -55 237 226 -100 -113 186 -433 -293 128 -31 158
5188 158 25 -7 -317 128 67 -128 303 -86 -81 -69 183 0 -60 -15 -94 9 59 -158 152 156 -312 -6 190 129
5212 129 200 -153 -218 -174 135 -117 -63 -27 155 -197 -29 -592 -303 50 -42 -163 138 167 -26 144 108 -351 91
5235 91 120 281 191 1 90 -114 27 80 -18 47 293 -220 307 -380 119 44 -37 -110 122 -128 85 177 -148 -276
$$ packed form
5075b05M99l74k24j24L08K05k92L11n8J40k94K29k54P9N9J60j25K85m71M1p8J55
5097b8l50N10n2j82M4r1O8K65k52k52K50J71P6K36m01j49L93K5k99O0l57L38J69
5120A92j3m91L3M10j39m2K1j29O4J35k6k58J94J30J30j93k10N8P8K68l24N3J21
5143F2j65L44k96k65K19kK57l52J39o3l6K46l48J38M29j99L9j55qJ96J11j76k72
5166a57L09l48K29R1j11k26O43j87k18k09R5L4K92j1l26j3K99o19J40M21j59J89
5188A58j33l2l10M45o1j95M31l89NJ2K52j83o0M5p9J03N0k17L10Mm68L06J96o1
5212A29P1l53o5M4L09k52N4L6J82l52J68n63K89L53r2j21L01K9j93J70l6m59M42
5235I1K9J61r0j90Q9k04J41N3r8O5K46n13N27o87M99p5q1p3K32k50K13R2l25j28
$$ plain form
5259 -276 96 178 -275 -65 -187 -40 61 59 -178 -213 332 -15 -22 33 54 94 66 -47 -147 118 -165 537 27
5282 27 -68 140 196 96 -265 -16 -252 -135 -23 -130 87 -30 14 -113 -358 -96 -174 97 316 -202 -211 -26
5304 -26 155 236 191 70 -114 105 -222 -77 267 13 174 -9 31 144 195 -83 -312 -9 -47 -197 196 -184
5326 -184 -240 -36 -146 -35 -61 -174 -121 141 7 -79 -128 -43 -104 80 -44 -249 35 104 -128 -302 208 -293 -178
5349 -178 -44 -93 -98 618 -155 -56 276 -28 132 198 -134 -172 -245 42 -223 -507 -219 -285 97 45 -47 -193 -128 199
5373 199 134 115 29 85 133 -160 -288 71 438 117 12 24 -26 154 2 49 192 -41 -46 63 -93 -383 -78
5396 -78 116 -50 315 -60 -63 266 184 -369 -364 390 15 136 433 49 -11 295 391 -105 -112 73 -114 207 57
5419 57 -179 -168 66 -318 -215 270 -32 236 -77 -20 103 341 -144 27 -172 -163 436 122 -92 -317 134 26
$$ packed form
5259b76L72Q2m53K10j22J47J01kk37l5N45l47pN5K1M0k8j13j00K65k83P02n10
5282B7r5K08N6j00l61K49k36J17J12j07K17j17M4j27k45K62p8K71K19n18rJ85
5304b6J81Q1m5j21j84K19l27J45L44k54J61j83M0J13N1k78k29L03l8j50L93l80
5326a84n6K04j10J11k6j13N3K62j34q6m9Q5o1J84j24k05K84O9k32j74N10n01J15
5349a78J34m9nP16p73R9L32l04J60O6l32l8p3K87k65k84K88o6L82n2r2j46O5L27
5373A99o5j9q6N6M8k93j28L59L67l21j05J2n0J80j52M7J43k33nJ09j56k90L05
5396g8J94j66L65l75lL29q2n53NP54l75J21K97l84o0L06R6m96pJ85j87L21j50
5419E7k36J1K34l84J03M85l02K68l13N7J23K38m85J71j99RN99l14k14k25M51j08
$$ [...]
8191B45
##END NTUPLES=NMR FID
##END=
