##TITLE=1H_EC-2352(III-3) 
 CDCl3, 8 sc, 
 8.04.2021
##JCAMPDX= 6.0         $$ Bruker NMR JCAMP-DX V2.0
##DATA TYPE= NMR SPECTRUM
##DATA CLASS= NTUPLES
##ORIGIN= UXNMR, Bruker Analytische Messtechnik GmbH
##OWNER= root
$$ XWIN-NMR		Version 3.5
$$ Thu Apr  8 11:45:21 2021 Russian Standard Time (UT+4h)  she@DPX200
##.OBSERVE FREQUENCY= 200.131506
##.OBSERVE NUCLEUS= ^1H
##.ACQUISITION MODE= SIMULTANEOUS
##.ACQUISITION SCHEME= undefined
##.AVERAGES= 8
##.DIGITISER RES= 18
##SPECTROMETER/DATA SYSTEM= spect
##.PULSE SEQUENCE= zg30
##.SOLVENT NAME= DMSO
##.SHIFT REFERENCE= (INTERNAL, DMSO, 0, 15.9606)
##AUDIT TRAIL= $$ (NUMBER, WHEN, WHO, WHERE, WHAT)
$$ ##TITLE= Audit trail, XWIN-NMR		Version 3.5
$$ ##JCAMPDX= 5.01
$$ ##ORIGIN= Bruker BioSpin GmbH
$$ ##OWNER= she
$$ F:/spectra/data/she/nmr/H-F/1/pdata/1/auditp.txt
$$ ##AUDIT TRAIL=  $$ (NUMBER, WHEN, WHO, WHERE, WHAT)
(   1,<2021-04-08 11:42:54.93 +0400>,<she>,<DPX200>,
      <created by zg, POWCHK disabled, PULCHK disabled
       configuration hash MD5:
       00 E9 B6 7A A2 85 ED C7 34 08 36 98 17 FE 4E 26
       data hash MD5: 16K
       97 19 0C 0A B4 85 54 2A E6 33 BC D4 94 A9 DA 90>)
(   2,<2021-04-08 11:42:57.84 +0400>,<she>,<DPX200>,
      <Start of raw data processing
       efp BC_mod = 2 LB = 0.24 FT_mod = 6 PKNL = 1 PHC0 = -11128.36 PHC1 = 21.40092 SI = 16K 
       data hash MD5: 16K
       BB F4 A1 D9 2D 33 EF A2 1B 80 AC FD 4A 69 A6 FE>)
(   3,<2021-04-08 11:43:17.29 +0400>,<she>,<DPX200>,
      <pk PHC0 = 7.749484 PHC1 = -8.799998 
       data hash MD5: 16K
       27 34 DD 15 CE CF 77 A8 CD 76 15 B4 2F 7F 51 FE>)
(   4,<2021-04-08 11:43:20.53 +0400>,<she>,<DPX200>,
      <abs ABSG = 5 
       data hash MD5: 16K
       C7 73 CA 60 2D D0 64 1B 9A BF 91 74 1E F4 7E C2>)
$$ ##END=
$$ 
$$ hash MD5
$$ 23 D8 98 6A 7B 2C 45 FA 42 AD FF 5C 7D 78 60 6E
##$RELAX= 
##$RELAX= 
##$RELAX= 
##$RELAX= 
##$RELAX= 
##$RELAX= 
$$ Bruker specific parameters
$$ --------------------------
##$DU= <F:/spectra>
##$EXPNO= 1
##$NAME= <H-F>
##$PROCNO= 1
##$TYPE= <nmr>
##$USER= <she>
##$AMP= (0..31)
100 100 100 100 100 100 100 100 100 100 100 100 100 100 100 100 100 100 
100 100 100 100 100 100 100 100 100 100 100 100 100 100 
##$AQSEQ= 0
##$AQ_mod= 1
##$AUNM= <au_zg>
##$AUTOPOS= <>
##$BF1= 200.13
##$BF2= 200.13
##$BF3= 200.13
##$BF4= 200.13
##$BF5= 200.13
##$BF6= 200.13
##$BF7= 200.13
##$BF8= 200.13
##$BYTORDA= 1
##$CFDGTYP= 0
##$CFRGTYP= 5
##$CHEMSTR= <none>
##$CNST= (0..31)
1 1 145 1 1 1 1 1 1 1 1 1 1 1 1 1 1 1 1 1 1 1 1 1 1 1 1 1 1 1 1 1 
##$CPDPRG= <>
##$CPDPRG1= <>
##$CPDPRG2= <>
##$CPDPRG3= <>
##$CPDPRG4= <mlev>
##$CPDPRG5= <mlev>
##$CPDPRG6= <mlev>
##$CPDPRG7= <mlev>
##$CPDPRG8= <mlev>
##$CPDPRGB= <>
##$CPDPRGT= <>
##$D= (0..31)
0 1.2 0 0 0 0 0 0 0 0.06 0 0.03 0 0 0 0 0.0002 0 0 0 0 0 0 0 0 0 0 0 0 
0 0 0 
##$DATE= 1617867774
##$DBL= (0..7)
120 120 120 120 120 120 120 120 
##$DBP= (0..7)
150 150 150 150 150 150 150 150 
##$DBP07= 0
##$DBPNAM0= <>
##$DBPNAM1= <>
##$DBPNAM2= <>
##$DBPNAM3= <>
##$DBPNAM4= <>
$$ [...]
##$SUBNAM3= <"">
##$SUBNAM4= <"">
##$SUBNAM5= <"">
##$SUBNAM6= <"">
##$SUBNAM7= <"">
##$SUBNAM8= <"">
##$SUBNAM9= <"">
##$SW= 16.9725357007746
##$SWIBOX= (0..15)
0 0 2 0 0 0 0 0 0 0 0 0 0 0 0 0 
##$SW_h= 3396.73913043478
##$TD= 16384
##$TD0= 1
##$TE= 0
##$TE2= 300
##$TE3= 300
##$TEG= 300
##$TL= (0..7)
0 120 120 120 120 120 120 120 
##$TP= (0..7)
150 150 150 150 150 150 150 150 
##$TP07= 0
##$TPNAME0= <>
##$TPNAME1= <>
##$TPNAME2= <>
##$TPNAME3= <>
##$TPNAME4= <>
##$TPNAME5= <>
##$TPNAME6= <>
##$TPNAME7= <>
##$TPOAL= (0..7)
0.5 0.5 0.5 0.5 0.5 0.5 0.5 0.5 
##$TPOFFS= (0..7)
0 0 0 0 0 0 0 0 
##$TUNHIN= 0
##$TUNHOUT= 0
##$TUNXOUT= 0
##$USERA1= <user>
##$USERA2= <user>
##$USERA3= <user>
##$USERA4= <user>
##$USERA5= <user>
##$V9= 5
##$VALIST= <valist>
##$VCLIST= <CCCCCCCCCCCCCCC>
##$VD= 0
##$VDLIST= <DDDDDDDDDDDDDDD>
##$VPLIST= <PPPPPPPPPPPPPPP>
##$VTLIST= <TTTTTTTTTTTTTTT>
##$WBST= 1024
##$WBSW= 4
##$XGAIN= (0..3)
0 0 0 0 
##$XL= 0
##$YL= 0
##$YMAX_a= 788649
##$YMIN_a= -771023
##$ZGOPTNS= <>
##$ZL1= 120
##$ZL2= 120
##$ZL3= 120
##$ZL4= 120
##$ABSF1= 15.9761
##$ABSF2= -0.996562
##$ABSG= 5
##$ABSL= 3
##$ALPHA= 0
##$AQORDER= 0
##$ASSFAC= 0
##$ASSFACI= 0
##$ASSFACX= 0
##$ASSWID= 0
##$AUNMP= <proc_1d>
##$AZFE= 0.1
##$AZFW= 0.1
##$BCFW= 0
##$BC_mod= 2
##$BYTORDP= 0
##$COROFFS= 0
##$CY= -3
##$DATMOD= 1
##$DC= 0
##$DFILT= <>
##$DTYPP= 0
##$F1P= 0
##$F2P= 0
##$FCOR= 1
##$FTSIZE= 16384
##$FT_mod= 6
##$GAMMA= 0
##$GB= 0
##$INTBC= 1
##$INTSCL= 2.992141e-10
##$ISEN= 128
##$LB= 0.24
##$LEV0= 0
##$LPBIN= 0
##$MAXI= 10000
##$MC2= 0
##$MEAN= 0
##$ME_mod= 0
##$MI= 1.114404
##$NCOEF= 0
##$NC_proc= -6
##$NLEV= 6
##$NOISF1= 3.799351
##$NOISF2= 2.8
##$NSP= 0
##$NTH_PI= 0
##$NZP= 0
##$OFFSET= 15.96056
##$PC= 1
##$PHC0= -11120.61
##$PHC1= 12.60092
##$PH_mod= 1
##$PKNL= yes
##$PPARMOD= 0
##$PSCAL= 0
##$PSIGN= 0
##$REVERSE= no
##$SF= 200.130010182894
##$SI= 16384
##$SIGF1= 3
##$SIGF2= 2
##$SINO= 5.538805
##$SIOLD= 16384
##$SREGLST= <1H.CDCl3>
##$SSB= 0
##$STSI= 16384
##$STSR= 0
##$SW_p= 3396.73913043479
##$SYMM= 0
##$S_DEV= 0
##$TDeff= 16384
##$TDoff= 0
##$TI= <>
##$TILT= no
##$TM1= 0
##$TM2= 0
##$TOPLEV= 0
##$USERP1= <user>
##$USERP2= <user>
##$USERP3= <user>
##$USERP4= <user>
##$USERP5= <user>
##$WDW= 1
##$XDIM= 16384
##$YMAX_p= 527077764
##$YMIN_p= -297024
$$ End of Bruker specific parameters
$$ ---------------------------------
##NTUPLES= NMR SPECTRUM
##VAR_NAME=  FREQUENCY,     SPECTRUM/REAL,   SPECTRUM/IMAG
##SYMBOL=    X,             R,               I
##VAR_TYPE=  INDEPENDENT,   DEPENDENT,       DEPENDENT
##VAR_FORM=  AFFN,          ASDF,            ASDF
##VAR_DIM=   16384,         16384,           16384
##UNITS=     HZ,            ARBITRARY UNITS, ARBITRARY UNITS
##FACTOR=    0.207333158178282, 1,           1
##FIRST=     3194.18700429868, 0,            0
##LAST=      -202.552126136114, 0,           0
##MIN=       -202.552126136114, -297024,     0
##MAX=       3194.18700429868, 527077764,    0
$$ Real data points
##PAGE= N=1
##DATA TABLE= (X++(R..R)), XYDATA
$$ [...]
$$ plain form
5202 1133233 1115781 1105177 1065256 1031933 1054697 1084231 1066456 1138485 1166577 1173263 1198635 1228781
5190 1228781 1238962 1308858 1356577 1413821 1437705 1422334 1377899 1365596 1410326 1461167 1509588
5179 1509588 1438032 1353101 1413101 1385482 1396408 1442802 1478694 1526078 1556621 1519296 1548796
5168 1548796 1564496 1488682 1396997 1509527 1517874 1586657 1619945 1542205 1553210 1638001 1552349
5157 1552349 1576562 1672296 1747858 1620894 1500738 1588281 1655774 1655090 1663164 1705602 1735747 1737844
5145 1737844 1665351 1721604 1747445 1730961 1797210 1822927 1835997 1765898 1714304 1709472 1764222 1816303
5133 1816303 1763923 1880245 1838323 1828295 1775461 1931683 1936127 1892752 1898557 1909884 1896094
5122 1896094 1889142 1933124 1985008 2024557 2096029 2030950 1982485 1965246 1995744 2104256 2117224
$$ packed form
5202A133233j7452j0604l9921l3323K2764K9534j7775P2029K8092O686K5372L0146
5190A228781J0181O9896M7719N7244K3884j5371m4435j2303M4730N0841M8421
5179A509588p1556q4931O0000k7619J0926M6394L5892M7384L0543l7325K9500
5168A548796J5700p5814r1685J12530Q347O8783L3288p7740J1005Q4791q5652
5157A552349K4213R5734P5562j26964j20156Q7543O7493o84Q074M2438L0145K097
5145A737844p2493N6253K5841j6484O6249K5717J3070p0099n1594m832N4750N2081
5133A816303n2380J16322m1922j0028n2834J56222M444m3375N805J1327j3790
5122A896094o952M3982N1884L9549P1472o5079m8465j7239L0498J08512J2968
$$ plain form
5111 2117224 2134085 2159897 2168136 2231165 2273530 2358334 2404185 2399466 2453782 2485565 2503311 2495201
5099 2495201 2586454 2736845 2737681 2785228 2783621 2718392 2739244 2827597 2786030 2777072 2854000 2829904
5087 2829904 2845697 2737554 2700731 2720403 2750208 2778763 2804026 2837359 2956929 2969006 2974569
5076 2974569 3025624 3081976 3127636 3196391 3294566 3389477 3533022 3600645 3702996 3763384 3866335
5065 3866335 3875684 3818067 3844123 3817567 3825617 3945470 3923774 3891308 3961059 4061731 4082084
5054 4082084 4124639 4209610 4161869 4116306 4159870 4138593 4179469 4211099 4335309 4444379 4509847
5043 4509847 4608361 4732584 4821130 4901532 4966805 5031708 5022822 5126209 5193319 5125172 5061894
5032 5061894 5149400 5124428 5073392 5111129 5163791 5266381 5305159 5318378 5403637 5373377 5417848
$$ packed form
5111B117224J6861K5812Q239O3029M2365Q4804M5851m719N4316L1783J7746q110
5099B495201R1253J50391Q36M7547j607o5229K0852Q8353m1567q958P6928k4096
5087B829904J5793j08143l6823J9672K9805K8555K5263L3333J19570J2077N563
5076B974569N1055N6352M5660O8755R8175R4911J43545O7623J02351O0388J02951
5065C866335R349n7617K6056k6556Q050J19853k1696l2466O9751J00672K0353
5054D082084M2555Q4971m7741m5563M3564k1277M0876L1630J24210J09070O5468
5043D509847R8514J24223Q8546Q0402O5273O4903q886J03387O7110o8147o3278
5032E061894Q7506k4972n1036L7737N2662J02590L8778J3219Q5259l0260M4471
$$ plain form
5021 5417848 5482540 5555136 5595368 5731480 5847973 6012482 6162580 6283222 6406197 6425912
5011 6425912 6610734 6603536 6767518 6752097 6676814 6819228 6931845 6856975 6839920 6807181 6884254
5000 6884254 6804626 6774753 6685859 6731302 6711360 6745420 6813555 6923199 7033718 7163221 7350379
4989 7350379 7583170 7802264 7979252 8185588 8458446 8711545 9043488 9377541 9702276 10084692
4979 10084692 10485529 10979061 11461792 11905358 12345865 12654742 12907594 13149138 13270949
4970 13270949 13244500 13047599 12815325 12460743 12108522 11769694 11625592 11530258 11373036 11313866
4960 11313866 11320787 11339080 11471396 11566184 11614248 11757463 12004538 12212843 12472317 12804286
4950 12804286 13165020 13587901 14163681 14827563 15418512 15902830 16504392 17166544 17736421
$$ packed form
5021E417848O4692P2596M0232J36112J16493J64509J50098J20642J22975J9715
5011F425912J84822p198J63982j5421p5283J42414J12617p4870j7055l2739P7073
5000F884254p9628k9873q8894M5443j9942L4060O8135J09644J10519J29503J87158
4989G350379K32791K19094J76988K06336K72858K53099L31943L34053L24735L82416
4979A0084692M00837M93532M82731M43566M40507L08877K52852K41544J21811
4970A3270949k6449j96901k32274l54582l52221l38828j44102r5334j57222n9170
4960A1313866O921J8293J32316R4788M8064J43215K47075K08305K59474L31969
4950A2804286L60734M22881N75780O63882N90949M84318O01562O62152N69877
$$ plain form
4941 17736421 18309795 18855140 19324695 19706283 19905310 20040940 20087667 19971621 19837013 19587721
4931 19587721 19252832 19022700 18633941 18310874 18066569 17817106 17728357 17576088 17490382 17444673
4921 17444673 17413046 17551374 17797800 18010124 18292892 18671913 19023298 19495277 20166569 20851510
4911 20851510 21511627 22360785 23292756 24329802 25483100 26678648 27937919 29409854 30860877
4902 30860877 32408392 33976902 35526555 37360590 39261542 40961555 42697735 44327576
4894 44327576 45671927 46587493 46872122 46496734 45364750 43771544 42031530 40155917 38487256
4885 38487256 37029526 35690887 34732842 34009397 33547233 33256268 33204887 33313901 33558955
4876 33558955 33968859 34677097 35489139 36557236 37906298 39527030 41359643 43435464 45863460
$$ packed form
4941A7736421N73374N45345M69555L81588J99027J35630M6727j16046j34608k49292
4931A9587721l34889k30132l88759l23067k44305k49463q8749j52269q5706m5709
4921A7444673l1627J38328K46426K12324K82768L79021L51385M71979O71292O84941
4911B0851510O60117Q49158R31971J037046J153298J195548J259271J471935J451023
4902C0860877J547515J568510J549653J834035J900952J700013J736180J629841
4894D4327576J344351R15566K84629l75388j131984j593206j740014j875613j668661
4885C8487256j457730j338639r58045p23445m62164k90965n1381J09014K45054
4876C3558955M09904P08238Q12042J068097J349062J620732J832613K075821K427996
$$ plain form
4867 45863460 48600443 51496671 54742241 58180899 61789506 65314769 68353208 70813162
4859 70813162 72348026 72799094 71768013 69559153 66305613 62317701 58067597 53825147
4851 53825147 49807303 46180314 42978799 40287110 37971678 35941244 34192224 32816793
4843 32816793 31795399 30927342 30274853 29844102 29693299 29679324 29882348 30196459 30682343
4834 30682343 31303274 32086801 33093822 34356709 35720522 37159431 38674043 39956914
4826 39956914 40966104 41476923 41314182 40439850 38754749 36434769 33948753 31282010 28638619
4817 28638619 26246376 24196742 22242392 20702341 19284040 18052624 16918541 15989732
4809 15989732 15123322 14317461 13548112 12943791 12420513 11939080 11521770 11040215 10655863
$$ packed form
4867D5863460K736983K896228L245570L438658L608607L525263L038439K459954
4859G0813162J534864M51068j031081k208860l253540l987912m250104m242450
4851E3825147m017844l626989l201515k691689k315432k030434j749020j375431
4843C2816793j021394q68057o52489m30751j50803j3975K03024L14111M85884
4834C0682343O20931P83527J007021J262887J363813J438909J514612J282871
4826C9956914J009190N10819j62741q74332j685101k319980k486016k666743k643391
4817B8638619k392243k049634j954350j540051j418301j231416j134083r28809
4809A5989732q66410q05861p69349o04321n23278m81433m17310m81555l84352
$$ plain form
4800 10655863 10346086 10039841 9698658 9343525 9119361 8927947 8641256 8412815 8130059
4791 8130059 7858015 7541258 7323059 7188600 7053779 6906285 6690124 6464874 6459796 6339541
4781 6339541 6106921 5905532 5907589 5845198 5693841 5534296 5458203 5387214 5245120 5166791 5140166
4770 5140166 5032794 4959243 4860196 4716585 4675031 4664161 4604412 4521611 4453580 4446933 4334750
4759 4334750 4282509 4261355 4153486 4126238 4127931 4054497 3958067 4005565 4014932 3955895 3993548 4020618
4747 4020618 3952995 3919865 3766662 3693091 3596937 3598129 3635010 3611300 3586465 3578544 3610945 3551422
4735 3551422 3606118 3644428 3715447 3605744 3540073 3485357 3431436 3421529 3420161 3423462 3433023 3538807
4723 3538807 3580534 3528009 3533843 3583272 3516985 3474048 3453652 3414333 3540113 3490876 3509090
$$ packed form
4800A0655863l09777l06245l41183l55133k24164j91414k86691k28441k82756
4791H130059k72044l16757k18199j34459j34821j47494k16161k25250n078j20255
4781F339541k32620k01389K057o2391j51357j59545p6093p0989j42094p8329k6625
4770E140166j07372p3551r9047j43611m1554j0870n9749q2801o8031o647j12183
4759D334750n2241k1154j07869k7248J693p3434r6430M7498R367n9037L7653K7070
4747D020618o7623l3130j53203p3571r6154J192L6881k3710k4835p921L2401n9523
4735C551422N4696L8310P1019j09703o5671n4716n3921r907j368L301R561J05784
4723C538807M1727n2525N834M9429o6287m2937k0396l9319J25780m9237J8214
$$ plain form
4712 3509090 3535647 3455039 3548022 3599134 3564333 3587129 3667958 3657411 3616602 3663468 3637943
4701 3637943 3643247 3753855 3801610 3791005 3802134 3816855 3981538 3943637 3844919 3913138 3935398
4690 3935398 4048172 4149863 4126458 4247019 4312224 4347475 4522567 4554998 4622932 4774465
4680 4774465 4855141 4941398 4877002 4768047 4625188 4564658 4551770 4356556 4270288 4188084 4093932
4669 4093932 4040511 4042992 4056443 4008888 3963710 3991173 3910291 3880241 3861604 3925011 3917217 3947001
4657 3947001 3976201 4070059 4032712 3983802 3968964 3977567 4094286 4154585 4185527 4230428 4231473 4161518
4645 4161518 4256610 4281784 4260243 4289738 4351951 4437321 4437190 4485140 4546999 4557524 4623902 4727729
4633 4727729 4779379 4775773 4777940 4860768 4919976 5047106 5202671 5310515 5404460 5434968 5543286
$$ packed form
4712C509090K6557q0608R2983N1112l4801K2796Q0829j0547m0809M6866k5525
4701C637943N304J10608M7755j0605J1129J4721J64683l7901r8718O8219K2260
4690C935398J12774J01691k3405J20561O5205L5251J75092L2431O7934J51533
4680D774465Q0676Q6257o4396j08955j42859o0530j2888j95214q6268q2204r4152
4669D093932n3421K481J3451m7555m5178K7463q0882l0050j8637O3407p794K9784
4657C947001K9200R3858l7347m8910j4838Q603J16719O0299L0942M4901J045o9955
4645D161518R5092K5174k1541K9495O2213Q5370j31M7950O1859J0525O6378J03827
4633D727729N1650l606K167Q2828N9208J27130J55565J07844R3945L0508J08318
$$ plain form
4622 5543286 5682793 5966289 6122460 6244568 6383725 6616193 6819453 7002876 7205488 7354847
4612 7354847 7350580 7134521 7160690 7054428 6926952 6811240 6751448 6710919 6750944 6776465 6789038
4601 6789038 6669335 6615463 6618690 6740154 6955406 7009599 7044532 7201781 7306537 7445171
4591 7445171 7422941 7577914 7713414 7778578 7959420 8102376 8197999 8305735 8458484 8587055
4581 8587055 8724784 8718991 8688940 8612653 8629843 8710184 8789927 8790958 8858280 8830293 8872808 8957418
4569 8957418 8964834 8948057 9037298 9235849 9318461 9413417 9496347 9544934 9630694 9613819 9829255
4558 9829255 10064747 10305850 10489308 10606589 10832792 11053214 11172165 11291297 11417678 11603687
4548 11603687 11784019 11969339 12138558 12314058 12585138 12787721 13060585 13264821 13584300
$$ packed form
4622E543286J39507K83496J56171J22108J39157K32468K03260J83423K02612J49359
4612G354847m267k16059K6169j06262j27476j15712n9792m0529M0025K5521J2573
4601F789038j19703n3872L227J21464K15252N4193L4933J57249J04756J38634
4591G445171k2230J54973J35500O5164J80842J42956R5623J07736J52749J28571
4581H587055J37729n793l0051p6287J7190Q0341P9743J031O7322k7987M2515Q4610
4569H957418P416j6777Q9241J98551Q2612R4956Q2930M8587Q5760j6875K15436
4558I829255K35492K41103J83458J17281K26203K20422J18951J19132J26381J86009
4548A1603687J80332J85320J69219J75500K71080K02583K72864K04236L19479
$$ plain form
4539 13584300 13940956 14350556 14822088 15179067 15565222 15971573 16404586 16876783 17482240
4530 17482240 18154219 18709873 19351942 20089858 20745766 21471318 22259546 23071643 23870361
4521 23870361 24657854 25524069 26588889 27682275 28923917 30124783 31545759 33031292
4513 33031292 34581677 36275786 38120749 39901612 41926297 44233396 46826015 49675876
4505 49675876 52972141 56716282 60772503 65258901 70245102 75654879 81400117 87478600
4497 87478600 93780286 100120799 106256346 111832636 116783724 120809744 123266708 123956794
4489 123956794 122690527 119559420 114753266 108960178 102637605 96175441 89743049 83557677
4481 83557677 77513273 71694519 66229882 61008468 56051825 51285589 47081203 43421834
$$ packed form
4539A3584300L56656M09600M71532L56979L86155M06351M33013M72197O05457
4530A7482240O71979N55654O42069P37916O55908P25552P88228Q12097P98718
4521B3870361P87493Q66215J064820J093386J241642J200866J420976J485533
4513C3031292J550385J694109J844963J780863K024685K307099K592619K849861
4505D9675876L296265L744141M056221M486398M986201N409777N745238O078483
4497H7478600O301686O340513O135547N576290M951088M026020K456964O90086
4489A23956794j266267l131107m806154n793088o322573o462164o432392o185372
4481H3557677o044404n818754n464637n221414m956643m766236m204386l659369
$$ plain form
4473 43421834 40281653 37653946 35293687 33295485 31603876 30085064 28706207 27604388
4465 27604388 26482327 25447472 24672334 23825137 22915673 22192396 21522146 20748585 20170951
4456 20170951 19850091 19394447 18933743 18567264 18277885 18112183 18051291 18012156 18004756 18084716
4446 18084716 18299267 18328940 18231878 17964805 17348868 16668985 16179114 15704333 15473853 15232326
4436 15232326 15049390 14918705 14799836 14694073 14592785 14488290 14385696 14426738 14465285 14435869
4426 14435869 14449836 14500926 14647271 14890295 14996683 15049672 15220404 15450953 15627593 15896491
4416 15896491 16044641 16254766 16573390 16731036 16958394 17134727 17176753 17212667 17199040 17200898
4406 17200898 17189784 17332984 17511910 17702801 17929844 18304616 18694106 19084102 19636001 20188206
$$ packed form
4473D3421834l140181k627707k360259j998202j691609j518812j378857j101819
4465B7604388j122061j034855p75138q47197r09464p23277o70250p73561n77634
4456B0170951l20860m55644m60704l66479k89379j65702o0892l9135p400P9960
4446A8084716K14551K9673r7062k67073o15937o79883m89871m74781k30480k41527
4436A5232326j82936j30685j18869j05763j01288j04495j02594M1042L8547k9416
4426A4435869J3967N1090J46345K43024J06388N2989J70732K30549J76640K68898
4416A5896491J48150K10125L18624J57646K27358J76333M2026L5914j3627J858
4406A7200898j1114J43200J78926J90891K27043L74772L89490L89996N51899N52205
$$ plain form
4396 20188206 20949747 21876013 22905549 24164281 25595057 27034609 28530861 29912433
4388 29912433 30949114 31411494 31393491 30936770 30268937 29721558 29458570 29496283 29719909 30021616
4378 30021616 30514682 31115324 31827222 32488133 33076819 33805782 34467302 35117800 35741603
4369 35741603 36402344 37186310 38146287 39447563 41018037 42977606 45227553 47423911 49435643
4360 49435643 50715842 50784314 49443714 46832690 43691754 40778553 38314965 36431426
4352 36431426 35011323 34018663 33340105 32579214 31773420 31086356 30248791 29360473 28613391
4343 28613391 27924479 27291490 26687738 26114336 25713737 25496263 25545786 25633988 25881083 26058692
4333 26058692 26191662 26048929 25370779 24089105 22356897 20541871 18762040 17195644 15897070
$$ packed form
4396B0188206P61541R26266J029536J258732J430776J439552J496252J381572
4388B9912433J036681M62380j8003m56721o67833n47379k62988L7713K23626L01707
4378C0021616M93066O00642P11898O60911N88686P28963O61520O50498O23803
4369C5741603O60741P83966R59977J301276J570474J959569K249947K196358K011732
4360D9435643J280199O8472j340600k611024l140936k913201k463588j883539
4352C6431426j420103r92660o78558p60891q05794o87064q37565q88318p47082
4343B8613391o88912o32989o03752n73402m00599k17474M9523Q8202K47095J77609
4333B6058692J32970j42733o78150j281674j732208j815026j779831j566396j298574
$$ plain form
4324 15897070 15065944 14364773 13811101 13248588 12744083 12440014 12091885 11888175 11542071
4315 11542071 11197093 11056666 10742682 10469479 10228697 9944432 9628835 9464291 9335984
4306 9335984 9265093 9136483 8922595 8834065 8651977 8422967 8263406 8232515 8058359 7963902
4296 7963902 7798546 7757804 7593773 7469417 7418670 7349206 7308434 7206405 7148655 7215497 7147482
4285 7147482 7134403 7120529 7177272 7186649 7093653 7073979 7048262 7083668 6967816 6977535 7109252
4274 7109252 7108794 6955995 6890434 6829775 6813680 6796173 6805907 6806357 6734126 6765613 6749652 6822472
4262 6822472 6771578 6691520 6625230 6501910 6498693 6487954 6537624 6452664 6439816 6432293 6458771 6456266
4250 6456266 6420229 6436654 6464149 6503262 6599090 6619280 6716838 6707019 6666559 6632950 6715582 6785326
$$ packed form
4324A5897070q31126p01171n53672n62513n04505l04069l48129k03710l46104
4315A1542071l44978j40427l13984k73203k40782k84265l15597j64544j28307
4306I335984p0891j28610k13888q8530j82088k29010j59561l0891j74156r4457
4296G963902j65356m0742j64031j24356n0747o9464m0772j02029n7750O6842o8015
4285G147482j3079j3874N6743R377r2996j9674k5717L5406j15852R719J31717
4274G109252m58j52799o5561o0659j6095j7507R734M50p2231L1487j5961P2820
4262F822472n0894q0058o6290j23320l217j0739M9670q4960j2848p523K6478k505
4250F456266l6037J6425K7495L9113R5828K0190R7558r819m0460l3609Q2632O9744
$$ plain form
4238 6785326 6878760 6952596 7025874 6986891 7011798 7074264 7105802 7255672 7406350 7489526 7645251
4227 7645251 7820923 7912740 7889543 7836301 7792247 7663458 7629625 7625839 7609198 7495017 7444031
4216 7444031 7334742 7253501 7248559 7235923 7361340 7441077 7519586 7563523 7668547 8075613 8511622
4205 8511622 8874801 9338299 9915645 10582396 11091952 11409026 11405187 10746007 9715663 8708333
4195 8708333 8053543 7665164 7314195 7095256 6919316 6753076 6728206 6627990 6507689 6459375
4185 6459375 6482611 6470010 6438606 6347891 6354852 6402626 6452015 6471494 6537304 6629849 6643004 6702422
4173 6702422 6763150 6817019 6930301 7029956 7080002 7194364 7284555 7408251 7523443 7539272 7616270
4162 7616270 7709428 7772991 7859228 7815311 7704348 7662197 7587987 7620879 7573656 7432000 7273151
$$ packed form
4238F785326R3434P3836P3278l8983K4907O2466L1538J49870J50678Q3176J55725
4227G645251J75672R1817k3197n3242m4054j28789l3833l786j6641j14181n0986
4216G444031j09289q1241m942j2636J25417P9737P8509M3937J05024M07066M36009
4205H511622L63179M63498N77346O66751N09556L17074l839o59180j030344j007330
4195H708333o54790l88379l50969k18939j75940j66240k4870j00216j20301m8314
4185F459375K3236j2601l1404r0715O961M7774M9389J9479O5810R2545J3155N9418
4173F702422O0728N3869J13282R9655N0046J14362R0191J23696J15192J5829P6998
4162G616270R3158O3563Q6237m3917j10963m2151p4210L2892m7223j41656j58849
$$ plain form
4151 7273151 7116356 7031851 6918807 6853303 6807356 6797473 6832399 6787539 6691679 6684179 6609841
4140 6609841 6470224 6479183 6456094 6392031 6526747 6506528 6505333 6500201 6480310 6609055 6538402
4129 6538402 6456474 6368890 6303327 6248603 6278695 6386033 6364128 6360805 6345816 6360454 6334149
4118 6334149 6297705 6387802 6435528 6400961 6379921 6494649 6600736 6599131 6676354 6712068 6712603 6824678
4106 6824678 6836530 6844914 6703310 6664451 6712301 6647206 6723614 6751301 6840338 6845057 6754498 6798815
4094 6798815 6870343 6892150 6840883 6938215 7076874 7107388 7037780 7004945 7000204 6967722 7037508
4083 7037508 7081040 7059624 7061921 7107207 7052915 7045081 7105098 7104019 7030165 7160417 7274581 7220384
4071 7220384 7266185 7364147 7389060 7341945 7269379 7282295 7314368 7357088 7362601 7415259 7409246 7459719
$$ packed form
4151G273151j56795q4505j13044o5504m5947r883L4926m4860r5860p500p4338
4140F609841j39617Q959k3089o4063J34716k0219j195n132j9891J28745p0653
4129F538402q1928q7584o5563n4724L0092J07338k1905l323j4989J4638k6305
4118F334149l6444R0097M7726l4567k1040J14728J06087j605P7223L5714N35J12075
4106F824678J1852Q384j41604l8859M7850o5095P6408K7687Q9037M719r0559M4317
4094F798815P1528K1807n1267R7332J38659L0514o9608l2835m741l2482O9786
4083G037508M3532k1416K297M5286n4292p834O0017j079p3854J30252J14164n4197
4071G220384M5801R7962K4913m7115p2566J2916L2073M2720N513N2658o013N0473
$$ plain form
4059 7459719 7540374 7559636 7619974 7633853 7631346 7647217 7701742 7790986 7820656 7910464 7910248 7920721
4047 7920721 7980683 8048747 8119418 8111292 8098366 8206436 8255411 8178024 8265529 8327773 8377608
4036 8377608 8322109 8301604 8371754 8425240 8478162 8548887 8470645 8570057 8438630 8483342 8524100
4025 8524100 8517690 8670379 8700838 8805650 8787453 8688575 8750488 8800375 8757453 8842846 8887697
4014 8887697 8810654 8754668 8687682 8710151 8825886 8926032 8980211 8962509 8945159 8929555 8899295
4003 8899295 8945016 9004122 8997786 8929063 8981331 8976613 8969770 9007144 9017492 9011072 8954935 9055263
3991 9055263 9117206 9072518 9052727 9034920 9033285 9027768 8992707 9146896 9193895 9186144 9189866 9115008
3979 9115008 9151755 9277837 9367371 9338698 9354966 9283306 9301254 9438741 9361505 9418455 9413486
$$ packed form
4059G459719Q0655J9262O0338J3879k507J5871N4525Q9244K9670Q9808k16J0473
4047G920721N9962O8064P0671q126j2926J08070M8975p7387Q7505O2244M9835
4036H377608n5499k0505P0150N3486N2922P0725p8242R9412j31427M4712M0758
4025H524100o410J52689L0459J04812j8197r8878O1913M9887m2922Q5393M4851
4014H887697p7043n5986o6986K2469J15735J00146N4179j7702j7350j5604l0260
4003H899295M5721N9106o336o8723N2268m718o843L7374J0348o420n6137J00328
3991I055263O1943m4688j9791j7807j635n517l5061J54189M6999p751L722p4858
3979I115008L6747J26082Q9534k8673J6268p1660J7948J37487p7236N6950m969
$$ plain form
3968 9413486 9395300 9413854 9355336 9349467 9298361 9309227 9391024 9408269 9370135 9440884 9434946 9341031
3956 9341031 9431377 9577044 9631494 9473443 9504674 9627936 9674624 9725102 9694882 9754117 9860430
3945 9860430 9849684 9881245 9815031 9890300 9881512 9855033 9890171 9939864 10065913 10197436 10249183
3934 10249183 10280795 10330732 10353611 10374192 10274852 10347977 10321385 10288112 10440114 10395101 10415498
3923 10415498 10512623 10579926 10551920 10676161 10647519 10649072 10746027 10766107 10741424 10774398 10812414
3912 10812414 10842080 10846906 10861775 10925521 10880376 10944414 11044868 11032188 11054531 10989809 11048146
3901 11048146 11169487 11213523 11263806 11282207 11361620 11363105 11417773 11508833 11567629 11501780 11647582
3890 11647582 11743278 11806875 11848551 11842816 11891915 12042364 12138392 12254744 12399854 12461516 12458592
$$ packed form
3968I413486j8186J8554n8518n869n1106J0866Q1797J7245l8134P0749n938r3915
3956I341031R0346J45667N4450j58051L1231J23262M6688N0478l0220N9235J06313
3945I860430j0746L1561o6214P5269q788k6479L5138M9693J26049J31523N1747
3934A0249183L1612M9937K2879K0581r9340P3125k6592l3273J52002m5013K0397
3923A0415498R7125O7303k8006J24241k8642J553R6955K0080k4683L2974L8016
3912A0812414K9666M826J4869O3746m5145O4038J00454j2680K2343o4722N8337
3901A1048146J21341M4036N0283J8401P9413J485N4668R1060N8796o5849J45802
3890A1647582R5696O3597M1676n735M9099J50449R6028J16352J45110O1662k924
$$ plain form
3879 12458592 12494539 12626180 12662647 12746641 12946314 12987130 13162032 13281698 13500504 13649271
3869 13649271 13806574 13943769 14013419 14034934 14102059 14280802 14434751 14463742 14635402 14823184
3859 14823184 15001826 15132275 15324623 15644685 15867020 16145172 16552939 16930966 17271344
3850 17271344 17535806 17964648 18335897 18672665 18987789 19238707 19410079 19473753 19478047 19269835
3840 19269835 19128385 19024429 18888780 18665633 18537455 18404459 18366310 18386901 18479802 18510980
3830 18510980 18521773 18753451 18957040 19164759 19532237 19798572 20024557 20315831 20600666 20827850
3820 20827850 21145189 21531691 21976812 22426552 22852017 23275552 23827026 24272107 24694615
3811 24694615 24976060 25210125 25451545 25752093 25861018 26123423 26180008 26237173 26332463 26407436
$$ packed form
3879A2458592L5947J31641L6467Q3994J99673M0816J74902J19666K18806J48767
3869A3649271J57303J37195O9650K1515O7125J78743J53949K8991J71660J87782
3859A4823184J78642J30449J92348L20062K22335K78152M07767L78027L40378
3850A7271344K64462M28842L71249L36768L15124K50918J71372O3674M294k08212
3840A9269835j41450j03956j35649k23147j28178j32996l8149K0591R2901L1178
3830A8510980J0793K31678K03589K07719L67478K66335K25985K91274K84835K27184
3820B0827850L17339L86502M45121M49740M25465M23535N51474M45081M22508
3811B4694615K81445K34065K41420L00548J08925K62405N6585N7165R5290P4973
$$ plain form
3801 26407436 26341231 26319829 26198039 26149369 26210891 26117599 26198768 26349640 26490467 26545166 26670178
3790 26670178 26698266 26706125 26740937 26739382 26698321 26763020 26867548 26947504 27092685 27269876 27313232
3779 27313232 27645497 27876577 27944784 28223500 28603431 28969775 29471266 29956522 30499422 31084257
3769 31084257 31889982 32667906 33481447 34105322 34735849 35364812 35851519 36330743 36608772
3760 36608772 36686733 36808592 36903356 36981007 37105337 37329365 37681779 38148038 38746817 39338723
3750 39338723 39936633 40582282 41388212 42290254 43288757 44414930 45606167 46759142 48049956
3741 48049956 49260536 50594010 51961980 53324412 54911307 56617862 58411360 60453434
3733 60453434 62576786 64830775 67476575 70409009 73447414 76776818 80445243 84260513
$$ packed form
3801B6407436o6205k1402j21790m8670O1522r3292Q1169J50872J40827N4699J25012
3790B6670178K8088P859L4812j555m1061O4699J04528P9956J45181J77191M3356
3779B7313232L32265K31080O8207K78716L79931L66344N01491M85256N42900N84835
3769C1084257Q05725P77924Q13541O23875O30527O28963M86707M79224K78029
3760C6608772P7961J21859R4764P7651J24330K24028L52414M66259N98779N91906
3750C9338723N97910O45649Q05930R02042R98503J126173J191237J152975J290814
3741D8049956J210580J333474J367970J362432J586895J706555J793498K042074
3733F0453434K123352K253989K645800K932434L038405L329404L668425L815270
$$ plain form
3725 84260513 88299963 92723735 97417431 102325901 107547172 113125249 118986857 125203065
3717 125203065 131967407 139223281 146892805 154866326 163082102 171493840 179845328 187987541
3709 187987541 195810886 202797101 208299336 211927043 213217631 211886800 207835275 201387888
3701 201387888 193441905 184441407 174915313 165151299 155564415 146135075 136705444 127057793
3693 127057793 117289776 107843045 99108474 91247123 84399818 78474743 73242513 68636538
3685 68636538 64698702 61316642 58062980 55321209 52895617 50685149 48753394 47017991
3677 47017991 45341968 43906522 42548022 41283813 40203331 39062958 38000331 36911681
3669 36911681 35696404 34668957 33585835 32538487 31676946 30870401 30117915 29440152 28852059
$$ packed form
3725H4260513M039450M423772M693696M908470N221271N578077N861608O216208
3717A25203065O764342P255874P669524P973521Q215776Q411738Q351488Q142213
3709A87987541P823345O986215N502235L627707J290588j330831m051525o447387
3701B01387888p945983r000498r526094r764014r586884r429340r429631r647651
3693A27057793r768017r446731q734571p861351o847305n925075n232230m605975
3685F8636538l937836l382060l253662k741771k425592k210468j931755j735403
3677D7017991j676023j435446j358500j264209j080482j140373j062627j088650
3669C6911681j215277j027447j083122j047348q61541q06545p52486o77763n88093
$$ plain form
3660 28852059 28222757 27688075 27333601 26939066 26568543 26166333 25907406 25585978 25345966
3651 25345966 25190791 24937560 24772425 24609649 24497127 24396812 24374751 24247721 24234160 24162243
3641 24162243 24103822 23984849 24119812 24199230 24135289 24217018 24092453 23922936 23829180 23654309
3631 23654309 23333388 22905071 22521921 22183842 21789199 21355882 21022546 20861616 20772623 20476023
3621 20476023 20123463 19959643 19740819 19602115 19406741 19069352 18724977 18383277 18097932
3612 18097932 17901999 17742063 17514802 17319288 17204222 17122229 17103611 17024771 16951325 16892845
3602 16892845 16774583 16806005 16896844 16837952 16852413 16853999 16881569 16960917 16994062 17010162 17066261
3591 17066261 17146898 17226180 17331069 17593536 17693620 17864326 18043727 18182696 18374182 18402593
$$ packed form
3660B8852059o29302n34682l54474l94535l70523m02210k58927l21428k40012
3651B5345966j55175k53231j65135j62776j12522j00315k2061j27030j3561p1917
3641B4162243n8421j18973J34963P9418o3941Q1729j24565j69517r3756j74871
3631B3654309l20921m28317l83150l38079l94643m33317l33336j60930q8993k96600
3621B0476023l52560j63820k18824j38704j95374l37389l44375l41700k85345
3612A8097932j95933j59936k27261j95514j15066q1993j8618p8840p3446n8480
3602A6892845j18262L1422R0839n8892J4461J586K7570P9348L3145J6100N6099
3591A7066261Q0637P9282J04889K62467J00084J70706J79401J38969J91486K8411
$$ plain form
3581 18402593 18526457 18752271 18787264 18831298 18929593 18966776 19119685 19249201 19412695 19518276
3571 19518276 19695565 19863811 20063656 20271334 20535532 20759647 21018461 21248877 21422460
3562 21422460 21704308 21950964 22138853 22362918 22648145 23129953 23645581 24115756 24603367
3553 24603367 25109864 25732555 26394836 27097267 27928416 28782380 29648494 30385835 31187268
3544 31187268 32131487 32973049 33699428 34337872 34776806 35187786 35517961 35861242 36155275
3535 36155275 36519035 36879809 37447114 38124045 39046688 40077696 41254594 42692365 44252463
3526 44252463 46070134 48153253 50436989 53024056 55715105 58453768 61163930 63490256
3518 63490256 65531606 66795737 67383599 67255668 66848764 66225648 65687044 65244225 64892103
$$ packed form
3581A8402593J23864K25814L4993M4034R8295L7183J52909J29516J63494J05581
3571A9518276J77289J68246J99845K07678K64198K24115K58814K30416J73583
3562B1422460K81848K46656J87889K24065K85227M81808N15628M70175M87611
3553B4603367N06497O22691O62281P02431Q31149Q53964Q66114P37341Q01433
3544C1187268R44219Q41562P26379O38444M38934M10980L30175L43281K94033
3535C6155275L63760L60774N67305O76931R22643J031008J176898J437771J560098
3526D4252463J817671K083119K283736K587067K691049K738663K710162K326326
3518F3490256K041350J264131N87862j27931m06904o23116n38604m42819l52122
$$ plain form
3509 64892103 64839245 64666647 64227511 63669026 62780038 61847237 61053838 60578354 60316140 60292366
3499 60292366 60665424 61365605 62314900 63635215 65170930 66899693 69026261 71557964 74355194
3490 74355194 77713498 81459772 85469218 89736908 93840738 97441633 100271415 101895136
3482 101895136 101939923 100235663 97404451 93809786 89893272 86053731 82455008 79205708
3474 79205708 76537868 74221700 72237221 70468664 68947489 67715806 66675043 65996787
3466 65996787 65564065 65412099 65592654 66095691 66804683 67868938 69194290 70718932 72434281
3457 72434281 74485851 76793060 79382066 82274189 85155428 87778193 90282139 92591244
3449 92591244 94551835 95796647 96479304 96493722 96168556 95789513 95573367 95732573 96634595
$$ packed form
3509F4892103n2858j72598m39136n58485q88988r32801p93399m75484k62214k3774
3499F0292366L73058P00181R49295J320315J535715J728763K126568K531703K797230
3490G4355194L358304L746274M009446M267690M103830L600895K829782J623721
3482A01895136M4787j704260k831212l594665l916514l839541l598723l249300
3474G9205708k667840k316168j984479j768557j521175j231683j040763o78256
3466F5996787m32722j51966J80555N03037P08992J064255J325352J524642J715349
3457G2434281K051570K307209K589006K892123K881239K622765K503946K309105
3449I2591244J960591J244812O82657J4418l25166l79043k16146J59206R02022
$$ plain form
3440 96634595 98180154 100553823 103764001 107615293 112116080 117540303 124126098 132047890
3432 132047890 141604504 153155791 166835372 182762994 200292107 218324013 235383837
3425 235383837 249716431 258925371 259425986 248785368 228422735 203694933 180016127
3418 180016127 159652612 142794632 129162798 118115878 108920591 101310243 95025662
3411 95025662 89720288 85201369 81403028 78320305 75516188 73122065 70849897 68842365
3403 68842365 67363767 66152831 65041963 63948122 62619327 61097612 59118332 56995435
3395 56995435 54851168 52705635 50848336 49142773 47760908 46503343 45403702 44560848
3387 44560848 43807949 43098127 42458992 42097200 41771283 41497902 41279780 41159339 41121769 41195764
$$ packed form
3440I6634595J545559K373669L210178L851292M500787N424223O585795P921792
3432A32047890R556614J1551287J3679581J5927622J7529113J8031906J7059824
3425B35383837J4332594R208940N00615j0640618k0362633k4727802k3678806
3418A80016127k0363515j6857980j3631834j1046920r195287p610348o284581
3411I5025662n305374m518919l798341l082723k804117k394123k272168k007532
3403F8842365j478598j210936j110868j093841j328795j521715j979280k122897
3395E6995435k144267k145533j857299j705563j381865j257565j099641q42854
3387D4560848p52899p09822o39135l61792l25917k73381k18122j20441l7570P3995
$$ plain form
3377 41195764 41322480 41589717 41887092 42128666 42430290 42831788 43329995 43971948 44680188
3368 44680188 45311983 46028370 46846261 47697160 48716373 49839026 50950497 52170295 53400027
3359 53400027 54740517 56101446 57411760 58656548 59931925 60990575 62029072 62968373
3351 62968373 63971154 65198496 66446971 68000724 69843538 71894379 74175580 76700012
3343 76700012 79590757 82844765 86517104 90626120 95157118 100321149 106246421 112729059
3335 112729059 119999079 128053704 136689005 145500108 154076783 162041826 169227905 175888325
3327 175888325 182172587 188719754 196338612 205574477 216862432 230137447 245271939 261200806
3319 261200806 275463987 285541346 289325030 286084932 275573040 258324718 236601601
$$ packed form
3377D1195764J26716K67237K97375K41574L01624M01498M98207O41953P08240
3368D4680188O31795P16387Q17891Q50899J019213J122653J111471J219798J229732
3359E3400027J340490J360929J310314J244788J275377J058650J038497R39301
3351F2968373J002781J227342J248475J553753J842814K050841K281201K524432
3343G6700012K890745L254008L672339M109016M530998N164031N925272O482638
3335A12729059P270020Q054625Q635301Q811103Q576675P965043P186079O660420
3327A75888325O284262O547167P618858R235865J1287955J3275015J5134492J5928867
3319B61200806J4263181J0077359L783684l240098j0511892j7248322k1723117
$$ plain form
3312 236601601 212562987 188160546 165566246 146313249 130853682 118607025 108630671
3305 108630671 100518037 93594552 87653867 82576211 78101388 74106189 70510216 67365940
3297 67365940 64420817 61717249 59253870 56930541 54750932 52817887 51003441 49269041
3289 49269041 47782781 46509976 45285846 44212045 43144179 42292251 41642049 40971475 40407112
3280 40407112 40054045 39778889 39481304 39234192 38929061 38596059 38134019 37557719 37048915
3271 37048915 36549931 36014881 35566912 35148864 34923222 34757325 34516697 34475485 34414410 34410142
3261 34410142 34435178 34564081 34711015 34909861 35060412 35209419 35462022 35695084 35925753 36182493
3251 36182493 36599488 37222996 37805832 38481266 39449896 40548060 41671573 43041459 44592472
$$ packed form
3312B36601601k4038614k4402441k2594300j9252997j5459567j2246657r976354
3305A08630671q112634o923485n940685n077656m474823l995199l595973l144276
3297F7365940k945123k703568k463379k323329k179609j933045j814446j734400
3289D9269041j486260j272805j224130j073801j067866q51928o50202o70574n64363
3280D0407112l53067k75156k97585k47112l05131l33002m62040n76300n08804
3271C7048915m98984n35050m47969m18048k25642j65897k40628m1212o1075m268
3261C4410142K5036J28903J46934J98846J50551J49007K52603K33062K30669K56740
3251C6182493M16995O23508N82836O75434R68630J098164J123513J369886J551013
$$ plain form
3242 44592472 46362346 48436982 50726042 53349617 56502071 60506943 65360498 71020537
3234 71020537 77740290 85282422 93016622 100343895 106716093 110525411 109732409 103088893
3226 103088893 92559328 81578914 72011563 64474549 58546080 53891659 50246665 47303276
3218 47303276 44780772 42815043 41278865 40041537 39121915 38571733 38213926 38067241 37982436
3209 37982436 38004361 37853560 37242663 36134408 34637182 33274693 31982162 30894599 30036405
3200 30036405 29227347 28549719 27848334 27196003 26566568 25940400 25420028 24938906 24444656
3191 24444656 23996338 23742491 23578632 23262542 23087360 22973666 22777410 22786320 22711891 22664126
3181 22664126 22794479 22932863 23133855 23233881 23357629 23581915 23745172 24060786 24330080
$$ packed form
3242D4592472J769874K074636K289060K623575L152454M004872M853555N660039
3234G1020537O719753P542132P734200P327273O372198L809318p93002o643516
3226A03088893j0529565j0980414r567351p537014n928469m654421l644994k943389
3218D7303276k522504j965729j536178j237328r19622n50182l57807j46685q4805
3209C7982436K1925j50801o10897j108255j497226j362489j292531j087563q58194
3200C0036405q09058o77628p01385o52331o29435o26168n20372m81122m94250
3191B4444656m48318k53847j63859l16090j75182j13694j96256Q910p4429m7765
3181B2664126J30353J38384K00992J00026J23748K24286J63257L15614K69294
$$ plain form
3172 24330080 24646833 25129659 25763546 26493665 27307050 28309564 29564561 30875362 32106774
3163 32106774 33153616 33931660 34120987 33582394 32595123 31623144 30969484 30353051 30155591
3154 30155591 30221062 30465251 30806306 31231969 31654267 32065561 32353378 32573604 32682199 32727112
3144 32727112 32681041 32591716 32697139 33013112 33441234 34118042 34987199 36033076 37395817
3135 37395817 39181788 41569099 44393033 47835300 51919341 56398368 60850983 64890922
3127 64890922 68185458 69408005 67312108 61904552 55164646 48980787 43982032 40101818
3119 40101818 37061641 34728047 32879454 31346600 29982190 28880033 28010753 27320917
3111 27320917 26832175 26453689 26093721 26169559 26308513 26394249 26592091 26880547 27215776 27576758
$$ packed form
3172B4330080L16753M82826O33887P30119Q13385J002514J254997J310801J231412
3163C2106774J046842P78044J89327n38593r87271r71979o53660o16433j97460
3154C0155591O5471K44189L41055M25663M22298M11294K87817K20226J08595M4913
3144C2727112m6071q9325J05423L15973M28122O76808Q69157J045877J362741
3135C7395817J785971K387311K823934L442267M084041M479027M452615M039939
3127F4890922L294536J222547k095897n407556o739906o183859m998755l880214
3119D0101818l040177k333594j848593j532854j364410j102157q69280o89836
3111B7320917m88742l78486l59968P5838J38954Q5736J97842K88456L35229L60982
$$ plain form
3101 27576758 27834939 28110629 28611511 29350473 30173163 30962845 31713643 32202637 32331340
3092 32331340 31835655 30829290 29716560 28619547 27604200 26701657 26017920 25519758 25031144
3083 25031144 24594080 24199359 23625192 22941873 22344071 21823419 21401269 21011975 20752334
3074 20752334 20579613 20469062 20434793 20469563 20704871 20887581 21095611 21424796 21796563 22376858
3064 22376858 23137342 23927504 24892718 25887879 26882572 27524739 27896032 27697661 26875375
3055 26875375 25707840 24432029 23407292 22627197 22203541 21864092 21405078 20924884 20432457
3046 20432457 20029937 19843740 19794109 19890355 19910598 20009786 20070201 20186638 20369532 20565484
3036 20565484 20739145 20892403 21059224 21269657 21539858 21740424 21953746 22156079 22517250
$$ packed form
3101B7576758K58181K75690N00882P38962Q22690P89682P50798M88994J28703
3092C2331340m95685j006365j112730j097013j015347r02543o83737m98162m88614
3083B5031144m37064l94721n74167o83319n97802n20652m22150l89294k59641
3074B0752334j72721j10551l4269L4770K35308J82710K08030L29185L71767N80295
3064B2376858P60484P90162R65214R95161R94693O42167L71293j98371q22286
3055B6875375j167535j275811j024737p80095m23656l39449m59014m80194m92427
3046B0432457m02520j86197m9631R6246K0243R9188O0415J16437J82894J95952
3036B0565484J73661J53258J66821K10433K70201K00566K13322K02333L61171
$$ plain form
3027 22517250 22833272 23144962 23467694 23898781 24365901 24932702 25570013 26195534 27059619
3018 27059619 27978379 28792171 29551631 30191190 30530508 30645872 30564072 30444771 30221256 29968622
3008 29968622 29786138 29707375 29871613 30082284 30270401 30638785 31096171 31547880 32160699 32658043
2998 32658043 33350879 34163526 34906401 35671863 36401333 37188137 38097528 39111900 40191422
2989 40191422 41241717 42323605 43564813 44790891 46073815 47610202 49193721 50679488
2981 50679488 52372941 54229488 55948419 57845517 60029486 62044939 64088072 66358968
2973 66358968 68693476 71107399 73508266 76104050 78730561 81356894 84115814 86850029
2965 86850029 89581742 92259821 95044596 97880180 100860095 103677858 106542520 109336604
$$ packed form
3027B2517250L16022L11690L22732M31087M67120N66801O37311O25521Q64085
3018B7059619R18760Q13792P59460O39559L39318J15364q1800j19301k23515k52634
3008B9968622j82484p8763J64238K10671J88117L68384M57386M51709O12819M97344
2998C2658043O92836Q12647P42875P65462P29470P86804R09391J014372J079522
2989D0191422J050295J081888J241208J226078J282924J536387J583519J485767
2981E0679488J693453J856547J718931J897098K183969K015453K043133K270896
2973F6358968K334508K413923K400867K595784K626511K626333K758920K734215
2965H6850029K731713K678079K784775K835584K979915K817763K864662K794084
$$ plain form
2957 109336604 112031726 114697069 117210531 119672869 122001532 124202574 126202751 128104034
2949 128104034 129860283 131360231 132797398 134123075 135243015 136222651 137104648 137688813
2941 137688813 138123559 138341013 138286037 137980447 137376900 136586276 135447023 133993742 132437549
2932 132437549 130783327 129029505 127126628 125066759 122869109 120570674 118163702 115625786
2924 115625786 112948139 110021093 107059796 104075826 100885656 97724060 94465866 91413279
2916 91413279 88420505 85393371 82489702 79582920 76753942 74003864 71359938 68775546
2908 68775546 66225656 63680076 61375250 59072117 56749006 54509353 52299842 50340702
2900 50340702 48401480 46581308 44920365 43390902 41903166 40529149 39199419 38043420
$$ packed form
2957A09336604K695122K665343K513462K462338K328663K201042K000177J901283
2949A28104034J756249J499948J437167J325677J119940R79636Q81997N84165
2941A37688813M34746K17454n4976l05590o03547p90624j139253j453281j556193
2932A32437549j654222j753822j902877k059869k197650k298435k406972k537916
2924A15625786k677647k927046k961297k983970l190170l161596l258194l052587
2916I1413279k992774l027134k903669k906782k828978k750078k643926k584392
2908F8775546k549890k545580k304826k303133k323111k239653k209511j959140
2900E0340702j939222j820172j660943j529463j487736j374017j329730j155999
$$ plain form
2892 38043420 37051259 35895614 34940832 34042215 33296828 32558645 31864297 31350695 30970060
2883 30970060 30482721 30078280 29700739 29406594 29245637 28975102 28846102 28873079 28818796 28965700
2873 28965700 29189489 29291386 29523972 29820803 30158770 30636279 31088374 31690350 32253017
2864 32253017 32779155 33234650 33559049 33881683 34030119 34009941 33844360 33646091 33409037 33102772
2854 33102772 32839640 32543115 32247149 32260187 32407238 32567177 32826655 33117401 33559655 34039038
2844 34039038 34562177 35211446 36055681 37006251 38049239 39115325 40345685 41708615 43149845
2835 43149845 44837227 46685735 48667051 50609277 52556339 54438943 56233038 57677373
2827 57677373 58601442 58892206 58781345 58128345 57111946 55709521 54183178 52683416 51187328
$$ packed form
2892C8043420r92161j155645r54782q98617p45387p38183o94348n13602l80635
2883C0970060m87339m04441l77541k94145j60957k70535j29000K6977n4283J46904
2873B8965700K23789J01897K32586K96831L37967M77509M52095O01976N62667
2864C2253017N26138M55495L24399L22634J48436k0178j65581j98269k37054l06265
2854C3102772k63132k96525k95966J3038J47051J59939K59478K90746M42254M79383
2844C4039038N23139O49269Q44235R50570J042988J066086J230360J362930J441230
2835D3149845J687382J848508J981316J942226J947062J882604J794095J444335
2827E7677373R24069K90764j10861o53000j016399j402425j526343j499762j496088
$$ plain form
2818 51187328 49958017 48953487 48025173 47232998 46814864 46494064 46381786 46456259 46628540
2809 46628540 47006090 47628432 48212205 49042197 50146374 51203083 52500210 54016376 55720294
2800 55720294 57558335 59538765 61737097 63857083 65870282 67614665 69107108 70046115
2792 70046115 70229107 69594450 68188264 66143178 63648495 60961833 58401405 56003583
2784 56003583 53591063 51452111 49519487 47847291 46387729 45201891 44153584 43270657
2776 43270657 42575501 42085561 41755244 41702591 41765736 41774674 42095953 42583738 43174010 43898882
2766 43898882 44688118 45606443 46581933 47621674 48717981 49627468 50379329 50780671 50679162
2757 50679162 50241230 49413395 47990891 46184336 44371015 42473639 40709578 38923640
$$ packed form
2818E1187328j229311j004530r28314p92175m18134l20800j12278P4473J72281
2809D6628540L77550O22342N83773Q29992J104177J056709J297127J516166J703918
2800E5720294J838041J980430K198332K119986K013199J744383J492443R39007
2792G0046115J82992o34657j406186k045086k494683k686662k560428k397822
2784E6003583k412520k138952j932624j672196j459562j185838j048307q82927
2776D3270657o95156m89940l30317n2653O3145Q938L21279M87785N90272P24872
2766D3898882P89236R18325R75490J039741J096307R09487P51861M01342j01509
2757E0679162m37932q27835j422504j806555j813321j897376j764061j785938
$$ plain form
2749 38923640 37248070 35698859 34256554 32915560 31728076 30718386 30076748 29404304
2741 29404304 28734947 28192484 27760112 27494766 27281001 27169443 26992475 26858827 26792681 26752746
2731 26752746 26813137 26869199 26867627 27007455 27083803 27204928 27105921 26937684 26827788 26467877
2721 26467877 26081936 25570363 24991204 24566558 24001003 23445321 22961014 22550849 22192684
2712 22192684 21898301 21574401 21362969 21238179 21105591 20970978 20836259 20798830 20853746 20817896
2702 20817896 20791708 20814969 20870331 20950734 21016512 21040338 21172559 21140645 21157477 21313994 21352829
2691 21352829 21354856 21554682 21668773 21813637 21959187 22032069 22203391 22444102 22723113 22920479
2681 22920479 23099122 23378205 23714619 24098236 24493737 24817478 25127977 25519258 26071458
$$ packed form
2749C8923640j675570j549211j442305j340994j187484j009690o41638o72444
2741B9404304o69357n42463m32372k65346k13765j11558j76968j33648o6146l9935
2731B6752746O0391N6062j572J39828P6348J21125r9007j68237j09896l59911
2721B6467877l85941n11573n79159m24646n65555n55682m84307m10165l58165
2712B2192684k94383l23900k11432j24790j32588j34613j34719l7429N4916l5850
2702B0817896k6188K3261N5362Q0403O5778K3826J32221l1914J6832J56517L8835
2691B1352829K027J99826J14091J44864J45550P2882J71322K40711K79011J97366
2681B2920479J78643K79083L36414L83617L95501L23741L10499L91281N52200
$$ plain form
2672 26071458 26498272 26998763 27470902 27972914 28479926 29077613 29708408 30390000 31029271
2663 31029271 31542318 31998584 32462090 32866246 33184431 33408090 33661368 33882670 34155500
2654 34155500 34381482 34648505 35052878 35404356 35792692 36145136 36557988 36929833 37267044
2645 37267044 37580639 37817593 38027999 38373525 38744403 39113187 39482308 39882347 40350805
2636 40350805 40944713 41664988 42382495 43110464 43912472 44810866 45824728 47008902 48108770
2627 48108770 49346828 50688038 51963410 53250465 54661691 56195005 57686179 59182141
2619 59182141 60751288 62284764 63881963 65399043 66984569 68537941 69971809 71343448
2611 71343448 72638317 73977529 75239337 76511595 77798702 79161049 80383549 81506495
$$ packed form
2672B6071458M26814N00491M72139N02012N07012N97687O30795O81592O39271
2663C1029271N13047M56266M63506M04156L18185K23659K53278K21302K72830
2654C4155500K25982K67023M04373L51478L88336L52444M12852L71845L37211
2645C7267044L13595K36954K10406L45526L70878L68784L69121M00039M68458
2636D0350805N93908P20275P17507P27969Q02008Q98394J013862J184174J099868
2627D8108770J238058J341210J275372J287055J411226J533314J491174J495962
2619E9182141J569147J533476J597199J517080J585526J553372J433868J371639
2611G1343448J294869J339212J261808J272258J287107J362347J222500J122946
$$ plain form
2603 81506495 82636621 83620258 84637486 85543275 86248340 86981918 87700107 88276665 88890296
2594 88890296 89482097 90075817 90767213 91415742 92173583 93102284 93960985 94943687 95898310
2585 95898310 96945862 98117996 99388569 100674602 102170587 103758694 105510357 107475696
2577 107475696 109630791 112084681 114589846 117272568 120277883 123502407 126854334 130573499
2569 130573499 134523067 138699989 143106794 147864328 153020166 158452833 164025367 169963521
2561 169963521 176294099 182724732 189205204 195950531 202810709 209717655 216576550 223491364
2553 223491364 230267923 237057645 243774489 250528779 257317210 264191153 271130357 278156963
2545 278156963 285153534 292176875 299271796 306334651 313344407 320222951 326870636 333565133
$$ packed form
2603H1506495J130126R83637J017228R05789P05065P33578P18189N76558O13631
2594H8890296N91801N93720O91396O48529P57841R28701Q58701R82702R54623
2585I5898310J047552J172134J270573J286033J495985J588107J751663J965339
2577A07475696K155095K453890K505165K682722L005315L224524L351927L719165
2569A30573499L949568M176922M406805M757534N155838N432667N572534N938154
2561A69963521O330578O430633O480472O745327O860178O906946O858895O914814
2553B23491364O776559O789722O716844O754290O788431O873943O939204P026606
2545B78156963O996571P023341P094921P062855P009756O878544O647685O694497
$$ plain form
2537 333565133 340194814 346865114 353673145 360611884 367885732 375630960 383663810 392024771
2529 392024771 400876050 409899437 419149925 428643871 438457146 448403586 458639899 469021618
2521 469021618 479518749 489901488 499853365 509018546 516668549 522514525 526105055 527077764
2513 527077764 525469678 521526941 515759741 508422517 500139760 491355838 482240672 473052691
2505 473052691 463878831 454620869 444986967 434721497 423469081 410947672 396812390
2498 396812390 381066655 363937139 345668524 326850788 308223506 289994219 272362777
2491 272362777 255569270 239569911 224659899 211135612 198911521 188307027 179063058
2484 179063058 171155809 164590844 158894041 154010415 149711370 145799663 142101177 138582250
$$ packed form
2537C33565133O629681O670300O808031O938739P273848P745228Q032850Q360961
2529C92024771Q851279R023387R250488R493946R813275R946440J0236313J0381719
2521D69021618J0497131J0382739R951877R165181P650003N845976L590530R72709
2513E27077764j608086l942737n767200p337224q282757q783922r115166r187981
2505D73052691r173860r257962r633902j0265470j1252416j2521409j4135282
2498C96812390j5745735j7129516j8268615j8817736j8627282j8229287j7631442
2491B72362777j6793507j5999359j4910012j3524287j2224091j0604494r243969
2484A79063058p907249o564965n696803m883626m299045l911707l698486l518927
$$ plain form
2476 138582250 135294537 132413666 129861912 127637225 125880798 124697529 123927370 123737596
2468 123737596 123963932 124473175 125032785 125496570 125222037 123867513 121071309 117167309 112801877
2459 112801877 108792137 105429634 102760275 100584191 98629948 96863364 95161554 93455967
2451 93455967 91757309 89929317 87936777 85722544 83329208 80561968 77741435 75215593
2443 75215593 72886219 70811844 69149223 67812429 66547945 65446001 64179309 62825574
2435 62825574 60992330 58586893 55652410 52542653 49605284 47066600 44792533 42779657
2427 42779657 40969494 39339882 37876694 36660520 35385956 34297767 33183474 32148028
2419 32148028 31225823 30328439 29619914 28853321 28133071 27489627 26841403 26292777 25796947
$$ packed form
2476A38582250l287713k880871k551754k224687j756427j183269p70159j89774
2468A23737596K26336N09243N59610M63785k74533j354524k796204l904000m365432
2459A12801877m009740l362503k669359k176084j954243j766584j701810j705587
2451I3455967j698658j827992j992540k214233k393336k767240k820533k525842
2443G5215593k329374k074375j662621j336794j264484j101944j266692j353735
2435F2825574j833244k405437k934483l109757k937369k538684k274067k012876
2427D2779657j810163j629612j463188j216174j274564j088189j114293j035446
2419C2148028r22205q97384p08525p66593p20250o43444o48224n48626m95830
$$ plain form
2410 25796947 25294268 24840429 24359430 23954554 23529826 23114375 22567246 22106784 21597759
2401 21597759 21127040 20697761 20338129 19994458 19646771 19273701 19081558 18865074 18435516
2392 18435516 18173863 17858954 17521470 17219214 17078468 16893588 16614644 16374709 16096637
2383 16096637 15955746 15648663 15282104 15035348 14731680 14427843 14244828 14090173 13817682
2374 13817682 13552031 13355758 13108653 12926786 12726312 12494501 12412124 12190572 11995100 11890007
2364 11890007 11662100 11565873 11399184 11241311 11134841 11028557 10910261 10711100 10576831 10474021
2354 10474021 10368774 10290919 10224611 10023595 9931818 9916455 9838924 9702954 9535772 9466729
2344 9466729 9439607 9487502 9486520 9350296 9261238 9118467 8951375 8760561 8632894 8492680 8394048
$$ packed form
2410B5796947n02679m53839m80999m04876m24728m15451n47129m60462n09025
2401B1597759m70719m29279l59632l43671l47687l73070j92143k16484m29558
2392A8435516k61653l14909l37484l02256j40746j84880k78944k39935k78072
2383A6096637j40891l07083l66559k46756l03668l03837j83015j54655k72491
2374A3817682k65651j96273k47105j81867k00474k31811q2377k21552j95472j05093
2364A1890007k27907r6227j66689j57873j06470j06284j18296j99161j34269j02810
2354A0474021j05247p7855o6308k01016r1777j5363p7531j35970j67182o9043
2344I466729k7122M7895r82j36224q9058j42771j67092j90814j27667j40214r8632
$$ plain form
2333 8394048 8355607 8317030 8190899 8010777 7844644 7738113 7661440 7546539 7451779 7397920
2323 7397920 7288236 7274007 7257065 7141248 7113827 7120263 7020558 6931448 6803509 6751313 6686359
2312 6686359 6695388 6631201 6528129 6540536 6542691 6522957 6422670 6425354 6464597 6301824 6242613
2301 6242613 6264993 6250858 6161928 6085766 6068701 6016116 5913746 5870226 5774315 5691937 5622550
2290 5622550 5673427 5688681 5586177 5548197 5505787 5457027 5421316 5428976 5379116 5388626 5452763 5517441
2278 5517441 5425035 5388522 5369039 5363222 5346854 5318146 5307523 5244303 5281882 5290065 5351323 5422363
2266 5422363 5403022 5349944 5349375 5323046 5328660 5379274 5302093 5358480 5238733 5169086 5246516 5271842
2254 5271842 5258165 5296966 5265372 5285724 5319997 5349719 5444245 5432488 5356721 5291753 5251995
$$ packed form
2333H394048l8441l8577j26131j80122j66133j06531p6673j14901r4760n3859
2323G397920j09684j4229j6942j15817k7421O436r9705q9110j27939n2196o4954
2312F686359R029o4187j03072J2407K155j9734j00287K684L9243j62773n9211
2301F242613K2380j4135q8930p6162j7065n2585j02370m3520r5911q2378o9387
2290E622550N0877J5254j02504l7980m2410m8760l5711P660m9860R510O4137O4678
2278E517441r2406l6513j9483n817j6368k8708j0623o3220L7579Q183O1258P1040
2266E422363j9341n3078n69k6329N614N0614p7181N6387j19747o9647P7430K5326
2254E271842j3677L8801l1594K0352L4273K9722R4526j1757p5767o4968l9758
$$ plain form
2243 5251995 5294210 5274965 5348215 5409334 5464571 5515347 5408448 5321745 5437028 5518590 5490153
2232 5490153 5481614 5608880 5685646 5717305 5777375 5708330 5752249 5800427 5669626 5742378 5765188
2221 5765188 5852553 5790735 5837469 5998488 5947152 5935801 6068487 6154615 6263372 6251911 6294394
2210 6294394 6340175 6312949 6355108 6470054 6466412 6390050 6389060 6484712 6499991 6437658 6486944 6489437
2198 6489437 6528249 6496949 6457811 6468629 6525237 6495163 6466717 6488703 6449604 6404703 6343846
2187 6343846 6204266 6016684 5896438 5723599 5493240 5407191 5197722 5000620 4922770 4807751
2177 4807751 4718329 4649593 4534026 4463975 4414523 4358662 4280229 4228045 4154922 4170576 4113429
2166 4113429 4174926 4126398 4152266 4062092 3969161 3943124 4019697 3981280 3947681 3893147 3957539
$$ packed form
2243E251995M2215j9245P3250O1119N5237N0776j06899q6703J15283Q1562k8437
2232E490153q539J27266P6766L1659O0070o9045M3919M8178j30801P2752K2810
2221E765188Q7365o1818M6734J61019n1336j1351J32686Q6128J08757j1461M2483
2210F294394M5781k7226M2159J14946l642p6362r90R5652J5279o2333M9286K493
2198F489437L8812l1300l9138J0818N6608l0074k8446K1986l9099m4901o0857
2187F343846j39580j87582j20246j72839k30359q6049k09469j97102p7850j15019
2177D807751q9422o8736j15567p0051m9452n5861p8433n2184p3123J5654n7147
2166D113429O1497m8528K5868r0174r2931k6037P6573l8417l3599n4534O4392
$$ plain form
2155 3957539 3956981 3951487 3976760 3966942 4033145 4066848 4086688 4168131 4237324 4349709 4490365 4757015
2143 4757015 5095749 5455790 5755226 6081933 6390691 6482456 6254262 5701763 5074659 4663143
2133 4663143 4433313 4206679 4082027 3984104 3944306 3875920 3746105 3699036 3775502 3695224 3731018
2122 3731018 3719901 3814378 3823449 3904819 4033033 4138852 4256637 4345830 4520222 4728367 4954665
2111 4954665 5294110 5808847 6294684 6939736 7503358 8086189 8682204 8817338 8323150 7227379
2101 7227379 6155611 5439371 4899721 4462903 4230557 4158846 3972387 3781509 3688007 3525474
2091 3525474 3486798 3463325 3459112 3437098 3499510 3550688 3611202 3650889 3694524 3806394 4001310
2080 4001310 4117380 4188662 4256771 4286125 4407728 4604223 4935424 5236761 5402422 5518407
$$ packed form
2155C957539n58n494K5273r818O6203L3703J9840Q1443O9193J12385J40656K66650
2143D757015L38734L60041K99436L26707L08758R1765k28194n52499o27104m11516
2133D663143k29830k26634j24652r7923l9798o8386j29815m7069P6466q0278L5794
2122C731018j1117R4477R071Q1370J28214J05819J17785Q9193J74392K08145K26298
2111D954665L39445N14737M85837O45052N63622N82831N96015J35134m94188j095771
2101G227379j071768p16240n39650m36818k32346p1711j86459j90878r3502j62533
2091C525474l8676k3473m213k2014O2412N1178O0514L9687M3635J11870J94916
2080D001310J16070P1282O8109K9354J21603J96495L31201L01337J65661J15985
$$ plain form
2070 5518407 5699089 5334311 4758412 4209287 3785922 3511820 3311586 3221770 3136635 3041227
2060 3041227 3031933 3129470 3053149 3064497 3081078 3173349 3156510 3067641 3061495 3005328 2972580 2883828
2048 2883828 2783424 2774548 2681404 2634458 2566950 2467624 2404933 2279682 2273894 2195115 2163470
2037 2163470 2222615 2178954 2172227 2163944 2148078 2088421 2045387 2100434 2134416 2102128 2131757 2180838
2025 2180838 2256342 2327350 2320539 2132933 2170657 2204580 2187553 2041648 2031192 2076352 2040810
2014 2040810 2087646 2107620 2137547 2283393 2373210 2443742 2528597 2732933 2897224 2925638 3088239
2003 3088239 3024086 2894706 2710306 2469965 2260383 2132151 2164922 2081721 2014974 1934058
1993 1934058 1841674 1883671 1834289 1729710 1780429 1845534 1804970 1786320 1828345 1818102 1867556
$$ packed form
2070E518407J80682l64778n75899n49125m23365k74102k00234q9816q5135r5408
2060C041227r294R7537p6321J1348J6581R2271j6839q8869o146n6167l2748q8752
2048B883828j00404q876r3144m6946o7508r9326o2691j25251n788p8779l1645
2037B163470N9145m3661o727q283j5866n9657m3034N5047L3982l2288K9629M9081
2025B180838P5504P1008o811j87606L7724L3923j7027j45905j0456M5160l5542
2014B040810M6836J9974K9927J45846Q9817P0532Q4855K04336J64291K8414J62601
2003C088239o4153j29380j84400k40341k09582j28232L2771q3201o6747q0916
1993A934058r2384M1997m9382j04579N0719O5105m0564j8650M2025j0243M9454
$$ plain form
1982 1867556 1910980 1979159 2066771 2121055 2226456 2371142 2615305 2687666 2843635 2789345 2645400
1971 2645400 2499994 2273018 2103401 1871107 1807308 1788844 1726180 1680663 1635118 1574621 1547925
1960 1547925 1572171 1530648 1459680 1300345 1370528 1393356 1369827 1285880 1247666 1210186 1264220
1949 1264220 1268692 1357949 1368345 1436033 1390569 1362615 1309036 1297613 1313643 1296944 1318578 1339096
1937 1339096 1308600 1312168 1279907 1314856 1355428 1367604 1405796 1333580 1327776 1376787 1334769 1432199
1925 1432199 1422123 1269994 1256930 1223615 1340495 1382433 1416741 1350785 1314023 1314543 1332464
1914 1332464 1264385 1324906 1357468 1426427 1387763 1399246 1510570 1561847 1477632 1397822 1474151
1903 1474151 1488922 1462937 1535917 1542686 1506670 1548503 1597987 1638382 1699426 1716149 1631604 1629010
$$ packed form
1982A867556M3424O8179Q7612N4284J05401J44686K44163P2361J55969n4290j43945
1971B645400j45406k26976j69617k32294o3799j8464o2664m5517m5545o0497k6696
1960A547925K4246m1523p0968j59335P0183K2828k3529q3947l8214l7480N4034
1949A264220M472Q9257J0396O7688m5464k7954n3579j1423J6030j6699K1634K0518
1937A339096l0496L568l2261L4949M0572J2176L8192p2216n804M9011m2018R7430
1925A432199j0076j52129j3064l3315J16880M1938L4308o5956l6762N20J7921
1914A332464o8079O0521L2562O8959l8664J1483J11324N1277q4215p9810P6329
1903A474151J4771k5985P2980O769l6016M1833M9484M0395O1044J6723q4545k594
$$ plain form
1891 1629010 1760639 1820858 1784851 1709501 1711891 1764044 1738673 1761161 1865483 1823863 1803412
1880 1803412 1807374 1778564 1867936 1874964 1879663 2100924 2135703 2155148 2137937 2166944 2245125 2450066
1868 2450066 2706761 2721674 2844007 3101782 3237841 3429930 3623202 3745319 3755845 3630376
1858 3630376 3494168 3341335 3088795 2811094 2753797 2608887 2505436 2444619 2324369 2416931
1848 2416931 2407296 2344002 2368808 2428185 2491355 2460610 2498944 2595367 2669144 2707970 2784954 2945606
1836 2945606 3092722 3254332 3350359 3472474 3747239 4032751 4218886 4459367 4773158 5102138
1826 5102138 5274466 5272283 5066855 4630860 4169053 3858533 3450669 3082577 2835291 2665887
1816 2665887 2552462 2393439 2238100 2143819 2099843 1999186 2051460 2142747 2124246 2080398 2047788
$$ packed form
1891A629010J31629O0219l6007p5350K390N2153k5371K2488J04322m1620k0451
1880A803412L962k8810Q9372P028M699K21261L4779J9445j7211K9007P8181K04941
1868B450066K56695J4913J22333K57775J36059J92089J93272J22117J0526j25469
1858C630376j36208j52833k52540k77701n7297j44910j03451o0817j20250R2562
1848B416931r635o3294K4806N9377O3170l0745L8334R6423P3777L8826P6984J60652
1836B945606J47116J61610R6027J22115K74765K85512J86135K40481L13791L28980
1826E102138J72328k183k05428m35995m61807l10520m07864l68092k47286j69404
1816B665887j13425j59023j55339r4281m3976j00657N2274R1287j8501m3848l2610
$$ plain form
1805 2047788 2087242 2150931 2145966 2247910 2283285 2339226 2234182 2229800 2230253 2392801 2481118 2455493
1793 2455493 2601164 2714256 2716483 2727460 2776275 2530658 2292504 2191812 2068666 1930265
1783 1930265 1786822 1646759 1629752 1544971 1464160 1363284 1198756 1198770 1210630 1145024 1153266
1772 1153266 1230366 1058425 1033733 1010767 1054729 950632 1012927 1035575 915334 967643 902040
1761 902040 974476 980562 1035286 1051691 941617 861897 894779 809686 752757 783637 770837 795055
1749 795055 874865 880060 789910 898961 821840 799140 856548 875599 949694 925926 819310
1738 819310 877154 893381 884020 918075 802668 772413 842781 846509 813542 640740 608727 654248
1726 654248 571110 626732 704625 712223 665504 703256 628521 572220 552892 576611 645036 760927
$$ packed form
1805B047788L9454O3689m965J01944L5375N5941j05044m382M53J62548Q8317k5625
1793B455493J45671J13092K227J0977M8815k45617k38154j00692j23146j38401
1783A930265j43443j40063j7007q4781q0811j00876j64528J4J1860o5606Q242
1772A153266P7100j71941k4692k2966M3962j04097O2295K2648j20241N2309o5603
1761I02040P2436O086N4724J6405j10074p9720L2882q5093n6929L0880j2800K4218
1749G95055P9810N195r0150J09051p7121k2700N7408J9051P4095k3768j06616
1738H19310N7844J6227r361L4055j15407l0255P0368L728l2967j72802l2013M5521
1726F54248q3138N5622P7893P598m6719L7752p4735n6301j9328K3719O8425J15891
$$ plain form
1714 760927 806059 787719 771433 694453 678247 765501 716871 699935 617124 763804 908828
1703 908828 874668 777597 747130 706540 727781 752409 742111 765860 750061 740702 714612 693868
1691 693868 728734 782626 771882 708289 654624 588363 548324 563918 656055 583748 462371
1680 462371 539643 571513 513888 562952 551931 509852 434440 480723 495651 456704 454077 557004
1668 557004 565478 538182 622588 512468 460426 552795 549997 519436 617777 610412 546739 536659
1656 536659 575460 574066 505950 654046 603832 459577 486519 407325 536463 656514 672460
1645 672460 550677 481105 437702 369024 310045 365325 385378 428563 327611 271762 353409
1634 353409 427599 441451 504002 389324 382614 350654 367134 303076 263618 384745 434522
$$ packed form
1714G60927M5132j8340j6286p6980j6206Q7254m8630j6936q2811J46680J45024
1703I08828l4160r7071l0467m0590K1241K4628j0298K3749j5799r359k6090k0744
1691F93868L4866N3892j0744o3593n3665o6261m0039J5594R2137p2307j21377
1680D62371P7272L1870n7625M9064j1021m2079p5412M6283J4928l8947k627J02927
1668E57004Q474k7296Q4406j10120n2042R2369k798l0561R8341p365o3673j0080
1656E36659L8801j394o8116J48096n0214j44255K6942p9194J29138J20051J5946
1645F72460j21783o9572m3403o8678n8979N5280K0053M3185j00952n5849Q1647
1634C53409P4190J3852O2551j14678o710l1960J6480o4058l9458J21127M9777
$$ plain form
1623 434522 438759 371634 423960 396956 419570 358471 304666 299990 330453 401505 373646 332506
1611 332506 377747 504668 491585 522180 397128 354420 325034 215700 272481 442624 380995
1600 380995 329635 339848 430037 400471 305353 257800 210427 242558 284157 326863 260889 262159
1588 262159 289321 359932 284541 329757 325378 332922 337535 212841 193508 171607 223597 308680
1576 308680 300345 309892 309199 325173 313796 302235 335635 347080 321386 296024 288114 242731 306831
1563 306831 312279 271771 259314 208710 416514 323850 282366 230516 287611 308672 404585 435463
1551 435463 361672 308791 294285 338290 377523 341185 340852 369884 400907 369007 413205 441595
1539 441595 454552 481881 317632 347753 361435 273281 332021 359520 343265 355731 391021
$$ packed form
1623D34522M237o7125N2326k7004K2614o1099n3805m676L0463P1052k7859m1140
1611C32506M5241J26921j3083L0595j25052m2708k9386j09334N6781J70143o1629
1600C80995n1360J0213R0189k9566r5118m7553m7373L2131M1599M2706o5974J270
1588B62159K7162P0611p5391M5216m379P544M613j24694j9333k1901N1990Q5083
1576C08680q335R547o93J5974j1377j1561L3400J1445k5694k5362p910m5383O4100
1563C06831N448m0508j2457n0604K07804r2664m1484n1850N7095K1061R5913L0878
1551D35463p3791n2881j4506M4005L9233l6338l33K9032L1023l1900M4198K8390
1539D41595J2957K7329j64249L0121J3682q8154N8740K7499j6255J2466L5290
$$ plain form
1528 391021 360966 370166 465409 440758 376999 403174 418706 433565 551635 449931 285738
1517 285738 304032 286275 299128 355079 300466 352175 412797 484798 397926 365757 421545 393923
1505 393923 335226 289863 344280 352032 297561 318785 320133 339956 279384 295465 349300 354459
1493 354459 325096 315123 336215 350761 331528 238712 175883 203813 313598 352682 384175 395956
1481 395956 342616 291483 214402 216423 306066 437307 390092 303437 282905 383042 340414
1470 340414 298445 349529 360376 380038 444054 536540 418465 278557 265546 286731 351164
1459 351164 396556 330009 331618 347478 394362 393075 345502 296343 334816 417448 370102 390897
1447 390897 402475 348674 263797 223985 289449 289656 347970 341110 251491 164059 184989 217698
$$ packed form
1528C91021l0055R200R5243k4651o3759K6175J5532J4859J18070j01704j64193
1517B85738J8294j7757J2853N5951n4613N1709O0622P2001q6872l2169N5788k7622
1505C93923n8697m5363N4417P752n4471K1224J348J9823o0572J6081N3835N159
1493C54459k9363r973K1092J4546j9233r2816o2829K7930J09785L9084L1493J1781
1481C95956n3340n1133p7081K021Q9643J31241m7215q6655k0532J00137m2628
1470C40414m1969N1084J0847J9662O4016R2486j18075j39908j3011K1185O4433
1459C51164M5392o6547J609J5860M6884j287m7573m9159L8473Q2632m7346K0795
1447C90897J1578n3801q4877l9812O5464K07N8314o860q9619q7432K0930L2709
$$ plain form
1435 217698 249446 342518 263812 220787 234366 274732 253149 223392 173341 188408 149458 140867
1423 140867 138020 83937 104553 186396 171349 144371 148783 181443 255767 228675 253461 228774
1411 228774 234904 244209 149039 118273 96228 172376 202261 159455 148798 195814 146811 222440
1399 222440 330664 335550 227823 181907 257136 219080 212328 247592 182991 160035 194082 202892
1387 202892 259757 160648 116304 114724 103432 52885 38581 85060 69881 48223 29883 4359
1375 4359 59903 145528 149837 100750 192754 192965 192026 181202 136229 114701 120827 141216 96022
1362 96022 81884 125179 127128 151218 120484 120990 104869 111171 25566 109543 152041 133010 132350
1349 132350 62159 11622 14718 82823 61848 30977 79916 164875 146644 58264 140050 141199
$$ packed form
1435B17698L1748R3072p8706m3025J3579M0366k1583k9757n0051J5067l8950q591
1423A40867k847n4083K0616Q1843j5047k6978M412L2660P4324k7092K4786k4687
1411B28774O130R305r5170l0766k2045P6148K9885m2806j0657M7016m9003P5629
1399B22440J08224M886j07727m5916P5229l8056o752L5264o4601k2956L4047Q810
1387B02892N6865r9109m4344j580j1292n0547j4304M6479j5179k1658j8340k5524
1375D359N5544Q5625M309m9087R2004K11r39j0824m4973k1528O126K0389m5194
1362I6022j4138M3295J949K4090l0734N06j6121O302q5605Q3977M2498j9031o60
1349A32350p0191n0537L096O8105k0975l0871M8939Q4959j8231q8380Q1786J149
$$ plain form
1337 141199 33029 30950 27575 26792 33851 6584 -94825 55071 135411 154724 147163 135098
1325 135098 183299 160184 128893 79602 156182 105774 77613 115176 88000 45248 62894 107515
1313 107515 72594 100547 113490 29142 78888 145070 105864 96247 44168 2716 18639 72721
1301 72721 74171 34548 71583 76811 151756 80635 79377 93561 119652 159292 61075 155026
1289 155026 116695 112376 121241 147571 74621 50407 127764 12120 -13762 33986 115203 95040
1277 95040 125540 72957 48018 93958 110709 109207 22579 69779 108363 165231 210526 99354
1265 99354 79246 67844 119576 179317 212222 209477 215405 281437 215110 180902 157441 210380
1253 210380 161813 196089 189983 174672 100950 154399 204146 223019 200304 198245 220996 200080
$$ packed form
1337A41199j08170k079l375p83P059k7267j01409J49896Q0340J9313p561j2065
1325A35098M8201k3115l1291m9291P6580n0408k8161L7563k7176m2752J7646M4621
1313A07515l4921K7953J2943q4348M9746O6182l9206r617n2079m1452J5923N4082
1301G2721J450l9623L7035N228P4945p1121j258J4184K6091L9640r8217R3951
1289A55026l8331m319Q865K6330p2950k4214P7357j15644k5882M7748Q1217k0163
1277I5040L0500n2583k4939M5940J6751j502q6628M7200L8584N6868M5295j11172
1265I9354k0108j1402N1732N9741L2905k745N928O6032o6327l4208k3461N2939
1253B10380m8567L4276o106j5311p3722N3449M9747J8873k2715k059K2751k0916
$$ plain form
1241 200080 139183 141292 94832 34294 16389 86755 104526 104903 117401 92579 85945 126889
1229 126889 57285 105601 143119 103550 94690 139883 165288 142105 41624 -10180 -13258 52625
1217 52625 76359 113059 79741 182384 218928 91768 133259 120398 172725 35384 26216
1206 26216 2904 -21332 47097 36287 45231 120219 103942 63866 41449 150493 288100 314012
1194 314012 259743 211138 113696 45810 57162 92046 111059 171552 170293 110734 81056 75938
1182 75938 107090 163436 215236 95826 17634 124676 114201 37432 6420 56209 78906
1171 78906 168141 93242 87509 182403 165134 130480 207825 165733 180772 126401 172614 195857
1159 195857 141356 240291 265505 155894 156513 111659 212823 224629 155428 201523 208449 188754
$$ packed form
1241B00080o0897K109m6460o0538j7905P0366J7771L77J2498k4822o634M0944
1229A26889o9604M8316L7518l9569q860M5193K5405k3183j00481n1804l078O5883
1217E2625K3734L6700l3318J02643L6544j27160M1491j2861N2327j37341r168
1206B6216k3312k4236O8429j0810Q944P4988j6277m0076k2417J09044J37607K5912
1194C14012n4269m8605r7442o7886J1352L4884J9013O0493j259n9559k9678n118
1182G5938L1152N6346N1800j19410p8192J07042j0475p6769l1012M9789K2697
1171G8906Q9235p4899n733R4894j7269l4654P7345m2092J5039n4371M6213K3243
1159A95857n4501R8935K5214j09611O19m4854J01164J1806o9201M6095O926j9695
$$ plain form
1147 188754 154961 168112 202617 235577 247191 216005 138547 146082 231380 231842 101665 129520
1135 129520 130544 75297 158011 233868 231545 261182 200478 210161 192409 145540 146771 179378
1123 179378 160835 200523 184311 157791 249317 343250 291253 198558 293235 334428 311233 266849
1111 266849 226474 228019 238504 244493 343272 341428 419790 383604 360200 388155 451347 365292
1099 365292 274022 342441 396568 393717 341831 382190 432789 523494 500607 503532 540381 584336
1087 584336 582043 556800 480985 522159 506763 644246 576120 494264 415010 419078 575066 684047
1075 684047 650095 590033 619905 627314 612334 665615 711475 647738 697895 675634 642786 800741
1063 800741 854849 806433 821099 807454 825932 743259 736978 746055 755921 780573 750439 846542
$$ packed form
1147A88754l3793J3151L4505L2960J1614l1186p7458P535Q5298M62j30177K7855
1135A29520J024n5247Q2714P5857k323K9637o0704R683j7752m6869J231L2607
1123A79378j8543L9688j6212k6520R1526R3933n1997r2695R4677M1193k3195m4384
1111B66849m0375J545J0485N989R8779j844P8362l6186k3404K7955O3192q6055
1099C65292r1270O8419N4127k851n1886M0359N0599R0705k2887K925L6849M3955
1087E84336k293k5243p5815M1174j5396J37483o8126q1856p9254M068J55988J08981
1075F84047l3952o0062K9872P409j4980N3281M5860o3737N0157k2261l2848J57955
1063H00741N4108m8416J4666j3645J8478q2673o281R077R866K4652l0134R6103
$$ plain form
1051 846542 836327 883044 834874 833486 853944 869557 931663 970929 993544 995836 966844 970088
1039 970088 1067194 1134345 1096295 1080248 1041270 1045301 1251392 1310175 1302018 1434685 1440558 1404241
1027 1404241 1506478 1529644 1511453 1406768 1397098 1552869 1643748 1703900 1735356 1704904 1793955
1016 1793955 1777631 1982049 2131546 2123906 2194361 2292545 2362983 2471473 2686148 2729876 2873648
1005 2873648 2953720 3070687 3272842 3438409 3542082 3677373 3831190 4119970 4377029 4747824
995 4747824 5167161 5498036 5871106 6372006 6796060 7072781 7479964 7920593 8528914 9356127
985 9356127 10391848 11807535 13554122 15620112 18479409 22125570 25129392 28306924
977 28306924 31699670 34277798 32228932 25012670 18865292 14960927 12396143 10589842
$$ packed form
1051H46542j0215M6717m8170j388K0458J5613O2106L9266K2615K292k8992L244
1039I70088R7106O7151l8050j6047l8978M031K06091N8783q157J32667N873l6317
1027A404241J02237K3166j8191j04685r670J55771R0879O0152L1456l0452Q9051
1016A793955j6324K04418J49497p640P0455R8184P0438J08490K14675M3728J43772
1005B873648Q0072J16967K02155J65567J03673J35291J53817K88780K57059L70795
995D747824M19337L30875L73070N00900M24054K76721M07183M40629O08321Q27213
985I356127J035721J415687J746587K065990K859297L646161L003822L177532
977B8306924L392746K578128k048866p216262o147378l904365k564784j806301
$$ plain form
969 10589842 9228472 8050567 7061904 6255571 5812502 5395518 4981646 4681511 4515843
960 4515843 4249884 3965111 3636192 3310088 3022461 2865950 2731636 2516228 2420595 2308428
950 2308428 2201536 2102592 2044567 1950566 1929407 1833511 1663841 1605041 1515047 1431843 1382547
939 1382547 1306086 1197470 1174069 1050808 972368 1068463 1058138 1002915 972318 988911 931981
928 931981 869525 875365 880017 855671 795303 890041 882658 804237 826623 786289 723924 714910 630396
915 630396 591855 565395 587006 636492 549287 579536 622378 551228 558287 556514 596604 633377
903 633377 636240 537027 506504 503016 467031 497470 456045 447562 501942 443667 408472 370949
891 370949 370385 296526 275149 410415 428760 404242 302907 340789 340061 270129 172497 224642
$$ packed form
969A0589842j361370j177905r88663q06333m43069m16984m13872l00135j65668
960D515843k65959k84773l28919l26104k87627j56511j34314k15408r5633j12167
950B308428j06892r8944n8025r4001k1159r5896j69670n8800q9994q3204m9296
939A382547p6461j08616k3401j23261p8440R6095j0325n5223l0597J6593n6930
928I31981o2456N840M652k4346o0368R4738p383p8421K2386m0334o2365r014q4514
915F30396l8541k6460K1611M9486q7205L0249M2842p1150P059j773M0090L6773
903F33377K863r9213l0523l488l5985L0439m1425q483N4380n8275l5195l7523
891C70949n64p3859k1377J35266J8345k4518j01335L7882p28o9932r7632N2145
$$ plain form
879 224642 184705 139976 108193 132833 215515 312690 306542 332764 277780 270426 280217 289802 227233
866 227233 206709 187347 227771 242469 217210 249653 261302 292521 175182 266181 274126 275613
854 275613 260812 190749 197902 183684 118306 115362 178432 164328 175280 100942 118790 207757
842 207757 185363 135736 91319 71830 181104 187891 142985 52368 36545 37639 107753 193334
830 193334 236077 171460 132380 174013 159201 46833 -46862 1621 3469 -7146 74836 16576
818 16576 778 27246 1489 13258 138235 185541 70193 63262 89929 80618 44304 19201
806 19201 -67704 -21859 -2793 -10461 77940 31729 -3201 57471 -20982 -37514 -47898 -19737
794 -19737 98743 80855 76297 153595 143698 102240 81593 109159 39452 -81209 -20949 -30302
$$ packed form
879B24642l9937m4729l1783K4640Q2682R7175o148K6222n4984p354R791R585o2569
866B27233k0524j9362M0424J4698k5259L2443J1649L1219j17339R0999P945J487
854B75613j4801p0063P153j4218o5378k944O3070j4104J0952p4338J7848Q8967
842B07757k2394m9627m4417j9489J09274O787m4906r0617j5823J094P0114Q5581
830A93334M2743o4617l9080M1633j4812j12368r3695M8483J848j0615Q1982n8260
818A6576j5798K6468k5757J1769J24977M7306j15348o931K6667r311l6314k5103
806A9201q6905M5845J9066p668Q8401m6211l4930O0672p8453j6532j0384K8161
794a9737J18480j7888m558P7298r897m1458k0647K7566o9707j20661O0260r353
$$ plain form
782 -30302 21808 60219 38894 -5462 -5729 102797 92517 141540 60411 -58661 -34318 42617
770 42617 71131 63071 5864 -303 -81912 32648 22787 -102136 -51500 -122555 -178881 -70357
758 -70357 -128245 -96760 -64741 -62544 -27961 -48873 -65996 -90463 -31354 30932 44309 38951
746 38951 13957 101099 164336 47330 25951 144351 154718 82745 115735 55907 33036 10642
734 10642 -51578 -3935 -4427 -50802 -54237 -18136 18057 -45453 -63639 -28925 -37014 -57230 -91
721 -91 28759 37361 51231 26947 -12422 -44627 -30919 33155 110270 48562 -45538 -99181 -21596
708 -21596 29863 -19080 -95696 -73055 21608 63856 28688 -5028 -55584 40741 -104 -66155
696 -66155 -37570 13688 50046 90169 141413 170554 179602 110120 62687 71577 10264 -72239
$$ packed form
782c0302N2110L8411k1325m4356k67J08526j0280M9023q1129j19072K4343P6935
770D2617K8514q060n7207o167q1609J14560r861j24923N0636p1055n6326J08524
758g0357n7888L1485L2019K197L4583k0912j7123k4467N9109O2286J3377n358
746C8951k4994Q7142O3237j17006k1379J18400J0367p1973L2990n9828k2871k2394
734A0642o2220M7643m92m6375l435L6101L6193o3510j8186L4714q089k0216N7139
721i1K8850Q602J3870k4284l9369l2205J3708O4074P7115o1708r4100n3643P7585
708b1596N1459m8943p6616K2641R4663M2248l5168l3716n0556R6325m0845o6051
696f6155K8585N1258L6358M0123N1244K9141R048o9482m7433Q890o1313q2503
$$ plain form
684 -72239 -73421 -9864 59997 80191 67820 -5115 19683 97727 60386 -6667 -1170 44388
672 44388 60325 -41923 -54902 -43187 -55488 -41267 -10422 -79947 -129819 72 -116682
661 -116682 -70070 58836 102878 148944 40654 -87048 -102846 -111561 -43482 -19613 -28962 44285
649 44285 -73031 -3359 -11007 -49110 -30696 120660 82487 -19828 -52559 -3080 -8269 -14058
637 -14058 -90648 -73991 -65089 -44238 -1310 920 8810 13274 11563 41668 -117025 -106810 -45733
624 -45733 -54921 -84379 -104138 -53657 -33037 -115849 -46936 -19477 12611 17276 -38350 12446
612 12446 -8085 -42753 -168778 -146199 -49877 -46054 -84370 -80161 -115023 -88029 -50062 -117281
600 -117281 -78610 14947 -9843 -26648 10831 2114 35351 111880 22965 -125465 -122223 -11684
$$ packed form
684g2239j182O3557O9861K0194j2371p2935K4798P8044l7341o7053N497M5558
672D4388J5937j02248j2979J1715j2301J4221L0845o9525m9872J29891j16754
661a16682M6612J28906M4042M6066j08290j27702j5798q715O8079K3869r349P3247
649D4285j17316O9672p648l8103J8414J51356l8173j02315l2731M9479n189n789
637a4058p6590J6657Q902K0851M2928K230P890M464j711L0105j58693J0215O1077
624d5733r188k9458j9759N0481K0620q2812O8913K7459L2088M665n5626N0796
612A2446k0531l4668j26025K2579R6322L823l8316M209l4862K6994L7967o7219
600a17281L8671R3557k4790j6805L7479q717L3237P6529q8915j48430L242J10539
$$ plain form
588 -11684 -49042 -68535 -75939 -54607 -9790 -37155 -17460 18123 -24068 6669 -83740 63227
576 63227 45015 -444 -67308 -95873 -8859 -5581 -23276 -99970 -105305 -76210 -59718 -109365
564 -109365 -99934 -103346 -82606 -101963 -95788 -128269 -199097 -132753 -136304 -153313 -108352 -101115 -36373
551 -36373 26673 -59667 -57035 -27246 18426 24119 11556 34844 19758 -116193 -79606 -51254
539 -51254 -5706 -20149 -123000 -77025 -6916 -32422 -110598 -108949 14146 25154 -88919 -149090
527 -149090 -122236 -89214 -17156 10446 -56735 -106527 -123971 -124215 -161444 -199068 -203189 -115590
515 -115590 -96861 -49891 17768 -127633 -137993 -24350 -20566 -24642 -146172 -140887 -122850 -77305
503 -77305 -26237 -111884 -139282 -18751 -46617 -139894 -159043 -182129 -176495 -142369 -67991 18911
$$ packed form
588a1684l7358j9493p404K1332M4817k7365J9695L5583m2191L0737r0409J46967
576F3227j8212m5459o6864k8565Q7014L278j7695p6694n335K9095J6492m9647
564a09365R431l412K0740j9357O175l2481p0828O6344l551j7009M4961P237O4742
551c6373O3046q6340K632K9789M5672N693j2563K3288j5086j35951L6587K8352
539e1254M5548j4443j02851M5975P0109k5506p8176J649J23095J1008j14073o0171
527a49090K6854L3022P2058K7602o7181m9792j7444k44l7229l7624m121Q7599
515a15590J8729M6970O7659j45401j0360J13643L784m076j21530N285J8037M5545
503g7305N1068q5647k7398J20531k7866r3277j9149k3086N634L4126P4378Q6902
$$ plain form
491 18911 -17640 -80617 -117171 -125294 -66823 -5962 7123 -47130 -9951 40941 28038 -41612
479 -41612 -118233 -165206 -68732 -100494 -80436 -50130 -73986 -63847 -160676 -168563 -119899 -94182
467 -94182 -108708 -165507 -129520 -132028 -151447 -112596 -118922 -198066 -183294 -170995 -237223 -205896
455 -205896 -76689 -75450 -93321 -59152 -10211 -33947 -41738 -137453 -142989 -133595 -89260 -111362
443 -111362 -113627 -72218 -141110 -177399 -182381 -26101 -61114 52472 -6176 -55454 -106824 -47117
431 -47117 -60659 -127924 -81332 -56978 -58693 -32768 -58306 -104655 -129304 -50104 -165168 -174993
419 -174993 -119485 -153940 -193703 -218287 -179182 -191340 -148050 -126916 -106848 -46238 -50695 -80107
407 -80107 -201415 -193227 -180880 -152344 -170522 -123678 -49171 -62494 -102034 -68469 -58198 -1132
$$ packed form
491A8911l6551o2977l6554q123N8471O0861J3085n4253L7179N0892j2903o9650
479d1612p6621m6973R6474l1762K0058L0306k3856J0139r6829p887M8664K5717
467i4182j4526n6799L5987k508j9419L8851o326p9144J4772J2299o6228L1327
455b05896J29207J239j7871L4169M8941k3736p791r5715n536R394M4335k2102
443a11362k265M1409o8892l6289m982J56280l5013J13586n8648m9278n1370N9707
431d7117j3542o7265M6592K4354j715K5925k5538m6349k4649P9200j15064r825
419a74993N5508l4455l9763k4584L9105j2158M3290K1134K0068O0610m457k9412
407h0107j21308Q188J2347K8536j8178M6844P4507j3323l9540L3565J0271N7066
$$ plain form
395 -1132 -76091 -77119 -58473 -175672 -124035 -106127 3267 18742 -50902 -94993 -32354 -20470
383 -20470 -39316 -61065 -129002 -157895 -68808 -4380 -29741 -95871 -85658 -38256 -39405 -52540
371 -52540 -60140 -168335 -118639 -66879 -64484 -145981 -101670 -96365 -134823 -107920 -112235 -128272 39476
358 39476 43235 1204 -4064 -37402 -68254 -122120 -89420 -209854 -210796 -155202 -145088 -127010 -144099
345 -144099 -143726 -140019 -151633 -173558 -216067 -158024 -83057 -44739 -31614 -51903 -130323 -146318
333 -146318 -144130 -248680 -177162 -18513 -144946 -198391 -129005 -191564 -186072 -151982 -121594 -145710
321 -145710 -134368 -232645 -178370 -102908 -172020 -178624 -70780 -107454 -157564 -185441 -77341 -64421
309 -64421 -74426 16880 72807 -8528 -3637 -51653 -100128 -72376 -139533 -108234 -113360 -171645
$$ packed form
395a132p4959j028J8646j17199N1637J7908J09394J5475o9644m4091O2639J1884
383b0470j8846k1749o7937k8893Q9087O4428k5361o6130J0213M7402j149j3135
371e2540p600j08195M9696N1760K395q1497M4311N305l8458K6903m315j6037J67748
358C9476L759m2031n268l3338l0852n3866L2700j20434r42N5594J0114J8078j7089
345a44099L73L707j1614k1925m2509N8043P4967L8318J3125k0289p8420j5995
333a46318K188j04550P1518J58649j26433n3445O9386o2559N492L4090L0388k4116
321a45710J1342r8277N4275P5462o9112o604J07844l6674n0110k7877J08100J2920
309f4421j0005R1306N5927q1335M891m8016m8475K7752o7157L1299n126n8285
$$ plain form
297 -171645 -134144 -110746 -104668 -96788 -196339 -152120 -152492 -170603 -145978 -122895 -140346 -140260 -61170
284 -61170 -92699 -100726 -67434 -170222 -163791 -71562 -169403 -125933 -37260 -63452 -183521 -198430
272 -198430 -178492 -220570 -91217 -34351 -23873 -83395 -75785 -88120 -140819 -161584 -139948 -128655
260 -128655 -201135 -193534 -133463 -218568 -225935 -190921 -161297 -133482 -141426 -138903 -174599 -182403 -70942
247 -70942 -6797 -93755 -232806 -210230 -263406 -133045 -93613 -149491 -184309 -135241 -87792 -214519
235 -214519 -273282 -183137 -108116 -94960 -141068 -190484 -183370 -198346 -245279 -217997 -215827 -187866
223 -187866 -245426 -260752 -227159 -210209 -173114 -172997 -142074 -52396 -63290 -185462 -218857 -146291
211 -146291 -83428 -119410 -144796 -182114 -211927 -105597 -147354 -175678 -152335 -221964 -142030 -110999
$$ packed form
297a71645L7501K3398O078P880r9551M4219l72j8111K4625K3083j7451Q6P9090
284f1170l1529q027L3292j02788O431R2229r7841M3470Q8673k6192j20069j4909
272a98430J9938m2078J29353N6866J0478n9522P610j2335n2699k0765K1636J1293
260a28655p2480P601O0071q5105p367L5014K9624K7815p944K523l5696p804J11461
247g0942O4145q6958j39051K2576n3176J30361L9432n5878l4818M9068M7449j26727
235b14519n8763R0145P5021J3156m6108m9416P114j4976m6933K7282K170K7961
223a87866n7560j5326L3593J6950L7095J17L0923Q9678j0894j22172l3395P2566
211a46291O2863l5982k5386l7318k9813J06330m1757k8324K3343o9629P9934L1031
$$ plain form
199 -110999 -75698 -141951 -105034 -60480 -70324 -116293 -71645 -83133 -133247 -110293 -131686 -173321
187 -173321 -151296 -120906 -181247 -81536 -96804 -161486 -176892 -175642 -166889 -122331 -43168 -100402
175 -100402 -107394 -152457 -160387 -229422 -199769 -92945 -145876 -253264 -171157 -143423 -91091 -114263
163 -114263 -146251 -208609 -195962 -107280 -180278 -175622 -151095 -192104 -134008 -123111 -178675 -258735
151 -258735 -335017 -275123 -281991 -235105 -218839 -230023 -206206 -224111 -191806 -101155 -146016 -206726
139 -206726 -246961 -119911 -175018 -186412 -202165 -185873 -159374 -111700 -43511 -63429 -69766 -122233
127 -122233 -178533 -160177 -220808 -230913 -181494 -232847 -223433 -240514 -188746 -195496 -169184 -268822
115 -268822 -187434 -70417 -162031 -184425 -195554 -223797 -241979 -284741 -204383 -193681 -184679 -185011
$$ packed form
199a10999L5301o6253L6917M4554r844m5969M4648j1488n0114K2954k1393m1635
187a73321K2025L0390o0341R9711j5268o4682j5406J250Q753M4558P9163n7234
175a00402o992m5063p930o9035K9653J06824n2931j07388Q2107K7734N2332k3172
163a14263l1988o2358J2647Q8682p2998M656K4527m1009N8096J0897n5564q0060
151b58735p6282N9894o868M6886J6266j1184K3817j7905L2305R0651m4861o0710
139b06726m0235J27050n5107j1394j5753J6292K6499M7674O8189j9918o337n2467
127a22233n6300J8356o0631j0105M9419n1353R414j7081N1768o750K6312r9638
115b68822Q1388J17017r1614k2394j1129k8243j8182m2762Q0358J0702R002l32
$$ plain form
103 -185011 -237912 -268110 -288963 -260785 -274320 -242585 -167012 -201719 -238619 -215169 -209224 -194185
91 -194185 -243265 -274668 -272911 -236075 -240077 -265636 -223363 -319125 -241598 -212899 -229910 -206458
79 -206458 -225488 -208343 -241111 -222748 -141873 -163148 -206993 -249896 -174276 -115382 -174009 -153137
67 -153137 -156239 -149782 -150038 -216737 -273017 -206608 -234516 -240291 -176758 -188442 -212674 -196375 -183531
54 -183531 -162205 -179903 -197399 -225592 -198007 -221994 -257816 -186101 -229558 -226655 -212350 -216750
42 -216750 -130662 -215990 -204979 -265384 -239421 -249555 -247257 -119947 -157997 -103183 -167187 -204663
30 -204663 -215759 -192505 -181366 -201876 -262467 -284503 -236455 -217993 -176295 -161584 -182604 -215725
18 -215725 -199945 -203758 -249541 -225725 -161855 -166022 -216597 -250370 -239711 -302391 -308932 -292738 -288896
$$ packed form
103a85011n2901l0198k0853K8178j3535L1735P5573l4707l6900K3450N945J5039
91a94185m9080l1403J757L6836m002k5559M2273r5762P7527K8699j7011K3452
79b06458j9030J7145l2768J8363Q0875k1275m3845m2903P5620N8894n8627K0872
67a53137l102O457k56o6699n6280O6409k7908n775O3533j1684k4232J6299J2844
54a83531K1326j7698j7496k8193K7585k3987l5822P1715m3457K903J4305m400
42b16750Q6088q5328J1011o0405K5963j0134K298J27310l8050N4814o4004l7476
30b04663j1096K3254J1139k0510o0591k2036M8048J8462M1698J4711k1020l3121
18b15725J5780l813m5783K3816O3870m167n0575l3773J0659o2680o541J6194L842
$$ plain form
5 -288896 -240372 -234984 -256232 -246821 -269953
0 -269953
$$ packed form
5b88896M8524N388k1248R411k3132
0b69953
$$ Imaginary data points
##PAGE= N=2
##DATA TABLE= (X++(I..I)), XYDATA
$$ plain form
16383 -4864723 -4876955 -4833671 -4694858 -4679767 -4642271 -4627708 -4567636 -4473469 -4421750 -4368701 -4325741
16372 -4325741 -4262752 -4238246 -4117388 -4056834 -4110863 -4045931 -3965844 -3928715 -3840112 -3711535 -3586657
16361 -3586657 -3565463 -3530072 -3477885 -3525552 -3528846 -3418134 -3347342 -3259465 -3194899 -3189804 -3120683
16350 -3120683 -3144939 -3107517 -3051744 -2932052 -2873812 -2777633 -2674429 -2663878 -2579101 -2561159 -2496993
16339 -2496993 -2498454 -2471421 -2388013 -2330013 -2271593 -2263713 -2220011 -2136564 -2108507 -2056169 -1973503 -1958039
16327 -1958039 -1891423 -1798036 -1808948 -1724844 -1658778 -1545846 -1458256 -1513620 -1460797 -1422784 -1361839
16316 -1361839 -1276232 -1279075 -1295767 -1271154 -1248620 -1206549 -1111896 -1042885 -1064464 -988352 -856584
16305 -856584 -758626 -764755 -756863 -763197 -701037 -610178 -588114 -555930 -471857 -411320 -414422 -345783
$$ packed form
16383d864723j2232M3284J38813J5091L7496J4563O0072R4167N1719N3049M2960
16372d325741O2989K4506J20858O0554n4029O4932Q0087L7129Q8603J28577J24878
16361c586657K1194L5391N2187m7667l294J10712P0792Q7877O4566N095O9121
16350c120683k4256L7422N5773J19692N8240R6179J03204J0551Q4777J7942O4166
16339b496993j461K7033Q3408N8000N8420P880M3702Q3447K8057N2338Q2666J5464
16327a958039O6616R3387j0912Q4104O6066J12932Q7590n5364N2823L8013O0945
16316a361839Q5607k843j6692K4613K2534M2071R4653O9011k1579P6112J31768
16305h56584R7958o129P892o334O2160R0859K2064L2184Q4073O0537l102O8639
$$ plain form
16293 -345783 -278763 -235327 -206109 -117513 -44788 -85651 -118102 -42942 62432 107571 73821
16282 73821 90515 148964 262840 264916 350773 409757 439396 409037 529977 629917 586978
16271 586978 575456 658419 687172 779741 789157 865209 901187 938100 967387 922343 1021473 1047441
16259 1047441 1089475 1028131 1095140 1189804 1216992 1210740 1274751 1318023 1314630 1371301 1356646 1418739
16247 1418739 1437109 1493666 1492060 1502082 1634896 1618081 1621981 1673461 1687149 1702273 1714790
16236 1714790 1665155 1741590 1805406 1877669 1851641 1924790 1966030 1846613 1892051 1904327 2017341
16225 2017341 2063700 2054500 2072078 2082234 2212929 2215907 2147985 2101480 2190060 2272202 2360301
16214 2360301 2397296 2298202 2277939 2392225 2448849 2463460 2492880 2538032 2499777 2599118 2568493
$$ packed form
16293c45783O7020M3436K9218Q8596P2725m0863l2451P5160J05374M5139l3750
16282G3821J6694N8449J13876K076Q5857N8984K9639l0359J20940R9940m2939
16271E86978j1522Q2963K8753R2569R416P6052L5978L6913K9287m5044R9130K5968
16259A047441M2034o1344O7009R4664K7188o252O4011M3272l393N6671j4655O2093
16247A418739J8370N6557j606J0022J32814j6815L900N1480J3688J5124J2517
16236A714790m9635P6435O3816P2263k6028P3149M1240j19417M5438J2276J13014
16225B017341M6359r200J7578J0156J30695K978o7922m6505Q8580Q2142Q8099
16214B360301L6995r9094k0263J14286N6624J4611K9420M5152l8255R9341l0625
$$ plain form
16203 2568493 2588176 2551003 2594023 2732876 2621239 2578731 2614583 2700130 2772643 2732280 2691030
16192 2691030 2742909 2761578 2814799 2827350 2874568 2795555 2896751 2927705 2948610 3005202 2878287
16181 2878287 2895914 2985665 2990835 3001837 3082014 3054581 3008382 3033073 3070597 3053455 3063211 3076982
16169 3076982 3096653 3120850 3047161 3060447 3086127 3082899 3183362 3186697 3244796 3333692 3332271 3286865
16157 3286865 3245499 3240215 3279009 3292003 3370185 3392606 3350968 3315289 3378016 3428580 3418963 3445931
16145 3445931 3416285 3425590 3466590 3470218 3485020 3454084 3412009 3374169 3343126 3358978 3467636
16134 3467636 3512688 3519059 3494581 3481860 3441910 3467427 3474247 3502635 3593772 3647679 3633427 3576286
16122 3576286 3578784 3640339 3577778 3563386 3632525 3601332 3545353 3562662 3593267 3546098 3534260
$$ packed form
16203B568493J9683l7173M3020J38853j11637m2508L5852Q5547P2513m0363m1250
16192B691030N1879J8669N3221J2551M7218p9013J01196L0954K0905N6592j26915
16181B878287J7627Q9751N170J1002Q0177k7433m6199K4691L7524j7142R756J3771
16169C076982J9671K4197p3689J3286K5680l228J00463L335N8099Q8896j421m5406
16157C286865m1366n284L8794J2994P8182K2421m1638l5679O2727N0564r617K6968
16145C445931k9646R305M1000L628J4802l0936m2075l7840l1043J5852J08658
16134C467636M5052O371k4478j2721l9950K5517O820K8388R1137N3907j4252n7141
16122C576286K498O1555o2561j4392O9139l1193n5979J7309L0605m7169j1838
$$ plain form
16111 3534260 3577305 3718991 3684419 3662428 3687137 3704193 3688786 3723442 3714577 3673539 3687590
16100 3687590 3738822 3714583 3809437 3768932 3693375 3629665 3697716 3640618 3609271 3637405 3592947
16089 3592947 3636104 3677768 3757733 3707118 3688547 3730335 3711226 3778307 3782709 3913083 3899403
16078 3899403 3814617 3701779 3703300 3818184 3797568 3788996 3827209 3791108 3747614 3784806 3667105
16067 3667105 3682850 3844198 3842630 3811463 3797880 3795643 3810300 3788887 3810436 3789074 3800144
16056 3800144 3926253 3879336 3771516 3770430 3749837 3726136 3722375 3785452 3791979 3889863 3818576
16045 3818576 3747511 3824595 3846309 3916853 3886170 3761397 3792508 3832303 3863117 3819039 3755041
16034 3755041 3722083 3758531 3717936 3715162 3751601 3756353 3794479 3834708 3850716 3875492 3822007 3865473
$$ packed form
16111C534260M3045J41686l4572k1991K4709J7056j5407L4656q865m1038J4051
16100C687590N1232k4239R4854m0505p5557o3710O8051n7098l1347K8134m4458
16089C592947M3157M1664P9965n0615j8571M1788j9109O7081M402J30374j3680
16078C899403q4786j12838J521J14884k0616q572L8213l6101m3494L7192j17701
16067C667105J5745J61348j568l1167j3583k237J4657k1413K1549k1362J1070
16056C800144J26109m6917j07820j086k0593k3701l761O3077O527R7884p1287
16045C818576p1065P7084K1714P0544l0683j24773L1111L9795L0814m4078o3998
16034C755041l2958L6448m0595k774L6439M752L8126M0229J6008K4776n3485M3466
$$ plain form
16022 3865473 3814386 3746944 3796560 3851402 3831582 3737368 3730874 3728630 3681798 3756992 3818455 3889928
16010 3889928 3831157 3796605 3831457 3844816 3966067 3937692 3872607 3924254 3861947 3909636 3907572
15999 3907572 3797691 3773001 3789732 3768055 3818706 3785588 3764101 3850036 3798704 3874992 3886678
15988 3886678 3919480 3936990 3794234 3752874 3786093 3775053 3835206 3862039 3834840 3786657 3790066
15977 3790066 3860984 3849715 3712502 3839934 3835262 3836457 3904356 3865928 3799516 3829735 3855850
15966 3855850 3894126 4033838 3956970 3944271 3875895 3905015 3972754 3931879 3865751 3766107 3718262
15955 3718262 3715609 3814999 3903753 3998056 3941855 3999823 3869363 3868449 3808845 3802390 3860453 3870578
15943 3870578 3942210 4048381 3938282 3798972 3842750 3812168 3820240 3791851 3791734 3761183 3759124
$$ packed form
16022C865473n1087o7442M9616N4842j9820r4214o494k244m6832P5194O1463P1473
16010C889928n8771l4552L4852J3359J21251k8375o5085N1647o2307M7689k064
15999C907572j09881k4690J6731k1677N0651l3118k1487Q5935n1332P6288J1686
15988C886678L2802J7510j42756m1360L3219j1040O0153K6833k7199m8183L409
15977C790066P0918j1269j37213J27432m672J195O7899l8428o6412L0219K6115
15966C855850L8276J39712p6868j2699o8376K9120O7739m0875o6128r9644m7845
15955C718262k653R9390Q8754R4303n6201N7968j30460r14n9604o455N8063J0125
15943C870578P1632J06171j10099j39310M3778l0582Q072k8389j17l0551k059
$$ plain form
15932 3759124 3832179 3937966 3921576 3887656 3884971 3860603 3828380 3820314 3808760 3886120 3856981
15921 3856981 3829324 3813598 3789708 3920943 3928338 3947682 4035206 3942102 3888618 3853785 3898875
15910 3898875 3889363 3946726 3956963 3911838 3827236 3846704 3885200 3900490 3929325 3966994 3925833
15899 3925833 3853403 3885662 3916513 3839815 3875786 3879719 3877812 3898960 3877591 3939568 3938700 3842979
15887 3842979 3826907 3838710 3881665 3862428 3882050 3873448 3875997 3908423 3925383 3894368 3915932 3913531
15875 3913531 3890310 3883577 3823147 3912329 3923865 3853847 3860247 3915592 3856115 3943866 3995396 3983352
15863 3983352 3879070 3921126 3983452 3954433 3947047 3869527 3802523 3755452 3870203 3852621 3889110
15852 3889110 3879990 3843137 3839457 3852790 3895102 3909893 3964105 3852896 3937559 3960717 3953565 3960191
$$ packed form
15932C759124P3055J05787j6390l3920k685k4368l2223q066j1554P7360k9139
15921C856981k7657j5726k3890J31235P395J9344Q7524r3104n3484l4833M5090
15910C898875r512N7363J0237m5125q4602J9468L8496J5290K8835L7669m1161
15899C925833p2430L2259L0851p6698L5971L933j907K1148k1369O1977q68r5721
15887C842979j6072J1803M2955j9237J9622q602K549L2426J6960l1015K1564k401
15875C913531k3221o733o0430Q9182J1536p0018O400N5345n9477Q7751N1530j2044
15863C983352j04282M2056O2326k9019p386p7520o7004m7071J14751j7582L6489
15852C889110r120l6853l680J3333M2312J4791N4212j11209Q4663K3158p152O626
$$ plain form
15840 3960191 3970361 3921741 3874138 3890272 3936427 3903630 3836655 3821028 3853943 3926299 4029777
15829 4029777 4024592 4018816 3988339 3958214 3941835 3977417 3925475 3803464 3938341 3995354 3992664
15818 3992664 3998875 3876802 3990032 3965024 3889678 3863343 3822863 3773398 3792234 3811483 3823324
15807 3823324 3896159 3816096 3814718 3903480 3900263 3927003 3922070 3923315 3998734 3917655 3919783 3908216
15795 3908216 3919178 3898478 3904238 3901486 3875733 3986999 3863358 3861496 3951463 3920857 3997734
15784 3997734 3889155 3913022 3919916 3923519 3898221 3966877 3882346 3894492 3945833 3871501 3868084 3867928
15772 3867928 3823641 3865761 3976869 3980484 4018509 4022787 3998127 3942324 3961004 3905368 3909695 3877039
15760 3877039 3997279 3986611 3995351 3971329 3912483 3916882 3972045 3974762 3955869 4036545 3991367 3919343
$$ packed form
15840C960191J0170m8620m7603J6134M6155l2797o6975j5627L2915P2356J03478
15829D029777n185n776l0477l0125j6379L5582n1942j22011J34877N7013k690
15818C992664O211j22073J13230k5008p5346k6335m0480m9465J8836J9249J1841
15807C823324P2835q0063j378Q8762l217K6740m933J245P5419q1079K128j1567
15795C908216J0962k0700N760k752k5753J11266j23641j862Q9967l0606P6877
15784C997734j08579K3867O894L603k5298O8656q4531J2146N1341p4332l417j56
15772C867928m4287M2120J11108L615L8025M278k4660n5803J8680n5636M327l2656
15760C877039J20240j0668Q740k4022n8846M399N5163K717j8893Q0676m5178p2024
$$ plain form
15748 3919343 3900544 3905940 3994849 3961921 3964694 3945410 3953257 3876129 3804098 3885408 3932173 3998223
15736 3998223 3941606 3946177 3827788 3829030 3842042 3952665 3972379 3942625 3819944 3901900 3931310
$$ packed form
15748C919343j8799N396Q8909l2928K773j9284P847p7128p2031Q1310M6765O6050
15736C998223n6617M571j18389J242J3012J10623J9714k9754j22681Q1956K9410
$$ [...]
##END NTUPLES=NMR SPECTRUM
##END=
