##TITLE=1H_EC-2323
 CDCl3,8 sc, 
 30.03.2021
##JCAMPDX= 6.0         $$ Bruker NMR JCAMP-DX V2.0
##DATA TYPE= NMR SPECTRUM
##DATA CLASS= NTUPLES
##ORIGIN= UXNMR, Bruker Analytische Messtechnik GmbH
##OWNER= root
$$ XWIN-NMR		Version 3.5
$$ Tue Mar 30 10:16:17 2021 Russian Standard Time (UT+4h)  she@DPX200
##.OBSERVE FREQUENCY= 200.131506
##.OBSERVE NUCLEUS= ^1H
##.ACQUISITION MODE= SIMULTANEOUS
##.ACQUISITION SCHEME= undefined
##.AVERAGES= 8
##.DIGITISER RES= 18
##SPECTROMETER/DATA SYSTEM= spect
##.PULSE SEQUENCE= zg30
##.SOLVENT NAME= D2O
##.SHIFT REFERENCE= (INTERNAL, D2O, 0, 15.974)
##AUDIT TRAIL= $$ (NUMBER, WHEN, WHO, WHERE, WHAT)
$$ ##TITLE= Audit trail, XWIN-NMR		Version 3.5
$$ ##JCAMPDX= 5.01
$$ ##ORIGIN= Bruker BioSpin GmbH
$$ ##OWNER= she
$$ F:/spectra/data/she/nmr/H-F/1/pdata/1/auditp.txt
$$ ##AUDIT TRAIL=  $$ (NUMBER, WHEN, WHO, WHERE, WHAT)
(   1,<2021-03-30 10:14:32.04 +0400>,<she>,<DPX200>,
      <created by zg, POWCHK disabled, PULCHK disabled
       configuration hash MD5:
       00 E9 B6 7A A2 85 ED C7 34 08 36 98 17 FE 4E 26
       data hash MD5: 16K
       2F 85 6B 0A C2 69 ED 23 6A 8F 89 19 5A CF 5D 9A>)
(   2,<2021-03-30 10:14:36.20 +0400>,<she>,<DPX200>,
      <Start of raw data processing
       efp BC_mod = 2 LB = 0.24 FT_mod = 6 PKNL = 1 PHC0 = -11122.85 PHC1 = 17.40094 SI = 16K 
       data hash MD5: 16K
       E0 1C 04 53 31 D2 41 C2 2F 5A 6E 5C A3 58 C0 6B>)
(   3,<2021-03-30 10:14:52.14 +0400>,<she>,<DPX200>,
      <pk PHC0 = 3.761675 PHC1 = -4.6 
       data hash MD5: 16K
       A1 5B EB 15 C8 F6 F4 4F 17 EE A2 D4 2B 28 2B 3E>)
(   4,<2021-03-30 10:14:55.15 +0400>,<she>,<DPX200>,
      <abs ABSG = 5 
       data hash MD5: 16K
       34 67 88 CE 8E AA 0A 7A 41 95 2B E8 8F 46 6B CD>)
$$ ##END=
$$ 
$$ hash MD5
$$ 00 D7 4F DA 86 A6 94 94 4D C0 3C 18 A0 55 4B AC
##$RELAX= 
##$RELAX= 
##$RELAX= 
##$RELAX= 
##$RELAX= 
##$RELAX= 
$$ Bruker specific parameters
$$ --------------------------
##$DU= <F:/spectra>
##$EXPNO= 1
##$NAME= <H-F>
##$PROCNO= 1
##$TYPE= <nmr>
##$USER= <she>
##$AMP= (0..31)
100 100 100 100 100 100 100 100 100 100 100 100 100 100 100 100 100 100 
100 100 100 100 100 100 100 100 100 100 100 100 100 100 
##$AQSEQ= 0
##$AQ_mod= 1
##$AUNM= <au_zg>
##$AUTOPOS= <>
##$BF1= 200.13
##$BF2= 200.13
##$BF3= 200.13
##$BF4= 200.13
##$BF5= 200.13
##$BF6= 200.13
##$BF7= 200.13
##$BF8= 200.13
##$BYTORDA= 1
##$CFDGTYP= 0
##$CFRGTYP= 5
##$CHEMSTR= <none>
##$CNST= (0..31)
1 1 145 1 1 1 1 1 1 1 1 1 1 1 1 1 1 1 1 1 1 1 1 1 1 1 1 1 1 1 1 1 
##$CPDPRG= <>
##$CPDPRG1= <>
##$CPDPRG2= <>
##$CPDPRG3= <>
##$CPDPRG4= <mlev>
##$CPDPRG5= <mlev>
##$CPDPRG6= <mlev>
##$CPDPRG7= <mlev>
##$CPDPRG8= <mlev>
##$CPDPRGB= <>
##$CPDPRGT= <>
##$D= (0..31)
0 1.2 0 0 0 0 0 0 0 0.06 0 0.03 0 0 0 0 0.0002 0 0 0 0 0 0 0 0 0 0 0 0 
0 0 0 
##$DATE= 1617084871
##$DBL= (0..7)
120 120 120 120 120 120 120 120 
##$DBP= (0..7)
150 150 150 150 150 150 150 150 
##$DBP07= 0
##$DBPNAM0= <>
##$DBPNAM1= <>
##$DBPNAM2= <>
##$DBPNAM3= <>
##$DBPNAM4= <>
##$DBPNAM5= <>
$$ [...]
##$SUBNAM3= <"">
##$SUBNAM4= <"">
##$SUBNAM5= <"">
##$SUBNAM6= <"">
##$SUBNAM7= <"">
##$SUBNAM8= <"">
##$SUBNAM9= <"">
##$SW= 16.9725357007746
##$SWIBOX= (0..15)
0 0 2 0 0 0 0 0 0 0 0 0 0 0 0 0 
##$SW_h= 3396.73913043478
##$TD= 16384
##$TD0= 1
##$TE= 0
##$TE2= 300
##$TE3= 300
##$TEG= 300
##$TL= (0..7)
0 120 120 120 120 120 120 120 
##$TP= (0..7)
150 150 150 150 150 150 150 150 
##$TP07= 0
##$TPNAME0= <>
##$TPNAME1= <>
##$TPNAME2= <>
##$TPNAME3= <>
##$TPNAME4= <>
##$TPNAME5= <>
##$TPNAME6= <>
##$TPNAME7= <>
##$TPOAL= (0..7)
0.5 0.5 0.5 0.5 0.5 0.5 0.5 0.5 
##$TPOFFS= (0..7)
0 0 0 0 0 0 0 0 
##$TUNHIN= 0
##$TUNHOUT= 0
##$TUNXOUT= 0
##$USERA1= <user>
##$USERA2= <user>
##$USERA3= <user>
##$USERA4= <user>
##$USERA5= <user>
##$V9= 5
##$VALIST= <valist>
##$VCLIST= <CCCCCCCCCCCCCCC>
##$VD= 0
##$VDLIST= <DDDDDDDDDDDDDDD>
##$VPLIST= <PPPPPPPPPPPPPPP>
##$VTLIST= <TTTTTTTTTTTTTTT>
##$WBST= 1024
##$WBSW= 4
##$XGAIN= (0..3)
0 0 0 0 
##$XL= 0
##$YL= 0
##$YMAX_a= 180106
##$YMIN_a= -152929
##$ZGOPTNS= <>
##$ZL1= 120
##$ZL2= 120
##$ZL3= 120
##$ZL4= 120
##$ABSF1= 15.96781
##$ABSF2= -1.004852
##$ABSG= 5
##$ABSL= 3
##$ALPHA= 0
##$AQORDER= 0
##$ASSFAC= 0
##$ASSFACI= 0
##$ASSFACX= 0
##$ASSWID= 0
##$AUNMP= <proc_1d>
##$AZFE= 0.1
##$AZFW= 0.1
##$BCFW= 0
##$BC_mod= 2
##$BYTORDP= 0
##$COROFFS= 0
##$CY= -3
##$DATMOD= 1
##$DC= 0
##$DFILT= <>
##$DTYPP= 0
##$F1P= 0
##$F2P= 0
##$FCOR= 1
##$FTSIZE= 16384
##$FT_mod= 6
##$GAMMA= 0
##$GB= 0
##$INTBC= 1
##$INTSCL= 2.992141e-10
##$ISEN= 128
##$LB= 0.24
##$LEV0= 0
##$LPBIN= 0
##$MAXI= 10000
##$MC2= 0
##$MEAN= 0
##$ME_mod= 0
##$MI= 1.114404
##$NCOEF= 0
##$NC_proc= -8
##$NLEV= 6
##$NOISF1= 3.799351
##$NOISF2= 2.8
##$NSP= 0
##$NTH_PI= 0
##$NZP= 0
##$OFFSET= 15.97403
##$PC= 1
##$PHC0= -11119.09
##$PHC1= 12.80094
##$PH_mod= 1
##$PKNL= yes
##$PPARMOD= 0
##$PSCAL= 0
##$PSIGN= 0
##$REVERSE= no
##$SF= 200.130007486744
##$SI= 16384
##$SIGF1= 3
##$SIGF2= 2
##$SINO= 5.538805
##$SIOLD= 16384
##$SREGLST= <1H.CDCl3>
##$SSB= 0
##$STSI= 16384
##$STSR= 0
##$SW_p= 3396.73913043479
##$SYMM= 0
##$S_DEV= 0
##$TDeff= 16384
##$TDoff= 0
##$TI= <>
##$TILT= no
##$TM1= 0
##$TM2= 0
##$TOPLEV= 0
##$USERP1= <user>
##$USERP2= <user>
##$USERP3= <user>
##$USERP4= <user>
##$USERP5= <user>
##$WDW= 1
##$XDIM= 16384
##$YMAX_p= 275258414
##$YMIN_p= -3164731
$$ End of Bruker specific parameters
$$ ---------------------------------
##NTUPLES= NMR SPECTRUM
##VAR_NAME=  FREQUENCY,     SPECTRUM/REAL,   SPECTRUM/IMAG
##SYMBOL=    X,             R,               I
##VAR_TYPE=  INDEPENDENT,   DEPENDENT,       DEPENDENT
##VAR_FORM=  AFFN,          ASDF,            ASDF
##VAR_DIM=   16384,         16384,           16384
##UNITS=     HZ,            ARBITRARY UNITS, ARBITRARY UNITS
##FACTOR=    0.207333158178282, 1,           1
##FIRST=     3196.88265163693, 0,            0
##LAST=      -199.856478797863, 0,           0
##MIN=       -199.856478797863, -3164731,    0
##MAX=       3196.88265163693, 275258414,    0
$$ Real data points
##PAGE= N=1
##DATA TABLE= (X++(R..R)), XYDATA
$$ [...]
3743A72340966n616113p921498r657434p490669m935231m160720k265431k465917
3735A27827953k833008j830864j878769j386758j016748j234925j430820p18334
3727A15497727r13465j590082j749020j859158k571378j978075j340612j004610
3719A02491327j356852j316019j172301j419828j164137o47725p24777j29391
3711I4560297l99628p62356q85060o72518k61541l27604l65715n78553m41233
3702H9866089k02636p19852j009828q71468m85523o28563l84998p24560m36336
3693H4402325K79595j38469k43822p17212k2923j04138K84822K47329L91950L4448
3683H4413905K47408k84560N96164L77528M50073N37405q595m50833n07088k50070
$$ plain form
3743 172340966 166724853 158803355 149145921 141655252 136720021 132559301 130293870 127827953
3735 127827953 124994945 123164081 121285312 119898554 118881806 117646881 116216061 115497727
3727 115497727 114584262 112994180 111245160 109386002 106814624 104836549 103495937 102491327
3719 102491327 101134475 99818456 98646155 97226327 96062190 95414465 94689688 94560297
3711 94560297 94160669 93398313 92513253 91840735 91579194 91251590 90885875 90307322 89866089
3702 89866089 89663453 88943601 87933773 87062305 86576782 85948219 85563221 84838661 84402325
3693 84402325 84681920 84543451 84299629 83582417 83559494 83455356 83740178 83987507 84379457 84413905
3683 84413905 84661313 84376753 84972917 85350445 85800518 86337923 86329328 85878495 85371407 85121337
3673H5121337o19441r95078q61567j011100J63138n74752j039321j272498o33192
3664G8277526r80089j317269j052407j597695j809163j142365q24718j128389
3656F8425431j447593j567756r00331j516110m40899n50961j651819j113479k79560
3647E8956923j033502k98435j156223j342930m43529j55140o42465q82219o07904
3638E2394576j195002l86839q40655j10539l21396o75157k5343l99130p49938
3629D7690577r28878k24646J48026m58826l95759m52439m26081j38294j55047
3620D4658633n74580o17441m08591o07258K8105j36569J12756r5916m43139l32945
3610D1583055J37154m90450k85463K61098o75029k32624j34320m22286K46392
$$ plain form
3673 85121337 84501896 83506818 82645251 81634151 81797289 81222537 80183216 78910718 78277526
3664 78277526 77297437 75980168 74927761 73330066 71520903 70378538 69553820 68425431
3656 68425431 66977838 65410082 64509751 62993641 62552742 62001781 60349962 59236483 58956923
3647 58956923 57923421 57624986 56468763 55125833 54682304 54527164 53884699 53002480 52394576
3638 52394576 51199574 50812735 49972080 49861541 49540145 48864988 48839645 48440515 47690577
3629 47690577 46761699 46537053 46685079 46226253 45830494 45378055 44951974 44813680 44658633
3620 44658633 44084053 43466612 43058021 42450763 42478868 42342299 42455055 42359139 41916000 41583055
3610 41583055 41720209 41229759 40944296 41205394 40530365 40297741 40163421 39741135 39987527
3601C9987527N7771l57374K14711O51551k58738n85308L17244n13147k27118M19725
3591C9706844O04334l53168j42781N49418r54122J30789K94688m85861k69756
3582C9080385q7025j79040M67524n2524k39434o12598N05485M79666M8370k93923
3572C9116886l26995L51212J84399j51905M45870m7923k73621l17144o38221p04088
3562C7638470N37352K53545J1102p2572j93996L10627k99827n79002l40173k8620
3552C7236906J96723o1462m84927k26352N47021K39943l12658J96112o12358K47431
3542C6966379O3192K92535K1248J14226l29727l15089l8745o8598K76158N01504
3532C7483083p0790m74263m66731J34511k27776k77190J93075K6271j51543J41780
$$ plain form
3601 39987527 40045298 39687924 39902635 40554186 40295448 39710140 40027384 39514237 39287119 39706844
3591 39706844 40311178 39958010 39815229 40364647 39410525 39541314 39836002 39350141 39080385
3582 39080385 38993360 38814320 39281844 39229320 38989886 38377288 38882773 39362439 39410809 39116886
3572 39116886 38789891 39141103 39325502 39173597 39619467 39571544 39297923 38980779 38342558 37638470
3562 37638470 38175822 38429367 38440469 38367897 38173901 38484528 38184701 37605699 37265526 37236906
3552 37236906 37433629 37372167 36887240 36660888 37207909 37447852 37135194 37331306 36718948 36966379
3542 36966379 37029571 37322106 37343354 37457580 37127853 36812764 36774019 36705421 36981579 37483083
3532 37483083 37412293 36938030 36471299 36605810 36378034 36100844 36293919 36320190 36168647 36310427
3522C6310427M75814l87699l52498j17633n70031Q4358L18375m23651l13238L34831
3512C5359055M81505j26575R5479r4922n91970m48178j37706J12834N6571J10695
3502C4816788k48072L83543l10187j24732N400R4386o5250j5615k21194j6641
3492C4298426K75435J46111M3443L01638P90938N04588p56104P8510K35018J94460
3482C6112463j20247J26821N32948m8919l99712m90085k85788q7215j64057k42969
3472C4933240m27488l53480O80658j08702L59976K81817k39806o7651M35229l4484
3462C5459309Q54511M30908q0393n3110P23384P4679K8216O33549P83926Q75634
3452C9730613L08606K35437P35568K85540M64548N27646M95881Q51518J056486
$$ plain form
3522 36310427 36786241 36398542 36046044 35928411 35358380 35442738 35761113 35337462 35024224 35359055
3512 35359055 35840560 35713985 35809464 35714542 35122572 34674394 34536688 34649522 34706093 34816788
3502 34816788 34568716 34952259 34642072 34517340 34522740 34617126 34551876 34536261 34315067 34298426
3492 34298426 34573861 34719972 34763415 35065053 35855991 36360579 35604475 35682985 35918003 36112463
3482 36112463 35992216 36119037 36651985 36603066 36203354 35713269 35427481 35340266 35176209 34933240
3472 34933240 34505752 34152272 34832930 34724228 35084204 35366021 35126215 35058564 35493793 35459309
3462 35459309 36313820 36744728 36664335 36611225 37334609 37409288 37437504 38071053 38854979 39730613
3452 39730613 40039219 40274656 41010224 41295764 41760312 42287958 42783839 43635357 44691843
3443D4691843L53646R68515J598413J074973N78198J143022J120659K023376J198267
3434E4750912J200159J131958J260143K303274L372364K368533K442759L315498
3426G2145600L950879L940546L592417N235425N242129N915520O427489P046664
3418A13496669P909833R476967R381348Q022272O771016M354684J283929k125118
3410A58571600m846440n663926o950416o507011o521161o542079o267039n972092
3402A09301436o817056o214122o241272n467191m672124l435041l265617l074328
3394G0114685k112332j909355k036962k147761j181052r05431r35405j290377
3386E7596010l90248j456315j602966n65523j478541o79982j140476j045261m36612
$$ plain form
3443 44691843 45045489 46014004 47612417 48687390 49265588 50408610 51529269 53552645 54750912
3434 54750912 55951071 57083029 58343172 60646446 64018810 66387343 68830102 72145600
3426 72145600 76096479 80037025 83629442 88864867 94106996 100022516 106450005 113496669
3418 113496669 121406502 130883469 140264817 148287089 155058105 159412789 160696718 158571600
3410 158571600 153725160 148061234 141110818 134603807 128082646 121540567 115273528 109301436
3402 109301436 102484380 96270258 90028986 84561795 79889671 76454630 73189013 70114685
3394 70114685 68002353 66092998 64056036 61908275 60727223 59821792 58886387 57596010
3386 57596010 57205762 55749447 54146481 53580958 52102417 51422435 50281959 49236698 48800086
3377D8800086p59647q07057r37103j001320j139131o93693k67436j02461l02461
3368D2789777p26136n96273k98513M7504k27625m4119k30668m89044L02582m14277
3358D0113208m25097K88996k3516n26865j87890m49172l54107q8393n17405J7366
3348C7847125m86208q0341J84722n40885r6387k88428p11985l89331j49317J06826
3338C5395791m71716k3389M27570r81038m58056n97573j91373L36854l70576l64553
3328C2701941j83418N34239j98670j89495l18277j09957j08957p1083k94820n49189
3318C1212314j80921j19981m77925n33413l61292J14718L26469L68815l975o46313
3308B9698496j07551k7145j02662l78471P570j6901K93819j42014K49183K8593
$$ plain form
3377 48800086 48040439 47233382 46296279 45294959 44155828 43462135 43194699 43092238 42789777
3368 42789777 42063641 41467368 41168855 41216359 40988734 40944615 40713947 40224903 40527485 40113208
3358 40113208 39688111 39977107 39953591 39426726 39238836 38789664 38435557 38347164 37829759 37847125
3348 37847125 37360917 37280576 37465298 36924413 36828026 36539598 35827613 35438282 35288965 35395791
3338 35395791 34924075 34900686 35328256 34347218 33889162 33291589 33100216 33437070 33066494 32701941
3328 32701941 32518523 33052762 32854092 32664597 32346320 32236363 32127406 32056323 31761503 31212314
3318 31212314 31031393 30911412 30433487 29900074 29538782 29653500 29979969 30348784 30344809 29698496
3308 29698496 29590945 29563800 29461138 29082667 29090237 29073336 29367155 29225141 29474324 29502917
3298B9502917n4094J96372J32622N78356J6086n23063L45902M76288P01072j11407
3288C1261051j45099N83813M14319M03705J85817q4296J8424J24611o3670p1670
3278C2627005L16246q9125L11963P11922K23354K02644J69719Q9125K80953m62059
3268C4381747j94972M1813k9106J21162M28819l32579K90206K79938m15748j0535
3258C4560745m29726J10304L13289j65987l14992J97476r991K14280m06851m75841
3248C3592706l18249m41841o00814q26236r8631J355368r3863J37455K54663N2183
3238C3012741j35051J12424N09024J03606m75496M82358L37320n88509O33184
3229C3991601J81560J31896j00881l10381q3409o91014M53724J17371l75662k38406
$$ plain form
3298 29502917 29448823 29645195 29777817 30356173 30372259 29849196 30195098 30671386 31372458 31261051
3288 31261051 31115952 31699765 32114084 32517789 32703606 32619310 32637734 32762345 32698675 32627005
3278 32627005 32943251 32854126 33166089 33878011 34101365 34304009 34473728 34562853 34843806 34381747
3268 34381747 34186775 34228588 34199482 34320644 34749463 34416884 34707090 34987028 34571280 34560745
3258 34560745 34131019 34241323 34554612 34388625 34073633 34271109 34261118 34475398 34068547 33592706
3248 33592706 33274457 32832616 32231802 31405566 31306935 32662303 32568440 32705895 32960558 33012741
3238 33012741 32877690 32990114 33499138 33602744 33127248 33609606 33946926 33358417 33991601
3229 33991601 34173161 34305057 34204176 33893795 33810386 33119372 33573096 33690467 33314805 33076399
3219C3076399n9202K74459n86992l26210j12997N00934M44743k13606l75142P15723
3209C3338109N35196j46462N3316k62736m47565J4852K71989J89854O3137K55923
3199C3865613j38323O59653J19858J44664M82062Q89482M88345N22334O06258
3190C7639946Q29893J62883O83024N29540J108823J924906J139186J729099J720250
3181D7467550K381037J903962R18287P0774o40276k487801j810583k111870k163944
3172D3527136j854463j472857j074356j408402o55014j110327o5852j10928l70078
3163C5404859r41308o69688K64218j348837j236773o51652N14965l92233q6419
3154C0857132l5578p94659n59924O81082M88709o89538k67170n06857k82440J69458
$$ plain form
3219 33076399 33017197 33291656 32704664 32378454 32265457 32766391 33211134 32997528 32622386 33338109
3209 33338109 33873305 33726843 33780159 33517423 33069858 33084710 33356699 33546553 33609690 33865613
3199 33865613 33727290 34386943 34506801 34651465 35133527 36023009 36511354 37033688 37639946
3190 37639946 38469839 38632722 39315746 39845286 40954109 42879015 44018201 45747300 47467550
3181 47467550 49848587 51752549 52670836 52741610 52101334 49613533 47802950 45691080 43527136
3172 43527136 41672673 40199816 39125460 37717058 37062044 35951717 35885865 35774937 35404859
3163 35404859 34463551 33793863 34058081 32709244 31472471 30820819 31335784 30943551 30857132
3154 30857132 30821554 30026895 29466971 30148053 30636762 29947224 29680054 29173197 28890757 29060215
3144B9060215n14207J41044O52907Q6067N00057k92859p19902O82570k3177l62402
3134B9210313o7852o51926l1695k98469k82868M10532J4946M2186o10815J02801
3124B7837153N99833l42947j11722O1326n76486N19436L46404r5236L12238Q14582
3114B9364581K00021M2120J025921L6114m80597o89728J067399N92145j52641
3105C1005335R06944m0490o53003O365O94428M59430q9773N2359J033987O20508
3095C3996090J87206N26348L44782J313316J072502R16890J041668J055686J063729
3086D1518217J358508R59580K16924O82202K335495J707149J482192J775033J199961
3077E3235261K395587K187179K260838K072347J715177K526159K744099L264113
$$ plain form
3144 29060215 28546008 28687052 29339959 29426026 29926083 29633224 28913322 29595892 29572715 29210313
3134 29210313 29142461 28490535 28458840 28160371 27877503 28288035 28302981 28345167 27734352 27837153
3124 27837153 28436986 28094039 27982317 28043643 27467157 27986593 28332997 28237761 28549999 29364581
3114 29364581 29564602 29606722 30632643 30668757 30188160 29498432 30565831 31157976 31005335
3105 31005335 31912279 31871789 31218786 31225151 31919579 32379009 32289236 32341595 33375582 33996090
3095 33996090 34183296 34709644 35054426 36367742 37440244 38357134 39398802 40454488 41518217
3086 41518217 42876725 43836305 44053229 44735431 47070926 48778075 50260267 52035300 53235261
3077 53235261 55630848 57818027 60078865 62151212 63866389 66392548 69136647 72400760
3069G2400760K893722L680641L587828L188419K534626K790395K177919M13563
3061I3667873L29220j04724j310915k263734k153001k923267k654193k444663
3053H0142596k760513j872706k218169k167881j860794k053627j932281j741641
3045F3534984j024670j423760j115246r56743q65290j014301m39944q39802j236123
3036E4619105o78696p23364o09378j008591l07321l8286l62193p21178j369915
3027D8800183q74329K41757n77658r24580n30324l01643q80473o4363l15034J50252
3017D4723788n47921p48111m81220k39853P640p19372k88325l9270m70749q6615
3007D1109992l5127p666J84986o11998J115J50926l64539k42647j04726L64203
$$ plain form
3069 72400760 75294482 78975123 82562951 85751370 88285996 91076391 93254310 93667873
3061 93667873 93997093 93892369 92581454 90317720 88164719 85241452 82587259 80142596
3053 80142596 77382083 75509377 73291208 71123327 69262533 67208906 65276625 63534984
3045 63534984 62510314 61086554 59971308 59014565 58149275 57134974 56695030 55855228 54619105
3036 54619105 53940409 53217045 52607667 51599076 51291755 51253469 50891276 50170098 48800183
3027 48800183 47925854 48167611 47589953 46665373 46135049 45833406 44952933 44888570 44573536 44723788
3017 44723788 44175867 43427756 42946536 42706683 42714323 41994951 41706626 41667356 41196607 41109992
3007 41109992 41074865 41067199 41252185 40640187 40641302 40792228 40427689 40185042 40080316 40444519
2997D0444519J82676Q9520M73709m89787k19869N12379P20540k54736n81018k10955
2987D0666978N16859M27243k0989J72131l72586r65639J93329M10585N9500o3497
2977D1023914L21117K20149J24475L06677J74441p1444j42680m55695o0136L95294
2967D1836112N16876m87842L77868R01990J73948J31085l49216M83152R3153j71529
2957D3505597K49335m38816m5155l52490J50499K26676l53726m27710M28940N93279
2947D3536429P7715q28897m60664K53212k25255l67334J5822P2517l87742Q7571
2937D1773374M72434Q3587P0498Q0947K98697k10895n54396K84688Q54764L40509
2927D3494207j43296N87291j06256M96752P00210J049278K47973K51727Q72483
$$ plain form
2997 40444519 40627195 40716715 41190424 40700637 40480768 40993147 41713687 41458951 40877933 40666978
2987 40666978 41183837 41611080 41590091 41762222 41389636 40423997 40617326 41027911 41087411 41023914
2977 41023914 41345031 41565180 41689655 41996332 42170773 42099329 41956649 41500954 41440818 41836112
2967 41836112 42352988 41865146 42243014 43145004 43318952 43450037 43100821 43583973 43677126 43505597
2957 43505597 43754932 43316116 43270961 42918471 43068970 43295646 42941920 42514210 42943150 43536429
2947 43536429 43614144 42785247 42324583 42577795 42352540 41985206 42001028 42073545 41685803 41773374
2937 41773374 42245808 42329395 42399893 42480840 42779537 42568642 42014246 42298934 43153698 43494207
2927 43494207 43350911 43938202 43831946 44328698 45028908 46078186 46326159 46577886 47450369
2918D7450369M10289M7640R18478R25470P96090J94027J13972N74233J114468
2909E2545036R75747N80653J012144K66675Q31237R44295O80432N93493Q50700
2900E9280412L32691N74725L78597Q82685j04475K70396L45432N76114L01654
2891F2838231o2288J24684k25067j45639n98754m54087J27313j89157K20811o7165
2881F1568882p52542m50558j079562k32132m74370o41870j064067l48726j040724
2872E5484331j024699o20314q4156q98708j114160o25710o94813q86963j482079
2863D8052729j21271j1686r37288m80604n13800r71561n19849n20539r60146j13144
2853D2902841j005448p42604K66715n67220n84531n6364l61259p83484p64164
$$ plain form
2918 47450369 47860658 47908298 48826776 49752246 50548336 50742363 50856335 51430568 52545036
2909 52545036 53520783 54101436 55113580 55380255 56211492 57155787 57836219 58429712 59280412
2900 59280412 59613103 60187828 60566425 61449110 61344635 61615031 61960463 62536577 62838231
2891 62838231 62775943 62900627 62675560 62529921 61931167 61477080 61604393 61415236 61636047 61568882
2881 61568882 60816340 60365782 59286220 59054088 58579718 57937848 56873781 56525055 55484331
2872 55484331 54459632 53839318 53755162 52856454 51742294 51116584 50421771 49534808 48052729
2863 48052729 47931458 47919772 46982484 46501880 45988080 45016519 44496670 43976131 43015985 42902841
2853 42902841 41897393 41154789 41421504 40854284 40269753 40213389 39852130 39068646 38304482
2844C8304482j004873m24940j80101p78270N81033m01754j268807o33721l8288
2835C4154761r18695K18227k42300L7816Q35002l82708q53305j84447R3196o9726
2825C2687821M89379m86310K06435P2498M44459K00558j39524P82607L03189J78019
2815C4739131N1078O43440M645K19022O04233L91275J000130J89647O37342M03883
2805C8883826L77050m4442N00028P35331Q51814L16595N14133Q78306K91590M62286
2795D3766517M43336n010j19976K44749O20872K05529l2359N18010m6903J75475
2785D5770240m66605j10281m50293n70304M11048m6959j58883k52791j57123l84259
2775D3583790r0345m16247O4997M8233o52856o4061M3004K44808p0448k28669
$$ plain form
2844 38304482 37299609 36874669 36694568 35916298 36497331 36095577 34826770 34193049 34154761
2835 34154761 33236066 33454293 33211993 33249809 34084811 33702103 32848798 32664351 32757547 32687821
2825 32687821 33177200 32690890 32897325 32969823 33414282 33614840 33475316 34257923 34561112 34739131
2815 34739131 34790209 35433649 35438294 35657316 36261549 36652824 37652954 37842601 38479943 38883826
2805 38883826 39260876 39216434 39716462 40451793 41303607 41620202 42134335 43012641 43304231 43766517
2795 43766517 44209853 44204843 44084867 44329616 44950488 45156017 45123658 45641668 45594765 45770240
2785 45770240 45303635 45193354 44743061 44172757 44583805 44536846 44377963 44125172 43968049 43583790
2775 43583790 43493445 43077198 43142195 43190428 42537572 42473511 42516515 42761323 42690875 42462206
2765D2462206K75268N36602K30157j131138M76229M9196J43381O80953l96232
2756D3326622p8081R63786l4034L85302r3261n38991j59853O17808R4144m55696
2746D4027746m41240m5396L07341J58715l38780k17038n4915k10502r06880k12129
2736D2066922r7517k42468l07853n16483k66907j06455p65005l98164m3798l33630
2726C8988642k64218m40058j05997r26780k4796K89504p60234l22008M55744K40163
2716C7129962J35893o61685m67460P27048O01534n42571j05128J34174J27396
2707C7079163J49268j78856j22222J48701J24477J05383M94942J38479k52611
2698C7686724N87260O1025M00725J56812N71850k51178K67870L53817M38547J33977
$$ plain form
2765 42462206 42737474 43274076 43504233 42373095 42849324 42898520 43041901 43722854 43326622
2756 43326622 43248541 44212327 44178293 44563595 44470334 43931343 43771490 44389298 44483442 44027746
2746 44027746 43586506 43541110 43848451 44007166 43668386 43451348 43396433 43185931 42279051 42066922
2736 42066922 41969405 41726937 41419084 40902601 40635694 40529239 39764234 39366070 39322272 38988642
2726 38988642 38724424 38284366 38178369 37251589 37226793 37516297 36756063 36434055 36889799 37129962
2716 37129962 37265855 36604170 36136710 36863758 37465292 36922721 36817593 36951767 37079163
2707 37079163 37228431 37049575 36927353 37076054 37200531 37305914 37800856 37939335 37686724
2698 37686724 38273984 38335009 38735734 38892546 39464396 39213218 39481088 39834905 40273452 40407429
2688D0407429o34959k45724L71568n5893P1053l6755M92256O22187r6840j072585
2678C9821737N51132L08542n911O12850K39854O38919P01041j67777O03690L43430
2668D3647507M04886q62175L73737J058313M68469O77837k62938N89376l2343
2659D6062669R62495J00735m9567O23117J003465R08467O72605N34677J65984
2650E0984647K48067K03957J128737Q76962L3223M05109O26423M86925J47309
2641E5141359l18983L75001J084246M16578O43845N94561J25485O98758O61376
2632E9422226L105P30825N37116P89833J223245O03600J000794K75219M22986
2623F5008949J048511M64531J083330J106214J351336J508034J441219O70114
$$ plain form
2688 40407429 39772470 39526746 39898314 39842421 39913474 39876719 40368975 40991162 40894322 39821737
2678 39821737 40372869 40681411 40675500 41288350 41528204 42167123 42868164 42700387 43304077 43647507
2668 43647507 44052393 43190218 43563955 44622268 45090737 45768574 45505636 46095012 46062669
2659 46062669 47025164 47125899 47076332 47699449 48702914 49611381 50283986 50818663 50984647
2650 50984647 51232714 51436671 52565408 53442370 53475593 53880702 54507125 54994050 55141359
2641 55141359 54822376 55197377 56281623 56698201 57342046 57936607 58062092 58760850 59422226
2632 59422226 59425331 60156156 60693272 61483105 62706350 63309950 64310744 64585963 65008949
2623 65008949 66057460 66521991 67605321 68711535 70062871 71570905 73012124 73682238
2615G3682238J105438J372440J927194J414121J934017J616771J813722K026634
2607H6892575K139555J911349K021761J496087K513689K494687J951588K288065
2599A03709356K506627K144040K346543K594264K730037K683832K532344K350932
2591A23597975J520126J994107K285369J937811J884805J343434J766486J159368
2583A37489481J398053J279415Q98190R07255J46609M01192L00J86932j99173
2574A42508254n11273k7103M0812j035272q95796k85300m38115j083211o31989
2565A37641007j456007j051824j069567k16909j035971j054356q34147q13553
2557A30108673j135858j571691n64289p90084r35971o80844r83797j025222r34806
$$ plain form
2615 73682238 74787676 76160116 78087310 79501431 81435448 83052219 84865941 86892575
2607 86892575 89032130 90943479 92965240 94461327 96975016 99469703 101421291 103709356
2599 103709356 106215983 108360023 110706566 113300830 116030867 118714699 121247043 123597975
2591 123597975 125118101 127112208 129397577 131335388 133220193 134563627 136330113 137489481
2583 137489481 138887534 140166949 141065139 141972394 142119003 142520195 142520495 142707427 142508254
2574 142508254 141996981 141969878 142010690 140975418 140079622 139794322 139356207 138272996 137641007
2565 137641007 136185000 135133176 134063609 133846700 132810729 131756373 130922226 130108673
2557 130108673 128972815 127401124 126836835 126046751 125110780 124429936 123446139 122420917 121486111
2548A21486111p53559p30882j273166j354457n59930p91545q77820j036153k10024
2539A13898575j230718j390525j095112j249810m32662j204160j062860j881408
2531A04351320j134551q22433j191399r61576j667918j122274j006490m26933
2523I6017746q25194j406978j027147j100578j002791m38511j015470j75240N6602
2514H9082439p3330r37973j281338K65859o16837m19242m75665m77426k42623
2505H4823864L60363k58611N60723k68365p3554N33522N73837K51118K98772L49273
2495H7150942m25510N55506O21555P4383N82700n02319m68333o66639j8660K60279
2485H7163904j21272l31603j81948m82132o90332q20376n11375o87875j370876
$$ plain form
2548 121486111 120732552 120001670 118728504 117374047 116814117 116022572 115144752 114108599 113898575
2539 113898575 112667857 111277332 110182220 108932410 108499748 107295588 106232728 104351320
2531 104351320 103216769 102394336 101202937 100241361 98573443 97451169 96444679 96017746
2523 96017746 95192552 93785574 92758427 91657849 90655058 90216547 89201077 89025837 89082439
2514 89082439 89009109 88071136 86789798 87055657 86438820 86019578 85543913 85066487 84823864
2505 84823864 85184227 84925616 85486339 85217974 85144420 85677942 86251779 86502897 86801669 87150942
2495 87150942 86725432 87280938 87902493 87976876 88559576 88057257 87588924 86922285 86903625 87163904
2485 87163904 87042632 86711029 86529081 86046949 85356617 84536241 84024866 83336991 81966115
2476H1966115m73732n20724j029673j310182r37248j356847j665606j140888q64091
2467G2667124j957878o53969r87805j454467n78647o76623j041657j294640j242830
2458F2778608p94956n14946r36434j405456n13143o68148p17621q01935j48725
2449E6277244j54360m82338k09456q25055n07409K30098J04607O50789Q2252M7207
2439E5213579j99058j92214j61389J92581J61428L07887M28507J80120R8992M44488
2429E6474921O34803m9901n03232p0839N29762N6115J50328M03546J39607r61858
2419E6803252r46149j33576K25523J62393m68974q21998l02800n05994j113045
2410E2898632j091767p94746k02599q94314l69047l07308j815490j010281j238461
$$ plain form
2476 81966115 81492383 80971659 79941986 78631804 77694556 76337709 74672103 73531215 72667124
2467 72667124 70709246 70055277 69067472 67613005 67034358 66357735 65316078 64021438 62778608
2458 62778608 61983652 61468706 60532272 59126816 58613673 57945525 57227904 56425969 56277244
2449 56277244 56122884 55640546 55431090 54606035 54098626 54328724 54433331 55084120 55166372 55213579
2439 55213579 55014521 54822307 54660918 54853499 55014927 55322814 55751321 55931441 56030433 56474921
2429 56474921 57109724 57059823 56556591 56485752 57015514 57071629 57221957 57625503 57765110 56803252
2419 56803252 55857103 55723527 55949050 56111443 55642469 54820471 54517671 54011677 52898632
2410 52898632 51806865 51012119 50809520 49915206 49546159 49238851 47423361 46413080 45174619
2401D5174619p81153p70520m05379q91310j333194n90189j040263q04627p96934
2392C7761050j145009r24276q18165l31062k78648n69826n28063m55825p55814
2383C1954362n0706n78879o0615k12289n72742R0056k18370k19968m53530K64814
2373B9942133J54177K8699j51654O2254l37850L7664k64286m98699K02383n5354
2363B9119467J44677K49677n43404k35389n44456p50200k15631K7288j20421r49166
2353B6182442j06592m92849M26252L5472l01189l64124r70553q62004q39267j42113
2343B2565475l09130n11316r40518L62491J50500p52888m79255q41311o78865
2334A8565183L64143j30057o18036o84904o10715q9904l16075j65683l62070k79856
$$ plain form
2401 45174619 44393466 43622946 43217567 42326257 40993063 40402874 39362611 38557984 37761050
2392 37761050 36616041 35691765 34873600 34542538 34263890 33694064 33166001 32710176 31954362
2383 31954362 31903656 31324777 31264162 31051873 30479131 30569187 30350817 30130849 29677319 29942133
2373 29942133 30096310 30125009 29973355 30035609 29697759 29735423 29471137 28972438 29174821 29119467
2363 29119467 29264144 29513821 28970417 28735028 28190572 27440372 27224741 27252029 27131608 26182442
2353 26182442 26075850 25583001 26009253 26044725 25743536 25379412 24408859 23546855 22707588 22565475
2343 22565475 22256345 21745029 20804511 21167002 21317502 20564614 20085359 19244048 18565183
2334 18565183 18929326 18799269 18181233 17496329 16885614 16795710 16479635 16313952 15951882 15672026
2324A5672026p37594K90950j87296m65485r08436k46296j0237K03378j28869k51817
2314A3230324K70827J46665n16419j56248L1740k01631n04284m3131n1133r92935
2304A1213775O1784j37606J64242L77290j38227k86444m4827k0388k94945O33367
2294A1528021J18790L42263k36664n42002m25383j00135j28307J66275Q6969l34843
2284A0474984M75853J95512j6446m96780k37751n74768M13593m45431J70603N0005
2274A0009374O9769N9625K7852j42412k99311l9959r7805J27713K29949n42786
2264I402009m15897k7053j10295J99467m59322m23467Q51335n88783j15863K68233
2254H580364k0876q3982J24682m2015O5259p3455K10021q1951N7302j79730r74327
$$ plain form
2324 15672026 14934432 15225382 15038086 14572601 13664165 13417869 13407632 13611010 13482141 13230324
2314 13230324 13501151 13647816 13131397 12975149 13006889 12805258 12300974 12257843 12206710 11213775
2304 11213775 11275559 11137953 11302195 11679485 11541258 11254814 11209987 11189599 10894654 11528021
2294 11528021 11646811 11989074 11752410 11210408 10785025 10684890 10556583 10722858 10809827 10474984
2284 10474984 10950837 11146349 11129903 10633123 10395372 9820604 10234197 9788766 9959369 10009374
2274 10009374 10079143 10138768 10166620 10024208 9724897 9684938 9587133 9714846 9944795 9402009
2264 9402009 8986112 8959059 8848764 9048231 8588909 8165442 9016777 8427994 8312131 8580364
2254 8580364 8559488 8475506 8600188 8558173 8623432 8549977 8759998 8678047 8735349 8555619 7581292
2243G581292K4288M13680j08022k3629L2717j80310p3358K62670j83373J67671
2233G913626j24942n22748O4333n16275J68941L75682n15694M08452n0454J39569
2223G340490k05413q6583Q0000p33157N42590N71655n02204L03273q3720J36656
2213G363587J36254n69666K51599n57516j74155l64975L6196k97438p1584k11377
2203E540925O7202Q42041J176089o55203m78327K49582M60516k16423q2635K843
2193F906610L50565l35285J6034p2301L88917P0429n37317o97509K78827Q42520
2183G211490K03203K84715j49303m84872k23998p7049j99693L12288N90347p0664
2173G396464J26538K98580n69755j55770m80613j37376J17971j50723m3970K22992
$$ plain form
2243 7581292 7605580 8019260 7911238 7887609 7920326 7740016 7666658 7929328 7745955 7913626
2233 7913626 7788684 7265936 7330269 6813994 6982935 7358617 6842923 7251375 7200921 7340490
2223 7340490 7135077 7048494 7128494 6395337 6937927 7509582 7007378 7310651 7226931 7363587
2213 7363587 7499841 6930175 7181774 6624258 6450103 6085128 6121324 5823886 5752302 5540925
2203 5540925 5608127 6450168 7626257 6971054 6492727 6742309 7202825 6986402 6903767 6906610
2193 6906610 7257175 6921890 6937924 6865623 7254540 7324969 6787652 6090143 6368970 7211490
2183 7211490 7414693 7699408 7550105 7065233 6841235 6764186 6564493 6876781 7467128 7396464
2173 7396464 7523002 7821582 7251827 7096057 6615444 6478068 6596039 6445316 6401346 6624338
2163F624338j73023j88740L5815L70105K21458j84840Q4633m75611m46213L30491
2153F198413Q3793j31102k35779j55360P15708l41240r14330R946M74681m6548
2143E658182j01752L24590L17092j33098k06398j038897N01367Q36085n57965
2134E599206m57499n88092o273M02065j00756j63518K53259P982l73336J2348
2124D585386N0697m75574K89645N0756J1752N0242J2023q15601P4072K86857k6087
2113D094168J0559J60979l27566O99997n88445l11712M03544Q4390K62518p6694
2103D411738q5354J53018k33012K44449m07019l72841Q447j63771O8553L04398
2093C928606j59841L85009L10685J38917M69721l12734m6300j25890j89857j98723
$$ plain form
2163 6624338 6451315 6262575 6298390 6668495 6889953 6705113 6789746 6314135 5867922 6198413
2153 6198413 6282206 6151104 5915325 5759965 6475673 6134433 5220103 5230049 5704730 5658182
2143 5658182 5556430 5881020 6198112 6065014 5858616 4819719 5321086 6157171 5599206
2134 5599206 5141707 4553615 4547342 4949407 4848651 4685133 4938392 4946374 4573038 4585386
2124 4585386 4636083 4160509 4450154 4500910 4512662 4562904 4574927 3759326 3833398 4120255 4094168
2113 4094168 4104727 4265706 3938140 4638137 4049692 3737980 4141524 4225914 4488432 4411738
2103 4411738 4326384 4479402 4246390 4490839 4083820 3710979 3719426 3555655 3624208 3928606
2093 3928606 3768765 4153774 4464459 4603376 5073097 4760363 4714063 4588173 4398316 4199593
2083D199593j07587k66457K60125O50388R4563o77471m80119K22988M70883n05042
2073C861864k02090J89767m81469J33689L53043J77545L33567J73493P9150o81502
2063C937057J01557k60505n03787j73185L06321M8479l33367N1907O76748M38958
2053D290183l97228m88986k99501m99091L29046K16051k66462J7671P6831M0971
2043C019485L81736M56682j021246m23254O02637L76973K06119l71239l76032
2034B851861J55369n5657m48720L40669K43330K59739m00363j16282K978n80908
2024B252016P06123M87134n55195l37337m9558J57096J08945J36811n43867j08502
2014B253666J45276J32177J06975m6090L06585n86450j45956o7319j27051K63202
$$ plain form
2083 4199593 4092006 3825549 4085674 4736062 4830625 4153154 3673035 3896023 4366906 3861864
2073 3861864 3659774 3849541 3368072 3501761 3854804 4032349 4365916 4539409 4618559 3937057
2063 3937057 4038614 3778109 3274322 3101137 3407458 3455937 3122570 3174477 3851225 4290183
2053 4290183 3892955 3403969 3104468 2605377 2934423 3150474 2884012 2901683 2978514 3019485
2043 3019485 3401221 3857903 2836657 2413403 3016040 3393013 3599132 3227893 2851861
2034 2851861 3007230 2951573 2502853 2843522 3086852 3346591 2946228 2829946 2832924 2252016
2024 2252016 2958139 3445273 2890078 2552741 2503183 2660279 2769224 2906035 2362168 2253666
2014 2253666 2398942 2531119 2638094 2592004 2898589 2312139 2166183 2098864 1971813 2235015
2004B235015K84865J14524K99036O3032l12670j6937o55266j59468R9328N04966
1994B456425l26367l96320N54027L8872K92489m35101l04751K19347R1541N8414
1984B248576j2756k42016K85121J55393L1179k60094J63650k48681p0793m30238
1974A619341N20550L83351m01358L27920J70147j36111l95088q86814m11238K16217
1964A006917K87249K08715K88005k18424m32389J50000O28912o0418j12781L59702
1954B105488r22962k30455N6063P03714K08835j89407M81649K93267j15559l68538
1944B022095j46861k10527k24314J10407K81169k58060k0277j90639J37928L76166
1934A877087l63732M30665N0003m48774l38278L21732P01310q4760k81966k49914
$$ plain form
2004 2235015 2519880 2634404 2933440 2996472 2683802 2666865 2011599 1852131 1951459 2456425
1994 2456425 2130058 1733738 2287765 2326637 2619126 2184025 1879274 2098621 2190162 2248576
1984 2248576 2235820 1993804 2278925 2434318 2465497 2205403 2369053 2120372 2049579 1619341
1974 1619341 2139891 2523242 2121884 2449804 2619951 2483840 2088752 1201938 790700 1006917
1964 1006917 1294166 1502881 1790886 1572462 1140073 1290073 1918985 1858567 1745786 2105488
1954 2105488 1182526 952071 1008134 1711848 1920683 1731276 2212925 2506192 2390633 2022095
1944 2022095 1875234 1664707 1440393 1550800 1831969 1573909 1553632 1362993 1500921 1877087
1934 1877087 1513355 1944020 1994023 1545249 1206971 1528703 2230013 2145253 1863287 1613373
1924A613373r9240K30983m56685j10376l68943O03653M08446J95266k09943m3148
1914A763386l80981J44777n9657M20823O73278n93088l70656j2450L16587j1880
1904A890139J08910l89981o1261K37361J26621m00416j05823N24589O8480m74428
1894A524191k68049k4886j94372j39777L70033J47221K2368p0000P7760k68602
1884A175887k40871K31708O0303J79233J57593m76477o7809k50002K46870P91209
1874A807644K46959k71915n68164j49451k18106l08985L31339N39067l10735m49855
1864F47798M91431K11978L27732k57485l19799l2556K65863O755j67914K09343
1854A383146N31389r79534L39244J90589P883J46993j0439J24710L1020q0688
$$ plain form
1924 1613373 1514133 1745116 1288431 1178055 809112 1412765 1821211 2016477 1806534 1763386
1914 1763386 1382405 1527182 1467525 1888348 2561626 1968538 1597882 1585432 1902019 1890139
1904 1890139 1999049 1609068 1547807 1785168 1911789 1511373 1405550 1930139 1998619 1524191
1894 1524191 1256142 1231256 1036884 897107 1267140 1414361 1436729 1366729 1444489 1175887
1884 1175887 935016 1166724 1227027 1406260 1563853 1087376 1019567 769565 1016435 1807644
1874 1807644 2054603 1782688 1214524 1065073 846967 537982 869321 1408388 1097653 647798
1864 647798 1139229 1351207 1678939 1421454 1101655 1069099 1334962 1341717 1173803 1383146
1854 1383146 1914535 935001 1274245 1464834 1472717 1619710 1609271 1733981 1765001 1684313
1844A684313K77099l01122k44790J19709o7533O5036P4552j49392j81068j50393
1834A126411l87290O83050r7655l93033L39038M60704k4920K53750n04421l56206
1824A099428Q1377N15041k44976N60786N0884k28863j98693O3338p9927L21774
1814A940169J05955O5717l38285l66350J27934J05368m07177l8495L91971k40248
1804A346559l6786L24123P7422K81307n20410l01668j26255R8380k58205M86147
1794A370614R8915k22050k69313M71214M21087k36612K83990L3659m31477m82182
1784A037845K39224K72163j2773k09584J96925n21111p7794k42468k99570M02702
1774G85559M84358m99192K57868L95274j62700N9768M34586j23759m8795n17127
$$ plain form
1844 1684313 1961412 1660290 1415500 1535209 1467676 1532712 1607264 1457872 1276804 1126411
1834 1126411 739121 1422171 1324516 931483 1270521 1731225 1706305 1960055 1455634 1099428
1824 1099428 1180805 1695846 1450870 2011656 2062540 1833677 1634984 1698322 1618395 1940169
1814 1940169 2046124 2111841 1773556 1407206 1535140 1640508 1233331 1194836 1586807 1346559
1804 1346559 1309773 1633896 1711318 1992625 1472215 1170547 1044292 1142672 884467 1370614
1794 1370614 1469529 1247479 978166 1449380 1870467 1633855 1917845 1951504 1520027 1037845
1784 1037845 1277069 1549232 1536459 1326875 1523800 1002689 924895 682427 382857 785559
1774 785559 1269917 770725 1028593 1423867 1261167 1320935 1755521 1631762 1582967 1065840
1764A065840m71834M8320J62910j43207N92130P00608J8767l11600n11723l16103
1754H34108L08001k69425k07173k37122K35701j16091J55645K32221m10050N541
1744E31356J61200o75758P62671N88889k33193k55142j86518k36127l02426k55524
1734a00572R3044N50072j98815M38917j67432N49J91654J32950L32314K84779
1724A557460m17142k75712n0305j19157k08059p8479L60266n04048r5301J88910
1714C58433K07787J67438K46683J0670l4703k8849k67926q4712L64797M57041
1704A396659k02771r81571m26290M95205M58832o3831M00107Q6071q78168m8808
1694B35435R0312l35825O19425J80004j50227L31736J28212J27007l31829J96646
$$ plain form
1764 1065840 594006 642326 805236 662029 1254159 1954767 1973534 1661934 1150211 834108
1754 834108 1142109 872684 665511 428389 664090 547999 703644 935865 525815 531356
1744 531356 692556 16798 779469 1368358 1135165 880023 693505 457378 154952 -100572
1734 -100572 -7528 542544 343729 782646 615214 615763 807417 940367 1272681 1557460
1724 1557460 1140318 864606 814301 695144 487085 408606 768872 264824 169523 358433
1714 358433 566220 733658 980341 991011 956308 927459 659533 574821 939618 1396659
1704 1396659 1193888 212317 -213973 281232 740064 676233 1076340 1162411 284243 235435
1694 235435 325747 -10078 609347 789351 639124 970860 1099072 1226079 894250 1090896
1684A090896r0744k97899j6092q1905n22587l99876K61436P27945j59015l95868
1674A16291p8015P10899L4890N9648L8176p51288q35912R79159p3645R4191P0282
1663C64676n42763O25865m12311N2812R1178J81474l77627j30491M60800n19000
1653b05387N44495l85608n36407q6187L94189j54816K26519N44275l19905N73869
1643E95037k72559r6782N07056l86833J30925J56537j28215J2083L43565n6624
1633H04190j55093L83182l18468p70513J58627J63329K8533K06642k41023k52332
1623G074P8101P20286l57040n89903Q34476j06360J7995k54766Q6860N43157l80611
1612E99269k78537k35972K0445p2486M73434K46421j24691J84553k19627J93402
$$ plain form
1684 1090896 1000152 702253 686161 604256 81669 -318207 -56771 671174 512159 116291
1674 116291 38276 749175 784065 843713 881889 130601 -705311 273848 200203 294394 364676
1663 364676 -178087 447778 35467 88279 179457 360931 -16696 -147187 313613 -205387
1653 -205387 339108 -46500 -582907 -669094 -274905 -429721 -203202 341073 21168 595037
1643 595037 322478 225696 732752 345919 476844 633381 505166 517249 860814 804190
1633 804190 649097 1032279 713811 -56702 101925 265254 293787 500429 259406 7074
1623 7074 85175 805461 448421 -141482 692994 586634 604629 349863 436723 979880 599269
1612 599269 320732 84760 105205 32719 506153 752574 627883 812436 592809 786211
1602G86211j13876J57292j21246K62269N5317m22522p45258j62589Q99071O030
1592F00699n3332N3507j6793p34885J46691j87849M36129J58762k19761k13671
1582c0503j34136J02471K60435K60706j839m73989m22528J75034Q14283k60361
1572B89573K2015J15375m53800j05610O85842n511L34317l73243j24748l56609
1562B7601M1367n34349Q52001K15337r1458k64900J59092q6149M31064L8859q25446
1551c6981R2982J19500K57516O4535J3558l39957K24859m5284j28602m59602J38676
1540i8800K01040M38133j21016l57246Q4873K39744L11605j58536o24881N21276
1530D36192N28502q5168K8078m0644k61359K21526k44495j762k25003R3446j52155
$$ plain form
1602 786211 672335 829627 708381 970650 1025967 603445 -141813 -304402 594669 600699
1592 600699 547367 600874 584081 -150804 -4113 -191962 244167 402929 183168 -30503
1582 -30503 -164639 -62168 198267 458973 457134 -16855 -439383 -264349 549934 289573
1572 289573 311588 426963 -26837 -132447 553395 547884 882201 508958 384210 27601
1562 27601 68968 -465381 386620 601957 510499 245599 404691 318542 749606 788465 -36981
1551 -36981 56001 175501 433017 497552 511110 171153 396012 350728 222126 -237476 -98800
1540 -98800 102240 540373 419357 62111 146984 386728 698333 539797 -85084 436192
1530 436192 964694 879526 907604 866960 605601 827127 582632 580870 355867 449313 297158
1519B97158J63581J15063l94794l21637M38095N3270L14495p76538j46787L39783
1509H1689J65530l29611N32108N7208j320816L49209K78940q4424j28743P56632
1499C57722j45954k0167R35266q27622R4107r1551m54844J29727K30462r6979
1489A10167P71174n44304o62013K61174j43515J94872L20450m3657L88135K9126
1479F81609j26626m03418j59658L06770j34331O0345K05471k64685K54040N54031
1469I73548O3296l75641l20370K01938p42462K6156L87581K58835j13381j27587
1459B31913j94832k97605J3731Q83288k98328Q215j06986r4963k61117k42443
1449c59127m0836J06256j47347N24007O7267n39772r3666K30395P65010J60196
$$ plain form
1519 297158 460739 575802 181008 -140629 297466 350736 665231 -111307 -258094 81689
1509 81689 247219 -82392 449716 506924 -813892 -464683 -185743 -270167 -398910 357722
1499 357722 211768 191601 1126867 299245 393352 301801 -153043 -23316 207146 110167
1489 110167 881341 337037 -324976 -63802 -207317 -12445 308005 264348 652483 681609
1479 681609 554983 151565 -8093 298677 164346 224691 430162 165477 419517 973548
1469 973548 1036844 661203 340833 542771 -199691 -173535 214046 472881 359500 231913
1459 231913 37081 -260524 -246793 636495 338167 346382 239396 144433 -116684 -359127
1449 -359127 -399963 -293707 -441054 82953 150220 -389552 -483218 -252823 512187 672383
1439F72383k48100l74539J58864k81004j07549k26706O6952L91546O33599l46828
1429C38618o91805J07183Q0137j1446j75764J1485Q0967O44284K84740l99267
1419B69132n19845j81889L22571o5877N0051M10262j38778q04093J14724j70377
1409g14119k07667M28967K47337l2928O48194K3860k38195K48082l8768J91661
1399E56424j07305R2974j98127k07492r1944K74201K16225n56512l35297N05473
1389A48620N9640q4039n22938j02690J83078O48274l3940n63485L44532J94085
1379B71137J87104J7145j69824m9510K42585j66307o9548l79817M14831m12659
1369a14863j68913R9143K32324L70902m92343K19411k08182J91689l32089l61269
$$ plain form
1439 672383 424283 49744 208608 -72396 -179945 -406651 -339699 51847 685446 338618
1429 338618 -353187 -246004 -165867 -177313 -353077 -341592 -260625 383659 668399 269132
1419 269132 -250713 -432602 -110031 -175908 -125857 284405 145627 -658466 -543742 -714119
1409 -714119 -921786 -492819 -245482 -278410 369784 393644 155449 403531 364763 556424
1399 556424 449119 542093 343966 136474 44530 318731 534956 -21556 -356853 148620
1389 148620 208260 124221 -398717 -501407 -318329 329945 296005 -267480 77052 271137
1379 271137 458241 475386 305562 256052 498637 332330 262782 -117035 297796 -114863
1369 -114863 -283776 -184633 47691 418593 -73750 145661 -62521 129168 -202921 -564190
1359e64190J70486N12603o4647L5075K41719O0954m81227J9180Q8667J47633n1020
1348A15233j2008n2045O1745q37824J47132J30144j75532L06702N61955k05619
1338C9883J28516J94953j19280j14843j62719L93387j83115K0667l76829l56940
1328e36320M53863L61612k50177J8611m26713J71164N80008n7319o60985k19104
1318e65360K1423O20581M69417J30103j54116K7515K68483j4376j36373m90393
1308A76904M9329j23379m17246j24817R0407K05032m33282m07652L34495M96231
1298a53978K86043j91731l84338J55864m23835N05967J84756Q0131L20634M4378
1288D23891m78391J98261n17793N21552K58355j4112Q9237J99166m23317l73681
$$ plain form
1359 -564190 -393704 118899 54252 89327 331046 392000 -89227 -70047 18620 166253 115233
1348 115233 103225 51180 112925 -724899 -577767 -447623 -623155 -316453 245502 39883
1338 39883 168399 363352 244072 129229 -33490 359897 176782 197449 -179380 -536320
1328 -536320 -82457 279155 28978 47589 -379124 -207960 372048 314729 -346256 -565360
1318 -565360 -543937 76644 546061 676164 522048 549563 818046 803670 667297 176904
1308 176904 226233 102854 -314392 -439209 -348802 -143770 -577052 -984704 -650209 -153978
1298 -153978 132065 -59666 -444004 -288140 -711975 -206008 -21252 58879 379513 423891
1288 423891 -54500 143761 -374032 147520 405875 391763 481000 680166 256849 -116832
1278a16832k56081l62571N19965j56988l92386P36727J25769p7832l59962J02765
1268b37426L88690m32812K96987O5025J65288j38327j97860j91323N18691N5437
1258B92370J60058k97993J11177L35166q6150Q7058O74181N23239k52603k22375
1248A324128O0142k97214J7705l55956R3166k42393n09511L00580P5906M48981
1238I15534L089o72993k16324L03764M23491k92213l36935K08520l5614l06450
1228f131k15993L96470l48021l49202O73602r4179j33846M36350M9158J17507
1218E25715k80637o15621q037j22391L9616L11466j36843J47123j56102k35713
1208e31424O81659P4583J26942r8850K56401m1568o6424m7609k64602m76060J93877
$$ plain form
1278 -116832 -372913 -735484 -215519 -372507 -764893 -28166 97603 19771 -340191 -237426
1268 -237426 151264 -281548 15439 80464 245752 107425 -90435 -281758 236933 292370
1258 292370 452428 154435 265612 600778 514628 601686 1275867 1799106 1546503 1324128
1248 1324128 1384270 1087056 1104761 748805 841971 599578 90067 390647 466553 915534
1238 915534 918623 245630 29306 333070 756561 464348 127413 335933 300319 -6131
1228 -6131 -222124 174346 -173675 -522877 150725 56546 -77300 359050 408208 525715
1218 525715 245078 -370543 -378580 -500971 -461355 -149889 -286732 -139609 -295711 -531424
1208 -531424 150235 224818 351760 252910 509311 467743 401319 353710 89108 -386952 -193075
1197a93075l04314j03427N77075M8974J86227m432M04469M9544j28176k75795
1187B57070l5768o26160j49383M81103N27534j57692j5079n0099j98345j03357
1177g0176K06017k35120l4125J08447Q97724J1573r8201l24593l46701R7565J05011
1166C17421j3819k16280M8157R8470J30150k82846m20318k51294q6831K66942
1156d10248K21348K52190m4391l80449L94570K64586k43285o54405M45215K97182
1146A42313K63129l14604Q8699j01577M76044j73070r9564L62022k48660J98080
1136E92812N52833j81424k9725o0072k46560J70180J59728m00336P2765l54997
1126B75204L44023K40639r5934k52362J90099M92597n1263K1258k60383P04164
$$ plain form
1197 -193075 -497389 -600816 -23741 25233 211460 207028 611497 661041 532865 257070
1187 257070 221302 -404858 -554241 -73138 454396 296704 281625 231526 33181 -70176
1177 -70176 135841 -99279 -133404 -24957 872767 884340 786139 461546 114845 212410 317421
1166 317421 303602 87322 135479 233949 364099 81253 -339065 -590359 -677190 -410248
1156 -410248 -188900 63290 18899 -361550 33020 297606 54321 -600084 -154869 142313
1146 142313 405442 90838 179537 77960 554004 380934 281370 643392 394732 592812
1136 592812 1145645 964221 934496 874424 627864 798044 957772 557436 630201 275204
1126 275204 619227 859866 763932 511570 701669 1194266 1143003 1164261 903878 1608042
1116A608042O60381q20635L17863J036037q6881J98629l38371n11893M8660K40167
1106B351999j84330l60733j34636j53308J21563J18001k8294J53657J32062p54603
1096A261378o02155J75578k53172N1331K92301J44139J64559K96208L55930K46712
1086B132809l50095l68779k10073J74667J33854J15307l13691j47244L32288J96629
1076A695672k20210Q654J02859L0002j55278Q11058K21764K9142J02131j31305
1066B494489N9058l1557j07584N3188L45218K52154K85816M12844j70967o51230
1056B941429j70788L88312q1045M03352J27979K71550Q13513k97777J81265r8133
1046D479657k54003R8602J58603J76121L01424L21030L21036k80254N76488P3854
$$ plain form
1116 1608042 2268423 1447788 1765651 2801688 2714807 2913436 2575065 2063172 2111832 2351999
1106 2351999 2167669 1806936 1672300 1518992 1640555 1758556 1730262 1883919 2015981 1261378
1096 1261378 659223 834801 581629 632960 925261 1069400 1233959 1530167 1886097 2132809
1086 2132809 1782714 1413935 1203862 1378529 1512383 1627690 1313999 1166755 1499043 1695672
1076 1695672 1475462 1484116 1586975 1616977 1461699 2272757 2494521 2523663 2625794 2494489
1066 2494489 2553547 2521990 2414406 2467594 2812812 3064966 3350782 3763626 3592659 2941429
1056 2941429 2770641 3158953 3077908 3481260 3609239 3880789 4694302 4396525 4577790 4479657
1046 4479657 4225654 4324256 4482859 4658980 4960404 5281434 5602470 5322216 5898704 5972558
1036E972558m20635J80149K69263N1783l83823P109N54943N70996j59806j42739
1026F499798R1497k48354K08472R01743L21845Q4993K61964l3482J89825J009830
1016I288131o03659n83668j77710O37994K53961N4698N74133O41616N11858M12194
1006A1009548k00814O7769M49870R68383j41246K633J200263N34870O97075Q96890
996A5485241R52454Q78647Q01654Q95489Q12955J210110P78856J117419Q62761
987B3795586J369666K147046J822847K355861K568507L462607M072671M567089
979D6161880M441675L259845K672211M058958N161795N599786O939851R250981
971H7546982J2091062J8273949K4726171K5201520K7619278L2950719K7618440
$$ plain form
1036 5972558 5551923 5732072 6001335 6053118 5669295 5676404 6231347 6802343 6642537 6499798
1026 6499798 6591295 6342941 6551413 7453156 7775001 7859994 8121958 8088476 8278301 9288131
1016 9288131 8684472 8100804 7923094 8561088 8815049 8869747 9443880 10085496 10597354 11009548
1006 11009548 10808734 10876503 11326373 12294756 12153510 12156143 13356406 13891276 14588351 15485241
996 15485241 16437695 17316342 18117996 19013485 19826440 21036550 21815406 22932825 23795586
987 23795586 25165252 27312298 29135145 31491006 34059513 37522120 41594791 46161880
979 46161880 50603555 53863400 56535611 60594569 65756364 71356150 78296001 87546982
971 87546982 99638044 117911993 142638164 167839684 195458962 228409681 256028121
964B56028121J9230293l437362l7944119n0517508l8091747k4363302j6420049
957A04484327j3030022j0905449q887097o903086n837484m812918l707215k469925
949D7931131j411524j855487k181365k694876k863624l082578k153091k083758
941B9604828k041741j246726j535336j100329j209913j463190j654474p95965
933A8557154q39843r27180n59113q49343l46155q18450J4229p72553j365736K713
923A2095723k42865p56032n51333o67347j9403M0603k42632o87960l64019J04461
913H709196k73688j12029q72194p25680n4194j78640k61125k74623k96206K94121
903E954938k36145R900q7603n45178l63611k17848k53769N49806J29995l95068
$$ plain form
964 256028121 275258414 271821052 233876933 183359425 145267678 120904376 104484327
957 104484327 91454305 80548856 71661759 64758673 58921189 54108271 50401056 47931131
949 47931131 46519607 44664120 42482755 39787879 36924255 33841677 31688586 29604828
941 29604828 27563087 26316361 24781025 23680696 22470783 21007593 19353119 18557154
933 18557154 17717311 16790131 16231018 15381675 15035520 14217070 14231299 13458746 12093010 12095723
923 12095723 11852858 11096826 10545493 9878146 9858743 9899346 9656714 8968754 8604735 8709196
913 8709196 8435508 8323479 7451285 6725605 6671411 6492771 6231646 5957023 5660817 5954938
903 5954938 5718793 5728693 5641090 5095912 4732301 4514453 4260684 4810490 4940485 4545417
893D545417j035338j4726K51073J76742K26547j75739j98269m01458l02569M64826
883C536506n5340q87114K39808r2168j01018k18917k68880J46717j7838p8737
873B203019K40341j77102p00J10789J4166J73762n9216j2757j77342P9040k97787
862B096213q9242j71203n44903N87907j7420n70335n47853L72643J018k29976
852H86849J58511N59849n88474K24108J94945L92115l03385K51406j86615m1263
842A548046K74452j67572Q9712j12173r1389j54893l41795o8545L17756j59249
832A134350j57915k59834J52650K80202j38082N96887M5773o7391p35888l85128
822D65624L72655l24470Q80930n28449k34344L79437K42595j68398m07838N9968
$$ plain form
893 4545417 3510079 3495353 3746426 3923168 4149715 3973976 3775707 3374249 3071680 3536506
883 3536506 3481166 2594052 2833860 2741692 2640674 2421757 2152877 2299594 2281756 2203019
873 2203019 2443360 2266258 2265558 2376347 2390513 2564275 2505059 2492302 2314960 2394000 2096213
862 2096213 2006971 1835768 1290865 1878772 1861352 1291017 743164 1115807 1116825 886849
852 886849 1045360 1605209 1016735 1240843 1435788 1827903 1524518 1775924 1589309 1548046
842 1548046 1822498 1654926 1744638 1632465 1541076 1386183 1044388 975843 1293599 1134350
832 1134350 976435 716601 869251 1149453 1011371 1608258 1654031 1586640 850752 465624
822 465624 838279 513809 1394739 866290 631946 1011383 1253978 1085580 677742 737710
812G37710M8901o58004N8126j41138J07871k43835j12749O43942J37143J09163
802F87130k92041o1599K80856O2433k39711N47938p67088m5973j50106J32752
792A54591n50515K80741R04938r16639M17516M30529o11794K21870o2649q1568
782A87020M8128K02443j62108l26005M46229M96609r3506k38336L39710m26510
772D73674M39005l07122p3809j51986o27649M64602N0363L90358k43403o63576
762b49543O31116J2664j51741l97483K33842m02875k15041j70694K65680O78874
752B34799o4922L5906o1596m4728J16905m00212p81072M14044Q81365J65436R939
741E05864m60585k9371n78931M24914m5316j68826l76173K81498Q44036K48443
$$ plain form
812 737710 786611 128607 186733 45595 153466 -90369 -203118 440824 577967 687130
802 687130 395089 333490 614346 676779 437068 985006 217918 171945 21839 154591
792 154591 -395924 -115183 789755 -126884 290632 721161 109367 331237 268588 187020
782 187020 235148 437591 275483 -50522 395707 892316 798810 560474 900184 473674
772 473674 912679 605557 531748 379762 -247887 216715 267078 657436 414033 -249543
762 -249543 381573 394237 242496 -154987 78855 -324020 -539061 -709755 -444075 234799
752 234799 169877 205783 144187 99459 216364 -183848 -964920 -550876 330489 495925 505864
741 505864 45279 15908 -563023 -138109 -183425 -352251 -728424 -446926 397110 645553
731F45553r8585m07787j94875l64278K49655k83669L67811k16569N52653Q9622
721C39531N9049m0992o5399J69007l77936J618k58583O68K994O984L03379l3319
709A07001k50372J98325M4987M08485J61250l01725m00475M5561p1823R26021
699H67235l47641m44310L01800k21575l47490j32453j32345L83386J54697l64314
689b83010R5373P23874J01857q37735J75969j7885K22386L21595K51121l54768
679C98777M38266K42361m43643m65539Q8469j75722M57439L76190o53784J46848
669D09662M90492n25368K85712k99075p85480J38410K13307m36474k51687k02460
659i62961M87445M28033m1594r9832n0178O26081L52624M84166p49259q19464
$$ plain form
731 645553 546968 139181 -55694 -419972 -170317 -453986 -86175 -302744 249909 339531
721 339531 398580 357588 292189 461196 83260 84878 -173705 -173037 -170043 -163059 140320 107001
709 107001 -143371 54954 99941 508426 669676 367951 -32524 13037 -58786 867235
699 867235 519594 75284 377084 155509 -191981 -324434 -456779 -73393 81304 -283010
689 -283010 -187637 536237 638094 -199641 -23672 -41557 180829 502424 753545 398777
679 398777 837043 1079404 635761 170222 258691 82969 540408 916598 262814 409662
669 409662 900154 374786 660498 361423 -424057 -285647 -72340 -508814 -760501 -962961
659 -962961 -475516 -47483 -89077 -188909 -239087 386994 739618 1223784 474525 -344939
649c44939J23249q4202k90376P57373K33857L27476k30074k15849j13968N98118
639G60665m91224k29543p108p9312L45956m94370k98465j24673J57321J75173
629b85580K58590j059087Q98728j07230K73388j85573j66264o50840O9170K78691
619f76007k48438K78968J77106N08795l55900n04451j53982L29243P82524O90086
609H27944q25614n93231L5725K57795m39444k70793J38820L13290j09279q657
599f73444L32191j98184O791j53621k49070j5191K56923j64030l61135J22232
589a096538q2093L05669K62076J02766L13395l65579k87589K32674P2174M28418
579a14627m08632p9073q5862j0409P7211L83958R052k37026J21896O40331j48528
$$ plain form
649 -344939 -221690 -305892 -596268 161105 394962 722438 492364 276515 162547 760665
639 760665 269441 39898 32790 -46522 299434 -194936 -493401 -618074 -460753 -285580
629 -285580 -26990 -1086077 -187349 -294579 -21191 -206764 -373028 -1023868 -954698 -676007
619 -676007 -924445 -645477 -468371 40424 -315476 -819927 -973909 -644666 137858 827944
609 827944 2330 -590901 -555176 -297381 -736825 -1007618 -868798 -555508 -664787 -673444
599 -673444 -341253 -539437 -532646 -686267 -935337 -950528 -693605 -857635 -1218770 -1096538
589 -1096538 -1178631 -872962 -610886 -508120 -194725 -560304 -847893 -615219 -543045 -114627
579 -114627 -523259 -602332 -688194 -698603 -621392 -237434 -228382 -465408 -343512 296819 148291
568A48291k77439j85532R7931p9541k24476j48421k22755m6319J84567Q58422
558A04728j49254k6680k52799l39268m7828L22701k67831p0332P91686l5404k42314
547b12595K39400k82753m9735j32812j2777M28796L03576k64842k73643n30247
537g87632P069J44096L6825L60058K47566K02600q5239p16864p22795P50345K69229
526b94742n88567K842M74945J94877m56513j44840j84621M1157N3793L02667k85981
515h84983k93623j57568J93996N80888M31327J52193m70216K92838L51156n44872
505c48864J13646k53478J57304l53389N128O90882J89535l33023Q9242J41377
495I8360r00974M47565j79654m30578l85743k40589O58005K41175n18818L33093
$$ plain form
568 148291 -129148 -314680 -216749 -296290 -520766 -669187 -891942 -938261 -753694 104728
558 104728 -44526 -71206 -324005 -663273 -711101 -388400 -656231 -726563 65123 29719 -212595
547 -212595 26805 -255948 -305683 -438495 -451272 -22476 281100 16258 -257385 -787632
537 -787632 -780563 -636467 -599642 -239584 7982 210582 125343 -591521 -1314316 -563971 -294742
526 -294742 -883309 -880467 -405522 -210645 -667158 -811998 -996619 -955462 -901669 -599002 -884983
515 -884983 -1178606 -1336174 -1142178 -561290 -129963 22230 -447986 -155148 196008 -348864
505 -348864 -235218 -488696 -331392 -684781 -679653 11229 200764 -132259 -43017 98360
495 98360 -802614 -355049 -534703 -965281 -1351024 -1591613 -933608 -692433 -1211251 -878158
485h78158J16983N23200k60916L31752J3727l70954R0540R3592j80838R4735l92838
474h19175L98958K83031l66239J20433l76639k27927L22643J89013m90290j89276
464a155468O94342k15198m68915P05828k94029J76961K21100o05827K93149K71533
454c76524Q4025p20369j83153N58342J09716k8156n70836N16127N04305p5320
444a81843k97502J0353j88800k85869O86253L18658n7431m16966m7124j61859
434f22130k41439L79301k04688j8473k9069n92568J78003L86206k0367R1325N50474
423a43425k48278k74739n9187J48812J16877l09185K53807k32895l22280L38704
413g31789k79276M2088j37509Q9622N95098K12882L08171o03190J32911J14639
$$ plain form
485 -878158 -761175 -237975 -498891 -167139 -153412 -524366 -433826 -340234 -521072 -426337 -819175
474 -819175 -420217 -137186 -503425 -382992 -759631 -987558 -664915 -475902 -966192 -1155468
464 -1155468 -461126 -676324 -1145239 -439411 -733440 -556479 -335379 -941206 -648057 -376524
454 -376524 -292499 -1012868 -1196021 -637679 -527963 -556119 -1126955 -610828 -106523 -181843
444 -181843 -479345 -468992 -657792 -943661 -257408 61250 3819 -413147 -460271 -622130
434 -622130 -863569 -484268 -688956 -707429 -736498 -1329066 -1151063 -764857 -785224 -693899 -143425
423 -143425 -391703 -666442 -725629 -576817 -459940 -769125 -515318 -748213 -1070493 -731789
413 -731789 -1011065 -968977 -1106486 -1016864 -421766 -208884 99287 -503903 -370992 -256353
403b56353k34277k30413L72886m21834m84486K49173J73188k79843m83473l75155
393a970587L23011M28643o44550k58031Q83485L78694K07605j11467N50360k50364
383d63201m4857j93229q1360K2155M28640N3363K563j35310n36429m3950K52316
372g39299J89710r34993M03353P30071j64213L54L0323m97029n61481L18810N35640
361f88754k9050L4043m2755J6043k93214j31938J674n7110J37528M90128n0918
350f14323j03912l30435k29830M79970J49514J61672m17807m40855L01992m3694
340a087708L47825j61962K95067J08731m84392k34674K73890J26440L38093J63957
330c14733j97954J0537m497k3028n97771j15566k1347K78850O98909l79760n65045
$$ plain form
403 -256353 -490630 -721043 -348157 -769991 -1254477 -1005304 -832116 -1111959 -1595432 -1970587
393 -1970587 -1647576 -1218933 -1863483 -2121514 -1238029 -859335 -651730 -763197 -212837 -463201
383 -463201 -508058 -701287 -782647 -760492 -331852 -278489 -275926 -411236 -947665 -991615 -739299
372 -739299 -549589 -1484582 -1081229 -351158 -515371 -515017 -484694 -981723 -1543204 -1224394 -688754
361 -688754 -717804 -683761 -726516 -710473 -1003687 -1135625 -1133951 -1191061 -1053533 -563405 -614323
350 -614323 -718235 -1048670 -1278500 -798530 -649016 -487344 -905151 -1346006 -1044014 -1087708
340 -1087708 -739883 -901845 -606778 -498047 -982439 -1217113 -943223 -816783 -478690 -314733
330 -314733 -512687 -502150 -506647 -529675 -1127446 -1243012 -1264359 -985509 -286600 -666360 -1231405
319a231405J02168k25428l60096m6844L97721j12728K52684K59446N58467J77726
309b28289o46973L6240j30829O38203J57552o15291j14848l1803J95392J55913
299e84733l8670k58729L66p1028m35643R08498j07153o38688N4672k64504K3051
288a412561J64774L93229k05634k17993L66304k29868n1954M35817n03542K25729
278a035699J45386o51898J35265J20353j42309j60635L90270K71282j56543J99144
268h85384j99793k60317k04621J75762J81282J27377r8887j69812L6724j38718
258a436387J20844n79055N21869N81405N7561j50223K36402R4115n16204m4539
248a114212N49753j57861o71237j39050L23346O55135m76529n91270K52238K47345
$$ plain form
319 -1231405 -1129237 -1354665 -1714761 -1761605 -1363884 -1476612 -1223928 -964482 -406015 -228289
309 -228289 -875262 -839022 -969851 -331648 -174096 -789387 -904235 -936038 -740646 -584733
299 -584733 -623403 -882132 -881766 -952794 -1388437 -479939 -587092 -1225780 -1171108 -1435612 -1412561
288 -1412561 -1247787 -854558 -1060192 -1278185 -911881 -1141749 -1193703 -757886 -1261428 -1035699
278 -1035699 -890313 -1542211 -1406946 -1286593 -1428902 -1589537 -1199267 -927985 -1084528 -885384
268 -885384 -1085177 -1345494 -1550115 -1374353 -1193071 -1065694 -1164581 -1334393 -1297669 -1436387
258 -1436387 -1315543 -1894598 -1372729 -791324 -733763 -883986 -647584 -553469 -1069673 -1114212
248 -1114212 -564459 -722320 -1393557 -1532607 -1209261 -554126 -1030655 -1621925 -1369687 -1122342
238a122342j16283J01985K89149l28280J57331j34976j98105m48365K5501Q59301
228i15084l5166K75274p6002o58432l45960M28122j46913L9874O53150n83389
218a364526K3388j82432n4341o2302n9205Q6399P9679K20275K10491L5226J98149
207h69199n9430j42871p1902k6796K27163k70768L04231J20155l29265o1813m6557
196a227052l0182p283L04171J30926l37072m98093J6540M69355K36148J61321
186g81221k88475L73664L33788P6993j058285L0351q4333m7173J30788M45234
176h68669r6696k75305m78039K55195L40435m63125p8085l18957L49674K25579
166a407993K83515j18753j97060J25981J53982j59185m8725l54074l71505K51515
$$ plain form
238 -1122342 -1238625 -1136640 -847491 -1175771 -1018440 -1153416 -1351521 -1799886 -1774385 -915084
228 -915084 -950250 -674976 -750978 -1409410 -1755370 -1327248 -1474161 -1434287 -781137 -1364526
218 -1364526 -1341138 -1523570 -1577911 -1640213 -1699418 -1613019 -1533340 -1313065 -1102574 -1067348 -869199
207 -869199 -928629 -1071500 -1143402 -1170198 -943035 -1213803 -909572 -789417 -1118682 -1180495 -1227052
196 -1227052 -1257234 -1264517 -960346 -829420 -1166492 -1664585 -1648045 -1178690 -942542 -781221
186 -781221 -1069696 -696032 -362244 -285251 -1343536 -1313185 -1397518 -1444691 -1313903 -868669
176 -868669 -965365 -1240670 -1718709 -1463514 -1123079 -1586204 -1664289 -1983246 -1633572 -1407993
166 -1407993 -1124478 -1243231 -1440291 -1314310 -1160328 -1319513 -1368238 -1722312 -2093817 -1842302
156a842302P20260M19960k90704k28491k91314k58377N76485M09206l46662n34920
146a666859n25284j26258O55134L26627J64316L04276r5346o39113Q2441l07697
136a827763k3082J91653j38404m2628j78871K00404J76603L49011K56872l20147
126a356352j34003j51313O7001K64567m80596K30535j76689k50385K94391L93746
116a299098k81585M29617k45859r8177m18746l33627N6123L11338L83422M63942
106a032650M57303k59711m95468j24607L33396j79608K27456j24550k35130k14140
96a647709n8339r4852M7356q589j70462M65292l07703K6720k65926k16506r3350
85b324068Q5214P02548M82915k87830m55110Q0519K58490J40619n15158M76952
$$ plain form
156 -1842302 -1122042 -702082 -992786 -1221277 -1512591 -1770968 -1194483 -785277 -1131939 -1666859
146 -1666859 -2192143 -2318401 -1663267 -1336640 -1172324 -868048 -963394 -1602507 -1520066 -1827763
136 -1827763 -1850845 -1659192 -1797596 -1840224 -2019095 -1818691 -1642088 -1293077 -1036205 -1356352
126 -1356352 -1490355 -1641668 -1574667 -1310100 -1790696 -1560161 -1736850 -1987235 -1692844 -1299098
116 -1299098 -1580683 -1151066 -1396925 -1495102 -1913848 -2247475 -2191352 -1880014 -1496592 -1032650
106 -1032650 -575347 -835058 -1330526 -1455133 -1121737 -1301345 -1073889 -1198439 -1433569 -1647709
96 -1647709 -1706048 -1800900 -1753544 -1762133 -1932595 -1467303 -1775006 -1748286 -2014212 -2230718 -2324068
85 -2324068 -2238854 -1536306 -1053391 -1341221 -1796331 -1715812 -1457322 -1316703 -1831861 -1354909
75a354909k44174L33348K21764m2359m10172m7836r0854L17137L42826l83054
65a358283k55337J96997J4622K36463m63358p3884K93820R0878O3693m14022J21096
54a547315J61441j11464j68899J71418j36301m83638q7023M19901J05696k1026
44a697210L35445K08014j03455j09181l47885L48970k41600m40599o1545L01104
34a807942j09602k36661L36870l01863j5263J58713l9166O8892n891m7631K57805
23a741739j26455j75259J98625J35037k35878M1468L2663j04871Q1273r0210K14478
12a770868M79755l95295K14389j96516k64792M75245n8118j62561J17536J81331
2a379894m67552l00090
$$ plain form
75 -1354909 -1599083 -1265735 -1043971 -1086330 -1496502 -1544338 -1635192 -1318055 -975229 -1358283
65 -1358283 -1613620 -1416623 -1402001 -1165538 -1628896 -1702780 -1408960 -1318082 -1254389 -1668411 -1547315
54 -1547315 -1385874 -1497338 -1666237 -1494819 -1631120 -2114758 -2201781 -1781880 -1676184 -1697210
44 -1697210 -1361765 -1153751 -1257206 -1366387 -1714272 -1365302 -1606902 -2047501 -2109046 -1807942
34 -1807942 -1917544 -2154205 -1817335 -2119198 -2134461 -1975748 -2014914 -1946022 -1951913 -1999544 -1741739
23 -1741739 -1868194 -2043453 -1844828 -1709791 -1945669 -1904201 -1871538 -1976409 -1895136 -1985346 -1770868
12 -1770868 -1291113 -1686408 -1472019 -1668535 -1933327 -1458082 -1516200 -1678761 -1561225 -1379894
2 -1379894 -1847446 -2147536
0b147536
$$ plain form
0 -2147536
$$ Imaginary data points
##PAGE= N=2
##DATA TABLE= (X++(I..I)), XYDATA
16383d900927j94858M1969M65342o7954J65264j71793k63009K04848L47858L20559
16373d052701k14006N4480K80594n16475m7215M37218k8193j99253K36546K03676
16363c845329k63865J03292L65224O7878p418R5743J10613j79071L00423l2792
16353c285302K06429P7906K68098l5980p8247j744k40995M40575l80287o6170
16343c095717K3517N11966M72706k96011r5503M08437N1497k27981l6080K37257
16333b045912K237J1103L4468k10961r1670L6041L11116j36575k84093K5577J10368
16322b238301L29866J83909L88383l11234l5127K21304M64328p67951M34753R0223
16312a239847J8510K83741J68299L0423k27424L37946K27004j5195k76105m6314
$$ plain form
16383 -4900927 -5095785 -5053816 -4588474 -4656428 -4491164 -4662957 -4925966 -4721118 -4373260 -4052701
16373 -4052701 -4266707 -4212227 -3931633 -4448108 -4495323 -4058105 -4086298 -4285551 -4049005 -3845329
16363 -3845329 -4109194 -4005902 -3640678 -3572800 -3580218 -3484475 -3373862 -3552933 -3252510 -3285302
16353 -3285302 -3078873 -3000967 -2732869 -2768849 -2847096 -2848840 -3089835 -2649260 -3029547 -3095717
16343 -3095717 -3072200 -2560234 -2087528 -2383539 -2479042 -2070605 -2019108 -2247089 -2283169 -2045912
16333 -2045912 -2043675 -2032572 -1998104 -2209065 -2300735 -2264694 -1953578 -2090153 -2374246 -2348669 -2238301
16322 -2238301 -1908435 -1724526 -1336143 -1647377 -1682504 -1461200 -996872 -1764823 -1330070 -1239847
16312 -1239847 -1221337 -937596 -769297 -738874 -966298 -628352 -401348 -416543 -692648 -738962
16302g38962J61122J77520N97000p12570k67877N27747k01199k07575J53671M81137
16292b9986M85536j13264l21269M11999j55797o5611o3633Q1424L24684K11472
16282G65555j92345L05930m38678n2693j14369M82458J57084M3613K60169n9448
16272A157276j37973k25087K14136j95726k73960L73094J04764j29496K36752
16263A123780q0418M875K60424m71313o2716k99043M87781m3372j21562K82610
16253A081046O58011O8468l64851m22875L80186j0633j52041J6640j3693L70504
16243A610762O22930k16796k76391L68196O4717J06131n08328L6438k62162J39277
16233A684774Q07076o9603k07600P6853O98544o4677l67015J02553k99236J6817
$$ plain form
16302 -738962 -577840 -400320 196680 -515890 -783767 -256020 -457219 -664794 -511123 -29986
16292 -29986 455550 342286 21017 433016 277219 211608 147975 229399 554083 765555
16282 765555 573210 879140 440462 387769 273400 755858 912942 956555 1216724 1157276
16272 1157276 1019303 794216 1008352 812626 538666 911760 1016524 887028 1123780
16263 1123780 1043362 1048237 1308661 837348 774632 475589 963370 919998 798436 1081046
16253 1081046 1739057 1807525 1442674 1019799 1399985 1389352 1237311 1253951 1240258 1610762
16243 1610762 2233692 2016896 1740505 2108701 2173418 2279549 1771221 1807659 1545497 1684774
16233 1684774 2491850 2422247 2214647 2291500 2990044 2925367 2558352 2660905 2361669 2378486
16223B378486L05662K14849j32991K06358k06154m10259J96173j51192J39183
16214B540115J57388K5794n6739j39817L9601P9841Q2950J59042k06176l85659
16204B296340M11001P68060J40147j54470j80954L4616j52889j83848L73419J36458
16194C487880l20862J9720L64708n20286J10602K42290j38707K33500n18732k16378
16184B743735L70885M41588j49947k6380L58856k27766J00894L7334L28017l9807
16174C937409n80364J34136o2648k62539O88215j16988R6010p5275l10071K96341
16164C744226J45792n35552k8845M40647k95793J74661K27741j90355j72255k16838
16154C293429N08478J30863l41737o66629J71930J4713J63488O72123N23551r21939
$$ plain form
16223 2378486 2684148 2898997 2766006 2972364 2766210 2355951 2552124 2400932 2540115
16214 2540115 2697503 2723297 2666558 2526741 2566342 2646183 2729133 2888175 2681999 2296340
16204 2296340 2707341 3475401 3615548 3461078 3280124 3314740 3161851 2978003 3351422 3487880
16194 3487880 3167018 3186738 3551446 3031160 3141762 3384052 3245345 3478845 2960113 2743735
16184 2743735 3114620 3556208 3406261 3379881 3738737 3510971 3611865 3649199 3977216 3937409
16174 3937409 3357045 3491181 3428533 3165994 3854209 3737221 3833231 3757956 3447885 3744226
16164 3744226 3890018 3354466 3325621 3766268 3470475 3645136 3872877 3682522 3510267 3293429
16154 3293429 3801907 3932770 3591033 2924404 3096334 3111047 3274535 3946658 4470209 3548270
16144C548270O44506M8907k0710n782n5757k0145m36438j6525k55804q5142k10836
16133C134544L11567P0084m3777J34301K78007k28634M22638K85665K80780O9262
16123D714437m22993K13606m61393n17168k42131L95530Q7957K90340L66627Q0889
16113D505701R325k28286L1493l96114J11423k92932p6737O70361Q921J0624J21931
16102D475710j27307k20691K5051L45333j64483j01347M78425J09157l4659p1228
16092D713961r9706N005K29955n41m75058O19392m84224q63018k99592L46406
16082C692580K68440J94223N24832K90956n29739m37963J72716k5890L50337L02800
16072D803292o23881K85963M09635L36468o49657m76902k42868l49940M16210
$$ plain form
16144 3548270 4192776 4241683 4220973 4215191 4159434 4139289 3702851 3686326 3430522 3345380 3134544
16133 3134544 3446111 3516195 3472418 3606719 3884726 3656092 4078730 4364395 4645175 4714437
16123 4714437 4291444 4505050 4043657 3526489 3284358 3679888 3767845 4058185 4424812 4505701
16113 4505701 4515026 4286740 4318233 3922119 4033542 3740610 3663873 4334234 4343155 4353779 4475710
16102 4475710 4348403 4127712 4152763 4498096 4333613 4232266 4710691 4819848 4785189 4713961
16092 4713961 4614255 4619260 4849215 4848674 4373616 4993008 4508784 3645766 3346174 3692580
16082 3692580 3961020 4155243 4680075 4971031 4441292 4003329 4176045 4150155 4500492 4803292
16072 4803292 4179411 4465374 4875009 5211477 4561820 4084918 3842050 3492110 3908320
16063C908320J48713j11150j2014k94138N2839L50481L87863k40401K82413j72289
16053D300637m72759P28600m81901k79952L32037J51567L09356K56555n23775
16044D320365p04353K01471q4967J22647N67361K14623o6877J67401q9274j39250
16034D509147j26727J7177L63431K7341l24613n30420m63822k7365p23M06148
16024C849574N77116j74863q7462L77207n5345m14128M2529P08975J26087r28894
16014D020796j50392M32030O15742m17621N38959r7063o19037M330o1567N04297
16004D770474l3797r12402K96750L14551q38002l46812N69634M97888j90072k52950
15994C875262K10331J15424n8514J232R7896l19941Q9964L84656q77937l82460
$$ plain form
16063 3908320 4057033 3945883 3933869 3639731 3692570 4043051 4430914 4190513 4472926 4300637
16053 4300637 3827878 4556478 4074577 3794625 4126662 4278229 4587585 4844140 4320365
16044 4320365 3616012 3817483 3732516 3855163 4422524 4637147 4570270 4737671 4648397 4509147
16034 4509147 4382420 4399597 4763028 4790369 4465756 3935336 3471514 3444149 3443426 3849574
16024 3849574 4426690 4251827 4164365 4541572 4486227 4072099 4114628 4823603 4949690 4020796
16014 4020796 3870404 4302434 4918176 4500555 5039514 4942451 4323414 4327744 4266177 4770474
16004 4770474 4736677 3824275 4121025 4435576 3597574 3250762 3820396 4318284 4128212 3875262
15994 3875262 4085593 4201017 4142503 4143735 4241631 3921690 4011654 4396310 3518373 3135913
15984C135913M70600K10866K07013L84004R9281M31350m13315k67894M15032O67345
15974E340195m89525J48261n07070Q6051n0652j73756R2273p3792R4742o52729
15964C813998L5221Q02969l28215O74n1392J76366J3761l53114K27165J35304
15954D472737K22778j26676j79903j38483m2029P6572J5559O4243O46558J0526
15944E021882m8422q09520j78714j50359Q2563M98055j73819P8671O03804k59121
15934D665020l54867r4637J66688j80528M68705q2847l68065k07397M02113j65831
15924D248354O5187j29192l1459R4004R6736K58736k89871m38198K07305j72542
15914C909060L50335j49948k23515j31151K76241K71985j75824k7332O0722J43897
$$ plain form
15984 3135913 3606513 3817379 4024392 4408396 4507677 4939027 4525712 4257818 4672850 5340195
15974 5340195 4850670 4998931 4491861 4577912 4527260 4353504 4445777 4371985 4466727 3813998
15964 3813998 3849219 4652188 4323973 4324647 4273255 4449621 4463382 4110268 4337433 4472737
15954 4472737 4695515 4568839 4388936 4250453 4208424 4284996 4300555 4364798 5011356 5021882
15944 5021882 4973460 4163940 3985226 3834867 3917430 4415485 4241666 4320337 4924141 4665020
15934 4665020 4310153 4215516 4382204 4201676 4670381 4587534 4219469 4012072 4414185 4248354
15924 4248354 4313541 4184349 4152890 4246894 4343630 4602366 4312495 3874297 4081602 3909060
15914 3909060 4259395 4109447 3885932 3754781 4031022 4303007 4127183 4099851 4160573 4304470
15904D304470n6622j01987j53039k84044j58923L68773n0203O03643K17763j94649
15894D495182n60033k75662L27572p4627p01225K00199L1279J78660L20166j14910
15884C826601K44549M39966q71659o3880P90753J86726J12392K03628k52034q0925
15874D536117L40166k23153j75964J29424L07289l94153k4721k59076M08262o21076
15864D023115j68082p2723M27091N98444j62982J7224k46347q4200o8457n55841
15854C707242N03894M09998l66110k90083l99471N83506m17982M20444k59445
15845C891993O8374M70697K15031M94392o72754l72434R3592L9193L47877l85485
15835D190476j63074M39081M42799m37083j18589k04087L24577l12311N02484
$$ plain form
15904 4304470 4247848 4145861 3992822 3708778 3549855 3918628 3868425 4472068 4689831 4495182
15894 4495182 3935149 3659487 3987059 3912432 3211207 3411406 3442685 3621345 3941511 3826601
15884 3826601 4071150 4511116 3639457 3575577 4366330 4553056 4665448 4869076 4617042 4536117
15874 4536117 4876283 4653130 4477166 4606590 4913879 4519726 4495005 4235929 4644191 4023115
15864 4023115 3855033 3782310 4209401 4807845 4644863 4662087 4415740 4331540 4263083 3707242
15854 3707242 4211136 4621134 4255024 3964941 3565470 4148976 3730994 4151438 3891993
15845 3891993 3960367 4431064 4646095 5140487 4467733 4095299 4188891 4228084 4575961 4190476
15835 4190476 4027402 4466483 4909282 4472199 4353610 4149523 4474100 4161789 4664273
15826D664273m04506k50060J59708k54110J24085L48679j65997k09625L1932N68873
15816D613252k02549K28065m80901j41199J72815j74903Q21825j05920k43272
15807D487213O8474r0861l21742j80098O10135O05106j45955k68065k00041p28706
15797C835460k14729j726J21742K34373L20217l13878J65080m8382q4390K60352
15787D274119l15854K12214j32607K71197m3373k28557j07385M61090l86492O26180
15777D630532n73619l39573K3593L44805J91727L64681n65239j92639L22219k1486
15767D185001r1574j65283j53773J917J52406L48501L69735K28216k84120m2144
15757D548882N1247k17395m00339M3076N17212j81607L10877L18n0033l77866
$$ plain form
15826 4664273 4259767 4009707 4169415 3915305 4039390 4388069 4222072 4012447 4044379 4613252
15816 4613252 4410703 4638768 4157867 4016668 4189483 4014580 4836405 4730485 4487213
15807 4487213 4555687 4464826 4143084 3962986 4573121 5178227 5032272 4764207 4564166 3835460
15797 3835460 3620731 3619005 3740747 3975120 4295337 3981459 4146539 4098157 4013767 4274119
15787 4274119 3958265 4170479 4037872 4309069 4265696 4037139 3929754 4390844 4004352 4630532
15777 4630532 4056913 3717340 3740933 4085738 4277465 4642146 4076907 3884268 4206487 4185001
15767 4185001 4093427 3928144 3774371 3776288 3928694 4277195 4646930 4875146 4591026 4548882
15757 4548882 4600129 4382734 3982395 4025471 4542683 4361076 4671953 4672271 4622238 4244372
15747D244372k37882K21791j71036K6496M55359K54175o35133M83858J46881r9036
15737D689845o18227j98860N44783J71543K83009m99846q1356q5020k03424O00714
15727D603161P32624m65081o95814J25063K49350l00329L7397m49818L95633K50235
15717D482421J08764o21402J4497L64893K04328N60300p79713Q0246o7916k41496
15707D104922P96956n89872j31265J33275o52166M92673J57399N41815L4655m24208
15697D464184k25001M95772k66197r5410K99831K59946j73785k97347M05879j85171
15687D682701r0925l72880K18065J27775O40164K83076l35436j47364l10981m52016
15677D242179k66375J23448O1574N66710Q5349k30830j14053M21409K39696r53746
$$ plain form
15747 4244372 4006490 4228281 4057245 4083741 4539100 4793275 4158142 4642000 4788881 4689845
15737 4689845 4071618 3872758 4417541 4589084 4872093 4372247 4290891 4205871 4002447 4603161
15727 4603161 5335785 4870704 4174890 4299953 4549303 4248974 4286371 3836553 4232186 4482421
15717 4482421 4591185 3969783 3984280 4349173 4553501 5113801 4334088 4414334 4346418 4104922
15707 4104922 4901878 4312006 4180741 4314016 3661850 4154523 4311922 4853737 4888392 4464184
15697 4464184 4239183 4734955 4468758 4373348 4673179 4933125 4759340 4461993 4867872 4682701
15687 4682701 4591776 4218896 4436961 4564736 5204900 5487976 5152540 5005176 4694195 4242179
15677 4242179 3975804 4099252 4160826 4727536 4812885 4582055 4468002 4889411 5129107 4175361
15667D175361R1348K5454k71596j97350N51626j5850k11563J9334k44820K723
15657C924667N25295J63578m60613j2536M41636O29838l49596n77119r7241k18764
15647C969145M99853R44314r5037k48421l57252k52894l09644K22084L43496K74607
15637D990251l82416L05298J82398l35650m5867N8428n27207j99149J27561K30225
15627D403872l6797k43470N6676P3955N72251m96839L11686J14057n97807J97659
15617D355243L22835l82300m55082L35233R8362K78450k65641j18551O5170n82461
15607C651258O65127O87177j19778J59128K09317p6828P8454o41614P2100l27383
15597D356958J9247K91286l04843M18215j80379l97471L66511O23j56633O27955
$$ plain form
15667 4175361 4266709 4292163 4020567 3823217 4374843 4358993 4147430 4166764 3921944 3924667
15657 3924667 4449962 4613540 4152927 4140391 4582027 5211865 4862269 4285150 4187909 3969145
15647 3969145 4468998 5413312 5318275 5069854 4712602 4459708 4150064 4372148 4715644 4990251
15637 4990251 4607835 4913133 5095531 4759881 4714014 4772442 4245235 4046086 4173647 4403872
15627 4403872 4367075 4123605 4180281 4254236 4826487 4329648 4641334 4755391 4157584 4355243
15617 4355243 4678078 4295778 3840696 4175929 4274291 4552741 4287100 4168549 4233719 3651258
15607 3651258 4316385 5003562 4883784 5042912 5252229 5175401 5253855 4612241 4684341 4356958
15597 4356958 4376205 4667491 4362648 4780863 4600484 4203013 4569524 4570147 4413514 5041469
15587E041469m65526m266j96640j89197Q93024m56965k57122K98744m387p6899
15577D582235J18415p952l77150n0161L99156m4447n75363n55557Q18744M93594
15567D801514k35589r46m21917o42513J51143m98761Q85965K58606l51682N24997
15557D470817J52185l02618j91787K82759J76040j30300k41228l45704K05263
15548D075427L80103m5520K39041k14959j00128j68944N59109N121J94190K54395
15538E177835O8649k27688j66999j61420l57619M70200n33370o23507O05361j99274
15528D052168n6867L49708K99449k81211J20057q9262K2474L28184J57486k44516
15518D657670j57986J14363P61810p4628o99118L08907J88168j87705o41383Q1303
$$ plain form
15587 5041469 4575943 4571677 4375037 4185840 5078864 4621899 4364777 4663521 4659134 4582235
15577 4582235 4700650 4692698 4315548 4265387 4664543 4620096 4044733 3489176 4307920 4801514
15567 4801514 4565925 4564979 4143062 3500549 3651692 3152931 4038896 4297502 3945820 4470817
15557 4470817 4623002 4320384 4128597 4411356 4587396 4457096 4215868 3870164 4075427
15548 4075427 4455530 4410010 4649051 4434092 4333964 4165020 4724129 4729250 4923440 5177835
15538 5177835 5246484 5018796 4851797 4690377 4332758 4802958 4269588 3646081 4251442 4052168
15528 4052168 3995301 4345009 4644458 4363247 4483304 4394042 4416516 4744700 4902186 4657670
15518 4657670 4499684 4614047 5375857 5301229 4602111 4911018 5099186 4911481 4270098 4351401
15508D351401L30744O95040n86353n18833N58870k1269k20553J38367M03984m12018
15498D719380n75792k11169K41941m0241k99075N58031K55281l39230L87784j524
15488D695386J30427j41736k00104j65136K30468M48477k02360J033l79777k67980
15478D148698N09377L14265n56947J88227O39279m40187l91083k07428J37625
15469D341826M36110j41336j58631k50749j80353j09444Q60442M19386q8741k62117
15459D866393m22155K04684K37319M40033l91654m29796L8180J05175j42220m10754
15449D095205K14109M6177K21137l17321K95211M47088k64657l55055o7620K65829
15439D580103j54742j38264N14813J61020o30772K62055k61298M05180o59585
$$ plain form
15508 4351401 4682145 5377185 4790832 4271999 4830869 4809600 4589047 4727414 5131398 4719380
15498 4719380 4143588 3932419 4174360 4134119 3835044 4393075 4648356 4309126 4696910 4695386
15488 4695386 4825813 4684077 4483973 4318837 4549305 4997782 4795422 4796455 4416678 4148698
15478 4148698 4658075 4972340 4415393 4603620 5242899 4802712 4411629 4204201 4341826
15469 4341826 4777936 4636600 4477969 4227220 4046867 3937423 4797865 5217251 5128510 4866393
15459 4866393 4444238 4648922 4886241 5326274 4934620 4504824 4543004 4648179 4505959 4095205
15449 4095205 4309314 4355491 4576628 4259307 4554518 5001606 4736949 4381894 4314274 4580103
15439 4580103 4425361 4287097 4801910 4962930 4332158 4594213 4332915 4738095 4078510
15430D078510p9476J97838R39652J3086m35081q3449k46059N43376p3144K44985
15420E100238o39270n73104J77842L18333M08827J23775j42130l9605j21788J01774
15410D714892M4203K54453m25639K1940J0899k07291n43628n5286J82163L27681
15400D324387M18466K33053l23624j25946k95196k46570K64900j10221j8418N54167
15390D674998J81655L04236L44505l36005l64055P8252L98295K40948O3830m10920
15380E175739o36887j56890J48625L19629l65211J7365m62638l64312O06217K75633
15370D557270L0112k24882J89490J60810M40054n55483j6565m79809K97008k98867
15360D099138j5278K47625k85688N82451N14897p43292j15266K37163k33631K35119
$$ plain form
15430 4078510 3999034 4196872 5136524 5149610 4714529 4631080 4385021 4928397 4855253 5100238
15420 5100238 4460968 3887864 4065706 4384039 4792866 4916641 4774511 4734906 4613118 4714892
15410 4714892 4759095 5013548 4587909 4609849 4620748 4413457 3869829 3814543 3996706 4324387
15400 4324387 4742853 4975906 4652282 4526336 4231140 3984570 4249470 4139249 4120831 4674998
15390 4674998 4856653 5160889 5505394 5169389 4805334 4883586 5281881 5522829 5586659 5175739
15380 5175739 4538852 4381962 4530587 4850216 4485005 4502370 4039732 3675420 4281637 4557270
15370 4557270 4587382 4362500 4551990 4712800 5152854 4597371 4580806 4100997 4398005 4099138
15360 4099138 4083860 4331485 4045797 4628248 5143145 4399853 4284587 4521750 4288119 4523238
15350D523238K26481j20402m2292K46259m91252K19288J49214J3539l56541k6867
15340D340665K50913j3521O4481R54469k81984q15817l09606O82613J86638k61924
15330D796927k46381N16715Q2614o41848L20944O1096m44206K46538j1667J66417
15320D847149l69920K14201Q4778n49499N9968j709j93383J12612k84034o5741
15310C854422P02216M12762n14314j11793L27921k44896M53120P8039J49393j6537
15300E090333l19165o4718K38645o7595l96704n02802J72529J27878J64390L16273
15290D759064J28066k98524k61449m0434L69731o68595Q5369j19133L09940J9672
15280D283707j89301L67546J43247j82223l86975N67733q4605m49632m10797L07768
$$ plain form
15350 4523238 4749719 4629317 4587025 4833284 4342032 4561320 4710534 4724073 4367532 4340665
15340 4340665 4591578 4578057 4642538 5597007 5315023 4499206 4189600 4872213 5058851 4796927
15330 4796927 4550546 5067261 5149875 4508027 4828971 4890067 4445861 4692399 4680732 4847149
15320 4847149 4477229 4691430 4776208 4226709 4286677 4284968 4091585 4204197 3920163 3854422
15310 3854422 4556638 4969400 4455086 4343293 4671214 4426318 4879438 4957477 5106870 5090333
15300 5090333 4771168 4706450 4945095 4877500 4480796 3977994 4150523 4278401 4442791 4759064
15290 4759064 4887130 4588606 4327157 4286723 4656454 3987859 4073228 3954095 4264035 4283707
15280 4283707 4094406 4461952 4605199 4422976 4036001 4603734 4519129 4069497 3658700 3966468
15270C966468L45404L30652K31194k79831k1568l03058m9286n20665J46179J98769
15260D044258J27099L0002r5826J95484J16888M40479l31970q7623L56635O8299
15250D863725N18909k60559j52803l38038M54729k19881p9749O75071l83834m78552
15240D599018l10952J31176M7170j76382k23322J12274J30739k86640Q4127L70115
15230D477323n77419O02914J58961j06799J94132k36367n58656j22020J09024
15221C941093R31386L68209n77659l07055r8933Q12346L54031r87220l5142K29455
15211D630511M71621k46215k72918L55890l24402n6779J14557j59005L29121l7519
15201D804862m21626J98713Q3131M29860n18281q4488l6743K26524J83168K96726
$$ plain form
15270 3966468 4311872 4642524 4873718 4593887 4572319 4269261 4219975 3699310 3845489 4044258
15260 4044258 4171357 4201359 4105533 4301017 4417905 4858384 4526414 4438791 4795426 4863725
15250 4863725 5382634 5122075 4969272 4631234 5085963 4866082 4786333 5461404 5077570 4599018
15240 4599018 4288066 4419242 4466412 4290030 4066708 4178982 4309721 4023081 4107208 4477323
15230 4477323 3899904 4502818 4661779 4554980 4749112 4512745 3954089 3832069 3941093
15221 3941093 4872479 5240688 4663029 4355974 4257041 5069387 5423418 4436198 4401056 4630511
15211 4630511 5102132 4855917 4582999 4938889 4614487 4557708 4672265 4513260 4842381 4804862
15201 4804862 4383236 4581949 4665080 5094940 4576659 4492171 4455428 4681952 4865120 5161846
15191E161846J11299m79792n19849M25615k86420m3569N2110L13670O35658q5117
15181E285451j40983m13607p65413J82335K06459l2296M56088O041Q6391J39623
15171E010089l61869m97061Q3841j40545L02007L24531p7044J3818L09979k37319
15161D730427k46453j36246N01318j59891J96482J62381j68255l12505L26778
15152D894036J92963K1224P8698M64783m32848k59368m38166N8020R6927j07474
15142D568795R8419L4647K62028j87878k63182K5098P2766R2061L85843l55216
15132D733381o4571N55509J91490K9808m52656k65273l53617J20066m1388J8998
15122D471747k57148j73189N62391l62505l83115K10107J23602N6581L86391o1475
$$ plain form
15191 5161846 5273145 4793353 4273504 4699119 4412699 4369130 4421240 4734910 5370568 5285451
15181 5285451 5144468 4730861 3965448 4147783 4354242 4321946 4778034 4784075 4870466 5010089
15171 5010089 4648220 4151159 4235000 4094455 4396462 4720993 4643949 4657767 4967746 4730427
15161 4730427 4483974 4347728 4849046 4689155 4885637 5048018 4879763 4567258 4894036
15152 4894036 5086999 5108223 5186921 5651704 5218856 4959488 4521322 4579342 4676269 4568795
15142 4568795 4667214 4701861 4963889 4776011 4512829 4537927 4610693 4702754 5088597 4733381
15132 4733381 4668810 5224319 5415809 5445617 4992961 4727688 4374071 4494137 4452749 4471747
15122 4471747 4214599 4041410 4603801 4241296 3858181 4068288 4191890 4248471 4634862 4573387
15112D573387J76428l29821J42139N01359Q8849j1341K77619m89259m75305P8168
15102D532223L59863l14813o7211j72842j44815L89904K42809l5780J10064n2166
15092D847236P238j99967m19838n32827M96261J55796N3686q0289J14688J384
15082D443368J48916P8443J0695M2681O7536P51692o33981l70347L08539j31977
15072D715565k25231Q49109m78209o10198Q2148L47513K37321N28593j57459o01404
15062D687748k2649L98782j20777m67739K85437j65820l33490O09991P24070l93760
15052E201793j71323k78553K05274o37427j38227O70959p8486L5720j62652n05487
15042D141591L91066k276k62874O1967j74102N95215l64904K6127O56473k30557
$$ plain form
15112 4573387 4749815 4419994 4562133 5063492 5152341 5141000 5418619 4929360 4454055 4532223
15102 4532223 4892086 4577273 4510062 4337220 4192405 4582309 4825118 4789338 4899402 4847236
15092 4847236 4854474 4654507 4234669 3701842 4198103 4353899 4407585 4327296 4441984 4443368
15082 4443368 4592284 4670727 4681422 4724103 4791639 5543331 4909350 4539003 4847542 4715565
15072 4715565 4490334 5339443 4861234 4251036 4333184 4680697 4918018 5446611 5289152 4687748
15062 4687748 4665099 5063881 4943104 4475365 4760802 4594982 4261492 4871483 5595553 5201793
15052 5201793 5030470 4751917 4957191 4319764 4181537 4852496 4774010 4809730 4647078 4141591
15042 4141591 4532657 4530381 4267507 4329474 4155372 4750587 4385683 4411810 5068283 4837726
15032D837726l25995K1757J11032R9843k55247o32988K14090O60937L47979q00848
15022D278286q190R40151k83667j62915m4121K49186J29570p93922M50376K80241
15012E034995j85199j88942k426M99834o8755j15666p45642M9707N56300O3555
15002D897761L50361l71564n81235p9935L20142L04271K40549m37967l51395L21237
14992D612225q89324r965L01237Q4214K16790j14572J82881Q6794J36186K01386
14982D807852M91707n32969n06468K47606K91923j5205K5802m14721J36901L30122
14972D862550k87559m22779m4942R42823k91576k2505j98395J94676K09639j60182
14962D781750m83254k77904L13491k428N8164k4878M41582m22777J15925J50031
$$ plain form
15032 4837726 4511731 4533488 4644520 4744363 4489116 3856128 4070218 4731155 5079134 4278286
15022 4278286 4270096 5210247 4926580 4763665 4719544 4968730 5098300 4304378 4754754 5034995
15012 5034995 4849796 4660854 4658428 5158262 5089507 4973841 4228199 4277906 4834206 4897761
15002 4897761 5248122 4876558 4295323 4215388 4535530 4839801 5080350 4642383 4290988 4612225
14992 4612225 3722901 3712936 4014173 4098387 4315177 4200605 4383486 4470280 4606466 4807852
14982 4807852 5299559 4766590 4260122 4507728 4799651 4784446 4810248 4395527 4532428 4862550
14972 4862550 4574991 4152212 4107270 5050093 4758517 4736012 4537617 4732293 4941932 4781750
14962 4781750 4298496 4020592 4334083 4331655 4389819 4364941 4806523 4383746 4499671 4649702
14952D649702J69434m09293J63362P30567p561l87578p3058q1053q5332L27607
14942D996797m68105j49913L01484M00553p0243l77834K6620O04548k71720l03848
14932D688339m98436n8843j05096j0212M66554J27679m90559Q7696L52864l90202
14922D169784K8081K22365k83952M28106K06028L73519l1778o77963J39643L55605
14912D929438p4594j08794p1744J91743J33326j3010r6733j61977j36699R224
14902D600180K30889m22149Q0645J88940J60468M37973k51398o07366J68825j12396
14892D474611l68325O47269k83902M87082M20928j022801K82253Q21377K10343
14883E668835l15796l81842n8739o39386Q3097L77509K59975m6131k78647N5694
$$ plain form
14952 4649702 4819136 4409843 4573205 5303772 5296211 4908633 4835575 4754522 4669190 4996797
14942 4996797 4528692 4378779 4680263 5080816 5010573 4632739 4659359 5263907 4992187 4688339
14932 4688339 4189903 4131060 4025964 4015752 4482306 4609985 4119426 4207122 4559986 4169784
14922 4169784 4197865 4420230 4136278 4564384 4770412 5143931 5112153 4434190 4573833 4929438
14912 4929438 4854844 4746050 4674306 4866049 4999375 4986365 4889632 4727655 4590956 4600180
14902 4600180 4831069 4408920 4489565 4678505 4838973 5276946 5025548 4418182 4587007 4474611
14892 4474611 4106286 4753555 4469653 4956735 5377663 4354862 4637115 5458492 5668835
14883 5668835 5353039 4971197 4912458 4273072 4356169 4733678 4993653 4947522 4668875 4724569
14873D724569L07413M9646l80038k53001N62493K31944k2203j20913l81433P4794
14863D793271p2677N767L17734j02064p76397Q87576P9732J56936M9627M0903
14853E380408M5754k07252l00567l67710k18696L87790K7426J43842P8695k21514
14843D748176K69731m18666k18648n1261J05889Q38260L48236k06479n31237j61012
14833D722989N53430M2244j13776l69341k03865R8278P8377K54803k2988k32450
14823D807701j41482r7497k16815L84916L13580N50862m80726m63870L45722J13809
14813E116200n35646k26679k74997J01354K16010J99675J08600J44524k48849
14804D600192J64785q8255L61585J42153o22343l45023L13830k10930J38590O80620
$$ plain form
14873 4724569 5031982 5081628 4701590 4448589 5011082 5243026 5220823 5099910 4718477 4793271
14863 4793271 4720594 4726361 5044095 4942031 4165634 5053210 5132942 5289878 5339505 5380408
14853 5380408 5426162 5218910 4918343 4550633 4331937 4719727 4747153 4890995 4969690 4748176
14843 4748176 5017907 4599241 4380593 4329332 4435221 5273481 5621717 5415238 4884001 4722989
14833 4722989 5276419 5318663 5204887 4835546 4631681 4729959 4808336 5063139 5040151 4807701
14823 4807701 4666219 4568722 4351907 4736823 5050403 5601265 5120539 4656669 5002391 5116200
14813 5116200 4580554 4353875 4078878 4180232 4396242 4595917 4704517 4849041 4600192
14804 4600192 4764977 4676722 5038307 5180460 4558117 4213094 4526924 4315994 4454584 5135204
14794E135204m79065L36838K3677j34727m48279q9027J35700P10987l94088j35837
14784D661383J41011q7139M9098K8260o08536L92864M00976l69880k68744k13560
14774D125733N54721M56910n59180R6590N10840o0204m08409M517J41213m63325
14764D399406q106K98841O40201j56166m59202p5520N5778M25247J38224j68081
14754E090622N9981J07581m74807k32472K18190j52733l37623j27315O02553J93524
14744D947501m61684K5923K31545L17742p8516J98586l94848o62001k34411R0990
14734C980827J014335J45764J8339O89384n54734k73017n21449L04178Q8039l26791
14724D564875j83894m03931L76470K24120M7276L71353k76003K0418M6847P5119
$$ plain form
14794 5135204 4656139 4992977 5016654 4881927 4433648 4344621 4480321 5191308 4797220 4661383
14784 4661383 4802394 4715255 4764353 4792613 4184077 4576941 4977917 4608037 4339293 4125733
14774 4125733 4680454 5137364 4578184 4674774 5185614 5125410 4717001 4721518 4862731 4399406
14764 4399406 4391300 4690141 5330342 5174176 4714974 4639454 4695232 5120479 5258703 5090622
14754 5090622 5150603 5258184 4783377 4550905 4769095 4616362 4278739 4151424 4753977 4947501
14744 4947501 4485817 4511740 4743285 5061027 4982511 5181097 4786249 4124248 3889837 3980827
14734 3980827 4995162 5140926 5159265 5848649 5293915 5020898 4499449 4803627 4891666 4564875
14724 4564875 4380981 3977050 4353520 4577640 4624916 4996269 4720266 4740684 4787531 4862650
14714D862650j33716p7949N16950J8205l77217J44020k58085r90434O60676N79689
14704D944789m03570l72312N86373J18230L2854K62559l36015l27348l38210k7251
14694D140099O36606J46199k31771J95268O817r2902m26978L36072j74863M80474
14684E015021L92888j6683l02207m80025j42324J48412M92910l30812J70854l19980
14674D628054l1153J23483j18251k95666J06754N51465J38549n76129k76035K12926
14664D463997j69287l88111M88104Q08642J00732j66302L85544j81898J9603J53733
14654E514757m80111o66578K15107l40702M54935L75115o45798k39222J11186
14645D298689J77782O67675j59180j04695M2370p1222k6518n518Q6926k34976
$$ plain form
14714 4862650 4728934 4650985 5167935 5186140 4808923 4952943 4694858 3704424 4365100 4944789
14704 4944789 4541219 4168907 4755280 4873510 4906364 5168923 4832908 4505560 4167350 4140099
14694 4140099 4776705 4922904 4691133 4886401 4893218 4800316 4373338 4709410 4534547 5015021
14684 5015021 5407909 5391226 5089019 4608994 4466670 4615082 5107992 4777180 4948034 4628054
14674 4628054 4596901 4720384 4602133 4306467 4413221 4964686 5103235 4527106 4251071 4463997
14664 4463997 4294710 3906599 4394703 5203345 5304077 5137775 5523319 5341421 5361024 5514757
14654 5514757 5034646 4368068 4583175 4242473 4697408 5072523 4426725 4187503 4298689
14645 4298689 4476471 5144146 4984966 4880271 4922641 4851419 4824901 4819383 4906309 4671333
14635D671333o81168L56252K46315l190L23692P3764o730k44268k86817j81646
14625D267537K43058M31146M5331k52678J56079O9274J77663K27131l46866j41754
14615D875921P0460l5556J69900r9462j16900l0053L10049n83832K08297M50917
14605E219741J0048p16727o64070N97966L06230l97644M02876R892l44400K94570
14595D718482J95977l57555J22284M21794J25915m05380n2414Q83425o1999j114128
14585D476401J25367N44677j41589j13305N00930j17031m78043m94315K81438
14576D584530l00143P7162L74586n99214J92606L92698K12776r3794l36383P1345
14566D576169P5237O8718l71793m6693o17177J08452J284815o855o63198j29947
$$ plain form
14635 4671333 3990165 4346417 4592732 4589542 4913234 4986998 4980268 4736000 4449183 4267537
14625 4267537 4510595 4941741 4987072 4734394 4890473 4959747 5137410 5364541 5017675 4875921
14615 4875921 4946381 4910825 5080725 4981263 4864363 4834310 5144359 4560527 4768824 5219741
14605 5219741 5229789 4513062 3848992 4446958 4753188 4355544 4758420 4768312 4423912 4718482
14595 4718482 4914459 4556904 4679188 5100982 5226897 4821517 4769103 5652528 5590529 4476401
14585 4476401 4601768 5146445 5004856 4891551 5392481 5275450 4797407 4303092 4584530
14576 4584530 4284387 4361549 4736135 4136921 4329527 4722225 4935001 4841207 4504824 4576169
14566 4576169 4651406 4720124 4348331 4301638 3684461 3792913 5077728 5070873 4407675 4277728
14556D277728P07971R7319K58959p9260o7104k0682l36076j50718j07586J17412
14546D697963K00363p64371m17281J49312R78997M47066l28225O6335N1522K92746
14536E374427o1215J21519p8988k00587j53575K11556O2590l39543q0257j33194
14526D722733M51137N22346j39293k47254n70679j4705j48879M42959L61797n53812
14516D826350m20433j07293K61310J85254n6158L39386L19125l68048n7274K31018
14506E153237Q14773n86846p4787l15541j4178j13801P16347L54669m89662o39774
$$ plain form
14556 4277728 4985699 5083018 5341977 5262717 5195613 5174931 4838855 4688137 4580551 4697963
14546 4697963 4898326 4133955 3716674 3865986 4844983 5292049 4963824 5030159 5081681 5374427
14536 5374427 5313212 5434731 5355743 5155156 5001581 5213137 5275727 4936184 4855927 4722733
14526 4722733 5173870 5696216 5556923 5309669 4738990 4724285 4575406 5018365 5380162 4826350
14516 4826350 4405917 4298624 4559934 4745188 4689030 5028416 5347541 4979493 4922219 5153237
14506 5153237 5968010 5381164 5306377 4990836 4976658 4862857 5579204 5933873 5444211 4804437
$$ [...]
##END NTUPLES=NMR SPECTRUM
##END=
