##TITLE=1H_CA-9319_5
 200.13MHz, CDCl3,
 8 sc
 
 14.2.2025
##JCAMPDX= 6.0         $$ Bruker NMR JCAMP-DX V2.0
##DATA TYPE= NMR SPECTRUM
##DATA CLASS= NTUPLES
##ORIGIN= UXNMR, Bruker Analytische Messtechnik GmbH
##OWNER= pz
$$ XWIN-NMR		Version 3.5
$$ Mon Feb 17 14:41:10 2025 Russian Standard Time (UT+4h)  new_Human@DPX200
##.OBSERVE FREQUENCY= 200.1313
##.OBSERVE NUCLEUS= ^1H
##.ACQUISITION MODE= SIMULTANEOUS
##.ACQUISITION SCHEME= undefined
##.AVERAGES= 8
##.DIGITISER RES= 18
##SPECTROMETER/DATA SYSTEM= spect
##.PULSE SEQUENCE= zg30
##.SOLVENT NAME= D2O
##.SHIFT REFERENCE= (INTERNAL, D2O, 0, 15.3811)
##AUDIT TRAIL= $$ (NUMBER, WHEN, WHO, WHERE, WHAT)
$$ ##TITLE= Audit trail, XWIN-NMR		Version 3.5
$$ ##JCAMPDX= 5.01
$$ ##ORIGIN= Bruker BioSpin GmbH
$$ ##OWNER= new_Human
$$ C:/Bruker/XWIN-NMR/data/yarkov/nmr/H-C/1/pdata/1/auditp.txt
$$ ##AUDIT TRAIL=  $$ (NUMBER, WHEN, WHO, WHERE, WHAT)
(   1,<2025-02-17 14:03:32.43 +0400>,<new_Human>,<DPX200>,
      <created by zg, POWCHK disabled, PULCHK disabled
       configuration hash MD5:
       00 E9 B6 7A A2 85 ED C7 34 08 36 98 17 FE 4E 26
       data hash MD5: 16K
       BB 8E E5 3A CB DB 58 4B 0C B5 9C FE 28 4D 43 79>)
(   2,<2025-02-17 14:29:01.59 +0400>,<new_Human>,<DPX200>,
      <Start of raw data processing
       efp BC_mod = 2 LB = 0.25 FT_mod = 6 PKNL = 1 PHC0 = -621.554 PHC1 = 6.192217 SI = 16K 
       data hash MD5: 16K
       C6 61 23 7E F4 E4 AB C3 BA 93 0E 60 85 62 37 D7>)
(   3,<2025-02-17 14:32:36.73 +0400>,<new_Human>,<DPX200>,
      <pk PHC0 = 158.7048 PHC1 = -1.399991 
       data hash MD5: 16K
       20 11 B4 38 80 93 81 33 41 D7 48 2D E0 3D F0 BA>)
(   4,<2025-02-17 14:34:14.20 +0400>,<new_Human>,<DPX200>,
      <abs ABSG = 5 
       data hash MD5: 16K
       A4 F9 BE 42 5D 14 32 DD D1 F8 22 85 6E D6 E5 13>)
$$ ##END=
$$ 
$$ hash MD5
$$ 52 7C 63 F7 18 3A 0A 91 76 72 1C 2B 3F 4A 8E FB
##$RELAX= 
##$RELAX= 
##$RELAX= 
##$RELAX= 
##$RELAX= 
##$RELAX= 
$$ Bruker specific parameters
$$ --------------------------
##$DU= <C:/Bruker/XWIN-NMR>
##$EXPNO= 1
##$NAME= <H-C>
##$PROCNO= 1
##$TYPE= <nmr>
##$USER= <yarkov>
##$AMP= (0..31)
100 100 100 100 100 100 100 100 100 100 100 100 100 100 100 100 100 100 
100 100 100 100 100 100 100 100 100 100 100 100 100 100 
##$AQSEQ= 0
##$AQ_mod= 1
##$AUNM= <au_zg>
##$AUTOPOS= <>
##$BF1= 200.13
##$BF2= 200.13
##$BF3= 200.13
##$BF4= 200.13
##$BF5= 200.13
##$BF6= 200.13
##$BF7= 200.13
##$BF8= 200.13
##$BYTORDA= 1
##$CFDGTYP= 0
##$CFRGTYP= 5
##$CHEMSTR= <none>
##$CNST= (0..31)
1 1 145 1 1 1 1 1 1 1 1 1 1 1 1 1 1 1 1 1 1 1 1 1 1 1 1 1 1 1 1 1 
##$CPDPRG= <>
##$CPDPRG1= <>
##$CPDPRG2= <>
##$CPDPRG3= <>
##$CPDPRG4= <mlev>
##$CPDPRG5= <mlev>
##$CPDPRG6= <mlev>
##$CPDPRG7= <mlev>
##$CPDPRG8= <mlev>
##$CPDPRGB= <>
##$CPDPRGT= <>
##$D= (0..31)
0 0.7 0 0 0 0 0 0 0 0 0 0.03 0 0 0 0 0 0 0 0 0 0 0 0 0 0 0 0 0 0 0 0 
##$DATE= 1739786611
##$DBL= (0..7)
120 120 120 120 120 120 120 120 
##$DBP= (0..7)
150 150 150 150 150 150 150 150 
##$DBP07= 0
##$DBPNAM0= <>
$$ [...]
##$SUBNAM3= <"">
##$SUBNAM4= <"">
##$SUBNAM5= <"">
##$SUBNAM6= <"">
##$SUBNAM7= <"">
##$SUBNAM8= <"">
##$SUBNAM9= <"">
##$SW= 18.0517328524113
##$SWIBOX= (0..15)
0 0 2 0 0 0 0 0 0 0 0 0 0 0 0 0 
##$SW_h= 3612.71676300578
##$TD= 16384
##$TD0= 1
##$TE= 0
##$TE2= 300
##$TE3= 300
##$TEG= 300
##$TL= (0..7)
0 120 120 120 120 120 120 120 
##$TP= (0..7)
150 150 150 150 150 150 150 150 
##$TP07= 0
##$TPNAME0= <>
##$TPNAME1= <>
##$TPNAME2= <>
##$TPNAME3= <>
##$TPNAME4= <>
##$TPNAME5= <>
##$TPNAME6= <>
##$TPNAME7= <>
##$TPOAL= (0..7)
0.5 0.5 0.5 0.5 0.5 0.5 0.5 0.5 
##$TPOFFS= (0..7)
0 0 0 0 0 0 0 0 
##$TUNHIN= 0
##$TUNHOUT= 0
##$TUNXOUT= 0
##$USERA1= <user>
##$USERA2= <user>
##$USERA3= <user>
##$USERA4= <user>
##$USERA5= <user>
##$V9= 5
##$VALIST= <valist>
##$VCLIST= <CCCCCCCCCCCCCCC>
##$VD= 0
##$VDLIST= <DDDDDDDDDDDDDDD>
##$VPLIST= <PPPPPPPPPPPPPPP>
##$VTLIST= <TTTTTTTTTTTTTTT>
##$WBST= 1024
##$WBSW= 4
##$XGAIN= (0..3)
0 0 0 0 
##$XL= 0
##$YL= 0
##$YMAX_a= 396446
##$YMIN_a= -508937
##$ZGOPTNS= <>
##$ZL1= 120
##$ZL2= 120
##$ZL3= 120
##$ZL4= 120
##$ABSF1= 15.50119
##$ABSF2= -2.550659
##$ABSG= 5
##$ABSL= 3
##$ALPHA= 0
##$AQORDER= 0
##$ASSFAC= 0
##$ASSFACI= 0
##$ASSFACX= 0
##$ASSWID= 0
##$AUNMP= <proc_1d>
##$AZFE= 0.1
##$AZFW= 0.1
##$BCFW= 0
##$BC_mod= 2
##$BYTORDP= 0
##$COROFFS= 0
##$CY= -3
##$DATMOD= 1
##$DC= 0
##$DFILT= <>
##$DTYPP= 0
##$F1P= 0
##$F2P= 0
##$FCOR= 1
##$FTSIZE= 16384
##$FT_mod= 6
##$GAMMA= 0
##$GB= 0
##$INTBC= 1
##$INTSCL= 3.241238e-09
##$ISEN= 128
##$LB= 0.25
##$LEV0= 0
##$LPBIN= 0
##$MAXI= 10000
##$MC2= 0
##$MEAN= 0
##$ME_mod= 0
##$MI= 1.114404
##$NCOEF= 0
##$NC_proc= -5
##$NLEV= 6
##$NOISF1= 3.799351
##$NOISF2= 2.8
##$NSP= 0
##$NTH_PI= 0
##$NZP= 0
##$OFFSET= 15.38109
##$PC= 1
##$PHC0= -462.8492
##$PHC1= 4.792226
##$PH_mod= 1
##$PKNL= yes
##$PPARMOD= 0
##$PSCAL= 0
##$PSIGN= 0
##$REVERSE= no
##$SF= 200.130028139693
##$SI= 16384
##$SIGF1= 3
##$SIGF2= 2
##$SINO= 0.751879
##$SIOLD= 32768
##$SREGLST= <19F.Aceton>
##$SSB= 0
##$STSI= 16384
##$STSR= 0
##$SW_p= 3612.71676300578
##$SYMM= 0
##$S_DEV= 0
##$TDeff= 16384
##$TDoff= 0
##$TI= <>
##$TILT= no
##$TM1= 0
##$TM2= 0
##$TOPLEV= 0
##$USERP1= <user>
##$USERP2= <user>
##$USERP3= <user>
##$USERP4= <user>
##$USERP5= <user>
##$WDW= 1
##$XDIM= 16384
##$YMAX_p= 310574116
##$YMIN_p= -227426
$$ End of Bruker specific parameters
$$ ---------------------------------
##NTUPLES= NMR SPECTRUM
##VAR_NAME=  FREQUENCY,     SPECTRUM/REAL,   SPECTRUM/IMAG
##SYMBOL=    X,             R,               I
##VAR_TYPE=  INDEPENDENT,   DEPENDENT,       DEPENDENT
##VAR_FORM=  AFFN,          ASDF,            ASDF
##VAR_DIM=   16384,         16384,           16384
##UNITS=     HZ,            ARBITRARY UNITS, ARBITRARY UNITS
##FACTOR=    0.220516191357247, 1,           1
##FIRST=     3078.21800737741, 0,            0
##LAST=      -534.498755628367, 0,           0
##MIN=       -534.498755628367, -227426,     0
##MAX=       3078.21800737741, 310574116,    0
$$ Real data points
##PAGE= N=1
##DATA TABLE= (X++(R..R)), XYDATA
$$ [...]
12498E843L4641o6098J2760K8336P0030m9972n752k7063q024L1017L972k0014
12486I676M8835m896l6849N4883l0665o0535L4120m7281J7131M1695o4002L4128
12474c760K7835j0058m7516L3921M2941K4069m7913o748n8467P311L1969m638
12462a1054k6195m1877l2303M6046P7902N4098L0072m1656m2615j4758M4840J2554
12450E5054k3460l189l1158L3901L0849o7781k217J6369N4642n5500l8666j1523
12438d2679N5216L9604L5195P838q7507l0152J3894n355r6165N4598J25043j2363
12426E7167j5952k9679m8097K1312k9137j1471P1408k397o0803N053q817P6973
12414B5560o1022n1991J576L9458j1323j187K8333k9132P4434l6813k1982M9858
$$ plain form
12498 5843 40484 -25614 -12854 15482 85512 35540 29788 2725 -5299 25718 29690 9676
12486 9676 58511 53615 16766 71649 40984 -19551 14569 -32712 -15581 26114 -37888 -3760
12474 -3760 24075 14017 -33499 422 43363 67432 19519 12771 -45696 -38385 -6416 -11054
12462 -11054 -37249 -79126 -111429 -65383 12519 66617 96689 55033 12418 -2340 42500 55054
12450 55054 31594 28405 -2753 31148 61997 -5784 -8001 8368 63010 7510 -31156 -42679
12438 -42679 12537 52141 87336 95174 7667 -22485 -8591 -13946 -110111 -55513 69530 57167
12426 57167 41215 11536 -36561 -15249 -44386 -55857 15551 13154 -47649 -42596 -51413 25560
12414 25560 -35462 -87453 -85877 -46419 -57742 -58929 -30596 -59728 14706 -22107 -44089 5769
12402E769p553l6014l331j1051L2268j4277k5632O8536P707o673K4443j2755n338
12389A6099k1890K4991o339l7573J6438m1894N1986K087m1924O872M4253L4826
12377D7932k4919q0760N5850j0320K5365R55j163P260Q433l2540n2130Q089P4068
12364B6120N2727R252j5146p7390o8629M8157J9780q927K4596M3144m9907m0383
12352c6606M3532Q400P62l5928k431J0932N4957L1114m7388o3677J323m5291j3343
12339i3644K7283L2205J00798J5339q1028j5411O1780L7976q946m4197p0581N8302
12327A9876P361q2811J036l1810L612M0184L7067P486M6840j549j0878M4449p2591
12314H272r810K4345Q558j7426p696r7782R5536M9281k7592J6783K0770k9204
$$ plain form
12402 5769 -1784 -37798 -41129 -52180 -19912 -34189 -59821 8715 16422 9749 34192 21437 16099
12389 16099 -5791 19200 12861 -24712 -8274 -50168 1818 3905 -38019 -31147 13106 47932
12377 47932 23013 -57747 -1897 -12217 13148 14103 12940 20200 28633 -3907 -56037 -47948 26120
12364 26120 78847 88099 72953 -4437 -73066 -24909 -5129 -14056 10540 53684 3777 -36606
12352 -36606 6926 15326 16088 -19840 -22271 -11339 43618 74732 27344 -36333 -35010 -80301 -93644
12339 -93644 -66361 -34156 66642 81981 953 -14458 47322 85298 76352 32155 -38426 19876
12327 19876 27237 -55574 -54538 -86348 -82736 -42552 -5485 2001 48841 47292 36414 80863 8272
12314 8272 -1538 22807 31365 13939 6243 -91539 3997 53278 25686 42469 63239 34035
12302C4035n9964j1826M1375J8462k5815l220K1631P474M0194N9694l444o5643
12290E2953M7766O486o2327m462n4208J9863n197j1351K902l2810j6459J2403
12278d4441N1193R553q903m2354l6073N8285n8966L6761K1226n0481L844K852
12266e7504N0287k3639J4958J6525m370l923m9219J3168N749n7384P5424N4918
12254C4990j7868L740j1548l326l9605P757M3718K1291Q624N591k6774O664l140
12241C0114n4562j4239K6017O2612m8190n3431m6830O3781R2033J2190l4241o5591
12229c0337L8677J2851M1846m7962p617l6379R072L3913L1124J8822J7988n2525
12217B9473n681p757j8309o26K1249L6547n4665j5938o2626M283P6852l4620m5784
$$ plain form
12302 34035 -25929 -37755 3620 22082 -3733 -6953 14678 22152 62346 122040 118596 52953
12290 52953 100719 107205 44878 40416 -13792 6071 874 -10477 -7575 -40385 -56844 -44441
12278 -44441 6752 16305 7402 -34952 -71025 -12740 -71706 -34945 -13719 -64200 -60356 -57504
12266 -57504 -7217 -30856 -15898 627 -3743 -7666 -56885 -43717 -37968 -95352 -19928 34990
12254 34990 17122 20862 9314 5988 -33617 -25860 17858 39149 47773 53364 26590 33254 30114
12241 30114 -24448 -38687 -12670 49942 1752 -51679 -98509 -34728 57305 69495 35254 -30337
12229 -30337 8340 21191 63037 15075 7458 -28921 -19849 14064 45188 64010 81998 29473
12217 29473 23792 16035 -2274 -2900 18349 54896 231 -15707 -78333 -74050 2802 -31818 -77602
12204g7602M4390M7300K6565m0327J8981k03K3944k5775l6957m795Q351o895K5315
12191B292o169l2547K6K2432K2882M7770n635O893q6421K6598N3501l6667l9773
12178b4818k2009l6380L7580P2560l2926R334J8130j0766J131k0775J5213K0238
12166B6512m7535n3050M2702N3313p144k7110k4844J7959k8118N0061o062N259
12154A943L6430j5033o2975o13m4744R9975Q24l0017p037K1195j9898l5861J8621
12141c7190K9109K9296m3034k5064N8254m3568m9330P4967K8548n1846J8606J0524
12129g28l8235O781j6971O2215N2163n712m809J1411j4919l0428k6269k64n263
12116a1028M4921j6251j8061J1426n8264p6537p943J18256K8189j882n999M9676
$$ plain form
12204 -77602 -33212 14088 40653 326 19307 19104 43048 17273 -19684 -24479 -16128 -23023 2292
12191 2292 -3877 -36424 -36398 -13966 8916 56686 51051 57944 -28477 -1879 51622 14955 -24818
12178 -24818 -46827 -83207 -45627 26933 -5993 3341 21471 10705 11836 -8939 6274 26512
12166 26512 -21023 -74073 -31371 21942 14798 -12312 -37156 -19197 -47315 2746 -3316 1943
12154 1943 38373 23340 -39635 -40248 -84992 14983 15807 -14210 -21247 -52 -19950 -55811 -37190
12141 -37190 -8081 21215 -21819 -46883 11371 -32197 -81527 -6560 21988 -29858 -11252 -728
12129 -728 -38963 -32182 -49153 13062 65225 59513 54704 66115 51196 20768 -5501 -5765 -11028
12116 -11028 33893 17642 -419 11007 -47257 -123794 -131737 -13481 14708 12826 6827 56503
12104E6503o4641o0319J9445L572J0718j9626L0824k6202J6092j4011m4830J9968
12092g2507L3735L4860o4165j4578J956K7121O9125m480j2085k9605q704j8462
12080e7789M8427l087j0532M0174n4318M5998p12k8506J02822p3018o2541L4833
12068a8249K5768j853r053L3974k9838l3734O136o6357L4227K4195k9343L0409
12056c3718l8829L3247K4531j8693j0831j7662P1335k5166O798M887J1021M4791
12044E1711m2903R854K4965m6047k0378n3866M375K6484O8868J434n8044l1191
12032f4738K1832L8648M6447l2285k9564o080K7373K6275p3167j8538J8027L853
12020d1917j8311K7783J4452k0936L2282L0129L1288J932k9272M692m9679P832
$$ plain form
12104 56503 -8138 -68457 -49012 -45440 -34722 -54348 -23524 -49726 -33634 -47645 -92475 -72507
12092 -72507 -38772 -3912 -68077 -82655 -80699 -53578 15547 11067 -1018 -30623 -39327 -57789
12080 -57789 -9362 -12449 -22981 17193 -37125 8873 8161 -20345 82477 9459 -53082 -18249
12068 -18249 7519 5666 -3387 30587 749 -32985 -26849 -93206 -58979 -34784 -64127 -33718
12056 -33718 -72547 -39300 -14769 -33462 -44293 -61955 9380 -15786 -8988 -4101 6920 51711
12044 51711 8808 18662 43627 -2420 -22798 -76664 -72289 -45805 23063 24497 -33547 -64738
12032 -64738 -42906 -4258 42189 9904 -19660 -25740 1633 27908 -45259 -63797 -45770 -41917
12020 -41917 -60228 -32445 -17993 -38929 -6647 23482 54770 56702 27430 32122 -17557 -9725
12008i725M073M7877P353m1567j1993L0313L1915q3149L3053J5654m8437M1367
11996A6734j8664l697j440K0014Q4835j08783j6593P3351m8144J1657l5514k7127
11984e3371N1816L344j0588l780P1916j8444L1810p654j0182J1549Q628k6136
11972D8908o907N95N085J6387p5097l541j7225o21j6806J7181K0425J3020K2239
11959B3643L863k6102M455M447k0809n0372K8248P460K9398l6606N7437l7482
11947a2420l8476L7658N5605j2274J0049n891J6750j5535j3791m4432j3671O708
11935b9720K5739j0927l1142p21N9783K9485q2811q847M4220Q3155L945k1251
11923F0908q0930m9478L1016J3290m9556O2084m637L3965k9745k3534j3453j7825
$$ plain form
12008 -9725 -5652 42225 49578 8011 -3982 26331 58246 -24903 8150 23804 -24633 16734
11996 16734 -1930 -5627 -7067 12947 97782 -11001 -27594 45757 -2387 9270 -26244 -53371
11984 -53371 -1555 1789 -8799 -12579 59337 40893 72703 65049 54867 66416 75044 48908
11972 48908 42001 42596 47681 64068 -11029 -14570 -31795 -32416 -49222 -32041 -11616 1404 23643
11959 23643 27506 1404 5859 10306 -10503 -60875 -32627 -25167 4231 -32375 25062 -12420
11947 -12420 -50896 -13238 42367 30093 40142 34251 51001 35466 21675 -22757 -36428 -29720
11935 -29720 -3981 -14908 -46050 -46771 13012 42497 -40314 -49161 -4941 78214 82159 60908
11923 60908 -20022 -69500 -38484 -25194 -74750 -12666 -17303 16662 -13083 -36617 -50070 -67895
11911f7895K0842L4588N7475O231l4112q5713M2901M072n0214j68M2489O3726
11899C4222m3077j9464m1509L5438J7753m3288k6404K492L800N1669r944m6717
11887h5029L3287O0988L3158J3835p9758k3614O6115m2387p3834J3828L8995K058
11875d2358N6538k2273Q897J4329n8264K2929p593k5488j6654m231k4708N1768
11863d7108L9416L6393l6122j3261P8254N5851o4685o7401Q3183J6566R164r1659
11851a409l707K8782K4870o3723m3934Q3868N3014l1446k5265l439M715l3061
11839a0735N9102N6594n9720o6990k8968M4714R52m7670M738o340l5238J9803
11827f9758M7341J9022l9493k0289l1619L8284J9419k7332K4463N7368o0293l6297
$$ plain form
11911 -67895 -47053 -12465 45010 51241 17129 -68584 -25683 -21611 -71825 -71993 -29504 34222
11899 34222 -8855 -28319 -69828 -34390 -16637 -59925 -86329 -83837 -80037 -28368 -38312 -85029
11887 -85029 -51742 9246 42404 56239 -23519 -47133 18982 -23405 -97239 -83411 -44416 -42358
11875 -42358 14180 -8093 804 15133 -43131 -20202 -27795 -53283 -69937 -74168 -98876 -47108
11863 -47108 -7692 28701 -7421 -20682 57572 113423 48738 -18663 64520 81086 90250 -1409
11851 -1409 -5116 23666 48536 -15187 -59121 24747 77761 46315 21050 17611 22326 -10735
11839 -10735 48367 104961 45241 -21749 -50717 -6003 -5051 -52721 -47983 -54323 -89561 -69758
11827 -69758 -22417 -3395 -42888 -63177 -94796 -56512 -37093 -64425 -39962 17406 -42887 -79184
11815g9184N5232L3047n0152k4400N4315J1347M4406j8867l1215J1703M326r184
11803A374o3901M12J5483L7910M866p6327O0328N1654l9174l8864R235N387M089
11790b7528l7047J5364N4015J8057L3556m9037j9356k681J8041P0782r3025r929
11778b8788K1616M9164n2897r254J1770N928K3210j7919j8357r3437R0582o5505
11766h3887k2356N289J7004N8866N9954j3737m0230l0115m6001k923R1404J3287
11754F555J8701J1013n2464m655M187m6306N062m3658K51P5460K8706k4621P796
11741a3973K3113r334Q996J5493p567n8721l84M2462K5931o870L0744p3500n3839
11728g7449N9650L1177p439p4197K1975M2365K6250j0915K387J7444o2321K1036
$$ plain form
11815 -79184 -23952 9095 -41057 -65457 -11142 205 44611 25744 -5471 6232 10558 1374
11803 1374 -62527 -62115 -46632 -8722 -3856 -80183 -19855 31799 -7375 -46239 -37004 -31617 -27528
11790 -27528 -64575 -49211 4804 22861 56417 7380 -11976 -14657 3384 74166 -18859 -28788
11778 -28788 -7172 41992 -10905 -20159 -8389 -2461 20749 2830 -15527 -108964 -18382 -83887
11766 -83887 -106243 -100954 -83950 -25084 34870 21133 -19097 -49212 -95213 -98136 -6732 6555
11754 6555 25256 36269 -16195 -20850 -16663 -62969 -57907 -101565 -101314 -25854 2852 -21769 -13973
11741 -13973 9140 -194 8802 24295 16728 -41993 -42377 85 26016 19146 49890 -23610 -77449
11728 -77449 -17799 13378 5939 -68258 -46283 -3918 22332 11417 13804 31248 -31073 -10037
11716a0037R840K0507k5535k3725r431M0940m850K6828m3312l6729O454n1308
11704a00358K5422J09489m558j21103k9473j5354P8084P1455p8125k3598p625
11693i5744L7995j2985L0372j5524m8361j4819O5923J9217o949j5079O7033k5191
11681a4112J3832l2738j9233O8644n6949K660p224k258J5581p811L633J0165J1935
11668a3875j2189j7485n099j3383K466j975R277J2870Q2824j2195p4688k9694
11656g3146K9437k893M393Q510P126n7547J7346N8602K3870l9110O3732m7416
11644g096k4347M078n2861P188M9516n2579n5089M9163O4000o329J4503j3361
11632b3214J7328L5740J2519m6319o7431L6382l274K7846J2216l2807K4345M5778
$$ plain form
11716 -10037 -197 20310 -5225 -28950 -38381 2559 -2291 24537 -18775 -55504 -49050 -100358
11704 -100358 -74936 34553 29995 -91108 -120581 -135935 -57851 13604 -64521 -88119 -95744
11693 -95744 -57749 -70734 -40362 -55886 -104247 -119066 -53143 -33926 -40875 -55954 11079 -14112
11681 -14112 -280 -33018 -52251 16393 -40556 -37896 -45120 -47378 -31797 -39608 -35975 -25810 -13875
11668 -13875 -26064 -43549 -48648 -62031 -59565 -61540 -52263 -39393 43431 31236 -43452 -73146
11656 -73146 -43709 -46602 -42209 -33699 -26573 -84120 -66774 -8172 15698 -23412 40320 -7096
11644 -7096 -31443 -27365 -80226 -73038 -23522 -76101 -131190 -82027 -18027 -24356 -9853 -23214
11632 -23214 -5886 29854 42373 -3946 -71377 -34995 -38269 -10423 1793 -31014 -6669 39109
11620C9109m7500L4841M8871J4327l9064k9760o7614l0928J8146J5950L7797K0671
11608A4846k3064K4121K4581p2008j7873K2813n5288K8668O6180j047l0483J2859
11596e695J4247L7982K4139o6166K6826m5786n4297O7054j3185k6931m861j03
11584d6776M0220r997o4418l8489K0110N5327N2127K623M1334o839p8223J1366
11572b1635j6050l6033K2878J363R709J2820K1941J8253j9841n3612m1226L2803
11560f8630K8346j0302J2460q35N518j6083m9785j109O3714J5261K1514l3958
11548c3889J080M5075k9354J8018l8285k0629M730L4504Q587j1187K0831K3562
11536B3043j6799Q2193K0163p3487j2089j3605m4613K9978j5618o5599J1524m603
$$ plain form
11620 39109 -8391 26450 75321 89648 50584 20824 -46790 -77718 -59572 -43622 -5825 14846
11608 14846 -8218 15903 40484 -31524 -49397 -26584 -81872 -53204 12976 11929 -18554 -5695
11596 -5695 8552 46534 70673 4507 31333 -14453 -68750 -1696 -14881 -41812 -46673 -46776
11584 -46776 -6556 -16553 -80971 -119460 -99350 -44023 8104 10727 52061 45222 -33001 -21635
11572 -21635 -37685 -73718 -50840 -49477 -39768 -26948 -5007 13246 -6595 -60207 -101433 -68630
11560 -68630 -40284 -50586 -38126 -38961 -33443 -49526 -99311 -100420 -36706 -21445 69 -33889
11548 -33889 -32809 12266 -17088 930 -37355 -57984 -53254 -18750 -10163 -21350 -519 23043
11536 23043 6244 88437 108600 35113 23024 9419 -35194 -5216 -20834 -86433 -74909 -79512
11524g9512K4540J1226K8480J1404L847n2371j5928O177j3625L3669m2996p960
11512i3049j7674J1928N9186k578K1797K129m409J5373q288q7188L3485L238m0836
11499a06886m013J1138l614J125N4869L275j3534J6J8947M5516l3563L4985l069
11486E192l9535j3550J1403J7616K543j6373o7944O5091P9706k9296k4560Q563
11474a144l087o852M8326r575o8003J1122P694l0668n8425k1048L2534M0977Q6527
11461B8378j2409m0825j5523k0841Q2648P327O327j8621k2952L5203J6216Q832
11449E3760J0512l4550p612k9812N5458p620K5076n1246k7897k6189M0889l244
11437b475q7345O1067N1044l7239k9531O3658j2835n142j1371J2122l4569l7574
$$ plain form
11524 -79512 -54972 -43746 -15266 -3862 -15 -52386 -68314 -62137 -75762 -42093 -85089 -93049
11512 -93049 -110723 -98795 -39609 -42187 -20390 -18261 -22670 -7297 -15585 -102773 -69288 -66050 -106886
11499 -106886 -110899 -99761 -103375 -102250 -47381 -44106 -57640 -57624 -38677 6839 -26724 8261 5192
11486 5192 -34343 -47893 -36490 -18874 -16331 -32704 -100648 -35557 44149 14853 -9707 -1144
11474 -1144 -4231 -11083 37243 27668 -40335 -29213 -21519 -52187 -110612 -131660 -99126 -58149 28378
11461 28378 15969 -24856 -40379 -61220 21428 28755 35082 16461 -6491 28712 44928 53760
11449 53760 64272 29722 22110 -7702 47756 40136 65212 13966 -13931 -40120 769 -2475
11437 -2475 -89820 -28753 22291 -14948 -44479 19179 6344 1202 -10169 1953 -32616 -70190
11425g0190j5176L8440J9234m94N3479M3476K9992l1569k1221n9857q732l6465
11413e9083J0656L096q5660J3224Q4725L1524n4379r247J4059r998n3205N0329
11401f3959k978p113M5911J3732J7472P4786k0601L2162J4618r5920l9356q84
11389c2130k2432m5919M4420Q351l585L8386J9510K1058o2051n8067K7351o441
11377g1549P687O5159M6286j8794J8991q073n0924o5316L3056j4684N1404Q217
11365A460j3621k9667P996J0459J6858J7310j6216J1085L338N164k4644n991k0725
11352c7194K8018o3525j6931l3902L5755k1808L1265P91J6383L764N6094K3834
11340B2544J1167p0790K6773k7799O009N5714o3222O0727j6713j6377O163o6139
$$ plain form
11425 -70190 -85366 -46926 -27692 -28186 25293 68769 98761 67192 45971 -13886 -22618 -59083
11413 -59083 -48427 -45331 -130991 -117767 -33042 -1518 -55897 -65144 -51085 -61083 -114288 -63959
11401 -63959 -66937 -74050 -28139 -14407 3065 77851 57250 89412 104030 8110 -31246 -32130
11389 -32130 -54562 -100481 -56061 -47710 -51295 -12909 6601 27659 -34392 -92459 -65108 -71549
11377 -71549 -63862 1297 47583 28789 47780 39707 -11217 -76533 -43477 -58161 -6757 1460
11365 1460 -12161 -41828 -33832 -23373 -6515 10795 -5421 5664 9002 14166 -10478 -16469 -37194
11352 -37194 -9176 -72701 -89632 -123534 -87779 -109587 -78322 -77531 -61148 -57384 -1290 22544
11340 22544 33711 -37079 -10306 -38105 -32096 23618 -39604 21123 4410 -11967 -5804 -71943
11328g1943N7315j5124n482L247k7501M4538k2682l904k4996P2115o8389j4412
11316g7218j9361J3942L8681j6963m6256J3182l4487P2833J9663n7417k7857L994
11304a17264K9247N9931K4699P94n4762j20769L0763N6108J5173M691M9201p8625
11292a00813l464L1927N7409J5678j5004l7321L1676k6907n9032M0306K7505j0288
11280d8328j9640k0094j3102M0305O093l051l4269K4417p649J5175q711M554j836
11267f6136n430n7201M5716P7881N9339K2160k0408m5088q6136J5316k1944J5296
11255f6635J7712L3571J7943K161j5641k6410m2215J3834J6286L179K5267j7698
11243c8646n1583L1131N5057K933o0014j0952M8252n348m2887M4636M4098l6442
$$ plain form
11328 -71943 -14628 -29752 -35234 -31987 -59488 -14950 -37632 -41536 -66532 5583 -62806 -77218
11316 -77218 -96579 -82637 -43956 -60919 -107175 -93993 -128480 -55647 -35984 -93401 -121258 -117264
11304 -117264 -88017 -28086 -3387 -2593 -57355 -178124 -147361 -91253 -76080 -71389 -22188 -100813
11292 -100813 -104277 -72350 -14941 737 -14267 -51588 -19912 -46819 -105851 -65545 -38040 -48328
11280 -48328 -67968 -88062 -101164 -60859 -54766 -57817 -92086 -67669 -75318 -60143 -68854 -64300 -66136
11267 -66136 -71566 -128767 -83051 -5170 54169 76329 55921 10833 -75303 -59987 -81931 -66635
11255 -66635 -48923 -15352 2591 4752 -10889 -37299 -79514 -65680 -49394 -46215 -20948 -38646
11243 -38646 -90229 -59098 -4041 -1108 -61122 -72074 -23822 -29170 -72057 -27421 16677 -19765
11231a9765P128K641K7538n7402k7215n916m9236P878N2438K8075j3805k1552
11219f9193N4448J4060l8997l7685J7055L6768L9170j5466l4662n118J0214k9724
11207e9130N5958J213N319k8358M048K3327o2205O1349p8794L4121j07156M8038
11195a02270M8485m4892R574J45m164l1889J00480J0610j2697n0976J6592M3264
11183a7738K8399j2032l5307m186L9448n039n3686o201Q0693K2806l5305k1954
11171b0102l3278l1372J6499j5845J7128j2609l5271K1650K4670J8426n841J323
11159e4622K1866P728J0351o2464j0300K4282L8381J1881p9894K5171N4637J8051
11147E068J2581m201j2116k5168j1314r175k585j2489j2669q122l6571o700J5661
$$ plain form
11231 -19765 -12637 -9996 17542 -39860 -67075 -72991 -122227 -114349 -61911 -33836 -47641 -69193
11219 -69193 -14745 -685 -39682 -77367 -60312 -23544 15626 160 -34502 -39620 -29406 -59130
11207 -59130 -3172 -1959 3360 -24998 -20950 2377 -59828 1521 -77273 -43152 -150308 -102270
11195 -102270 -53785 -98677 -89103 -88958 -93122 -125011 -24531 -13921 -26618 -77594 -61002 -17738
11183 -17738 10661 -1371 -36678 -40864 -1416 -6455 -60141 -66342 14351 37157 1852 -20102
11171 -20102 -53380 -84752 -68253 -84098 -66970 -79579 -114850 -93200 -68530 -50104 -55945 -54622
11159 -54622 -32756 -25028 -14677 -77141 -87441 -63159 -24778 -12897 -92791 -67620 -12983 5068
11147 5068 17649 13448 1332 -23836 -35150 -44325 -46910 -59399 -72068 -80190 -116761 -123461 -107800
11134a07800Q3658n91j6038L3507k9517p5551Q751J4027k5721j8280L6151O0562
11122c6842N880n0097N4261K4632m9517k6044p956L960L6076J6629P2456n5816
11110a2378p921l959l6977l8259K9059J4768M732J6705K9174P0037n6137k252
11098F592J4394L8393J4911n7856O1589O930o592o7792j4728N9244L0388J03182
11086A88655j02343o8179L638K3494m2729j0362K1252l9846N095l53N3428K9465
11074F1215p0046k7656j4519o329j535K4569M3408N652l7484j007o4485K0362
11062f7855N0125j2904M415K7371K1142k2312k701M252m0125P090L8692j5760
11050h570K007k0446o5801j0179M549L6394K7869M4410N988o5563l2421L6451
$$ plain form
11134 -107800 -24142 -24733 -40771 -7264 -36781 -112332 -103581 -89554 -115275 -133555 -97404 -36842
11122 -36842 -30962 -81059 -26798 -2166 -51683 -77727 -85683 -81723 -45647 -29018 43438 -12378
11110 -12378 -20299 -24258 -61235 -99494 -70435 -55667 -50935 -34230 -5056 64981 8844 6592
11098 6592 20986 59379 74290 16434 78023 84953 78361 10569 -4159 55085 85473 188655
11086 188655 86312 18133 21771 45265 2536 -7826 13426 -26420 -21325 -21678 31750 61215
11074 61215 -8831 -36487 -51006 -57335 -58870 -34301 9107 14759 -22725 -23732 -88217 -67855
11062 -67855 -17730 -30634 -26219 1152 22294 -18 -2719 1533 -38592 -31502 7190 -8570
11050 -8570 -6563 -27009 -92810 -102989 -98440 -62046 -34177 10233 16221 -49342 -81763 -45312
11038d5312L4103Q549k041m2319n736l059n818k3089Q3597k1069l3999k116J6215
11025d2094L4751M671K8662M830p0021Q914o69j5129J8257M559n4856l6168K1014
11012i3279m839Q321K1719j5102m475L9821r923k0048j4728O8748m9845J2843
11000f0787M6202K4484p0851L1869k0525J4147k2226k094K3144O1916R405m8357
10988a3673l1035l4651O8447j1360j1035P89J8134K4642k8606o5754k6827j0334
10976a21263n063K7584N5847n3686N9502O2671j6176l2183p4736j5488L0637m3269
10964a25623O364K3036j2917M8034p769m393r529p3924o3838M7033O5564K1200
10952h6762L4978k1548J9324J1567l2735K2532M9323N735J528l402L965n6917
$$ plain form
11038 -45312 -11209 -2660 -4701 -47020 -52756 -55815 -61633 -84722 -1125 -22194 -56193 -58309 -42094
11025 -42094 -7343 -2672 25990 30820 -39201 -30287 -30956 -46085 -27828 -23269 -78125 -114293 -93279
11012 -93279 -98118 -89797 -68078 -83180 -87655 -47834 -57757 -77805 -92533 -23785 -73630 -60787
11000 -60787 -14585 9899 -60952 -29083 -49608 -35461 -57687 -59781 -36637 25279 34684 -13673
10988 -13673 -44708 -79359 -10912 -22272 -33307 -32518 -14384 10258 -18348 -84102 -110929 -121263
10976 -121263 -126326 -98742 -42895 -96581 -37079 25592 9416 -22767 -97503 -112991 -82354 -125623
10964 -125623 -119259 -96223 -109140 -61106 -68875 -73268 -82797 -156721 -220559 -173526 -107962 -86762
10952 -86762 -51784 -73332 -54008 -42441 -75176 -52644 -3321 2414 3942 540 4505 -52412
10940e2412n5746J526K9746p358j8481j1053J4051M0768M820l7130o615j1662
10928a09546K0830L3250l1307J3630K1845l4190L0930K2584m8133M9651K6428
10917d028P88o6916j0673L8129J2248m5379k8615M2318L8714K2889K0794m4159
10905b3890l7843L3503q212m2367m0323J8642J670r828N9957M1038m1829k1081
10893g0563O609R446R56j8490j5326M0369o0353K2728K6083l3179K8390N9693
10881c637l5727j8396o3493K5301O5397R6344m6739p1182L3287l4577q5029j3788
10869a52239K0839J9801L3805N700J1230l5029j5614L2332q5301P844R7558k5861
10857h4935J8748J8584p677K6197K2013l5838j2477K5713J0868k9516J2389N505
$$ plain form
10940 -52412 -108158 -106632 -76886 -84244 -102725 -113778 -99727 -58959 -54139 -91269 -97884 -109546
10928 -109546 -88716 -55466 -86773 -73143 -51298 -85488 -54558 -31974 -80107 -30456 -4028
10917 -4028 -3240 -70156 -80829 -42700 -30452 -75831 -104446 -62128 -23414 -525 20269 -23890
10905 -23890 -61733 -28230 -36442 -78809 -119132 -100490 -98820 -108648 -48691 -7653 -49482 -70563
10893 -70563 -63954 -54508 -53552 -72042 -87368 -46999 -107352 -84624 -58541 -91720 -63330 -3637
10881 -3637 -39364 -57760 -121253 -95952 -30555 65789 19050 -52132 -18845 -53422 -138451 -152239
10869 -152239 -131400 -111599 -77794 -72094 -60864 -95893 -111507 -79175 -164476 -156632 -59074 -84935
10857 -84935 -66187 -47603 -55280 -29083 -7070 -42908 -55385 -29672 -18804 -48320 -35931 -30426
10845c0426n277J9208j771M1377L1310l7321k6866n2084n137J6735N3073k1878
10833a9057m2026j1370n380k8842J9146K9601K2258o0648k6023L9213N8298m7772
10821g2602m1362O8653K1846p2176j1299j3120L0448l4259j1494M4531P4795m7883
10809f3922n1928Q8034j6016q7206M6265L8208m7964k795n867J7724N849N3068
10797b6550l9406m2122K1625j26K0638l8714n3477L4780m017l32O7401R709m6826
10784i7417K4351O380l610m9626l3607O30K2444J9476K0938L0929q5194K9425
10772a14881K5368m5922n1969k0435L5117J2491P814L5198K1860K4338l325Q545
10760f5801J9914L417m930j0809n6776o4643j355j4251k565O8749j816M6246J2074
$$ plain form
10845 -30426 -35703 -16495 -18266 23111 54421 17100 -9766 -61850 -66987 -50252 2821 -19057
10833 -19057 -61083 -72453 -77833 -106675 -87529 -57928 -35670 -96318 -122341 -83128 -24830 -72602
10821 -72602 -113964 -45311 -23465 -95641 -106940 -120060 -89612 -123871 -135365 -90834 -16039 -63922
10809 -63922 -115850 -27816 -43832 -131038 -84773 -46565 -94529 -97324 -103191 -85467 -79618 -26550
10797 -26550 -65956 -108078 -86453 -86579 -65941 -104655 -158132 -123352 -127369 -127701 -60300 -50591 -97417
10784 -97417 -73066 -66686 -70296 -119922 -153529 -152899 -130455 -110979 -90041 -59112 -144306 -114881
10772 -114881 -89513 -135435 -187404 -207839 -172722 -160231 -152417 -117219 -95359 -71021 -74346 -65801
10760 -65801 -45887 -42470 -47400 -58209 -114985 -179628 -180983 -195234 -197799 -129050 -130866 -84620 -72546
10747g2546q151N3503k0519o2111P60L6846J9608M7333j2115k3078j4132K2914
10735c1688k3026j3251o2378J1808M83J0688K4628j6214l8374N3887L695o3895
10723a43637k0195L3303N3351n0408l1268K4327L2870l3371n052N2402n0014l713
10711a41405j6932L2222k0580k2196L0343J2560k318J0673M2086k6748l1442j0589
10699a44326R784J0092J773K2558k8030J3155J693k2769L0046M0101l1886r08
10687i8717O6521p3124m1321k2461L7309j3320J0344R2355L669m002j26116L3792
10675a35071M7580q379k5314Q74K3118l3511j542L4303n0365p9119J03366O0404
10663f3656k4157l518M015q863m8541j1972J3293L7638j051O88K417K854m8516
$$ plain form
10747 -72546 -80697 -27194 -47713 -109824 -109064 -72218 -52610 -5277 -17392 -40470 -54602 -31688
10735 -31688 -54714 -67965 -130343 -118535 -118052 -107364 -82736 -98950 -137324 -83437 -79742 -143637
10723 -143637 -163832 -130529 -77178 -127586 -158854 -134527 -101657 -135028 -140080 -87678 -137692 -141405
10711 -141405 -158337 -126115 -146695 -168891 -138548 -125988 -128306 -117633 -75547 -102295 -133737 -144326
10699 -144326 -134542 -124450 -122677 -100119 -128149 -114994 -113301 -136070 -106024 -65923 -97809 -98717
10687 -98717 -32196 -105320 -146641 -169102 -131793 -145113 -134769 -42414 -38745 -42747 -168863 -135071
10675 -135071 -87491 -95870 -121184 -120310 -97192 -130703 -132245 -97942 -148307 -227426 -124060 -63656
10663 -63656 -87813 -91331 -87316 -96179 -144720 -156692 -143399 -105761 -106812 -106124 -103707 -100853 -149369
10650a49369N628L0408R392P190L1159k172k7314O2948j1386J9999l7985k4744
10638h6246K698Q9628p2930l0552l0377Q0P216O282O344k8065J3501J5794M2524
10625f4103L2452j821L9918O1186m6980M107O253m6251K4916j44989L8508L8242
10613e8562k9977P625m8200O54M0597n9354j5648O507N2031O4749p6363K3815
10601i2126k0754O149k2443o2586L2814K0232P6769j695o8111j931L3113M3223
10589e7346k1894J4833m4722L209J9714m2063J7003J2298J2746l923k3999m2444
10577a56588k8328L7113K4582k314Q397O0586k1703n4364K1291l8415l5061O5653
10565a19151m2672k9900P6536P2592M828j0508J407l6246n2048M8335r314O655
$$ plain form
10650 -149369 -143741 -113333 -103941 -96751 -65592 -67764 -95078 -32130 -43516 -23517 -61502 -86246
10638 -86246 -83548 6080 -66850 -97402 -127779 -127699 -120483 -114201 -107857 -135922 -122421 -106627 -64103
10625 -64103 -31651 -33472 6446 67632 20652 24759 31012 -15239 9677 -135312 -96804 -58562
10613 -58562 -88539 -80914 -129114 -128460 -87863 -147217 -162865 -156358 -104327 -39578 -115941 -92126
10601 -92126 -112880 -106731 -129174 -191760 -158946 -138714 -61945 -63640 -131751 -133682 -100569 -57346
10589 -57346 -79240 -64407 -109129 -105920 -86206 -128269 -111266 -98968 -86222 -90145 -114144 -156588
10577 -156588 -184916 -147803 -123221 -125535 -117138 -56552 -78255 -132619 -111328 -149743 -184804 -119151
10565 -119151 -161823 -191723 -115187 -42595 -37767 -48275 -46868 -83114 -135162 -86827 -96141 -89486
10553h9486K9738J9595j6501l5620J2396j5071l787m3691K2162K0955j5488j5286
10541a30084L54N8932O0495k2714o7716O8017n5246J4425L4423j1231m3717O5120
10529b8942l3296M5343K7904j00909l9780N856K9097o2971M2204p5669N6792L2476
10517a01895K6837K3482j9202M9737m5825J6586r1072J6300L1836n7646M3041
10506a07821K8689R962L0103j8222n9329m301O1087r878J1602M062p3792n795
10494a33633r861L4897m0374l0165j0893R242L8354O4344k1897n591k6565k4483
10482a56625j4372J4699Q0036O866j6795J2915j4149j5196K7259j7637n913M2911
10470e6001p4966k5530J0456J0453O8737n1026n054J253l1874j0195O3191j1042
$$ plain form
10553 -89486 -59748 -40153 -56654 -92274 -79878 -94949 -98736 -142427 -120265 -99310 -114798 -130084
10541 -130084 -129730 -70798 -10303 -33017 -100733 -32716 -87962 -73537 -39114 -50345 -94062 -28942
10529 -28942 -62238 -16895 11009 -89900 -129680 -123824 -94727 -157698 -115494 -191163 -134371 -101895
10517 -101895 -75058 -51576 -70778 -21041 -66866 -50280 -141352 -125052 -93216 -150862 -107821
10506 -107821 -79132 -69170 -39067 -57289 -116618 -120919 -59832 -69710 -58108 -54046 -127838 -133633
10494 -133633 -143494 -108597 -148971 -179136 -190029 -180787 -142433 -78089 -99986 -105577 -132142 -156625
10482 -156625 -170997 -156298 -76262 -69396 -86191 -73276 -87425 -102621 -75362 -92999 -98912 -56001
10470 -56001 -130967 -156497 -146041 -135588 -66851 -117877 -122931 -121678 -153552 -163747 -100556 -111598
10458a11598q171L5411L183m6289m7154M5713r597M9270K2903J5326l9109P222
10446h2890j5072j5811N927K9991M3511n4846k2493m1557K414J5885j1390K488
10434a43843q697J0092P5088J1392J903J200m2484m0313M141J4709l4249Q622
10422a42439j0178M1771N3707O074k6272n7914L4144N4810l6467l3695O2230J8374
10410c5855o0090K3461l517l8091k26O6883M1777r9512m0118N0426r214J8496
10398h5580J5857n8256o333J3759m739K6242M2569k1940p248l4284M6195k082
10386g5840M2574J2481n9201J0364N956r419L2503k4576k4907J5928q0824K2807
10374a32154N6055n7124j1604N1306k7989L2195k61j0402q8267j0571M6877k271
$$ plain form
10458 -111598 -119769 -84358 -81175 -127464 -174618 -128905 -138502 -89232 -66329 -51003 -90112 -82890
10446 -82890 -97962 -113773 -107846 -77855 -34344 -89190 -111683 -153240 -150826 -134941 -146331 -143843
10434 -143843 -152540 -142448 -67360 -55968 -54065 -52865 -95349 -135662 -131521 -116812 -151061 -142439
10422 -142439 -152617 -110846 -57139 -51065 -77337 -135251 -101107 -46297 -82764 -116459 -54229 -35855
10410 -35855 -95945 -72484 -76001 -114092 -114318 -47435 -5658 -105170 -145288 -94862 -104076 -85580
10398 -85580 -69723 -127979 -134312 -120553 -125292 -99050 -56481 -78421 -85669 -119953 -73758 -75840
10386 -75840 -33266 -20785 -79986 -69622 -63666 -73085 -40582 -65158 -90065 -74137 -154961 -132154
10374 -132154 -76099 -133223 -144827 -93521 -121510 -89315 -89576 -99978 -188245 -198816 -151939 -154210
10362a54210J05791l8526j09460N7865L8027k5602J5732L432m7661n1655Q064
10351a98203M0786l845k2605k9692O3207K2755k1661J7245o120L1261R228J8154
10339g9490k3062j05774O9139O1125Q582K1676o9437m1600n0156M2428J2596R1470
10327f2503j1522j0221K6896j4937K5078j6351n1014m3818j1356L2903P1228k5297
10315i0914q227L6746j4390o510m77L250J9336L5048l9201j3920K7873J0991j9284
10302e9679Q0393l299p6634J3637j4463P8767R1663O294m2540K8415L4613K4187
10290A61354P339q593O5510R6255L8812K4842K8589K1396o8833n7383L2690M1897
10278C83875n52L141J1631j9428m7731j9355q80o8915q7290N1558m5255m8371
$$ plain form
10362 -154210 -48419 -86945 -196405 -138540 -100513 -126115 -110383 -106951 -154612 -206267 -198203
10351 -198203 -157417 -161262 -183867 -213559 -150352 -127597 -149258 -132013 -138133 -106872 -97644 -79490
10339 -79490 -102552 -208326 -139187 -78062 -69480 -47804 -117241 -158841 -208997 -166569 -153973 -62503
10327 -62503 -74025 -84246 -57350 -72287 -47209 -63560 -114574 -158392 -169748 -136845 -65617 -90914
10315 -90914 -99141 -62395 -76785 -83295 -83772 -80522 -61186 -26138 -65339 -79259 -51386 -40395 -59679
10302 -59679 20714 17415 -59219 -45582 -60045 18722 110385 116679 74139 102554 137167 161354
10290 161354 168693 160100 225610 321865 360677 385519 414108 435504 366671 309288 341978 383875
10278 383875 383323 386464 398095 378667 330936 311581 310701 241786 154496 206054 160799 112428
10266A12428L0713K8870n2531M6784j6454o4672O2937J8205K6942K9667N5076
10255B77965M6162J8519j4643P726K5187M6646J0055L3002K3594J9734j0889L8574
10243E21632o527m8685k8043k8048j8635q4374p8588r4615L1008J3818n2908o2889
10231F3146j8801J7270L6920R74k6071m9632l8217O3636M412j0664m7529l1211
10219c5767N9471J5269k3200M2044o9278m6088n362M9872n816j8768N2358n857
10207H878j5515k2202q412J3199J8954J9680m9995l0583N5828l449m0099J0759
10195d2957M9843j9148N266j0726l4480k4177j1025O3206L4154P385o1786r080
10183e3525L106l4994M1517J847M6279M0480j1767J3048n3968p1165J4944O9197
$$ plain form
10266 112428 143141 172011 119480 166264 149810 85138 148075 166280 193222 222889 277965
10255 277965 324127 342646 328003 335729 360916 407562 417617 450619 474213 493947 483058 521632
10243 521632 515105 466420 438377 410329 391694 307320 228732 134117 165125 178943 126035 63146
10231 63146 44345 61615 98535 99509 73438 23806 -14411 49225 53637 42973 -4556 -35767
10219 -35767 23704 38973 15773 57817 -11461 -57549 -62911 -13039 -18855 -37623 14735 8878
10207 8878 -6637 -28839 -37251 -24052 -5098 14582 -35413 -65996 -10168 -13617 -53716 -42957
10195 -42957 6886 -12262 -6996 -17722 -52202 -76379 -87404 -24198 9956 17341 -44445 -53525
10183 -53525 -50419 -85413 -43896 -42049 4230 44710 32943 45991 -7977 -79142 -64198 4999
10171D999J0457l7995K4390J3928j3322M975L2278j6200k159j7699j5460j4301
10159b6109N6245O7683m0157m0666j6017k7741q701j2268P6239j8668m2684M1549
10147H705j4359j4832K6842l6116J2314L4843r518q623J00996m6860m3498L2874
10135D2768l8158J8155Q795J01650J7905j2007J3951J11342P9497L8761k2354
10124C60305K9124j4402j0639k1459M5644O2614Q0062M399O1787l0333k1572L0078
10112E75608k610N3259n9174k3798k2724m0818o7148m4310N165o6515m5292j8350
10100B43293l5971j3836R608j8269P3415m9569o5648M9626r584N3465N3308l4233
10088B55605o5260L1474P8422P0862Q588L7928M5950P0668o259k5019K8089Q3805
$$ plain form
10171 4999 15456 -22539 1851 15779 2457 7432 39710 23510 21351 3652 -11808 -26109
10159 -26109 30136 97819 57662 16996 979 -26762 -35463 -47731 28508 9840 -32844 8705
10147 8705 -5654 -20486 6356 -29760 -17446 17397 7879 -744 100252 53392 9894 42768
10135 42768 4610 22765 31560 133210 151115 139108 153059 264401 343898 382659 360305
10124 360305 389429 375027 364388 342929 388573 451187 531249 535648 597435 567102 545530 575608
10112 575608 572998 626257 567083 543285 520561 479743 412595 368285 373450 306935 261643 243293
10100 243293 207322 193486 203094 184825 258240 208671 143023 192649 183065 236530 289838 255605
10088 255605 190345 221819 300241 371103 379691 417619 463569 534237 527978 502959 531048 614853
10076F14853l6421J8239q0129m0515l8605r4224L6475o1129L251k1945m298n1092
10064B44460m0436K3787k4796K3904l0188J2427o5803p014j1075J8514M5089O9750
10052B58619j7107n6142l0442K3619N3364p2963K4379q0532M257J1157L4029N7599
10040B09837K7037K6210K1259n341K6500j0425q512M5187J13475R7398j5600P3489
10028F00514Q960L4614P2522J16052L0431Q6042J72868J15861O6461J39303J25330
10017A568958R9034M9575L3911j11053k18536j11283m8523j73199j43384p1771
10007H73729j13985l8153j22745n0964k82o7073L0256m5315k5022j5055l9396
9996C85995m895p4881M9435k3897j8841l4761O626N2141J6829M1707L0222o8744
$$ plain form
10076 614853 578432 596671 516542 476027 437422 343198 379673 318544 321795 299850 295552 244460
10064 244460 204024 227811 203015 226919 196731 209158 143355 136341 125266 143780 188869 258619
10052 258619 241512 185370 154928 178547 231911 158948 183327 102795 107052 118209 152238 209837
10040 209837 236874 263084 284343 279002 305502 295077 286565 331752 445227 542625 527025 600514
10028 600514 609474 644088 716610 832662 863093 949135 1122003 1237864 1304325 1443628 1568958
10017 1568958 1667992 1717567 1751478 1640425 1421889 1310606 1262083 1088884 945500 873729
10007 873729 759744 721591 598846 547882 547600 480527 510783 465468 440446 425391 385995
9996 385995 381100 306219 355654 331757 312916 278155 284781 336922 353751 395458 425680 356936
9984C56936p074n593m5094J6324l5993n9467P2184L8184m7418K0496K7095K4230
9972C54810k318J9741k898o0394l4040O3898k2307l7103k8691k6006K4450J4259
9960B63401O2835l0266k1257j1269L6824Q7329k2222m7305K6503k7132p6722k7226
9948B13493P5580j0511Q091r187K8152p9604K8313N9767m4667M9272L0118n1814
9936B97003J9286P2934j822M3259m2095l4207L1504L3795k0091k1717l6491L2908
9924C74266N339j7507M0622N4336M777K2471k59j8406L3098m6062m7742L8793
9912D43726O0872k0304M2016j0025k9843Q9728M7145j1857j3335P2961l7840k7925
9900F05319O9853J7099L0673m7201l7996O7538l2229K3935K2750j3404N592n6224
$$ plain form
9984 356936 349862 344269 299175 315499 279506 220039 292223 330407 282989 303485 330580 354810
9972 354810 352492 372233 369335 308941 274901 338799 316492 279389 250698 224692 249142 263401
9960 263401 326236 295970 274713 263444 300268 387597 365375 318070 344573 317441 240719 213493
9948 213493 289073 278562 286653 277466 305618 226014 254327 314094 269427 318699 348817 297003
9936 297003 316289 389223 387401 430660 388565 354358 385862 419657 399566 377849 341358 374266
9924 374266 379605 362098 402720 457056 461833 484304 484045 465639 498737 452675 404933 443726
9912 443726 504598 484294 526310 516285 486442 576170 623315 611458 598123 671084 633244 605319
9900 605319 675172 692271 722944 675743 637747 705285 673056 696991 719741 706337 711929 655705
9888F55705O4547K9836k4536P0977l4913m2552N024O9372l734m860M7499o2119
9876G70246m9368M7650l2801k7224N1831l5086N9450O5686L6175o547L9037l060
9864I15989j8714m3026k1389N5920N020Q3300l2916l1913L3933N4800j968M2420
9852A041456K1950l3535M3634R21j8168N198O5846K4522j0506J5238K9404J0786
9840A196746J4544K7067L9549O6839O9557k081j15023K9769L4372K3377N7856
9829A442572L0117K5132R0696L2806M0357J4548M6529O5449R4009K3903r332J30749
9817B027535N4792J24951P1974N3638J75861J24883L0580J31926J08871M1349
9807B946360J31519J83468J78852J65398J51372J54652K28433K79453K52911J63393
$$ plain form
9888 655705 720252 750088 725552 796529 761616 719064 724088 793460 789726 784866 832365 770246
9876 770246 720878 768528 735727 708503 760334 725248 784698 850384 886559 880012 919049 915989
9864 915989 897275 854249 832860 888780 893800 977100 944184 912271 946204 1001004 999036 1041456
9852 1041456 1063406 1029871 1073505 1074426 1056258 1061456 1127302 1151824 1141318 1156556 1185960 1196746
9840 1196746 1211290 1238357 1277906 1344745 1414302 1412221 1297198 1326967 1361339 1384716 1442572
9829 1442572 1472689 1497821 1588517 1621323 1661680 1676228 1722757 1788206 1882215 1906118 1896786 2027535
9817 2027535 2082327 2207278 2279252 2332890 2508751 2633634 2664214 2796140 2905011 2946360
9807 2946360 3077879 3261347 3440199 3605597 3756969 3911621 4140054 4419507 4672418 4835811
9797D835811K41744K97385K60776J61924K40729L16857K62267K53101K54737K65343
9787G390674L13070L55146K73919L65109M08080M39301N12682N60170O85261P55332
9777A2058744Q05633R43736J022156J175503J309286J355448J571227J723117
9769B1964850J867449K245221K399829K712834L365160M053954M584167N420276
9761D8613740O794600P793608P894994P239144O050123N607998N541058K944446
9753I8479711k04795j644939l090819m036679n503369p559883p775936o312382
9745F2350909n815613n266782m086275k791387j795736j177500n32482J61998
9737D1047132N29634Q57912J184599J293072J512480J753909J961707K393988
$$ plain form
9797 4835811 5077555 5374940 5635716 5797640 6038369 6355226 6617493 6870594 7125331 7390674
9787 7390674 7703744 8058890 8332809 8697918 9105998 9545299 10057981 10618151 11303412 12058744
9777 12058744 12864377 13808113 14830269 16005772 17315058 18670506 20241733 21964850
9769 21964850 23832299 26077520 28477349 31190183 34555343 38609297 43193464 48613740
9761 48613740 55408340 63201948 71096942 78336086 84386209 89994207 95535265 98479711
9753 98479711 98274916 96629977 93539158 89502479 83999110 76439227 68663291 62350909
9745 62350909 56535296 51268514 47182239 44390852 42595116 41417616 40885134 41047132
9737 41047132 41576766 42434678 43619277 44912349 46424829 48178738 50140445 52534433
9729E2534433L044610L524752M463193N800005O966319P275112O893022N693509
9721I6194955N337487N686955L398836n99417l218177m183569m839426o728235
9713I1049409q934439r264395p809535p271371o865076n540491m285744l346426
9705C7731932k707461k056540j422878j203634q58571p29709p46888q07626p78024
9696B6420601r60214j049923j177141j253316j293709j298097j382426j388193
9688A6617582j083053r35091q62524q44993o91703o41351n36438m85311l85014
9679A0152104l96090k76181k49083k79798k30808k31001k34727k83682j51476
9670G819258p6016k25487r2501j14088o5529q2341k02944q5989j10709j40938
$$ plain form
9729 52534433 55579043 59103795 63566988 69366993 76333312 83608424 90501446 96194955
9721 96194955 101532442 107219397 110618233 110018816 106800639 102617070 97777644 91049409
9713 91049409 82114970 72850575 65041040 57769669 50904593 45364102 41078358 37731932
9705 37731932 35024471 32967931 31545053 30341419 29482848 28753139 28006251 27198625 26420601
9696 26420601 25460387 24410464 23233323 21980007 20686298 19388201 18005775 16617582
9688 16617582 15534529 14599438 13736914 12891921 12200218 11558867 11022429 10537118 10152104
9679 10152104 9756014 9479833 9230750 8950952 8720144 8489143 8254416 7970734 7819258
9670 7819258 7743242 7517755 7425254 7311166 7245637 7163296 6960352 6874363 6763654 6622716
9660F622716j34542j49413p5477j21743j15973l0584k451k733Q170K9995j0272
9649F017693r692j6697o9587j29045j36591o5732j6104k0584j39934m3948M1374
9638E411153L9203O0535J2323M6000m4425o2372r7890n3577j21449r1104l1659
9627E066738m1039n7184l9710k1938n4371Q503k6040J2218k8359j55694j10431
9616D552693j43196j72772j53885j63760m4038j51203j49502p6168r3960m4387
9606C359822p6027j03992n7832o4592q2006j33377n3348K2337m7122k7012l4283
9595B702568j72027o9079L4572m939m9041j8885k4426k5157N827N2266j3208o9250
9583B349221J6278J8170J8313k6909n0098M695j8400q8488q8787q7515L55J7241
$$ plain form
9660 6622716 6488174 6338761 6263284 6141541 6025568 5994984 5992533 5989800 5997970 6027965 6017693
9649 6017693 6008001 5991304 5921717 5792672 5656081 5590349 5574245 5553661 5413727 5369779 5411153
9638 5411153 5450356 5510891 5523214 5569214 5524789 5462417 5364527 5310950 5189501 5098397 5066738
9627 5066738 5025699 4968515 4928805 4906867 4852496 4860999 4834959 4847177 4818818 4663124 4552693
9616 4552693 4409497 4236725 4082840 3919080 3875042 3723839 3574337 3498169 3404209 3359822
9606 3359822 3283795 3179803 3121971 3057379 2975373 2841996 2788648 2810985 2763863 2736851 2702568
9595 2702568 2530541 2461462 2496034 2491095 2442054 2423169 2398743 2373586 2379413 2431679 2418471 2349221
9583 2349221 2365499 2383669 2401982 2375073 2324975 2329670 2311270 2222782 2133995 2046480 2046835 2064076
9571B064076K7394L2109k1935p804q943m2210N1605k1915p7387N2557K2292k5431
9559B044408L9983k4161p3757O7218J4069j786m3041l475N9493K3441K923J2331
9547B117646N0253Q2784J4564j9167J2408P3275L7083j1811M1398L6534K6500
9536B461467J47393J54019n368N5592L9351j8862j7329J0806l6756l6418o5985
9525B687910k2854r6266k5991r57j35740r0067j5167o2159M2656k5845j3243j0322
9513B231955o228p8339m5629P3720K6987l1616J1882K7123j276j4671k7655K1710
9501B187963l8800p003l1980J5388K2442J5152P0606J1642L5085J49632J6467
9490B446594j3673j0733n4920p0866j49083j79970p0617o7882q2837j7850r4467
$$ plain form
9571 2064076 2091470 2123579 2101644 2093840 2084897 2042687 2094292 2072377 1994990 2047547 2069839 2044408
9559 2044408 2084391 2060230 1986473 2053691 2067760 2065974 2022933 2019458 2078951 2102392 2105315 2117646
9547 2117646 2167899 2250683 2265247 2246080 2258488 2331763 2368846 2357035 2398433 2434967 2461467
9536 2461467 2608860 2762879 2757511 2813103 2852454 2833592 2816263 2827069 2790313 2753895 2687910
9525 2687910 2665056 2568790 2542799 2541842 2406102 2316035 2300868 2238709 2281365 2255520 2242277 2231955
9513 2231955 2225727 2147388 2101759 2175479 2202466 2170850 2182732 2209855 2208579 2193908 2166253 2187963
9501 2187963 2149163 2142160 2110180 2125568 2148010 2163162 2233768 2245410 2280495 2430127 2446594
9490 2446594 2432921 2422188 2367268 2296402 2147319 1967349 1896732 1828850 1746013 1728163 1633696
9479A633696p6389P32m6584Q0955J1109q3068l2593n8863m1365j1205K211Q9995
9467A468631n1785k6097r148k2789m4046N1106m2242k2226M6795J1404J2786J6523
9455A388912j0148l7163M376j5863J03348O296J7956M507P1581J9597O079j6589
9443A542889j7383K2438N7613M1644j4686K4358j8221J4838Q127M4210k8936M0285
9431A717176n5760j2873N8931o675O0609j6247K8866J05815R0228l2993K3134
9420A960211Q8187K2334M1980J3811R4778J68229J19809J10135Q4841J19669J64319
9409B988303J79653L03876M13157K84750K75547K48384J72737J64032J28479J68184
9399E327102P8502K5843O0277n9278p6635j20272k23534k63715j57241k00487
$$ plain form
9479 1633696 1557307 1558039 1511455 1592410 1603519 1520451 1487858 1428995 1387630 1376425 1378636 1468631
9467 1468631 1416846 1390749 1381601 1358812 1314766 1365872 1323630 1301404 1348199 1359603 1372389 1388912
9455 1388912 1378764 1341601 1345977 1330114 1433462 1439758 1457714 1462221 1533802 1553399 1559478 1542889
9443 1542889 1525506 1547944 1605557 1647201 1632515 1656873 1638652 1653490 1661617 1705827 1676891 1717176
9431 1717176 1661416 1648543 1707474 1700799 1761408 1745161 1774027 1879842 1970070 1937077 1960211
9420 1960211 2048398 2070732 2112712 2126523 2221301 2389530 2509339 2619474 2704315 2823984 2988303
9409 2988303 3167956 3471832 3884989 4169739 4445286 4693670 4866407 5030439 5158918 5327102
9399 5327102 5405604 5431447 5491724 5432446 5355811 5235539 5012005 4748290 4591049 4390562
9389D390562k36295j84910k02803k07986k18895j06239j6899j05554p0293o960
9379C033728M9715K6010O1276j617P8398R7111L5497J27042J28611J02449K00691
9368C938911L04743K37786L15890L68386L62422L21499L77143K10032R1053P6285
9358F604150p8192j34960j67651k27493k07294k22574k75031k31811k02869j32038
9348D724237j10700j62072j47773q0794o8116q2547o5689n9308r1769q6577r6453
9337C672439q7752l7139J6103n1217K1048N1539o8374M846O9337k2729k6570j8226
9325C523305j1176O1893K1852Q0794M5261J24915R7167J28139J33521J12284P5114
9314D393069n3009L971l7739m9483l2024k8666o9109n1549j3203n7659m6909r7915
$$ plain form
9389 4390562 4154267 3969357 3766554 3558568 3339673 3233434 3216535 3110981 3040688 3033728
9379 3033728 3083443 3109453 3170729 3169112 3247510 3344621 3380118 3507160 3635771 3738220 3938911
9368 3938911 4243654 4481440 4797330 5165716 5528138 5849637 6226780 6436812 6527865 6604150
9358 6604150 6525958 6390998 6223347 5995854 5788560 5565986 5290955 5059144 4856275 4724237
9348 4724237 4613537 4451465 4303692 4222898 4154782 4072235 4006546 3947238 3855469 3768892 3672439
9337 3672439 3584687 3547548 3563651 3512434 3533482 3585021 3516647 3521493 3590830 3568101 3541531 3523305
9325 3523305 3512129 3574022 3595874 3676668 3721929 3846844 3944011 4072150 4205671 4317955 4393069
9314 4393069 4340060 4344031 4306292 4256809 4224785 4196119 4127010 4075461 4062258 4004599 3957690 3859775
9302C859775r4072k257n5256n6656L1177j8135J1018M5121k7928l5063r99j9381
9290C637344M209O0470k5343M6348L7446k3528K4073K6603R0224N2228j6263K7452
9278C941263N5674O6285l567K8964L0188P9679j1935J1862J62469P8879J13194
9267D552955O5043P2294Q0034Q9942N4925J24669K10579J59999J04658J47651
9257E662749J48394J20001J72290J93196J85613K53457K20800K78834K45327K25180
9247G705841L13056L26336L14255L23178M63539N40679N50211O19281O68536P49247
9237A2574159Q92093J170946J303718J532386J888364K088333J822003J312542
9229B4584544N82271N00984O53849K81622l8359o49967j067469j011236j044093
$$ plain form
9302 3859775 3765703 3763446 3708190 3651534 3682711 3664576 3675594 3720715 3692787 3657724 3656725 3637344
9290 3637344 3641553 3702023 3676680 3723028 3760474 3736946 3761019 3787622 3877846 3930074 3913811 3941263
9278 3941263 3996937 4063222 4059655 4088619 4118807 4198486 4186551 4198413 4360882 4439761 4552955
9267 4552955 4617998 4690292 4770326 4860268 4915193 5039862 5250441 5410440 5515098 5662749
9257 5662749 5811143 5931144 6103434 6296630 6482243 6735700 6956500 7235334 7480661 7705841
9247 7705841 8018897 8345233 8659488 8982666 9446205 9986884 10537095 11156376 11824912 12574159
9237 12574159 13466252 14637198 15940916 17473302 19361666 21449999 23272002 24584544
9229 24584544 25166815 25667799 26321648 26603270 26564911 25914944 24847475 23836239 22792146
9220B2792146r14012n96477k35868K1045K03144L96825N97466P81474R70030J273010
9210B5288783J420926J534454J818480K109393K375299K902363L329849L505216
9202D4284763L385496L183225L460639M342360M682073N276038O203880O845358
9194H1663832O320468M525171J802251R95154J963570J085648m10297k428515
9186I5517282m625542m535875m417509m010476k538258j199430n8587Q62619J713820
9177G6708044K876482L837227M834901N997563P428732R428297J1614242J4120186
9169A36845674J6957007J9982485K1602739K0086995J6101860R630080M345550
9162B45552390K651499L89132j418104l463973o578056q720220j0890347j3118933
$$ plain form
9220 22792146 21878134 21281657 21045789 21066834 21269978 21666803 22264269 23045743 24015773 25288783
9210 25288783 26709709 28244163 30062643 32172036 34547335 37449698 40779547 44284763
9202 44284763 47670259 50853484 54314123 58656483 63338556 68614594 74818474 81663832
9194 81663832 87984300 92509471 94311722 95306876 97270446 98356094 97945797 95517282
9186 95517282 90891740 86355865 81938356 77927880 75389622 74190192 74131605 74994224 76708044
9177 76708044 79584526 83421753 88256654 94254217 101682949 111111246 122725488 136845674
9169 136845674 153802681 173785166 195387905 215474900 231576760 241206840 245552390
9162 245552390 248203889 248593021 247174917 243710944 237132888 228412668 217522321 204403388
9154B04403388j4669781j5816743j6713494j7725285j7081367j4539177j1664965
9147I6192576r415360p672926o256211n134368m116736l408849k918125k370774
9139E4899227j937833j512394j196726q19867m05196l6098M67745J255163J827815
9130E2541836J758680J309265P66298n8965j081853j869683k351606k717733k767509
9121D5528730k395954k034245j785793j707339j685308j640896j586078j468669
9113C1224448j435102j439433j351418j284523j144658r65021j008822q67612
9105B1727859r45023r96663q73600p97075o86166n37944n07974l83467l09849
9096A5690098l48494j44187j84359j08587P82r8445Q0296J45291K00264L00071
$$ plain form
9154 204403388 189733607 173916864 157203370 139478085 122396718 107857541 96192576
9147 96192576 86777216 79104290 72848079 67713711 63596975 60188126 57270001 54899227
9139 54899227 52961394 51449000 50252274 49432407 49027211 48991113 49458858 50714021 52541836
9130 52541836 54300516 55609781 56376079 56317114 55235261 53365578 51013972 48296239 45528730
9121 45528730 43132776 41098531 39312738 37605399 35920091 34279195 32693117 31224448
9113 31224448 29789346 28349913 26998495 25713972 24569314 23604293 22595471 21727859
9105 21727859 20782836 19786173 18912573 18115498 17429332 16891388 16383414 15999947 15690098
9096 15690098 15341604 15197417 15013058 14904471 14905253 14806808 14887104 15032395 15232659 15532730
9086A5532730L77213M25781M86935M38115M19145K07252k0260J8825m1605J2374
9076A7856505j07819k62354m39393l78625m52564m21322j70912P1942R7157J61530
9066A5954145L26574N05793P10964Q72404J148125J150753J008129Q37719O75510
9057B3190116N82255L32619K78393R5195k75315l98479l12459m94781o76723o69317
9047B1651504n68031n61510l05251P952K40306L84641N05871O73971Q57959Q90131
9037B3777543Q98905J210431J420287J652060J699323J880410K269645L009720
9029C7818324L743723M151201N111429N933353N588129L862709R76244j368744
9021F5816368r18382j9713o00146l68361P42131P48038n15940k476514l795906
$$ plain form
9086 15532730 15909943 16335724 16822659 17260774 17679919 17887171 17866911 17885736 17844131 17856505
9076 17856505 17748686 17486332 17046939 16668314 16215750 15794428 15623516 15695458 15792615 15954145
9066 15954145 16280719 16786512 17497476 18369880 19518005 20668758 21676887 22514606 23190116
9057 23190116 23772371 24104990 24383383 24478578 24203263 23804784 23492325 22997544 22320821 21651504
9047 21651504 21083473 20521963 20216712 20224664 20464970 20849611 21355482 22029453 22887412 23777543
9037 23777543 24676448 25886879 27307166 28959226 30658549 32538959 34808604 37818324
9029 37818324 41562047 45713248 50824677 56758030 62346159 66208868 67185112 65816368
9021 65816368 64897986 64878273 64278127 63909766 64651897 65399935 64883995 62407481 58611575
9012E8611575l239430k252031k559985k593768j800844q83961k52755R9021N06923
9003D5634745J045427J662776K256784K909025L725656M629402M856783M232559
8995G0953157L103772J735922K140250L692530M180927M456495M025221K012877
8987I6301151j154743k807008l484885l907750l114115k349099k248940k423479
8979G4811132l787646n159537n095735l765151l408241l621413l041154k116787
8971D4815468j247065q32386n08930P9620P36824J400255J761590K279428L025611
8962E1510415K921014J964778K98312j467187j305865o14371r21680n85187N44245
8953E2344474J032598K30331j280551l050525l341925k748512k947914l258128
$$ plain form
9012 58611575 55372145 53120114 50560129 47966361 46165517 45281556 45028801 45127822 45634745
9003 45634745 46680172 48342948 50599732 53508757 57234413 61863815 66720598 70953157
8995 70953157 74056929 75792851 77933101 81625631 85806558 90263053 94288274 96301151
8987 96301151 95146408 92339400 88854515 84946765 81832650 79483551 77234611 74811132
8979 74811132 71023486 65863949 60768214 57003063 53594822 49973409 46932255 44815468
8971 44815468 43568403 42736017 42227087 42306707 43043531 44443786 46205376 48484804 51510415
8962 51510415 54431429 56396207 56694519 55227332 53921467 53307096 52385416 51800229 52344474
8953 52344474 53377072 53607403 52326852 49276327 45934402 43185890 40237976 36979848
8945C6979848k840189k363922j963871j497262j233283q80437m94466k21759r453
8936B5475206K21394N85151Q06826J024548J131713J259089J496738J843182K362011
8927C6205858K519908L174570M727494M483006J734674j384361l893547o206093
8919D1361509n908607m252735l387577k797956k337126j861560j624550j341515
8911A7849883j098293q94211q19943p56037p09338n30624l97292l05417l29452
8902A2009276k04248k52413k74638k41581j96481k20650l12991k37526l29847
8893I738901l75561l43827l33474l70364l46758k77648k54110l15051l32882l00596
8883F488630k09090j54594j84093k11938j32941j52368j70789q4372p2570j16448
$$ plain form
8945 36979848 34139659 31775737 29811866 28314604 27081321 26200884 25706418 25484659 25475206
8936 25475206 25696600 26281751 27088577 28113125 29244838 30503927 32000665 33843847 36205858
8927 36205858 38725766 41900336 46627830 51110836 52845510 51461149 47567602 41361509
8919 41361509 35452902 31200167 27812590 25014634 22677508 20815948 19191398 17849883
8911 17849883 16751590 15857379 15037436 14281399 13572061 13041437 12644145 12338728 12009276
8902 12009276 11805028 11552615 11277977 11036396 10839915 10619265 10306274 10068748 9738901
8893 9738901 9363340 9019513 8686039 8315675 7968917 7691269 7437159 7122108 6789226 6488630
8883 6488630 6279540 6124946 5940853 5728915 5595974 5443606 5272817 5188445 5115875 4999427
8873D999427j63236j15402o0286j31544j04197n0087n3525r1117r8770p3663n2793
8862D004807n5250l0685m9610m7682k3989p2013r8906r1500j08694o0679k1852
8851C343947r1649j29728j09049m5927n7681q7705m8076l1356j7470o5383k2942
8840B636981p3747l3552J0540j9304r4252k4202M6582p2k5237n1790l0524Q1305
8828B422728N7414j7301j0627L6560m843l0957K717L6034l172K2363P998L862
8816B522776p3873r7957k0973p6951P1026l6765J6405N4457O6324L6233M570j1666
8804B453606j6072l8051j3122j07155k4950p5224j41827k4817l8567l3581l2426
8793A907814l2016j4681p0757J5201K0100l7730j4718j6534l8083j8343K0073
$$ plain form
8873 4999427 4836191 4720789 4660503 4528959 4424762 4374675 4321150 4230033 4131263 4057600 4004807
8862 4004807 3949557 3918872 3869262 3821580 3797591 3725578 3626672 3535172 3426478 3365799 3343947
8851 3343947 3252298 3122570 3013521 2967594 2909913 2822208 2774132 2742776 2725306 2659923 2636981
8840 2636981 2563234 2529682 2540222 2520918 2426666 2402464 2449046 2448974 2423737 2371947 2341423 2422728
8828 2422728 2480142 2462841 2452214 2488774 2483931 2452974 2455691 2491725 2488553 2510916 2518914 2522776
8816 2522776 2448903 2350946 2329973 2253022 2324048 2287283 2303688 2358145 2424469 2460702 2465272 2453606
8804 2453606 2437534 2399483 2386361 2279206 2254256 2179032 2037205 2012388 1973821 1940240 1907814
8793 1907814 1875798 1861117 1790360 1805561 1825661 1787931 1773213 1756679 1718596 1700253 1720326
8782A720326l5996k292P6237o9249l1976p3086j2125j6081n540O2504K1823j8129
8770A616416M1079N3394M4957l4515j9655N0361j8059j00208j37305j577k047
8759A492841j04060m4792r3157k7357J16713j35452k4022j5479j4679J7165J3249
8748A180970K1714n5168p350l0582J3400J3676k1632m3848K057J3256p7420k0534
8736I88539M6732M8289m4050j4106n7360m3047j7116j0980J8068N4224l5851l5667
8724H97675n9702K7534N0326O869j4955J329j14567j9479O1423J0396K0525J3151
8712H80525o9688M1826J6106l0580n4153J4755J4453K9732O3932m7250n17q2392
8700G76749J519n063M1604j5065K779j5263l0928O4174L2803n6591j3440K3180
$$ plain form
8782 1720326 1684330 1682038 1758275 1689026 1657050 1583964 1571839 1555758 1550218 1612722 1634545 1616416
8770 1616416 1657495 1710889 1755846 1721331 1701676 1752037 1733978 1633770 1496465 1494888 1492841
8759 1492841 1388781 1343989 1250832 1223475 1340188 1204736 1180714 1165235 1150556 1167721 1180970
8748 1180970 1202684 1147516 1140166 1109584 1122984 1136660 1115028 1071180 1073237 1086493 1009073 988539
8736 988539 1035271 1083560 1039510 1025404 968044 924997 907881 896901 914969 969193 933342 897675
8724 897675 837973 865507 915833 922702 907747 909076 794509 775030 836453 846849 867374 880525
8712 880525 810837 852663 868769 838189 784036 798791 813244 842976 906908 859658 859141 776749
8700 776749 778268 773205 814809 799744 802523 787260 756332 820506 853309 796718 783278 806458
8688H06458J4011P7029j4967o5290k7664p996M3949P9038J6714k7237l4479L7032
8676H96598o335N938M0570m4213j8052K4387k1480L4110m7027j8141j1261n213
8664H29881J4384L8087M8956k4263j4132n411J9713O499k2397j8694K5663o8456
8652H29830L216n330J2680m6336J7287n645o2064j1238L0533k1727O16n256Q681
8639G45247q909L7651p8701O5317M1877J3357J3351k5429K4006M9782K9428J2537
8627I19514M9694k2593k2024K1288K9055l1407n860n2378M8079r5114m7725N2166
8615H42695o1086M259J554L24j4061p9535j8083J2547L640K4135N046k3371J3630
8602G11694p738m9193k2754n159M6756M0264l1917l781J059l5145M691L2288m8233
$$ plain form
8688 806458 820469 897498 882531 817241 789577 781581 825530 904568 921282 894045 859566 896598
8676 896598 890263 896201 936771 892558 874506 898893 877413 911523 864496 846355 835094 829881
8664 829881 844265 882352 931308 907045 892913 887502 907215 913714 891317 872623 898286 829830
8652 829830 833046 827716 840396 794060 811347 805702 743638 732400 762933 741206 741822 736566 745247
8639 745247 736338 773989 695288 760605 802482 815839 829190 803761 827767 877549 906977 919514
8627 919514 969208 946615 924591 945879 974934 943527 937667 885289 933368 838254 790529 842695
8615 842695 781609 785868 787422 787746 773685 694150 676067 688614 692254 716389 721435 698064 711694
8602 711694 703956 654763 632009 626850 673606 713870 681953 678172 679231 644086 648777 681065 632832
8589F32832n206L0458q6951j1166L1018k1830L72J592k7202m3799K415N1105n2976
8576E00662o3210K1195J524L6734o7043j3060o0333N5023j9978r057N3997J4167
8564D50621j8319K9971l6293l2229l5987K1900N807m6707j0355K3599L950l7858
8552C18100J5719l5772l888Q469L0278j90j3785M8690o4L1630p198l3263j2666
8539C46060l1231K4666M2834N074O091k7572l9294N0509j4389l4561p6439m6692
8527B05056L511L0668J2782J9407M0723P7860n7095K5314l4091k9632k770L691
8515B95424k1899L9067m4146J4242L4058p1177p564j421L7258M1047l9198P6752
8503C52443o9480p4799J2346l0612N3238j8576l8907L9797l935k0902K1164L6810
$$ plain form
8589 632832 627626 658084 571133 559967 590985 569155 569527 571119 543917 500118 502533 553638 500662
8576 500662 437452 458647 460171 496905 429862 416802 356469 411492 391514 382457 436454 450621
8564 450621 432302 462273 425980 393751 357764 379664 385471 338764 328409 352008 355958 318100
8552 318100 333819 298047 294159 302628 332906 332716 318931 367621 367557 399187 391989 358726 346060
8539 346060 314829 339495 382329 387403 393494 365922 326628 377137 362748 328187 251748 205056
8527 205056 208567 239235 252017 271424 312147 390007 332912 358226 324135 294503 291733 295424
8515 295424 273525 312592 268446 282688 316746 245569 238005 236584 273842 314889 275691 352443
8503 352443 282963 208164 220510 189898 243136 224560 185653 225450 221515 200613 221777 258587
8491B58587K9807j794o6982P7573n881l3695n5069J9730K7201p1491L1825Q770
8479B18581J2189J1344m221k5282L3661Q764m3207l3168N2085K561L1448O401
8467B71156L1150k1596n9235k0347O3245j0855l6562k8769p401M6074k6820P338
8455B07378Q1250M4297K6291j09586o678K9916P327Q1417Q9477l2533O3864m617
8443D77803q6891p0990K981n3003j7401m5611N2571J5258n6154K6220J4313N288
8431B64384o015L6805p9219n0674J6852k6260K3272j374j9845J2013N1286J9084
8419B40309m8955k0760M0195M7683l7438k1900m315k5391k8523Q794M642M91j3858
8406A40974K331k3866M0639k2104K8266M4341o7642K7392r021L0609M4333n1357
$$ plain form
8491 258587 288394 286600 219618 297191 291310 257615 202546 222276 249477 177986 209811 218581
8479 218581 230770 242114 237893 212611 246272 255036 211829 178661 230746 233307 264755 271156
8467 271156 302306 280710 221475 201128 264373 253518 216956 188187 180786 226860 200040 207378
8455 207378 288628 332925 359216 249630 242952 272868 280195 361612 451089 418556 482420 477803
8443 477803 390912 319922 322903 269900 252499 206888 259459 274717 218563 244783 259096 264384
8431 264384 258369 295174 215955 165281 182133 155873 179145 177771 157926 169939 221225 240309
8419 240309 191354 170594 210789 258472 221034 199134 194819 169428 140905 149699 154341 154832 140974
8406 140974 143305 119439 160078 137974 166240 210581 142939 170331 161310 191919 236252 184895
8394A84895l8073k4847N6655J2424n9858m481K3796K195l8674R029N9025k841
8382A79245m3519J0065m417l4651J1284n5469J9606J9902L710l6599M3473O6874
8370A79504o0603j6763r970j0330L6447J7994K3998J327l9448k4247l7653n266
8358E4990O7202N9659n1621k4250J3785L3814N9259p2494k0495o6259M7548N801
8346A06939K5763J3552m020m2449O5186k5992R376k9175L4417J8803n9054M3592
8334A56938j4138m6656J4049O305n1757M3978k4120Q978L9284j1627L1624M2540
8322A95398n117o4287l366Q938O5595J1196j13228M4659j6306K7890J6159J364
8310A68895n3985K3978n676J2174L496j3583M0161J7377N4310K3469k8755j9760
$$ plain form
8394 184895 146822 121975 178630 191054 131196 126715 150511 152706 114032 123061 182086 179245
8382 179245 135726 145791 141374 106723 118007 62538 82144 102046 105756 69157 112630 179504
8370 179504 118901 102138 92168 81838 118285 136279 160277 161604 122156 97909 60256 54990
8358 54990 122192 181851 130230 105980 119765 153579 212838 140344 119849 53590 101138 106939
8346 106939 132702 146254 142234 99785 164971 138979 148355 119180 153597 172400 113346 156938
8334 156938 142800 96144 110193 116498 64741 108719 84599 93577 132861 121234 152858 195398
8322 195398 190281 125994 122628 131566 197161 208357 95129 139788 123482 151372 167531 168895
8310 168895 114910 138888 133212 145386 148882 135299 175460 192837 247147 270616 241861 222101
8298B22101k9531p166j0940K5813o7691N2544J0238l6079L8551J9867P170l8626
8286A86251L2691K9491m9668M416o501l5320l3976L6265P5967j9864p7328O7235
8274B09659O3220M4250k3257K6343M6332L6689N7666J6453N6251o8302m1104o7795
8262C56405n5097l2030J479n9319J8641L0457r7328L281M3614J140o3370J9670
8250A67543l9688n792m4706m9919J7579L3103J4590n0799K0655K8706M0561L7175
8238A69008l3428r7464n2651l353P8063r900m336k8361J3599j9867L4743M9309
8226I5362n4943l8767O3656L3989o1475M1668O4751k0059k7004n2097K7126P5420
8214A47627j8197l7356j3548k5619j4839K7635k5498J345j320O0700m1993Q469
$$ plain form
8298 222101 192570 185404 174464 200277 132586 185130 195368 159289 197840 217707 224877 186251
8286 186251 218942 248433 198765 203181 196680 161360 127384 163649 239616 219752 142424 209659
8274 209659 272879 317129 293872 320215 366547 403236 460902 477355 533606 465304 424200 356405
8262 356405 301308 269278 270757 211438 230079 260536 163208 166489 210103 211243 147873 167543
8250 167543 127855 122063 77357 27438 45017 78120 92710 41911 62566 91272 131833 169008
8238 169008 135580 38116 -14535 -17888 60175 50275 45939 17578 31177 11310 46053 95362
8226 95362 40419 1652 65308 99297 37822 79490 144241 124182 97178 45081 72207 147627
8214 147627 129430 92074 78526 52907 38068 65703 40205 41550 40230 100930 58937 67406
8202F7406K7517q3180l0389L0646J00439P7618o5059k437n3631P1715J0402j41129
8190I918k2197J6038L3970o6854M6953P4229k0179l340L0000p0695r2179L7878
8178b6458M3942M548R452K3819p7442J4817J16976j3207K2152Q0433r7345l900
8166I7787m1848l2873J28344n6754K0622o7618J2365L1839j6714L1842J8965m9079
8154G6878M425J9286m5261l3417O1131L5588n0948m3388L2960R003p668l0939
8142B7650k3043K0584L4116K0105N127O348o3699j6561K460L5543n2402k607O945
8129E66K9655o1997J7934O9918l6300J6234j897j3567J4427M354j5615p404O4125
8116H0433J3107j06730K0865j7041K4294j6119L542O615L2225J4181L1573R254
$$ plain form
8202 67406 94923 11743 -18646 12000 112439 190057 124998 122561 68930 140645 151047 9918
8190 9918 -12279 3759 37729 -29125 17828 92057 71878 68538 98538 27843 -64336 -26458
8178 -26458 17484 22032 31484 55303 -22139 -7322 109654 96447 118599 199032 101687 97787
8166 97787 55939 23066 151410 94656 115278 47660 60025 91864 75150 106992 125957 76878
8154 76878 81303 100589 55328 21911 83042 118630 67682 24294 57254 66257 58589 27650
8142 27650 4607 25191 59307 79412 84539 90887 27188 10627 13087 48630 -3772 -6379 566
8129 566 30221 -31776 -13842 56076 19776 36010 34113 20546 34973 39327 23712 16308 80433
8116 80433 93540 -13190 7675 -9366 14928 -1191 2351 8966 41191 55372 86945 96199
8104I6199o4p0201j0050N9767l4737l2687M8297l5213l3169N1349Q295K4964n455
8091F7295L7930l3464k1768m5160N1163m1460J5312L951J8575l227N065J9556
8079G3768q827J7829l7812j4674J6761L4545j0494j3640k7622N851m1263o5305
8067g0883M1308L9509m4567K0957O0914k270m4301Q3323N6370n7469l3999m7135
8055A757m1287K0358J132p852j1889M2070J0236j0038N0283M6552j10722J5110
8043E710Q4160j06836o0815m9600M5285P2162k2813P535M4441r131L432l518J9900
8030B9912O2936l5158n3181L4996k9682p350o9414k5597R4621l868o8923Q3633
8018A2925O1374k2233l0944k6887k7609l0743L8207J9784l7630j7747N5088P5118
$$ plain form
8104 96199 96135 25934 15884 75651 40914 8227 56524 21311 -11858 39491 47786 72750 67295
8091 67295 105225 71761 49993 4833 55996 14536 29848 33799 52374 49147 54212 73768
8079 73768 64941 82770 44958 30284 47045 81590 71096 57456 29834 35685 -5578 -70883
8067 -70883 -29575 9934 -34633 -13676 47238 44968 667 83990 140360 82891 48892 1757
8055 1757 -39530 -19172 -18040 -25892 -37781 4289 14525 4487 54770 101322 -9400 5710
8043 5710 89870 -16966 -77781 -127381 -82096 -9934 -32747 -25212 19229 10098 13530 10012 29912
8030 29912 92848 57690 4509 39505 9823 2473 -66941 -92538 2083 -1785 -70708 12925
8018 12925 74299 52066 21122 -5765 -33374 -64117 -25910 -6126 -43756 -61503 -6415 68703
8006F8703m4298N400N9321q2990l6639N0091o960l2684j9857M2744R3687R189
7994A05707l2597M6664l4650J6718j5764o2015m932j7794l4647n8009P6195P2695
7982E7571m3478o5379O263P8933N1008r240k2183J7152J8268l1084r4731J8126
7970a8774L2510j9843J7157L0068p6723j2452N5212j8559j1708m4819j8521k4815
7958a11267L4437L8964m820m393J047L7954k8224K6561L4289n168J0359K370o776
7945B5333o8615Q850M5096N5152K9273J2508l0663j5406j2506L6213J3636o6885
7933C1986k9658l2567o2751O1678L1584l5176J797L7998L217q010M0902k7558
7921A3442l9939J0460l6510l949K6113p4j2846k8215L0153K4780Q498R2728l3390
$$ plain form
8006 68703 24405 29805 89126 6136 -30503 19588 12628 -20056 -39913 2831 96518 105707
7994 105707 73110 119774 85124 101842 86078 24063 19131 1337 -33310 -91319 -15124 57571
7982 57571 14093 -51286 -45023 33910 84918 75678 53495 70647 88915 57831 -36900 -18774
7970 -18774 13736 -6107 11050 41118 -35605 -48057 7155 -11404 -23112 -67931 -86452 -111267
7958 -111267 -76830 -37866 -42686 -47079 -46032 -8078 -36302 -9741 24548 19380 29739 32109 25333
7945 25333 -43282 -34432 10664 65816 95089 107597 76934 61528 49022 85235 98871 31986
7933 31986 2328 -30239 -92990 -31312 272 -34904 -33107 4891 8108 98 41000 13442
7921 13442 -26497 -16037 -52547 -56496 -30383 -30457 -43303 -71518 -41365 -16585 -8087 84641 51251
7908E1251K2761n295l6805n438K1614j8579L0739j521l9083j780n3828M9655M6354
7895F0045o5124k8720L5540N9761l7165l74N2596l7594k8187j4596O1584l0051
7883B7715n7080O5544p0527J4843L3325k448j6094m1095M0934n6767N22R1815
7871C0687m581j7232R601R244k1797O598L6966J5477J4909n8884K1581n35L182
7858D5216j8560j4332K777K7973L2728k8780r053L7259l7721o9324k9611P460
7846e3968L6809j353j0189j264j3181O0078n0681K9998L3439m7438O5870m4369
7834C751m0534r730K5648j5285o209L2891n3P6193o3313k1904k0000J9700K1133
7821B288k0103J185j9439o6464P1269M0039n548K7589M6858O4272k2078k3950
$$ plain form
7908 51251 74012 68717 31912 26474 48088 29509 60248 58727 19644 17864 -35964 13691 60045
7895 60045 -5079 -33799 1741 61502 24337 23963 76559 38965 10778 -3818 57766 27715
7883 27715 -29365 36179 -34348 -19505 13820 11372 -4722 -45817 -4883 -61650 -61128 30687
7871 30687 26106 8874 18475 27719 5922 12520 49486 64963 79872 20988 42569 42034 45216
7858 45216 26656 12324 15101 43074 75802 47022 37969 75228 37507 -31817 -61428 -53968
7846 -53968 -17159 -18512 -28701 -29965 -43146 16932 -33749 -3751 29688 -17750 48120 3751
7834 3751 -36783 -46513 -20865 -36150 -42359 -9468 -9521 66672 3359 -18545 -38545 -18845 2288
7821 2288 -17815 -16630 -36069 -102533 -31264 8775 3227 30816 77674 141946 119868 95918
7809I5918o8540j5218Q2242M3181J20561k16093q4672P7784j2862P255k4085L2966
7797C8437n8005o1416J03413J5682l1468R1944m8289q0328K5890j2776j7575j3955
7785d8446N893K3958M1455L0417r8316r755L1148L0505J450M3062j2998P60K29
7772C9362K4686J321l3001k02K2624J1497K9041n1645l7020N4504P2761P1927
7760B05855M3165j8012J620Q880n2570j470R996l954l8408l3083j8682l9260R020
7747G3097o0179j6617J1789M1063o6256m5023N4905L3739Q240j9363j0658M0138
7735D4875m0411l8230l6460K8438N3980k7608m4700P0034k2872k0507P668J4340
7723a1453J8795J1671j4324R841l1476K1419J9185o4064N6146n4000m2621r833
$$ plain form
7809 95918 27378 12160 94402 137583 258144 42051 -42621 35163 22301 29556 5471 38437
7797 38437 -19568 -80984 22429 38111 6643 98587 50298 -30030 -4140 -16916 -34491 -48446
7785 -48446 -42553 -18595 22860 53277 -45039 -54794 -23646 6859 8309 51371 38373 39133 39362
7772 39362 64048 65369 32368 32166 54790 66287 95328 43683 6663 61167 133928 205855
7760 205855 249020 231008 232628 241508 188938 187468 197464 193510 155102 122019 103337 64077 73097
7747 73097 12918 -3699 8090 49153 -17103 -62126 -7221 26518 34758 15395 4737 44875
7735 44875 4464 -33766 -70226 -41788 12192 -15416 -60116 9918 -12954 -33461 -25793 -11453
7723 -11453 7342 19013 4689 14530 -16946 4473 23658 -40406 15740 -38260 -80881 -90714
7711i0714M4214O323O2771K245l1277k6583n6805J8027L7660J1168L1487q313
7699B03M5449j101o269m3484j527k7918M334J7219K0805J7130m977J7262m5275
7686h149j232k9733N5455N4912l221k1257k7857K7638j4074L0873K595K6779k8539
7673F4190m0389O4833Q530q524l477l893j4881j2689j9322N0645k3971K7318o4367
7660B4003J6310m9230p5481O1321k52n6728L5166M0204p505K1614N76J8389K2605
7647E0992N5622k0605j9179j1445l4406K0431P345n1884K5858P795k9348k7659
7635b6483L5801M7337k8169q4543j5375K086O300N9697j8319K8853R2808p5652
7623B4341K6502L8621k913l9022K9447L0244k1325j4532l0480K0172O1169k4796
$$ plain form
7711 -90714 -46500 -40177 22594 24839 -6438 -33021 -89826 -71799 -34139 -22971 8516 203
7699 203 45652 44551 38282 -5202 -6729 -34647 -30313 -13094 7711 24841 19864 37126 -8149
7686 -8149 -9381 -39114 16341 71253 68032 46775 18918 46556 32482 63355 65950 92729 64190
7673 64190 23801 88634 97164 88640 85163 81270 66389 53700 34378 85023 61052 88370 24003
7660 24003 40313 -8917 -84398 -23077 -23329 -80057 -44891 -4687 -12192 9422 9998 28387 50992
7647 50992 106614 86009 66830 55385 20979 41410 48755 -3129 22729 30524 1176 -26483
7635 -26483 9318 56655 28486 -56057 -71432 -69346 -63046 -3349 -21668 7185 99993 24341
7623 24341 50843 89464 86551 47529 76976 107220 85895 71363 40883 61055 122224 97428
7611I7428j9144K694L1112m2759m818o312K3167n5048M9112K2197k8176R0124
7599A59577m3826J2763K0570o563o096M6232nM1792n98m6860L520N5166p275K4364
7585B52761M3114L5338Q048J7903O207P0850J560M5991K7119N7707K9462K7335
7573F23395P2944J30071O2392Q4389J20129M0082J10170K08644J62004J19477
7563A733697K71346L34454L89606N22732M97781M10503J05839k05054l63935n54061
7553C142908m08675l73571l18206k71400j75321j07143j46057o0662m6365k5441
7543A210067K1485M536L6755O2895M0381O2743J32574O7043Q0486K76269K96116
7532B291350L61431M09187M67115M02471J56610r9614l99753m61498n41174m55564
$$ plain form
7611 97428 78284 80978 112090 69331 64513 58201 81368 26320 75432 97629 69453 159577
7599 159577 115751 128514 149084 142521 136425 182657 182652 224444 223846 176986 180506 235672 228397 252761
7585 252761 295875 331213 339261 357164 363371 434221 435781 481772 508891 566598 596060 623395
7573 623395 696339 826410 888802 973191 1093320 1133402 1243572 1452216 1614220 1733697
7563 1733697 2005043 2339497 2729103 3251835 3749616 4160119 4265958 4060904 3696969 3142908
7553 3142908 2734233 2360662 2042456 1771056 1595735 1488592 1342535 1281873 1235508 1210067
7543 1210067 1231552 1236088 1272843 1335738 1376119 1438862 1571436 1638479 1718965 1995234 2291350
7532 2291350 2652781 3061968 3529083 3931554 4088164 3988550 3588797 3127299 2586125 2130561
7522B130561k79500k40353l01279j28892r9852j34852j02494n7827l9196r6544
7512F49772q1079j8862l7244m9419j1166K3619l9444n7834n0385j4504p4240M392
7500B43606K2358m0317J6876l8770j3574r321q6857L8343M7119l947j4666l9752
7488A21098J8616k5130m828o1603L828L8404L4182m2806l3201K6255L9887r560
7476A05142N5235k5514m7964m4177J1559M2439o391P287l9254L8889q391K2247
7464A11107R692j5000j1508j0096K1655m4881J0832J2500J4587l0303o362j0749
7452E1474j2302L8373j3536J0573j8687j5352M5498L4374j2240j03370j2124j5542
7440b2861O567N3578K417m0060j4863Q409j6810J2842p174M5672j1215m706j1266
$$ plain form
7522 2130561 1851061 1610708 1309429 1180537 1080685 945833 843339 785512 746316 649772
7512 649772 568693 549831 512587 463168 452002 475621 436177 378343 327958 313454 239214 243606
7500 243606 265964 225647 242523 203753 190179 180858 94001 132344 179463 175516 160850 121098
7488 121098 139714 114584 109756 48153 51981 90385 124567 81761 48560 74815 114702 105142
7476 105142 160377 134863 86899 42722 54281 96720 90329 97616 58362 97251 88860 111107
7464 111107 120799 105799 94291 84195 105850 60969 71801 84301 98888 68585 62223 51474
7452 51474 39172 77545 64009 74582 55895 40543 86041 120415 108175 4805 -7319 -22861
7440 -22861 -16294 37284 39701 -359 -15222 -6813 -23623 -10781 -17955 27717 16502 11796 530
7427E30K3523k4401m3139K5248K4484m3596j5857J2630M552K2652L6798k8399
7415d975l559O286q8900K5512M7587K2325n638J2805K3482l456l4834k3514K930
7402b3949N3554l743K8885k440J7964k6898k6586j4326J6665L1859K2388o990
7390F6383j2268J486k2164l3733J4054M1104j1675j4925m7569J826L1262O9982
7378H3763k3280m2644M522k7037K7335j7856j5732L6417k8609N7619M7219n2146
7366D9571k1985M4693j7402N5416l5111j2598L5903p292n0063J6942P51r694l0539
7353A8592N6294M173r5858j6537K2669m9706l4005K7730L1760K740k6846M0303
7341a8691r1P4026l1007r899M016m041n5944K212P4315q730k5582M7611j552K3821
$$ plain form
7427 530 24053 -348 -43487 -18239 6245 -37351 -53208 -40578 -36026 -13374 23424 -4975
7415 -4975 -8534 -2248 -91148 -65636 -18049 4276 -1362 11443 34925 31469 -3365 -26879 -23949
7402 -23949 29605 25862 54747 52307 70271 43373 16787 2461 19126 50985 73373 66383
7390 66383 54115 55601 33437 -296 13758 54862 43187 28262 -19307 -17481 13781 83763
7378 83763 60483 17839 22361 -4676 22659 4803 -10929 25488 -3121 54498 101717 49571
7366 49571 27586 72279 54877 110293 75182 62584 98487 91195 41132 58074 58825 49131 18592
7353 18592 74886 79059 -16799 -33336 -10667 -60373 -94378 -66648 -34888 -32148 -58994 -18691
7341 -18691 -18782 55244 24237 14338 18354 14313 -41631 -39419 34896 26166 584 48195 46643 70464
7327G0464L9280l6202m6670J1951j5n9446N2125M944Q80m8255O3914N764M412
7314F3146j9009r969l3126L9937K6268j3983l8476l0890Q106J8082J7048J0755
7302C7889L553m1277n912q038j309P213j3722M4981N894k0847k1767m3976N8386
7289A068l0628K4760k506m7496j5525K5509k101R0944N99L839L6545o958l7616
7276D0434n445q743L8150k5315o1243N2309K6568m8879M6548n6102P6090Q2813
7264A57185p7194m5650L7904M7952j3077k2976j1286L1536N7442l1327M064m7654
7252H6919l3689M4737k4392M4711n7163J4826k0733k7697K5665K0985M3855k8201
7240H9823l4186L0430L7381K3830K651L5222m0477l2613P5380p688J13066j3059
$$ plain form
7327 70464 109744 73542 26872 38823 38808 -20638 31487 36431 37311 -10944 52970 58734 63146
7314 63146 44137 34168 1042 40979 67247 53264 14788 -16102 -7996 10086 27134 37889
7302 37889 41442 165 -5747 -13785 -15094 -7881 -21603 23378 29272 8425 -13342 -57318 1068
7289 1068 -29560 -4800 -7306 -54802 -70327 -44818 -46919 44025 44624 48463 85008 78050 40434
7276 40434 34989 26246 64396 39081 -22162 30147 56715 7836 54384 -1718 74372 157185
7264 157185 79991 34341 72245 120197 107120 84144 72858 104394 161836 130509 134573 86919
7252 86919 53230 97967 73575 118286 61123 75949 55216 27519 53184 74169 118024 89823
7240 89823 55637 86067 123448 147278 149929 185151 144674 112061 187441 179753 292819 279760
7228B79760l9446K4830k1278L9058K2447N0605j3932Q9477J3756k9237q298M0953
7216D48695j5174M2815J6862J44714R8305K2267Q2709J1662o4368l3502l0720
7205G24265N590K3579N059P2107K7392J2156r21j6808p5789n336m3122r8796j06035
7192E23341l7783n5389m0119j242n5730m7333M2879m254k6000n7433k2922K2975
7180B40990j9924l3835M4843M3355k0226L2860j1709l1496m4728J0366K3488j2710
7168B21274j0518q637N2013K8082J7840J6615n2686k7692m588j471K7728O1774
7156C19734K8446k3321L1631m3987J2828M0710l9338p346K6591j4441j2305q103
7144C11099N0375q6071k210N2352l7922O052L3765N5848m981q76r262j2785l0292
$$ plain form
7228 279760 240314 265144 243866 282924 305371 355976 342044 431521 445277 416040 407742 448695
7216 448695 433521 476336 493198 637912 736217 758484 841193 852855 788487 754985 724265
7205 724265 729855 753434 758493 830600 857992 870148 869227 852419 776630 771294 728172 629376 523341
7192 523341 485558 430169 390050 388808 333078 285745 328624 324370 298370 240937 218015 240990
7180 240990 221066 187231 232074 275429 255203 288063 276354 244858 200130 210496 233984 221274
7168 221274 210756 202119 254132 282214 300054 316669 263983 236291 231703 230232 257960 319734
7156 319734 348180 324859 356490 312503 325331 366041 326703 319357 345948 331507 319202 311099
7144 311099 361474 275403 273193 325545 287623 293675 327440 383288 378307 377431 368169 355384 325092
7131C25092J6597k2251k2980j8467L4382Q3789j4932j3752l2807k4172J4991J1973
7119C37463M4307K2678n2346L4114J3022k8992n4397l614O7590K3274M8317q4775
7107C66641Q0352J1755k643j9813J311l6662k2492K6034M5841K1698Q760j2354
7095D68428J8729M3583j03467K2924K8321L7821J764k4268N1469J29194l247j02266
7083E68985P1954L8839l625R1349K0301k0310o492O3883O6527M5443J23002O3437
7071A123293K968P7508K01427J30022R4922M3623k7404p2965j04188j13935j20430
7060A234841m8938j13669r0752J121J2094j0776p3133O765l4957j4949j06009
7049G61638p7279p478K2940P6317p45p809k8197N0897R2095J0548q5867n800m6916
$$ plain form
7131 325092 341689 319438 296458 277991 312373 396162 381230 367478 334671 310499 325490 337463
7119 337463 381770 404448 352102 386216 399238 370246 315849 312235 379825 403099 451416 366641
7107 366641 446993 458748 456105 436292 437603 400941 378449 404483 450324 472022 480782 468428
7095 468428 487157 530740 427273 450197 478518 516339 518103 493835 545304 674498 671251 568985
7083 568985 640939 679778 676153 767502 787803 767493 761001 824884 891411 936854 1059856 1123293
7071 1123293 1126261 1203769 1405196 1535218 1630140 1673763 1646359 1573394 1469206 1355271 1234841
7060 1234841 1185903 1072234 981482 982603 994697 983921 910788 917553 882596 867647 761638
7049 761638 684359 676881 699821 776138 775393 767584 739387 790284 882379 892927 807060 801260 754344
7036G54344r036K3105j4808P450N4942P828k8963R788L2949k5721l9984R6989
7024H68883k622n9933J9977N1116K3211m9101O7317r215j9385j4752O9298o882
7012I37912k9116j2204J3078J6230j3867K1156l940J6513j732M801l014Q528M5365
6999I99710N881K9617J7545n0253L3052N6758P2376N9178j6235n8224Q2039P3967
6987A305411k3021p126L0698L2532j0885O8887k833N3989M5372M0766P5279k3365
6975A585704j0490J0512j7036N3854N1531L6725J03448P0366J5358J6398P0204
6964A986574M6647k0757M7161R9831K5751R5572J13099J31446M8623Q1864M2334
6953B698145J20861J63334J03039J05822O0797J77175J05514J37929O8760M4511
$$ plain form
7036 754344 745308 768413 753605 761055 815997 823825 794862 804650 837599 811878 771894 868883
7024 868883 866261 806328 826305 877421 900632 851531 918848 909633 890248 875496 944794 937912
7012 937912 908796 896592 909670 925900 912033 933189 929249 945762 944030 948831 945817 954345 999710
6999 999710 1005591 1035208 1052753 1002500 1035552 1092310 1164686 1223864 1207629 1149405 1231444 1305411
6987 1305411 1282390 1275264 1305962 1338494 1327609 1396496 1393663 1447652 1493024 1533790 1609069 1585704
6975 1585704 1575214 1585726 1568690 1622544 1674075 1710800 1814248 1884614 1899972 1916370 1986574
6964 1986574 2033221 2012464 2059625 2159456 2185207 2280779 2393878 2525324 2573947 2655811 2698145
6953 2698145 2819006 2982340 3085379 3191201 3251998 3429173 3534687 3672616 3741376 3785887
6943C785887J88310J95989J48881J82330K15946J85810K33473K52555K52506L45548
6933E987235L51827M45920M91381N04623M67422M44362M46858N49659O37585P22729
6923A1049601P05979O64348P11076O56483P33156O85240Q38930Q70763J014221
6914A7929797J146877J343889J501424J501422J650592J689085J759576J851344
6906C0374006K063809K450427K831771L256109L883627M557949N093928N774337
6898F0285963O535398P605375Q869168J0569785J2549383J5170078J6643816J3346288
6890A51575254N675262j790501n856736o883316o939277o025288l115432R98385
6882A27638351N266165Q722533Q208776K062120o029775j1596940j3610315j4411868
$$ plain form
6943 3785887 3974197 4170186 4319067 4501397 4717343 4903153 5136626 5389181 5641687 5987235
6933 5987235 6339062 6784982 7276363 7780986 8248408 8692770 9139628 9689287 10326872 11049601
6923 11049601 11755580 12419928 13131004 13787487 14520643 15205883 16044813 16915576 17929797
6914 17929797 19076674 20420563 21921987 23423409 25074001 26763086 28522662 30374006
6906 30374006 32437815 34888242 37720013 40976122 44859749 49417698 54511626 60285963
6898 60285963 66821361 74426736 83295904 93865689 106415072 121585150 138228966 151575254
6890 151575254 157250516 155460015 149603279 142719963 135780686 129755398 126639966 127638351
6882 127638351 132904516 141627049 149835825 151897945 145868170 134271230 120660915 106249047
6874A06249047j4846060j3691725j1240681q717952o871120n524941m502471l731168
6866C7122929l184219k774829k360003k028048j729502j613793j405170j254133
6858B0773232j228530j140636r54253r48884q38276p71816p39578o85019o04684
6849A2861556o34627o35501n19327m48570m28875m62372m07249m01416m36317
6840H487302l43582l41587l34719k88609l01962l31140k79922k46770j76244k16288
6830E626479k62292k26672j78655j13391j79054k68536j61748o4611j25398j80715
6820C865407q6548j04903j64671j03022j28863j3131m2249o0575o3452j63060
6810B934933p8377n3231l6321q6387q6852r6267o9236k8860q4051n8633N600p364
$$ plain form
6874 106249047 91402987 77711262 66470581 57752629 50881509 45356568 40854097 37122929
6866 37122929 33938710 31163881 28803878 26775830 25046328 23432535 22027365 20773232
6858 20773232 19544702 18404066 17449813 16500929 15662653 14890837 14151259 13466240 12861556
6849 12861556 12226929 11591428 11072101 10623531 10194656 9732284 9325035 8923619 8487302
6840 8487302 8143720 7802133 7467414 7178805 6876843 6545703 6265781 6019011 5842767 5626479
6830 5626479 5364187 5137515 4958860 4845469 4666415 4397879 4236131 4171520 4046122 3865407
6820 3865407 3778859 3673956 3509285 3406263 3277400 3264269 3222020 3161445 3097993 2934933
6810 2934933 2856556 2803325 2767004 2680617 2593765 2497498 2428262 2399402 2315351 2256718 2262318 2254954
6798B254954r5227k3193l3053j42790m6096m4451o5346m7227j0053L8863l8169
6787A748212M5409j3925j04131n5066n7166o8415k1858m2114m4238P6740K673
6776A466121n4191o7521o5744q31k0430k2040m312l7715J6562j7548j48477L6892
6764A080766J473J4672M372l9945l2764q1808n6l1330k5232J7286j2297J5255
6752I10392M03o7513J3646J1833m9162M2674o1215o5670j9477l5549j0003K4171
6740F94530r658n0488r391p588o742j4943J5861M747M9511m8835K2922o5377o784
6727E67765M0021L6596o6311o4298k655P3721j9130q7520l7716j3676J4217m8961
6715C92053N6076l5862l0868Q3755n2475k6302O7292K2926k3016r7797J9713l4381
$$ plain form
6798 2254954 2159727 2136534 2103481 1960691 1914595 1870144 1804798 1757571 1747518 1786381 1748212
6787 1748212 1793621 1779696 1675565 1620499 1563333 1494918 1473060 1430946 1386708 1463448 1466121
6776 1466121 1411930 1344409 1278665 1277834 1257404 1235364 1231052 1193337 1209899 1192351 1043874 1080766
6764 1080766 1082239 1096911 1101283 1061338 1028574 946766 946710 915380 890148 907434 895137 910392
6752 910392 910795 843282 856928 868761 819599 862273 801058 735388 715911 680362 670359 694530
6740 694530 684872 634384 624993 617405 610663 595720 611581 616328 665839 617004 639926 574549 567765
6727 567765 607786 644382 578071 513773 511118 584839 565709 478189 440473 426797 441014 392053
6715 392053 448129 412267 381399 465154 412679 386377 453669 476595 453579 355782 375495 341114
6703C41114L9976K0816M2924j4525K6272N8556J6346M439r8924n9855K2502L0505
6691D30146l3999K7837r540l6057J9754n2787J8458N3540k4413j2356R652j8248
6679C71987m4258L5714Q254J9653K1390n4639k6087J3621l8126M7342M0501m5608
6667C49744r627M547k505l0162k5962l4057L3410J0847J0953J9496l8987l6320
6655B51377j5268j9868Q1063j3517k6307J1417K7255J435L9960k158j694l4948
6643B98747l7982N5442P969l7406j117l1287j7952j2848l7805L6058M2255J3817
6631B77891k6147l4332K3596L3434n7207k1514k9565k1803N3558N5628n5462L8806
6619B36883p726O896M7164j3234r907o4811m717j6904P109j0409J3146K5277K591
$$ plain form
6703 341114 381090 401906 444830 430305 456577 515133 531479 535918 436994 377139 399641 430146
6691 430146 396147 423984 414444 378387 398141 345354 363812 417352 392939 380583 390235 371987
6679 371987 327729 363443 371697 391350 412740 358101 332014 345635 307509 354851 395352 349744
6667 349744 340117 344664 342159 311997 286035 251978 285388 296235 307188 326684 287697 251377
6655 251377 236109 216241 297304 283787 257480 268897 296152 297587 337547 335389 333695 298747
6643 298747 260765 316207 324176 286770 285653 254366 236414 223566 185761 221819 264074 277891
6631 277891 251744 217412 241008 274442 217235 195721 166156 144353 197911 253539 198077 236883
6619 236883 229157 236053 283217 269983 260076 195265 190548 173644 180753 170344 183490 208767 211358
6606B11358J9297K9277o2406j7510Q957j7687Q908m152j0258k299K2195K1859
6594B07539N431k3081N1970l474l6184N9223J1153n3807K5209J6994j6476K0254
6582B64751L0845K6098j5981m8496K2375O2168N3045Q8767O8756j5232O0246k182
6570E95160M0890J27693R4973k2053J2860J798l1140q5826l0602J4306O5297j2437
6558G70919j1093N7154J6891J1178k7733p0687L3294j07866r8792p4604o7677
6547D30984m6371m8075J7226P687n2722k9645k4357k0579P756k6125j0782J3224
6535B18221L5047J0956J6808j2196l2426n2306L0445m3960k9725j6561M9367L5872
6523B09542m3248m059J0860M174J9391J1946K7767J8801Q0822K766m6082K0040
$$ plain form
6606 211358 230655 259932 197526 180016 188973 171286 180194 176042 165784 163485 185680 207539
6594 207539 212970 189889 241859 238385 202201 261424 272577 218770 243979 260973 244497 264751
6582 264751 295596 321694 305713 257217 279592 341760 394805 483572 552328 537096 597342 595160
6570 595160 636050 763743 858716 836663 849523 851321 820181 734355 703753 718059 783356 770919
6558 770919 759826 816980 833871 845049 817316 746629 779923 672057 573265 498661 430984
6547 430984 384613 336538 353764 361451 308729 279084 254727 234148 241904 215779 204997 218221
6535 218221 253268 264224 281032 268836 236410 184104 214549 170589 140864 124303 173670 209542
6523 209542 166294 162235 173095 177269 196660 208606 236373 255174 335996 338762 292680 312720
6511C12720J388o2485j2542M5362n5366k40M5938L8686O6719p1222m1886p2582
6499A94490m7776k4747O7757k3755o1749m0773o577L3347m4552k3981K9585k177
6487D9092k0957k9853n0393O7702M2285k4087M2307J3337j5834L8221N168p2220
6475D4768q5907k0247O8674P630k8995K6458L102K6003P589N223K8502K2086l3781
6462G1105m1213L163q42J1459m523k4312M7769o493j08121q02R0425L0158j3639
6449E4134m235r368n3391p929O7942J0569J473L8494O291K5022K5166n2106k6996
6436G5066L1239N6364l2915k8899j5296O3193n6914o9155K2872l6478M4257l8175
6424A5159N117j6373M4813l5460m5735j74L7309L7741J8464k8819J9937N065n0603
$$ plain form
6511 312720 314108 251623 239081 284443 229077 228837 274775 313461 380180 308958 267072 194490
6499 194490 146714 121967 189724 165969 104220 63447 56870 90217 45665 21684 51269 49092
6487 49092 28135 -1718 -52111 15591 57876 33789 76096 89433 73599 111820 116988 44768
6475 44768 -41139 -61386 7288 14918 -14077 12381 15483 41486 49075 54298 82800 104886 71105
6462 71105 29892 33055 32213 43672 39149 14837 62606 56113 -52008 -52810 37615 67773 54134
6449 54134 49899 40531 -12860 -20789 47153 57722 59195 97689 103980 129002 154168 102062 75066
6436 75066 106305 162669 129754 100855 85559 148752 91838 22683 45555 9077 53334 15159
6424 15159 20276 3903 48716 13256 -32479 -32653 4656 42397 60861 32042 51979 57044 6441
6411F441n4041L9000L5909j6005n9224K4543J8471m5821J3601L7978Q702J8731
6399B8285j0672n6845J5998J2261L7855q871n105K7456k2708n2908m215m1248
6387h0717M9612P017L642O8048N9504q6112p0945l2573L3145N2343J929k9057
6375b4164j3800R376N8473o2987o0652J5492O2057J7271J0206Q219n790J5243
6363B8944j9064K894j5279J5488P895l4928K9911k3949J0076q972L3958J729j7994
6350A0709M5607o6753j6481J7121m28J05688o8104k8418n845l3391J01015q344
6338E2376m4740K2711L876j06705M6914M1787J3585o3683L5536k3750O2322J1038
6326E1267J1015o5418l3034L4002j2834K9161m1007l6100O9268N317n113O841
$$ plain form
6411 6441 -47600 -8600 27309 11304 -47920 -23377 -4906 -50727 -37126 852 9554 28285
6399 28285 17613 -39232 -23234 -10973 26882 18011 12906 40362 17654 -35254 -39469 -80717
6387 -80717 -31105 -24088 -20446 47602 107106 20994 -49951 -82524 -49379 2964 4893 -24164
6375 -24164 -37964 -28588 29885 -33102 -93754 -78262 -16205 1066 11272 19491 13701 28944
6363 28944 9880 12774 -2505 12983 20878 -14050 15861 -8088 1988 -6984 26974 28703 10709
6350 10709 56316 -10437 -26918 -9797 -10225 95463 27359 -1059 -6904 -40295 60720 52376
6338 52376 7636 30347 34223 -72482 -25568 16219 29804 -33879 1657 -22093 40229 51267
6326 51267 62282 -3136 -36170 -2168 -15002 14159 -26848 -62948 6320 11637 6524 13365
6314A3365N7749M8287L8741O113j14484n0495N242K0486l048J7291j2775l5148
6302h676N8040J5580l1689J5523k2752L612o1786M8725R135j0316L8188k9286
6290B4298K788k6480M2301o6296M4878P6037l7769l4294R5970L6869K8171k6029
6278A60444O735N914J6477N9830m8960k164K5345J203k2497L4118P8269k7967
6266B86747p3320P981J9251O955j8375n77l2010Q5126K5096l8277l6996j51502
6254H0099l1451N9342o648K973o8897p196K6420M1041l7020K462O188j2779J436
6241E5970Q6264n2190j5390R17J4611l915n241P34m117m4149L5725k0332l0405
6228A8482L8188L0422j9146k1427l2314l8993L9402l8283J60K9725n919L7974
$$ plain form
6314 13365 71114 119401 158142 164255 49771 -724 4518 25004 21956 39247 26472 -8676
6302 -8676 49364 64944 33255 48778 26026 29638 -32148 16577 25712 15396 53584 24298
6290 24298 27086 606 42907 -23389 21489 97526 59757 25463 121433 158302 186473 160444
6278 160444 167179 173093 189570 249400 200440 198276 223621 224824 202327 236445 314714 286747
6266 286747 213427 221408 240659 247614 229239 228662 196652 281778 306874 268597 231601 80099
6254 80099 48648 107990 101342 104315 35418 28222 54642 95683 58663 61125 67313 54534 55970
6241 55970 142234 90044 74654 75571 90182 86267 81026 81760 77643 33494 69219 48887 18482
6228 18482 56670 87092 67946 46519 14205 -24788 14614 -23669 -23509 6216 297 38271
6216C8271M9731j7186K4176r364o229L1474l1649P587j9147R673k3135l7791J2211
6203B8622L6610L21n5821L6197l328r608l7460j5572r561J3612J4778r255j4386
6190b4851N6517M4915k3534p4035J5282K9004K7290k3910M1300J1083k1180l0879
6178B7002p1019J0332M023M5841k7795O974K6213k4379m9426J9065J7047k7939
6166d4061M0464q3397r834K6778K080M226l5253l6910O415L2174M8457M7624o182
6153g419K4005j6432M021k0821k0164J6924L2061N5171l076o6355k0218K8629
6141F326m5974Q076O0960M4710o4168K953l9623o449l310n6052k1996L4124L9813
6128d0610j8996L0902K400J3190n3191j3985M1385N6637k7388k4644l9440K7311
$$ plain form
6216 38271 88002 70816 94992 85628 79399 110873 79224 86811 67664 77337 54202 16411 28622
6203 28622 65232 65553 9732 45929 42601 32993 -4467 -20039 -29600 -15988 -1210 -10465 -24851
6190 -24851 31666 76581 53047 -20988 -5706 23298 50588 26678 67978 79061 57881 27002
6178 27002 -44017 -33685 -29662 16179 -11616 -4642 21571 -2808 -52234 -33169 -16122 -44061
6166 -44061 -3597 -86994 -96828 -70050 -67970 -63744 -98997 -135907 -129492 -97318 -48861 -1237 -7419
6153 -7419 16586 154 4175 -16646 -36810 -19886 12175 67346 64270 -2085 -22303 6326
6141 6326 -39648 -31572 29388 74098 9930 12883 -26740 -33189 -36499 -92551 -114547 -80423 -40610
6128 -40610 -59606 -28704 -26304 -13114 -66305 -80290 -38905 17732 -9656 -34300 -73740 -46429
6116d6429J6023M565l9421n227N6784K7011m1322M2926M0251n1333j7924m0425
6104e4521K6520n0253p167J04127L1255o1072J7378J793j3981J2371L0474l7274
6092c50j5386R444J048k3696m3089M902J9041l5552Q2880J9751k4102L2062P289
6079C4242l7844k1789k0510K0827K8647M4015K3506j09054l8988J3961n0056M2504
6067g0539O7598P203J4873l0601j3550L5225M639r544k9322M4181q300n9L2514
6054D4318k0509J4528k6501K0018l8333m1868j0099K7142j7632N3211m6500r9081
6042a41306N7026J1304o022j6096L3146J6550K1949m1752M6924M5053m2567j4242
6030c0033k1906n5871J2678l649J9563J782l2473M0798M1624N3285M201J6999
$$ plain form
6116 -46429 -30406 -25841 -65262 -70489 -13705 13306 -28016 14910 55161 3828 -14096 -54521
6104 -54521 -28001 -78254 -85421 18706 49961 -11111 6267 8060 -5921 6450 36924 -350
6092 -350 -15736 -6292 -5244 -28940 -72029 -67127 -48086 -83638 -758 18993 -5109 26953 34242
6079 34242 -3602 -25391 -45901 -25074 3573 47588 71094 -37960 -76948 -62987 -113043 -70539
6067 -70539 -2941 4262 19135 -11466 -25016 10209 14848 5304 -24018 20163 11863 11804 44318
6054 44318 23809 38337 11836 31854 -6479 -48347 -58446 -31304 -48936 4275 -42225 -141306
6042 -141306 -84280 -72976 -78998 -95094 -61948 -45398 -23449 -65201 -18277 26776 -15791 -30033
6030 -30033 -51939 -107810 -95132 -98781 -79218 -77436 -109909 -69111 -27487 25798 29999 46998
6018D6998j6677P110m8428r5743L2231J2020k6801O1007m9555J8347N7052N032
6006B593r5322k3951L5223L0407o331R6812k801m6696m4174m627k0941L9076m1090
5993h1822j4865N0274j9900l3229L7464N9704l8841j7486j8924M1627J928j0282
5981d4352l7057K2263L8790k1710M396r1876L0641l6779P0923K921k2496K9592
5969e4744l9116M2835o0000K8306L7109m7842N0510M3686r5314J5602k0637Q5152
5957a4453j1604k7986N8527N2877p8095O1193j1557o3127j4454J5121k7036l8926
5945i9520o781Q891N9637K2032M850q637K7781O328j6575n5938K8350R787K8528
5932H733l11J5668J2082k8299R7990k6332o394j7043l0549O4738M1690k9996K9129
$$ plain form
6018 46998 30321 37431 -10997 -106740 -74509 -62489 -89290 -28283 -77838 -59491 -2439 2593
6006 2593 -92729 -116680 -81457 -51050 -57381 39431 36630 -10066 -54240 -58867 -79808 -40732 -81822
5993 -81822 -96687 -46413 -66313 -99542 -62078 -2374 -41215 -58701 -77625 -35998 -34070 -44352
5981 -44352 -81409 -59146 -20356 -42066 -37670 -129546 -98905 -135684 -64761 -61840 -84336 -54744
5969 -54744 -93860 -51025 -111025 -82719 -45610 -93452 -42942 744 -94570 -78968 -99605 -14453
5957 -14453 -26057 -54043 4484 57361 -20734 40459 28902 -34225 -48679 -33558 -60594 -99520
5945 -99520 -106301 -97410 -37773 -15741 -10891 -19528 8253 14581 -1994 -57932 -29582 -19795 8733
5932 8733 8422 24090 36172 7873 105863 79531 73137 56094 25545 90283 131973 101977 131106
5919A31106P4819K18J6811Q920M4794P1400N1914L0614M5111k3523M3838N1522
5907E47544O0082l0223k7354m7992n5554p6854j2853K4021k7552m5353J2004o1081
5895B58835q071j5210K2888j322m0419j3282L2455O0157L5754N6246p4413R9130
5883D12748N9767M0817L1358J48751P0033J73010J21335M1179M276r8173j41777
5872H63324j8167q2260r2414Q921J14000J15436J1236R440N4663J1094j22765
5861H72508j67036j60598p2570o1165j6790o5131l562n2717j06421m5064j3020
5850A08434M5663n5279k5579J4653k596N7956Q776k7315j5631K7529m5774k2582
5838F8255j9848o5140j4896R6714o624q0465j189k2434M884n9678K2684P1960
$$ plain form
5919 131106 205925 206143 222954 231874 276668 348068 399982 430596 475707 452184 496022 547544
5907 547544 607626 577403 550049 502057 446503 369649 356796 380817 353265 307912 319916 258835
5895 258835 250764 235554 258442 257120 216701 203419 235874 296031 331785 388031 313618 412748
5883 412748 472515 513332 544690 693441 763474 936484 1057819 1098998 1103274 1005101 863324
5872 863324 845157 762897 670483 679404 793404 908840 920076 929516 984179 995273 872508
5861 872508 705472 544874 472304 411139 394349 329218 325656 272939 166518 121454 108434
5850 108434 154097 98818 73239 87892 85296 143252 152028 124713 109082 136611 90837 68255
5838 68255 48407 -16733 -31629 65085 58461 -22004 -23193 -45627 -40743 -100421 -77737 -5777
$$ [...]
##END NTUPLES=NMR SPECTRUM
##END=
