##TITLE=1H_CG-2352x
 CDCl3
 8 sc, 
 1.06.2022
##JCAMPDX= 6.0         $$ Bruker NMR JCAMP-DX V2.0
##DATA TYPE= NMR SPECTRUM
##DATA CLASS= NTUPLES
##ORIGIN= UXNMR, Bruker Analytische Messtechnik GmbH
##OWNER= root
$$ XWIN-NMR		Version 3.5
$$ Wed Jun  1 16:26:51 2022 Russian Standard Time (UT+4h)  she@DPX200
##.OBSERVE FREQUENCY= 200.13135
##.OBSERVE NUCLEUS= ^1H
##.ACQUISITION MODE= SIMULTANEOUS
##.ACQUISITION SCHEME= undefined
##.AVERAGES= 8
##.DIGITISER RES= 18
##SPECTROMETER/DATA SYSTEM= spect
##.PULSE SEQUENCE= zg30
##.SOLVENT NAME= DMSO
##.SHIFT REFERENCE= (INTERNAL, DMSO, 0, 15.7568)
##AUDIT TRAIL= $$ (NUMBER, WHEN, WHO, WHERE, WHAT)
$$ ##TITLE= Audit trail, XWIN-NMR		Version 3.5
$$ ##JCAMPDX= 5.01
$$ ##ORIGIN= Bruker BioSpin GmbH
$$ ##OWNER= she
$$ F:/spectra/data/she/nmr/H-F/1/pdata/1/auditp.txt
$$ ##AUDIT TRAIL=  $$ (NUMBER, WHEN, WHO, WHERE, WHAT)
(   1,<2022-06-01 16:25:30.18 +0400>,<she>,<DPX200>,
      <created by zg, POWCHK disabled, PULCHK disabled
       configuration hash MD5:
       00 E9 B6 7A A2 85 ED C7 34 08 36 98 17 FE 4E 26
       data hash MD5: 16K
       53 35 93 B9 3A 01 02 E9 04 72 8F 24 63 DE 52 DE>)
(   2,<2022-06-01 16:25:36.34 +0400>,<she>,<DPX200>,
      <Start of raw data processing
       efp BC_mod = 2 LB = 0.24 FT_mod = 6 PKNL = 1 PHC0 = -18026.83 PHC1 = -6.199261 SI = 16K 
       data hash MD5: 16K
       54 E1 D8 E6 D8 79 83 44 DD AD 3B 8E ED 5B 37 7D>)
(   3,<2022-06-01 16:25:57.95 +0400>,<she>,<DPX200>,
      <pk PHC0 = -7.881015 PHC1 = 9.400001 
       data hash MD5: 16K
       14 0A 82 21 05 0C D4 88 0C 3E BD FA 6F 86 E4 D3>)
(   4,<2022-06-01 16:26:01.18 +0400>,<she>,<DPX200>,
      <abs ABSG = 5 
       data hash MD5: 16K
       BB 1C 8D A4 80 71 8E C2 7F 1B 99 28 B1 05 5D 99>)
$$ ##END=
$$ 
$$ hash MD5
$$ 7F D3 DF 9D 8D A7 1D 9C 67 FF 88 A7 3D E1 0A 97
##$RELAX= 
##$RELAX= 
##$RELAX= 
##$RELAX= 
##$RELAX= 
##$RELAX= 
$$ Bruker specific parameters
$$ --------------------------
##$DU= <F:/spectra>
##$EXPNO= 1
##$NAME= <H-F>
##$PROCNO= 1
##$TYPE= <nmr>
##$USER= <she>
##$AMP= (0..31)
100 100 100 100 100 100 100 100 100 100 100 100 100 100 100 100 100 100 
100 100 100 100 100 100 100 100 100 100 100 100 100 100 
##$AQSEQ= 0
##$AQ_mod= 1
##$AUNM= <au_zg>
##$AUTOPOS= <>
##$BF1= 200.13
##$BF2= 200.13
##$BF3= 200.13
##$BF4= 200.13
##$BF5= 200.13
##$BF6= 200.13
##$BF7= 200.13
##$BF8= 200.13
##$BYTORDA= 1
##$CFDGTYP= 0
##$CFRGTYP= 5
##$CHEMSTR= <none>
##$CNST= (0..31)
1 1 145 1 1 1 1 1 1 1 1 1 1 1 1 1 1 1 1 1 1 1 1 1 1 1 1 1 1 1 1 1 
##$CPDPRG= <>
##$CPDPRG1= <>
##$CPDPRG2= <>
##$CPDPRG3= <>
##$CPDPRG4= <mlev>
##$CPDPRG5= <mlev>
##$CPDPRG6= <mlev>
##$CPDPRG7= <mlev>
##$CPDPRG8= <mlev>
##$CPDPRGB= <>
##$CPDPRGT= <>
##$D= (0..31)
0 1.2 0 0 0 0 0 0 0 0.06 0 0.03 0 0 0 0 0.0002 0 0 0 0 0 0 0 0 0 0 0 0 
0 0 0 
##$DATE= 1654086329
##$DBL= (0..7)
120 120 120 120 120 120 120 120 
##$DBP= (0..7)
150 150 150 150 150 150 150 150 
##$DBP07= 0
##$DBPNAM0= <>
##$DBPNAM1= <>
##$DBPNAM2= <>
##$DBPNAM3= <>
##$DBPNAM4= <>
$$ [...]
##$SUBNAM2= <"">
##$SUBNAM3= <"">
##$SUBNAM4= <"">
##$SUBNAM5= <"">
##$SUBNAM6= <"">
##$SUBNAM7= <"">
##$SUBNAM8= <"">
##$SUBNAM9= <"">
##$SW= 18.05172834244
##$SWIBOX= (0..15)
0 0 2 0 0 0 0 0 0 0 0 0 0 0 0 0 
##$SW_h= 3612.71676300578
##$TD= 16384
##$TD0= 1
##$TE= 0
##$TE2= 300
##$TE3= 300
##$TEG= 300
##$TL= (0..7)
0 120 120 120 120 120 120 120 
##$TP= (0..7)
150 150 150 150 150 150 150 150 
##$TP07= 0
##$TPNAME0= <>
##$TPNAME1= <>
##$TPNAME2= <>
##$TPNAME3= <>
##$TPNAME4= <>
##$TPNAME5= <>
##$TPNAME6= <>
##$TPNAME7= <>
##$TPOAL= (0..7)
0.5 0.5 0.5 0.5 0.5 0.5 0.5 0.5 
##$TPOFFS= (0..7)
0 0 0 0 0 0 0 0 
##$TUNHIN= 0
##$TUNHOUT= 0
##$TUNXOUT= 0
##$USERA1= <user>
##$USERA2= <user>
##$USERA3= <user>
##$USERA4= <user>
##$USERA5= <user>
##$V9= 5
##$VALIST= <valist>
##$VCLIST= <CCCCCCCCCCCCCCC>
##$VD= 0
##$VDLIST= <DDDDDDDDDDDDDDD>
##$VPLIST= <PPPPPPPPPPPPPPP>
##$VTLIST= <TTTTTTTTTTTTTTT>
##$WBST= 1024
##$WBSW= 4
##$XGAIN= (0..3)
0 0 0 0 
##$XL= 0
##$YL= 0
##$YMAX_a= 239823
##$YMIN_a= -459147
##$ZGOPTNS= <>
##$ZL1= 120
##$ZL2= 120
##$ZL3= 120
##$ZL4= 120
##$ABSF1= 15.73367
##$ABSF2= -2.318179
##$ABSG= 5
##$ABSL= 3
##$ALPHA= 0
##$AQORDER= 0
##$ASSFAC= 0
##$ASSFACI= 0
##$ASSFACX= 0
##$ASSWID= 0
##$AUNMP= <proc_1d>
##$AZFE= 0.1
##$AZFW= 0.1
##$BCFW= 0
##$BC_mod= 2
##$BYTORDP= 0
##$COROFFS= 0
##$CY= -3
##$DATMOD= 1
##$DC= 0
##$DFILT= <>
##$DTYPP= 0
##$F1P= 0
##$F2P= 0
##$FCOR= 1
##$FTSIZE= 16384
##$FT_mod= 6
##$GAMMA= 0
##$GB= 0
##$INTBC= 1
##$INTSCL= 0
##$ISEN= 128
##$LB= 0.24
##$LEV0= 0
##$LPBIN= 0
##$MAXI= 10000
##$MC2= 0
##$MEAN= 0
##$ME_mod= 0
##$MI= 1.114404
##$NCOEF= 0
##$NC_proc= -7
##$NLEV= 6
##$NOISF1= 3.799351
##$NOISF2= 2.8
##$NSP= 0
##$NTH_PI= 0
##$NZP= 0
##$OFFSET= 15.75681
##$PC= 1
##$PHC0= -18034.71
##$PHC1= 3.200739
##$PH_mod= 1
##$PKNL= yes
##$PPARMOD= 0
##$PSCAL= 0
##$PSIGN= 0
##$REVERSE= no
##$SF= 200.130002948613
##$SI= 16384
##$SIGF1= 3
##$SIGF2= 2
##$SINO= 5.538805
##$SIOLD= 16384
##$SREGLST= <1H.CDCl3>
##$SSB= 0
##$STSI= 16384
##$STSR= 0
##$SW_p= 3612.71676300578
##$SYMM= 0
##$S_DEV= 0
##$TDeff= 16384
##$TDoff= 0
##$TI= <>
##$TILT= no
##$TM1= 0
##$TM2= 0
##$TOPLEV= 0
##$USERP1= <user>
##$USERP2= <user>
##$USERP3= <user>
##$USERP4= <user>
##$USERP5= <user>
##$WDW= 1
##$XDIM= 16384
##$YMAX_p= 342128526
##$YMIN_p= -817020
$$ End of Bruker specific parameters
$$ ---------------------------------
##NTUPLES= NMR SPECTRUM
##VAR_NAME=  FREQUENCY,     SPECTRUM/REAL,   SPECTRUM/IMAG
##SYMBOL=    X,             R,               I
##VAR_TYPE=  INDEPENDENT,   DEPENDENT,       DEPENDENT
##VAR_FORM=  AFFN,          ASDF,            ASDF
##VAR_DIM=   16384,         16384,           16384
##UNITS=     HZ,            ARBITRARY UNITS, ARBITRARY UNITS
##FACTOR=    0.220516191357247, 1,           1
##FIRST=     3153.4104694439, 0,             0
##LAST=      -459.306293561875, 0,           0
##MIN=       -459.306293561875, -817020,     0
##MAX=       3153.4104694439, 342128526,     0
$$ Real data points
##PAGE= N=1
##DATA TABLE= (X++(R..R)), XYDATA
$$ [...]
7733 719251 827993 783133 602457 477664 602991 700844 512598 251526 321985 320573 357714
7722 357714 489684 411178 182505 278087 136148 178769 269264 109231 143812 219893 180195
7711 180195 160103 188096 183497 59611 44584 209094 172314 110826 45124 27110 -125233
7700 -125233 -183669 -269735 -48883 -108497 100678 170291 62434 -182291 -238221 -41165 53971
7689 53971 73998 60062 -45896 -15043 -15089 91799 123561 256020 241597 126818 140572 16866
7677 16866 93327 123873 146780 238408 289689 225919 149633 -5729 -78063 96655 169870
7666 169870 34645 -107853 160202 333308 263246 266519 323962 263474 278481 383290 366003
7655 366003 355063 507517 471333 312754 219529 112539 352720 298130 146689 172709 99563
7644 99563 100059 36902 247396 31220 14098 106872 173010 130371 87784 -8031 -24981 80591
7632 80591 21641 -24543 -19646 -129176 -46901 -15107 -217480 -121842 -50250 -152475 -162336 -208677
7620 -208677 -327957 -340387 -231896 -21772 44605 177803 4541 58995 19761 14008 97178
7609 97178 55128 167288 110755 34776 236128 335426 289976 113211 171226 161560 172026
7598 172026 -31976 62907 -64175 -118407 130203 21049 -57493 -157410 57172 95336 1942
7587 1942 41700 1013 97813 101373 196911 276881 234462 327903 120021 176386 167731 169236
7575 169236 36855 152295 198575 -103228 -39797 35072 173073 63625 198746 110542
7565 110542 18688 -23810 11195 115240 74996 -101250 33591 47030 -129745 -210155 -207459
7554 -207459 -114330 9962 -15755 205864 195993 90163 200601 195421 155182 213890 117531
7543 117531 12702 51643 -52327 -29595 66475 83670 61082 13415 -76867 30521 121616
7532 121616 231461 243726 243557 109246 287754 225290 57569 197714 287050 85233 69960
7521 69960 122032 187990 268171 319321 318495 260819 455865 458388 457757 605640 312143 277018
7509 277018 355085 300027 325752 351355 274319 226000 336885 411135 429224 421252 318955
7498 318955 295294 429072 659307 717111 639474 463980 494286 665219 653948 700258 744445
7487 744445 860646 833202 979199 1009254 768812 704143 675692 751429 911324 911338 892615
7476 892615 1015725 1089681 972771 1214842 1187614 1143691 942979 960355 1189200 1095078 1032308
7465 1032308 744775 609273 581915 842848 1004278 919703 879684 894315 964173 831469
7455 831469 859871 926202 1067921 1217469 1037151 974211 1167273 1156763 1136150 1275926 1226576
7444 1226576 1305878 1457745 1640483 1607193 1539463 1445597 1459780 1617657 1608810 1595688 1648524
7433 1648524 1899743 1931223 1934439 2106559 2183471 2277962 2198879 2266328 2258056 2429701 2458715
7422 2458715 2356418 2484766 2507115 2389058 2511844 2411459 2247857 2295432 2605623 2440248
7412 2440248 2333689 2242081 2411335 2426751 2407452 2650500 2695238 2734733 2732126 2814069 2762439
7401 2762439 2779745 2803439 2803957 3019246 2987310 3051386 3369771 3509891 3669205 3674957 3608168
7390 3608168 3639222 3772821 3893397 4021783 4059122 4260692 4542830 4947868 4835954 4925193
7380 4925193 5056475 5308752 5289886 5491891 5728158 5999909 6294761 6532089 6656660 6789299
7370 6789299 7148081 7422793 7793283 8299580 8820990 9318360 9737156 10226623 10752873 11363611
7360 11363611 12148423 12706269 13285157 14129298 14729561 15224278 15637705 16374349 16936746
7351 16936746 17901380 18983182 19875697 21436984 23124156 24794347 26532518 28580980
7343 28580980 30639446 33266342 36330252 39669453 43675978 48624619 54376917 61061206
7335 61061206 68594886 75122700 79473049 79797022 75595510 68489449 60537902 52626636
7327 52626636 46152255 41344042 37508366 34440492 31695701 29389306 27245842 25425513
7319 25425513 23693491 22538496 21288680 19861599 18511764 17212703 15877997 14736132
7311 14736132 13906747 13144533 12411030 11802101 11126329 10727724 10529039 9877886 9481361
7302 9481361 9022567 8610857 8486343 8085182 7858717 7379690 6842573 6822761 6540963 6395088
7292 6395088 6050521 5759517 5673926 5483238 5417739 5200452 4939347 4929499 4788343 4510224
7282 4510224 4409188 4237007 4150934 4068470 3952621 3966927 3728177 3569815 3652616 3401810
7272 3401810 3384494 3250263 3019449 3195256 3218560 2888645 3217226 3226225 2830019 2842970
7262 2842970 2868304 2617943 2754750 2845439 3028499 2762281 2657117 2718093 2759073 2818459
7252 2818459 3046642 3029100 3003144 2701245 2598182 2626821 2677878 2421962 2033699 1747322
7242 1747322 1692665 2082741 1958794 1838590 1668357 1638545 1731312 1660483 1514528 1509150 1505067
7231 1505067 1344175 1290617 1417883 1305386 1319507 1323024 1351080 1436987 1416634 1241012 1333526
7220 1333526 1255658 1365252 1350727 1445316 1333784 1153197 1190615 1320121 1204004 1078381
7210 1078381 1096810 1066686 1076844 1044550 1150770 1016091 1211885 1105560 916290 1101172
7200 1101172 1086512 1017632 912604 1087027 1007579 956080 766559 774711 888715 1075772 1074333
7189 1074333 1052431 947051 956285 987406 1051734 908601 741815 913699 884785 683621 685995
7178 685995 700310 776221 871329 914528 946846 854808 828574 728081 824346 929382 725360
7167 725360 787047 1114876 1217012 1233679 1155892 1300370 1266223 1283989 1476299 1165743 900084
7156 900084 742615 963678 1208385 1083767 1277238 1195922 1182086 1249440 1196491 1012388
7146 1012388 1137590 1056314 984703 1049055 1005529 1166568 1147127 1179894 1204148 1281433 1262378
7135 1262378 1227281 1147047 1253358 1314991 1234212 1291773 1185412 1133933 978597 1108399 1316671
7124 1316671 1244664 1334694 1209902 925880 919517 954309 964238 819336 1062727 1107095 967054
7113 967054 834802 784182 880237 745343 596247 760724 909133 791245 712586 663831
7103 663831 643206 555322 721561 729151 781629 660492 695809 695146 677915 591926 559154 552791
7091 552791 794530 922884 729787 804529 703736 704307 541461 591677 535784 564802 649233
7080 649233 588955 714084 778170 744613 802010 814261 843692 587424 337655 278524 177044
7069 177044 379099 645468 651699 419561 379007 488799 374730 550237 558943 419461 396512
7058 396512 386020 486017 390588 401014 450491 496391 489155 630079 683300 667921 565542
7047 565542 523905 644334 611220 367152 147455 331258 428669 564646 585065 443621
7037 443621 470699 501217 356597 304287 208399 284187 319270 447459 481436 520240 394363
7026 394363 538640 448889 652339 586104 377765 557792 530962 683241 498179 257068
7016 257068 217008 173555 370548 660846 619828 578728 656961 617713 500451 492167 478964
7005 478964 438407 368932 359095 222696 168691 218825 200768 268556 402763 355692 487568
6994 487568 648867 616189 444517 439639 379361 564462 491117 376012 296713 456270 475445
6983 475445 602616 568134 463822 460283 567373 536964 467465 589396 671612 699641 482923
6972 482923 382616 468511 386623 418306 487986 594003 789265 723377 821469 683858 507492
6961 507492 507488 426015 362953 395887 501293 574698 422474 422462 499930 589707 687456 791414
6949 791414 674406 592431 655800 706818 612273 644041 748762 727435 879927 748103 756034
6938 756034 684325 609028 663009 683532 823281 924720 1117646 1245902 986191 978533 1059003
6927 1059003 946387 1068509 993583 986922 1033756 897020 722436 649832 564711 675958 866614
6916 866614 794062 691225 675510 592119 523594 644101 659708 613636 455203 509569 565391
6905 565391 404325 490305 512757 682418 710117 655748 620735 755718 739539 787325 818776
6894 818776 621848 334110 176877 607862 713117 669382 610525 545947 650952 704897
6884 704897 615340 535710 619078 817309 582862 702782 656342 579072 701466 670692 530973
6873 530973 464290 772103 764739 451574 532759 650509 828801 691272 539333 646777
6863 646777 713491 728851 775408 899500 861224 1132419 896379 854928 935108 887151 617486
6852 617486 552159 735188 751522 853952 943512 712216 679703 692821 872384 951756 757378
6841 757378 808064 811828 872360 827762 771649 602502 432304 758693 831208 907648 896809
6830 896809 899428 741611 813204 867170 657975 629992 723545 672270 719390 846408 772039
6819 772039 700539 852297 852414 809025 941379 858715 865732 815647 881170 884460 952283 827998
6807 827998 777401 643192 585644 902401 923304 955996 888610 898311 938437 989963 972859
6796 972859 879455 1043106 1163169 1139702 1011866 1012730 986900 800398 882918 855493 1111814
6785 1111814 1023194 932715 798986 764023 828273 732381 1067598 1066673 1034642 991395 945594
6774 945594 850564 1032028 1190868 1287662 1052418 1032791 835005 811316 1009764 1258667
6764 1258667 1322456 1198346 1123854 976612 1217179 1360500 1369398 1408127 1365862 1472801 1427905
6753 1427905 1283591 1127011 1011508 1249388 1399723 1340011 1291495 1298793 1398626 1306886 1269364
6742 1269364 1221295 1209270 1140919 1235156 1449053 1356655 1325772 1370657 1306645 1325706 1392495
6731 1392495 1404917 1430972 1286421 1248005 1273952 1286258 1159181 1121349 1205496 1033757 1065139
6720 1065139 1174307 1492851 1501354 1434333 1240616 1303112 1156857 1235008 1152394 1281149 1466836
6709 1466836 1452596 1513600 1449700 1408386 1472637 1598897 1421588 1331270 1389334 1564604 1511820
6698 1511820 1538163 1346093 1466723 1404490 1182862 1293474 1370918 1354822 1502671 1454521
6688 1454521 1439808 1520986 1541086 1544377 1615408 1491729 1625835 1645114 1636028 1759340 1583322
6677 1583322 1490345 1468947 1387997 1402777 1333183 1527585 1446025 1376323 1531553 1510386 1739804
6666 1739804 1891458 1713916 1967174 1853319 1733505 1777970 1733390 1850887 1769081 1694996
6656 1694996 1911160 1861824 1563691 1455291 1648440 1924407 2107051 2083866 2020754 2067520
6646 2067520 2039200 2104545 2013121 1972251 1710045 1883409 2370949 2263311 2147139 2201118
6636 2201118 2241572 2123828 1944886 2100149 1794188 1924564 1955187 2046416 2125790 2051366
6626 2051366 2406576 2373433 2317380 2316901 2125678 2030974 2114460 2174028 2202411 1984345 2261007
6615 2261007 2303052 2318051 2423298 2463841 2404993 2508411 2767865 2748359 2678404 2531315 2644314
6604 2644314 2682152 2491883 2513826 2454497 2705583 2890728 2947508 2788477 2885271 2899092 2965791
6593 2965791 2957253 2865759 3000817 2908432 3050536 3256197 3237956 3378746 3626448 3880856
6583 3880856 3830184 3975909 4239925 4362948 4469119 4465058 4264385 3837167 3874025 3667698
6573 3667698 3481766 3588008 3457799 3282262 3298256 3136276 3195252 3279436 3308779 3422090
6563 3422090 3395239 3402253 3402563 3286657 3216817 3199251 3332633 3246863 3316641 3279976 3377967 3369903
6551 3369903 3317629 3184690 3430923 3283335 3479727 3406776 3424029 3493179 3439657 3393258 3461293
6540 3461293 3539397 3570158 3718641 3687236 3595385 3447120 3398478 3380470 3428097 3702619 3796561
6529 3796561 3747698 3939718 3849742 3791395 3679112 3819124 4054067 4076539 3985462 3844385
6519 3844385 3817897 3881565 4130171 4310042 4333818 4201145 4096310 4254180 4014878 4146898
6509 4146898 4293431 4514041 4448169 4135711 4186031 4460125 4503297 4586933 4634912 4679166 4756299
6498 4756299 4680056 4681020 4582081 4836208 4884039 4819964 4858784 4991672 5263009 5029772 5062738
6487 5062738 5087193 5023195 5076620 5177167 5317089 5247343 5117021 5227409 5182618 5358788
6477 5358788 5508219 5545822 5429627 5483109 5734797 5684948 5711357 5811227 5945757 6022579 6114799
6466 6114799 6361453 6303606 5989076 6319868 6269691 6106917 6130226 6202242 6375080 6535581
6456 6535581 6545960 6475016 6520419 6492162 6691053 6652123 6682774 6726768 6728805 6710013 6864978
6445 6864978 7191137 7296776 7325875 7354908 7460823 7576921 7512356 7448779 7570786 7673137
6435 7673137 7623706 7650167 8016518 8251068 8222682 8265807 8229980 8488368 8489243 8466693 8222011
6424 8222011 8312029 8535021 8662480 8877843 8718760 8705633 8965833 9209163 9253436 9324489
6414 9324489 9236593 9313446 9426842 9602811 9819802 9884780 9917497 9709406 9818353 10007880
6404 10007880 10197349 10252483 10510056 10622134 10747300 10777457 10580537 11004123 11082715 11241953
6394 11241953 11433472 11409777 11411746 11587058 11771257 11767702 11832782 11992992 12241676 12715110
6384 12715110 12604868 12572546 12868219 12754479 12825409 13170756 13270157 13313893 13422583 13638168
6374 13638168 13871370 14051585 14140113 14149903 14382207 14584732 14766534 15107589 15488877 15601904
6364 15601904 15502902 15680748 16080887 16308880 16338883 16708692 16720367 17051940 17220260 17102550
6354 17102550 17416273 17858838 18107594 18191743 18278909 18527465 18841956 19188295 19334907 19604027
6344 19604027 19801168 20165184 20336461 20547723 20933432 21036135 21413810 21706521 21866199
6335 21866199 21951005 22436069 22853801 23114281 23557786 23901840 24241558 24422659 24850190 25187978
6325 25187978 25288720 25600249 26069696 26474646 26667542 26901444 27373801 27963952 28491598
6316 28491598 29031150 29477313 29859961 30118455 30616972 30935337 31467216 31858250 32556650
6307 32556650 33081685 33510259 33867990 34309205 34959180 35529264 35997708 36703039 37481125
6298 37481125 38205976 38678832 39179394 39793872 40248003 40971788 41828124 42447867 43063213
6289 43063213 43969928 44702394 45664954 46504431 46990097 47669411 48641161 49458282 50264237
6280 50264237 50896735 51577171 52539307 53614531 54640701 55509744 56605545 57618025 58555215
6271 58555215 59700794 60586693 61688529 62852836 64069579 65416793 66494443 67518252
6263 67518252 68730960 70140812 71615084 72958425 74330137 75838840 77402740 78784677
6255 78784677 80191943 81630958 83388170 85018160 86677212 88317208 90004384 91918130
6247 91918130 93775983 95652685 97312746 99267219 101396095 103265450 105264542 107509976
6239 107509976 109695808 112047055 114500474 116887309 119229741 121443415 123778397 126158171
6231 126158171 128695563 131273673 133971925 136860445 139373342 142106781 144909828 147722101
6223 147722101 150532935 153350945 156112031 158902155 161693568 164503296 167470096 170366340
6215 170366340 173310889 175996687 178972872 181863317 184498339 187129143 189696941 192244785
6207 192244785 194767095 197233013 199447786 201670533 203757941 205527765 207450156 209160057
6199 209160057 210533039 211914087 213308584 214699931 215930591 217046507 218075798 219109447
6191 219109447 220013624 221295254 222375808 222688949 222126430 220446503 217809409 214607701
6183 214607701 211272837 208146832 205183026 202594818 199789260 197043140 194410292 191491982
6175 191491982 188830476 186156213 183372379 180520634 177739427 174946666 172006567 169064665
6167 169064665 166206253 163483120 160662684 157775241 155047883 152292964 149470978 146748523
6159 146748523 144060548 141416531 138552218 135934282 133376376 130971719 128260076 125574610
6151 125574610 123326139 121094594 118808915 116524705 114256728 112089028 110020582 108046313
6143 108046313 106157786 104086982 101997921 100144957 98202714 96336662 94424837 92704861
6135 92704861 91299175 89530471 88011654 86482620 84872779 83509102 81974939 80448438
6127 80448438 79258087 77873217 76428752 75136424 73757497 72526140 71389466 70088987
6119 70088987 68998051 68108789 66968815 65744063 64822938 63787269 62949805 61967549 60910424
6110 60910424 59807919 59030779 58450918 57651224 56783275 55845467 54954357 54132417 53220557
6101 53220557 52248941 51302246 50519626 49498896 48782470 48325816 47515679 46830292 46211822
6092 46211822 45523265 44824660 44179676 43830547 43164028 42486052 41909322 41348048 40852993
6083 40852993 40475125 39897369 39416271 38747046 38279689 37775594 37045808 36661871 36281741
6074 36281741 35828596 35332999 34949270 34695053 34389403 34015624 33563219 33057868 32538763
6065 32538763 32076298 31989990 31571026 31105849 30765443 30354680 30002932 29832320 29520279 29153928
6055 29153928 28900557 28712083 28374961 28122108 27721614 27367284 27168825 27021846 26723509
6046 26723509 26593065 26406363 26117634 25985064 25659468 25334491 25182443 24989326 24880443
6037 24880443 24872435 24781323 24543426 24223432 23897781 23710819 23763075 23783852 23623625 23491264
6027 23491264 23559868 23732110 23622437 23685031 23721939 23663703 23536740 23476887 23735619 23823300
6017 23823300 24069256 24062886 24221720 24139021 23959369 24107691 24131854 24235400 24357207 24751632
6007 24751632 24980881 25178677 25339236 25646844 25915560 25931493 26115996 26124315 26476997 26797367
5997 26797367 27086348 27526216 27680666 27990292 28372225 28562397 28740309 29020986 29285853
5988 29285853 29509437 29860811 29958994 29996817 30297445 30585455 30794536 30834675 31074942 31549145
5978 31549145 31856598 31884763 31771394 31724833 31751433 31717776 32042715 32061090 32252445 32344130
5968 32344130 32244530 32302175 32126553 32123032 32079293 32351252 32663211 32698811 32914955 33168683
5958 33168683 33324625 33462509 33537606 33728388 33758478 33860014 33960886 33874433 34213203 34235964
5948 34235964 33904316 33739439 33785082 33809625 33672614 33731770 33560434 33535760 33602489 33514323
5938 33514323 33520837 33493036 33607598 33595945 33641263 33559029 33499036 33564567 33657654 33787764 33908013
5927 33908013 33935500 33848386 33853244 33744280 33854722 33875915 33839092 33744295 33754768 33673498 33407365
5916 33407365 33382805 33250953 33085554 32819045 32816055 32900567 32961902 32888078 32934416 33166438 33150149
5905 33150149 33300602 33733506 34085766 34402620 34935751 35504577 36116377 36824989 37780009
5896 37780009 38470375 39335277 40158026 41141351 42363866 43608504 45215798 46768748 48528245
5887 48528245 50653299 52581289 54593928 57354175 59973997 62763978 65797271 68511633
5879 68511633 71523125 74206181 76446025 78360936 79683880 80128661 79696242 78627996
5871 78627996 77163849 75461542 73506680 71564107 69830808 68523185 67459538 66300182
5863 66300182 65629986 65138239 64762393 64695938 64650840 64501920 64435969 64373734 63934567 63241466
5853 63241466 62537043 61725200 60339969 58705844 56974693 55089413 53041768 50739710
5845 50739710 48549166 46702704 44664657 42597828 40970530 39193840 37931991 36764266
5837 36764266 35643651 34594040 33679471 32933135 31997642 31170738 30404140 29717174 29116177
5828 29116177 28384077 27744091 27303446 26785011 26376797 25858031 25387743 24861343 24476972
5819 24476972 23919632 23322537 22795471 22172485 21473221 21241634 21190205 20876523 20460627 20081945
5809 20081945 19716579 19503216 19198750 18820848 18656009 18280654 17925825 17680352 17432167
5800 17432167 17351242 17137430 16818501 16719461 16539943 16377723 16251884 16062560 15821598 15637464
5790 15637464 15554112 15399342 15002742 14612810 14619035 14405515 14159645 13886260 13797069 13768167
5780 13768167 13406478 13347447 13275862 13187974 13008758 12772580 12490266 12618739 12602814 12349188
5770 12349188 11989873 11690634 11641565 11410595 11279840 11317340 11353284 11326298 11124441 10765586
5760 10765586 10655498 10703994 10655316 10630243 10420668 10342026 10397545 10376453 10644686 10422386
5750 10422386 10251249 10118576 10041407 9891986 9499277 9545288 9603093 9655006 9601364 9522884
5740 9522884 9526861 9530351 9108482 9069423 9222187 9165177 9217543 9032946 9084146 9055220 9085578
5729 9085578 8975865 8765272 8762474 8868692 8720241 8708300 8569380 8487759 8471223 8622130
5719 8622130 8547488 8560596 8689946 8705482 8463592 8266393 8035669 8071379 8085974 7969730
5709 7969730 8046104 8146070 8175950 7980236 7815259 7727411 7814746 7785427 7755206 7715584 7741869
5698 7741869 7722292 7584032 7598152 7646175 7666571 7420271 7343010 7544833 7390448 7372267 7407496
5687 7407496 7414588 7203401 7211342 7289781 7336684 7426067 7510918 7396339 7401537 7229489 7239870
5676 7239870 7420713 7228240 7295068 7457660 7466602 7344700 7065262 7214628 7187106 7164141
5666 7164141 7360331 7485239 7246116 7252403 7219703 7149373 7324073 7438771 7345713 7294180 7315504
5655 7315504 7161515 7397074 7567901 7555724 7354300 7354115 7204374 7039937 7006204 6985253 7151649
5644 7151649 7188891 7173211 7246274 7209020 7025955 7067664 7168538 7168402 7111865 7028001 6932208
5633 6932208 6963607 6855824 6743476 6806361 6929423 6930186 6715472 6673415 6842721 6689127 6691527
5622 6691527 6673473 6661173 6551634 6738833 6505505 6455093 6430830 6569250 6566800 6469250 6559326
5611 6559326 6444613 6535155 6475648 6449453 6507173 6517404 6655749 6667774 6513256 6503158 6413562
5600 6413562 6746443 6697855 6502521 6492113 6409416 6446169 6534842 6432883 6481620 6603469 6404686
5589 6404686 6477010 6623888 6497686 6283971 6209568 6335712 6223668 6154807 6014580 6135109
5579 6135109 6211893 6154730 6165462 6349819 6247451 6209672 6218190 6152104 6158373 6234441 6163010
5568 6163010 6194702 6242206 6085980 5846029 5932216 6008702 6088385 5944148 6030323 6125818 6175607
5557 6175607 6234676 6354632 6295290 6207008 6286436 6230025 6320516 6464243 6512230 6620751 6473694
5546 6473694 6454183 6527325 6542193 6811967 6538899 6483198 6670636 6677058 6745532 6626348 6384461
5535 6384461 6421534 6529615 6330574 6267239 6302236 6204941 6192619 6301666 6247019 6190928 6166139
5524 6166139 6100821 6003036 6102195 6108439 5740168 5612026 5657015 5718858 5784394 5694269 5640695
5513 5640695 5767731 5520967 5576319 5510816 5666997 5522423 5385082 5404091 5441440 5352653
5503 5352653 5216736 5631578 5691475 5546734 5426157 5576118 5386616 5311070 5140073 5232746
5493 5232746 5328078 5229865 5415788 5531009 5450266 5248960 5308545 5371162 5618499 5503751
5483 5503751 5474201 5484658 5468370 5289370 5311968 5219434 5269661 5269139 5285737 5290073 5177670 5181284
5471 5181284 5243828 5387797 5570064 5622428 5501343 5314477 5248925 5327638 5252611 5283880 5416732
5460 5416732 5221506 5246676 5376904 5377616 5331012 5155845 5040822 5233893 5380091 5404789 5615585
5449 5615585 5543296 5695657 5543865 5476158 5497268 5469079 5678527 5929582 6067488 6146139
5439 6146139 6100930 6075091 6082616 6320297 6293707 6145339 6295861 6234083 6068736 6191317 6211280
5428 6211280 6166543 5968362 5840106 6014895 6291200 6492131 6397210 6532179 6555257 6612988
5418 6612988 6807861 6835736 6815112 6727412 6589697 6677205 6514977 6232074 6019608 5914813
5408 5914813 5904236 5942922 5730536 5704466 5690368 5607523 5772471 5917394 5818608 5985139 5832382
5397 5832382 5469970 5740140 5725448 5733479 5876909 5833400 5844429 5814930 5641885 5610219 5511096
5386 5511096 5665766 5509371 5450238 5576208 5434344 5468325 5740620 5760486 5670380 5642582
5376 5642582 5505040 5392986 5426015 5492136 5409286 5446444 5383284 5501618 5538264 5472157 5234423
5365 5234423 5158918 5256816 5241070 5113681 5133516 5140058 5173208 5102819 5180926 5130102 5296105
5354 5296105 5377901 5121569 5193778 5322890 5397667 5279358 5162586 5185478 5333467 5360692
5344 5360692 5364834 5220436 5195857 5041658 5353373 5393600 5350514 5206861 5210860 5197261 5269566
5333 5269566 5269626 5235167 5258303 5361181 5510159 5292052 5277936 5393332 5160769 5320619 5362907
5322 5362907 5429122 5292855 5331116 5607449 5540729 5246182 5171757 5299886 5131977 5301495
5312 5301495 5299494 5271555 5192724 5325477 5324710 5276642 5363425 5331994 5226423 5249052 5164089 5294627
5300 5294627 5358120 5255684 5284585 5498429 5436623 5599683 5410860 5343996 5527621 5556950
5290 5556950 5590653 5843067 5997496 5688098 5862918 5742309 5715631 5738357 5731505 5694706 5624038
5279 5624038 5892501 5841236 5940651 5983909 5991425 5990410 5828247 5991194 5878904 6012319 6144559
5268 6144559 6008055 6042940 6033170 6158508 6220225 6316383 6368894 6099160 5990909 6146685 6293157
5257 6293157 6262347 5999517 5892199 5991971 6006345 6035183 6126260 6187458 6228650 6082527 5844239
5246 5844239 5836410 5959261 6136152 6262976 6292197 6234549 6053007 6155372 6084549 6204112
5236 6204112 6326626 6489737 6527402 6487461 6313135 6068678 6338960 6048692 6115446 6218430
5226 6218430 6280825 6446769 6662621 6425092 6060329 6068025 6175166 6202536 6066704 6153184
5216 6153184 6204304 6279254 6335164 6184634 6023943 6269805 6022516 5868036 5940452 5886353
5206 5886353 5966553 6051732 5888538 5901907 5886681 5628967 5668813 5760876 5771365 5627170 5629504
5195 5629504 5666997 5617873 5718193 5914613 5943340 5564005 5577424 5477881 5433766 5447949 5436246
5184 5436246 5441154 5671445 5569115 5514333 5554796 5300734 5518455 5523384 5382264 5409279 5564677
5173 5564677 5494565 5421210 5368147 5280436 5484025 5662691 5519097 5396621 5368477 5395962 5183500
5162 5183500 5203607 5404087 5264447 5238333 5305939 5308944 5222050 5196118 5265509 5240990 5288966
5151 5288966 5286283 5260097 5280507 5316760 5029061 5002520 5082090 5220368 5120467 5186821 5234300
5140 5234300 5183340 5152128 5060109 4978868 5153685 5146721 5246696 5286622 5092708 5114405 5065227
5129 5065227 4925006 5027098 5249583 5115536 4995566 5073492 5143427 5058896 4972302 5027951
5119 5027951 5318521 5144500 5006067 5223486 5394098 5285968 5173490 4972323 5126828 5095990
5109 5095990 5072253 5078209 5156534 5182539 5069285 5161625 5358802 5340746 5229616 5181646 5348617
5098 5348617 5391585 5189306 5307797 5248638 5126645 5164141 5426305 5316135 5090726 5312124
5088 5312124 5382287 5118777 5120224 5278800 5327360 5267332 5343533 5302487 5206089 5186097 5154381
5077 5154381 5199441 5210212 5169625 5112908 5318551 5285140 5313404 5321874 5296345 5412303 5318036
5066 5318036 5324472 5458166 5538177 5563144 5566085 5544169 5417197 5290681 5247934 5140499 5136289
5055 5136289 5302189 5351333 5452092 5497065 5310566 5342037 5367397 5402014 5278551 5420496
5045 5420496 5543230 5509628 5568154 5762582 5561788 5474333 5422632 5447585 5761923 5629486
5035 5629486 5528354 5584326 5649012 5630741 5635876 5720967 5840570 5767721 5879838 5908912 5894494
5024 5894494 5909414 6143039 6185241 6190356 6295993 6092119 6193788 6359926 6441865 6395041 6465706
5013 6465706 6311291 6442045 6696880 6746804 6685508 6685105 6621336 6929594 7101986 7204359 7465680
5002 7465680 7390490 7560959 7576178 7712800 8054975 8200036 8382916 8527769 8710780 8885160
4992 8885160 8702121 8863490 9134838 9460463 9601152 9705840 9919327 10025997 10091052 10193170
4982 10193170 10572669 10830730 10940004 11123758 11066925 11191388 11426249 11517925 11505874 11769825
4972 11769825 11752513 11916122 11957589 12139706 12220771 12215251 12050378 11862580 12108636 12189381
4962 12189381 12151568 12195667 12222720 12164558 11978964 12064357 12364201 12575133 12487408 12402632 12422971
4951 12422971 12590333 12936012 12973516 13329650 13516668 13672398 13936987 14012737 14059622 14314220
4941 14314220 14467891 14723797 15108623 15497579 15826646 16036971 16291508 16742195 16895386
4932 16895386 17048448 17271049 17271247 17358356 17498705 17603414 17856597 17900149 17933049 17935638 17797468
4921 17797468 17799621 18002925 17862138 17777411 17715713 17576182 17261618 17192739 17228450 16907948
4911 16907948 16830231 16689931 16437976 16379140 16020061 15772797 15625288 15478537 15505953 15436825
4901 15436825 15231467 15124971 15080943 14992079 14978219 14894894 15074343 14962343 14894977 14912835
4891 14912835 15045835 15074783 15255055 15317708 15222301 15232789 15299335 15256570 15248609 15265643 15465007
4880 15465007 15351132 14969915 14711538 14702632 14671658 14521802 14277834 14227909 14340778 14091468
4870 14091468 13762541 13344911 13120959 12849336 12749886 12481255 12129189 11898145 11951740 11829776
4860 11829776 11402589 11096829 10812708 10447102 10203574 10081217 9905100 9846809 9732089 9702664
4850 9702664 9520899 9172233 8887608 8570149 8614558 8536178 8345868 8161926 8032907 7796881
4840 7796881 7899421 7873242 7696512 7539506 7510380 7519765 7288633 7240518 7236255 7194865 7263253
4829 7263253 7221105 7145843 7159293 6979458 7077384 6921608 6842290 7061235 7062404 6966793 6883152
4818 6883152 6912375 6937634 7036034 6949888 6994582 6963229 6853480 6866023 7019872 7108252 7048930
4807 7048930 7107238 7116000 7010214 7131686 7129855 7088918 7216720 7395565 7554972 7431122 7354338
4796 7354338 7370800 7280162 7569980 7641987 7642752 7949204 7923976 8012269 8184449 8272117 8322174
4785 8322174 8429657 8769583 9070439 9267781 9410822 9306423 9627500 9836562 9939803 9945785
4775 9945785 10215022 10545493 10871767 10942771 10840928 10853461 11027658 11201502 11188724 11367162
4765 11367162 11648717 11655285 11697945 11599950 11879737 11833590 11800605 11745176 11918940 11939994 11851603
4754 11851603 11801576 11920984 12002413 11836706 12039126 12360370 12441401 12349483 12496850 12651815
4744 12651815 12814803 12921202 13141869 13291903 13602974 13579551 13789918 14125851 14321152 14516109
4734 14516109 14777325 15016632 15264876 15535733 15838721 15867213 15907916 16064281 16386408 16438714
4724 16438714 16505988 16514887 16523403 16375310 16356136 16465438 16323948 16172255 16199198 16019920 15995299
4713 15995299 15889726 15609001 15321136 15086568 15093662 15133871 15061712 14862504 14903662 14884091
4703 14884091 14702144 14458528 14416060 14558241 14646476 14329964 14271636 14301798 14369149 14471993
4693 14471993 14370868 14509821 14468201 14529162 14622984 14706999 14805364 14870450 14913995 15024361 15004511
4682 15004511 14868905 15199134 15207867 15052696 15192007 15092426 14907008 14867297 14679346 14642320
4672 14642320 14594627 14510579 14248895 13908975 13633656 13441122 13274357 12841907 12674926 12348403
4662 12348403 12070691 11956419 11507332 11202034 11032331 10861516 10595010 10425138 10206223
4653 10206223 9994217 9956679 9793227 9450976 9400481 9492877 9517372 9293209 9073904 9168239
4643 9168239 9177249 9140489 8979412 8878230 8791094 8786914 8613207 8644723 8695805 8533806 8507929
4632 8507929 8337933 8204048 8128952 8187657 8015545 7873067 7817914 7902716 7829200 7776259 7544106
4621 7544106 7452394 7295937 7026721 6833583 6752267 6707076 6739669 6748657 6614106 6564583 6374925
4610 6374925 6148945 6013977 5918786 5936148 5842905 5501210 5479192 5321552 5161891 5520339
4600 5520339 5562473 5373870 5297913 5286208 5424258 5206656 5169259 5118644 5127269 5293673 5287965
4589 5287965 5235456 5157644 5050179 4912866 4964898 5066852 4979815 4734306 4733786 4834672 4891928
4578 4891928 4880773 4806317 4862769 4747693 4749545 4530776 4736600 4857161 4822466 4774045 4707258
4567 4707258 4635446 4612831 4527569 4619509 4834735 4967412 4621960 4443344 4525109 4555293 4605027
4556 4605027 4690450 4700115 4552710 4521949 4540107 4487683 4515031 4582741 4389837 4535922 4476806
4545 4476806 4413981 4379223 4248040 4335126 4375511 4375787 4376540 4329746 4354836 4351290 4326814 4267862
4533 4267862 4260004 4488862 4678073 4593247 4609178 4616192 4631848 4552250 4452673 4626844 4557055
4522 4557055 4642582 4795932 4814470 4921048 4958776 4909291 4900461 5003320 4957451 4988208 5022986
4511 5022986 5153326 5198146 5241784 5216478 5228791 5155809 5187380 5326705 5588026 5600248 5414498
4500 5414498 5440473 5451073 5710766 5647094 5700435 5628781 5636705 5768040 5968288 5878070 6009998
4489 6009998 6074982 6022415 6266621 5995420 6047231 6264994 6297476 6187395 6376269 6260142
4479 6260142 6416578 6645788 6789722 6527100 6670980 6641666 6641091 6738165 6661048 6537975 6510324
4468 6510324 6578401 6441602 6374996 6317142 6303810 6404114 6113126 6150686 6300714 6309404 6209048
4457 6209048 6059053 6022169 5915686 6144625 6271983 6407439 6552440 6547478 6495008 6705965
4447 6705965 6869074 6882369 6783622 6641257 6727328 6676833 6670235 6867564 7002050 6916637 6800357
4436 6800357 6914706 6993797 7250226 7324172 7201538 7171858 7468695 7541709 7505224 7726206
4426 7726206 7785008 7772649 7772278 7775801 7784817 7940031 8309685 8285768 8363597 8390806 8442344 8725665
4414 8725665 8785110 8826173 9058670 9258790 9618183 9544550 9729168 9946203 10351616 10570551
4404 10570551 10673171 10860387 11225226 11449995 11830475 12336505 12585446 13036390 13600545
4395 13600545 14177803 14719472 15219811 16081800 16893156 17852571 18975186 20239186 21755506
4386 21755506 23269116 25179891 27229777 29400289 31697535 34017323 35770297 37285937
4378 37285937 38953048 40988992 43198778 45767238 49040014 51887536 53797048 54445712
4370 54445712 54672009 55055154 55774158 57216994 59400601 61517276 62465044 61658397 59709206
4361 59709206 57199408 54793026 53391051 52648900 52204299 51662814 50052157 47390172 44548704
4352 44548704 41591690 38980322 37371296 36017926 34912828 33572463 31734439 30015212
4344 30015212 28071424 26340931 24756043 23470491 22259028 21272567 20260075 19373331
4336 19373331 18828177 18381182 17624057 16961277 16588538 16207294 15757046 15204147 14885894
4327 14885894 14621604 14018939 13899161 13466738 13114621 13116369 13089862 13105601 12938163 12931245
4317 12931245 12935688 13016441 13123375 13136037 13120159 12791873 12786238 13069018 13064774 12817266 12626113
4306 12626113 12586069 12561727 12514397 12463437 12260944 12156790 12098848 12098577 12151696 12176688 12122791
4295 12122791 12169141 12066655 12124859 12304637 12525056 12630273 12611826 12904987 13081134 13408835
4285 13408835 13565107 13687787 13609707 13636862 13743838 13563787 13566716 13473819 13494112 13478152 13564537
4274 13564537 13736687 13843430 13891551 14087893 14157740 14191374 14513597 14639812 14979568 15167883
4264 15167883 15531718 15973376 15985345 16235135 16757774 17125807 17318565 17586062 17860139 18367536
4254 18367536 18680083 18786408 19276526 19772189 20142130 20562548 21032565 21717045 22297459
4245 22297459 22970639 23638064 24061757 24398703 24702959 25434497 25985702 26527718 27250454
4236 27250454 27729398 28487980 29267852 29996863 30952355 32228481 33478451 34552021 35627203
4227 35627203 37011211 38257789 39648604 41124590 42794621 44547962 46582514 48222485
4219 48222485 50047075 52095416 53718893 56035994 57910902 59883542 61972810 63984565
4211 63984565 66277997 68757204 71296896 74074022 77151699 80882588 84824071 89095827
4203 89095827 94006233 99488509 105233209 111620046 118636596 126184923 134917314 144771613
4195 144771613 155186212 167134907 179711010 192152993 203903353 213715460 220071303
4188 220071303 222259492 219827532 212770937 201901980 188689857 174372014 160334386
4181 160334386 147368267 136217843 126809650 119015067 112759282 107610040 103210997 99758901
4173 99758901 96864541 94240958 91895820 89834422 87771597 85708846 83872759 82079706
4165 82079706 80218478 78261147 76370733 74364645 72483580 70740488 69103561 67524011
4157 67524011 66327361 65052542 63837557 62607162 61462808 60264614 58920708 57521606
4149 57521606 56309994 55090386 54032896 52989277 52116282 51514653 50888089 50524437 50187692
4140 50187692 49597765 49249321 49050019 48420387 47597583 47149036 46488700 45740793 44683865
4131 44683865 43930057 43295435 42870511 42413069 41870796 41306425 41051005 41036205 41005932 40983232
4121 40983232 40911245 40896693 41212850 41414838 41485138 41827351 41957197 42354950 42629102 43257577
4111 43257577 43574037 43762023 43737901 44135832 44491911 44528367 44691312 44816185 45019498 45642491
4101 45642491 46378120 46869303 47285225 47984579 48934099 49834308 50903331 52192724 53519351
4092 53519351 54852341 56439264 58071830 59539737 61191889 63125160 65270740 67282471
4084 67282471 69203361 71442449 73371994 75801259 78531850 81490317 84626497 88363220
4076 88363220 92277308 96563464 101582635 107054739 112979063 119478986 126727301 134845594
4068 134845594 143636675 153740094 164865556 177228492 191027207 206448811 223588597
4061 223588597 242301279 262101305 281895655 298494273 306430818 302494613 287593102
4054 287593102 266575875 244337455 223994423 206094288 190405639 176794260 164935198
4047 164935198 154178079 144974582 136968897 129614760 123455987 117996073 112722984 108029421
4039 108029421 103638977 99452120 95681201 92380745 89623453 86776063 84385260 82203985
4031 82203985 79783103 77561332 75414148 73121018 70900071 68861663 66658193 64337335
4023 64337335 62486989 60759529 59205287 57547933 55646891 53595024 51834982 50070558
4015 50070558 48753069 47348635 46101137 45161243 43833426 42710905 41677337 40808934
4007 40808934 39860404 39124449 38291754 37609038 37091387 36408625 35929789 35576622 35124426
3998 35124426 34706855 34406185 33980915 33573386 33459762 33309326 33341286 33553100 33853357 34223032
3988 34223032 34920687 35745951 36419534 37584195 39089269 40993658 43515762 46764245 51456940
3979 51456940 58006055 61683482 58431987 51809762 43982666 37846053 33665370 30619523
3971 30619523 28442349 26980744 25629795 24509661 23537364 22778853 22097809 21504178 20910153
3962 20910153 20472613 20104985 19469576 19004206 18848311 18537686 18178922 17880396 17556915
3953 17556915 17352676 17055358 16803813 16733477 16759473 16471689 16191371 16214021 16109388 16078793
3943 16078793 15904841 15718471 15302244 15109502 15186943 14840700 14502337 14180555 13941296 13852762
3933 13852762 13579566 13130467 12885146 12788379 12650088 12340231 12241259 12205701 12100157 12060389
3923 12060389 11913817 11842464 11608856 11297107 11358356 11372828 11326379 11227167 11250206 11062591
3913 11062591 11054483 11117574 11021525 11079839 10927321 10844183 10809921 10834220 10860300 11047387 11232053
3902 11232053 11012641 10906586 11004258 11070059 10994593 10799165 10600053 10747597 10649597 10430698
3892 10430698 10268153 10455121 10294891 10114963 10127975 9946847 9705028 9734978 9683874 9820349
3882 9820349 9577156 9507615 9415168 9388913 9374108 9244007 9292398 9437981 9350169 9274936 9358356
3871 9358356 9370300 9198196 9044834 9058359 9252420 9486610 9304561 9385244 9336540 9432741
3861 9432741 9462143 9231601 9377598 9460260 9492188 9425210 9307585 9316668 9456621 9539296 9744288
3850 9744288 9576172 9520787 9700879 9751062 9747074 9796682 9724757 9933707 10002473 9770807 10066488
3839 10066488 9956421 9898505 10017830 10046625 10215131 10458962 10489145 10606296 10634897 10675217
3829 10675217 10898882 11005520 11202667 11366317 11446177 11416614 11593075 11632161 11810596 11961761
3819 11961761 12162490 12185880 12104148 12128508 12047255 12067836 12212350 12312684 12209044 12058290
3809 12058290 12031785 12119252 12107411 12020933 12123030 12306099 12305786 12330751 12342122 12638932 12803051
3798 12803051 12822715 12783019 13001412 13034759 13286993 13463052 13269858 13276669 13479314 13516678
3788 13516678 13779721 13932382 14112799 14041623 14325177 14737802 14729100 14892907 15124295 15252841
3778 15252841 15388327 15291362 15472720 15631728 15880209 16089804 16453729 16736853 16923948 17087839
3768 17087839 17458785 17631823 17840624 17961250 18382401 18677251 18679297 18691705 18584930 18755887
3758 18755887 18772100 18804357 18957913 18948986 18871597 18818620 19064702 19102361 18887881 18964369 19062875
3747 19062875 19380107 19734052 19778801 19751079 20015083 20063089 20316130 20426764 20612415 20593110
3737 20593110 20950158 21248832 21236152 21380395 21442503 21511369 21633392 21818802 21922623 21891505
3727 21891505 22127850 22216569 22297213 22420295 22622786 22694432 22865910 22834013 22807342 23219352
3717 23219352 23485758 23713314 23794127 23976623 24150408 24423411 24766815 25035063 25287456 25604721
3707 25604721 25987763 26351410 26989613 27590722 28199213 28892391 29371641 30189421 31094692
3698 31094692 32174277 33081638 34094351 35166479 36095220 37120570 38394012 39901717
3690 39901717 41005344 42258860 43408271 44626231 45860268 46906957 47915817 49069483
3682 49069483 49850951 50810736 51849695 52916682 53697747 54427962 55077437 55891582 56491009
3673 56491009 57081855 57662316 58003768 58423465 58721942 58737690 58619614 58366573 57961919 57557554
3663 57557554 57027146 56501683 55823036 55029115 54146089 53530106 52856931 52168171 51351800
3654 51351800 50499729 49598168 48747396 47849548 46853965 45916765 44960399 43995073 42799750
3645 42799750 41431614 40201792 39238550 38316841 37304020 36408715 35458292 34806115 34135457
3636 34135457 33482857 32777945 32364849 31845615 31371308 31198754 30840242 30515158 30093464
3627 30093464 29732005 29405577 29325220 29373478 29507862 29417580 29349146 29467682 29551622 29605495
3617 29605495 29637793 29424316 29499184 29709536 29755433 29751050 29724618 29625553 29753848 29828491 29646490
3606 29646490 29532800 29507780 29690201 29868601 29935416 29950918 29984508 29775984 29719013 29902636
3596 29902636 29796742 29679164 29875147 29582206 29542909 29559900 29506746 29394999 29340248 29382020
3586 29382020 29474505 29536345 29631152 29898727 30012648 30094838 30352107 30486301 30587672 30834969
3576 30834969 31028040 31418337 31652480 31820264 32155625 32674845 33230134 33409411 33777367
3567 33777367 34355540 34777214 35408625 36072563 36468134 37213872 37815698 38063904 38632748
3558 38632748 39023157 39271123 39649946 39978673 40150494 40198226 40167467 40229711 40215584 40203004
3548 40203004 39970980 39573714 39435978 39269579 39098492 39186133 38960937 38645695 38730399 38805001
3538 38805001 38876187 39224179 39389089 39451777 39694929 39788580 40161027 40605257 40908765 41203968
3528 41203968 41606099 42300490 42694692 43398090 44174277 45105991 45877741 46656739 47413432
3519 47413432 48103280 49372619 50517347 51638521 52997708 54567987 56086492 57728312
3511 57728312 59332647 61345003 63117390 64920486 66709584 68720018 70776130 72489005
3503 72489005 74321570 76154095 77969870 79561909 81097082 82720845 84401661 86141633
3495 86141633 87833106 89372009 91169973 92982101 94732207 96386202 98436873 100700898
3487 100700898 102671856 104544006 106128278 107530086 108751249 109690666 110368738 110514346
3479 110514346 109967272 109044706 107614381 106130028 104255104 102318346 100091840 97376541
3471 97376541 94948373 92582072 90377501 87923831 85601501 83111809 80893163 78792736
3463 78792736 76443184 73937096 71585852 69562719 67399996 65188010 62674617 60339365
3455 60339365 58190674 56219636 54328304 52512074 50652640 48942267 47474173 46280034
3447 46280034 44909393 43611012 42554275 41391783 40296477 39262237 38511085 37745681
3439 37745681 36976670 36145261 35421168 34966175 34483439 34056748 33628841 32985803 32495555
3430 32495555 32081243 31804639 31738854 31506168 31455980 31129953 31033906 31020727 30972029 30950282
3420 30950282 30700012 30724222 30580649 30582588 30524211 30449882 30155816 29967926 29729244 29285297
3410 29285297 28843277 28396306 27897312 27572834 27173910 26570808 26043994 25431501 24802864
3401 24802864 24133789 23680993 23221586 22775196 22331216 21863091 21732568 21446943 20880643
3392 20880643 20586785 20390474 20149027 20078591 20052725 19933260 19450774 19409161 19218909 19053080
3382 19053080 18730238 18611503 18721278 18601031 18299184 18288671 18234068 17909006 17901533 17910537
3372 17910537 17838000 17835772 17806048 17655393 17690550 17577652 17521988 17623476 17701357 17671618 17559577
3361 17559577 17654825 17586929 17649929 17746307 17627315 17749364 17740753 17885401 17822112 17967718 18022674
3350 18022674 18057199 18229842 18336779 18581727 18675500 18820564 18833181 18925275 19090566 19448272
3340 19448272 19655526 19908248 20317733 20353295 20721774 21094581 21304964 21649649 21805355 21955201
3330 21955201 22484883 22786774 23118763 23595412 23956290 24236112 24448663 24698032 25361378
3321 25361378 25759047 25876763 26402744 26966465 27430636 27880916 28317597 29012558 29560962
3312 29560962 30116049 30904340 31605683 32167241 32728933 33496365 34060812 34861360 35711411
3303 35711411 36662690 37709194 38609276 39659640 40698807 41867435 43014962 44353686
3295 44353686 45854335 47238695 48649620 50096721 51823310 53866192 55597857 57824881
3287 57824881 60142109 62504491 65115494 67776309 70708873 73855151 76886960 80213597
3279 80213597 83815758 87607063 91634055 95742517 100163837 104902891 109499306 114341305
3271 114341305 119113207 123939976 128547790 132971507 137029442 140819284 144217445 147067800
3263 147067800 149323264 151013522 152485174 153546474 154138853 154402279 154366204 153927078 153333065
3254 153333065 152048447 150390926 148460687 146300780 143433078 140244774 136789655 133000635
3246 133000635 128963106 124745721 120418403 116088387 111738053 107536215 103268492 99286293
3238 99286293 95639313 92202092 88816645 85620389 82875053 79980509 77280645 74896908
3230 74896908 72785186 70683207 68542862 66335044 64538198 63002340 61556795 60238456
3222 60238456 58790154 57440151 56270459 55085892 54120354 53059615 52169721 51447301 50446853
3213 50446853 49695865 49037302 48373217 47735604 46954757 45899008 45294238 44780987 44257969
3204 44257969 43579165 43001638 42690578 42389894 41843768 41414424 40785170 40504413 39976474
3195 39976474 39346676 39017753 38540890 38003996 37757133 37580119 37363692 37177808 37070432
3186 37070432 37040380 36988788 37038098 37291157 37234138 37133674 37290048 37217852 37123206 37046571 36855985
3175 36855985 36707201 36422862 36073542 35763187 35226551 34769856 34518083 34049918 33707148
3166 33707148 33299488 32578410 32179118 32061372 31789478 31438660 31233057 31103951 31043939 30877709
3156 30877709 30988625 31180862 31145781 31326294 31309552 31676788 31897883 32157675 32656284 33087394
3146 33087394 33534896 34149721 34577018 35031926 35618266 36138025 37062697 37880954 38729975
3137 38729975 39609346 40436741 41231514 42292709 43420594 44558904 45814913 47158395 48709431
3128 48709431 50474302 51912711 53619217 55513786 57507853 59254331 60905107 62340932
3120 62340932 63587790 64425595 65152055 65775151 66358323 66684698 66680210 66501937 66223769 66223571
3110 66223571 65773897 65424624 65067780 64714894 64522779 64255570 64301915 64391430 64595499 64737564
3100 64737564 64874378 64990335 65161319 64974040 64791246 64152150 63502667 62706193 61737910
3091 61737910 60519795 58963752 57562734 55920018 54131234 52473586 50574484 48875284
3083 48875284 47165057 45497329 43947677 42616361 41256006 39900412 38835420 37570088
3075 37570088 36186155 35070799 34263930 33280946 32240367 31422132 30670083 30086894 29425799
3066 29425799 28758097 28234657 27778132 27233700 26684654 26204628 25788509 25524531 25380181
3057 25380181 24921823 24431943 24137743 23809925 23690126 23649417 23494893 23542926 23512228 23499378
3047 23499378 23788752 23712497 23890751 23909303 23985972 23950603 23808996 23880963 23988871 23735600
3037 23735600 23345939 23167636 22698609 22203989 21933222 21506889 21249953 20824421 20356410
3028 20356410 19747380 19192578 18964579 18428198 17929850 17530252 17082188 16989600 16870820 16590903
3018 16590903 16141805 15909389 15473515 15129257 15058466 15011008 14987778 14866421 14595434 14391249
3008 14391249 14311794 14016030 13786988 13718525 13611300 13550542 13299174 13133358 13281949 13236740
2998 13236740 13261462 13003757 12779428 13052423 13155310 12976660 12657992 12924342 12868331 12675738
2988 12675738 12693119 12751037 12736922 12818603 12781039 12733903 12816224 12887922 12940705 13077719 12967690
2977 12967690 12775068 12924755 13013489 13045508 13191965 13184065 13115570 13154569 13226989 13404433 13574860
2966 13574860 13674897 13682799 13747706 13929435 14106822 14076379 14090298 14302707 14391303 14642912
2956 14642912 14688058 14752029 14957615 15120861 15147134 15383006 15558671 15674560 15905917 16210243
2946 16210243 16614484 16853266 17136507 17250517 17597993 18061016 18202188 18697686 19146949
2937 19146949 19558949 19939104 20279188 20692195 20941381 21419628 21968820 22621191 23162346
2928 23162346 23608683 23810781 24379236 24806209 25484659 26225531 26789049 27380207 28260768
2919 28260768 28858455 29464728 30226903 31146540 31982933 32760446 33507329 34301152 35141812
2910 35141812 36165472 37188056 38275831 39292751 40425620 41806906 42983147 44168483
2902 44168483 45646142 47325014 48928470 50482353 52232398 54227397 56039277 58093828
2894 58093828 60492113 62849635 65303251 67906778 70539247 73457994 76347977 79449063
2886 79449063 82679882 86187847 90198546 94257307 98639358 103414624 108841390 114672784
2878 114672784 121066137 127998485 135658041 143848280 152895495 162802476 173685694 185617027
2870 185617027 198110479 211650077 226136833 241537370 257936980 274309824 291017988
2863 291017988 307117674 321645518 333512582 340660192 342128526 337027024 326235699
2856 326235699 311376049 293942779 275649817 258189675 241913332 226859406 213572056
2849 213572056 201679011 191156623 181697220 172827946 164801604 157406859 150739059 144160225
2841 144160225 138068559 132637190 127188932 122047240 117103928 112820224 108489254 104425458
2833 104425458 100571794 96735541 93414851 90099245 87253203 84285569 81560856 79023028
2825 79023028 76641172 73874552 71418191 69435079 67469736 65489348 63502800 61803191
2817 61803191 60072342 58475806 57003799 55399729 54231655 53000933 51842199 50703106
2809 50703106 49576523 48369858 47170566 46216082 45491935 44461544 43455335 42569069 41758427
2800 41758427 40918344 40245817 39627492 38825128 38105016 37528157 36756797 36041482 35680699
2791 35680699 35278976 34603036 33934404 33327182 32734031 32142915 31479884 30896867 30390712
2782 30390712 29616097 28554729 27906344 27432780 26699779 25730687 25023514 24348476 23855418
2773 23855418 23212244 22368458 21595990 20981583 20353023 19999126 19438980 18927792 18778630
2764 18778630 18153655 17695636 17524619 17201426 16912011 16318916 16057572 15756264 15307947
2755 15307947 14982715 14485545 14395743 14246465 14100824 13801327 13485663 13103652 12818263 12782107
2745 12782107 12605354 12443429 12226268 12101317 11952962 11711207 11493033 11398760 11208182 10947679
2735 10947679 11002537 10800128 10551118 10518188 10457491 10205358 10021885 9932043 9598046 9385629
2725 9385629 9215189 9275608 9304818 9096780 8806228 8789116 8676093 8521883 8255430 7933184
2715 7933184 8049031 7850155 7627069 7725045 7538495 7288686 7234526 7211172 6915784 6795242
2705 6795242 6830979 6680543 6716830 6584911 6440930 6431218 6299209 6393471 6300113 6197007 6202278
2694 6202278 6050098 5711826 5551030 5634691 5512182 5207500 5349487 5290601 5289339 5022638
2684 5022638 4739959 4744031 4691964 4775123 4694321 4568810 4437077 4468013 4339817 4354138 4391012
2673 4391012 3965603 3876455 4068998 4121180 3836024 3847338 3888749 3728700 3798834 3727088 3579526
2662 3579526 3721675 3751477 3370830 3274188 3511109 3702023 3448174 3383446 3372448 3179528
2652 3179528 2993635 3241156 3176631 3108687 2986274 3007213 3004285 2798986 2631949 2746880
2642 2746880 2792501 2760911 2901129 2888151 3010343 2811695 2769898 2823867 2581230 2493387 2533613
2631 2533613 2616639 2630806 2594757 2662330 2805463 2707405 2536538 2403294 2322682 2376807 2169021
2620 2169021 2197696 2342604 2323267 2160087 2105967 2317669 2223063 2217579 2300150 2066068 2120444
2609 2120444 2121070 2067263 1986398 2124631 2252602 2201506 2277722 2001833 2082754 2124255 1965392
2598 1965392 1906473 1993145 1926670 1939283 2018398 2219757 2338070 2220998 2093799 2212836
2588 2212836 2377561 2170019 2159666 2426721 2619126 2523465 2908410 2930606 2841563 2729803
2578 2729803 2851930 2911435 2969243 2893455 2749865 2768608 2753735 2800764 2638815 2497365 2331185
2567 2331185 2051900 2029259 2010465 2109495 2041255 1831077 1973420 1965972 1846289 1742998 1735849
2556 1735849 1768342 1783846 1529193 1465927 1609230 1642052 1459150 1328732 1272585 1201107 1499480
2545 1499480 1468580 1255315 1108499 972071 1185160 1279563 1220643 1072755 1247722 1205863
2535 1205863 1076227 1038976 930110 958375 988575 1063317 995709 1030529 1119342 1214132 1199106
2524 1199106 1060364 951490 914233 990253 1030080 853333 946035 901039 937088 906394 788060
2513 788060 776621 763109 859692 747497 823174 758867 792627 685603 742833 773635 696682
2502 696682 698268 808361 729232 769812 769725 853726 887586 762798 693086 701986 551975 483660
2490 483660 304158 216689 317396 337818 443257 409662 350502 403672 313869 498860 676844
2479 676844 741249 788038 667015 506840 303877 423847 206145 160683 354293 283427
2469 283427 369808 442804 541092 534286 245456 152451 129911 376961 245408 423430 628989
2458 628989 428110 568250 505165 189534 -30075 14643 -8470 157711 181371 136025 91419
2447 91419 -7242 -4657 195236 193831 104223 146394 160853 310970 333529 312856 178573 435511
2435 435511 465267 344412 26173 44461 253558 209537 128994 272529 348397 441574 354393
2424 354393 344151 388817 274035 107376 80789 169396 399307 298876 150487 238382 220344
2413 220344 64189 54954 223346 148061 87122 166892 271057 286522 147100 130472 154479
2402 154479 61529 128423 192035 95492 114045 245559 251847 254900 274795 269192 170472 -54063
2390 -54063 -129793 104552 162674 139572 395028 420659 448145 447567 58690 -29342 -38344 108916
2378 108916 144189 92465 63097 64241 35489 240558 379679 267896 102645 267741 320288
2367 320288 73764 188086 258491 185500 147759 108690 131312 241722 111740 5361 200438
2356 200438 350053 295525 248800 224090 295062 504612 311587 350328 303540 303332 398529
2345 398529 275754 349483 288273 249202 138465 278012 183321 14720 77780 84510 79998
2334 79998 164188 146775 -1968 9942 -10738 216782 293166 353135 313535 333344 224205
2323 224205 136468 158167 349699 272268 236125 253743 459617 389601 206760 173109 31221
2312 31221 -112936 30597 160482 210613 69573 -9026 287148 163897 10684 158898
2302 158898 298902 16361 30283 28754 168477 33296 105661 156069 157276 65734 158161
2291 158161 174542 237803 100498 165193 340678 210406 272819 271382 261132 202354 209539
2280 209539 340168 342093 154714 314365 318507 256577 266794 234827 293389 276149 11337
2269 11337 -95513 158624 263760 -95082 -188142 -127185 79780 68057 47327 111103 204008
2258 204008 117952 143482 -4840 146591 204077 9044 163892 151653 273911 196810 353105
2247 353105 522729 411177 327992 249663 161875 150247 127285 182255 172687 147030 142049 213391
2235 213391 135030 -54126 21203 202186 394597 328677 92855 86252 377152 246131 170665
2224 170665 296359 351164 443262 505982 433755 323248 235217 109104 125544 11293 157951
2213 157951 122555 137096 125036 241639 8498 193007 194849 247918 98782 195914 448170
2202 448170 460057 262878 279978 390107 175910 113313 -52282 -2354 -7134 132991 181
2191 181 114469 300562 255254 328286 363156 369182 366839 334893 586330 546728 392452 111384
2179 111384 169652 449490 507117 307353 369989 137548 155741 355294 457632 279215
2169 279215 368592 609073 411748 436443 439878 546237 674423 686781 633562 691703 703016
2158 703016 566153 608979 705799 827938 719559 592170 589874 558721 672427 624491 759776
2147 759776 871441 835808 615576 646891 791810 768532 758756 782340 832439 1006952 1248578
2136 1248578 1123290 966533 932228 944784 943939 1060495 1407108 1374074 1354705 1297925 1345093
2125 1345093 1505975 1771479 1841305 1655932 1479496 1777054 1999277 1867067 2064050 1915314
2115 1915314 2009271 2352447 2581994 2636230 2693801 2660185 2862470 3039201 3079981 3472578
2105 3472578 3817592 3861408 4073948 4384518 4799543 5315036 5723307 6235592 6841701 7273569
2095 7273569 7705530 8130568 8858700 10026981 11303244 12799471 14783990 16855827 19319670
2086 19319670 22228793 26354575 31878098 37736975 38670019 34086902 27849737 21089452
2078 21089452 16310843 13389534 11497409 9966359 8777127 7776165 6959723 6412194
2070 6412194 5969802 5490502 5429476 5075804 4631179 4171871 3950956 3798273 3299697 2941731
2060 2941731 2797895 2743172 2601402 2385084 2186857 2247459 2234122 1922401 1902629 1883665
2050 1883665 2000225 1896176 1748349 1657650 1643004 1473548 1581404 1452521 1162214 1206267
2040 1206267 1217391 987620 1047051 1072301 710073 772857 896952 749331 936932 1009325
2030 1009325 995454 793602 578045 584834 677868 877950 703406 501441 275504 383092
2020 383092 346426 625723 590558 539013 408019 272426 387025 502738 366312 468451
2010 468451 308923 263069 518033 516405 400109 441495 403964 330837 258961 154021 245929
1999 245929 150537 45735 152418 328737 340613 124403 256253 131078 176881 112361
1989 112361 18200 244364 135409 -106098 -52499 204603 283539 141276 70551 -21245 25444
1978 25444 -56733 -34640 43897 34774 -47347 -72316 -48399 27735 -68219 -48457 44141 -91573
1966 -91573 -156315 -272422 -144724 -169801 -120187 -255248 -120872 23534 -106933 91210
1956 91210 115585 18377 29137 31404 74175 60193 15538 91398 -45666 23439 64529 53049
1944 53049 -54002 -17068 61404 -167671 -11888 -12396 65260 106360 -58429 -75041 125556
1933 125556 3145 -69955 -109451 -162870 -143118 32787 -29293 -63274 34198 286235 212939
1922 212939 173255 99482 96101 -22478 -6377 -89369 169977 38815 -2183 -302901 -378830
1911 -378830 -197095 -59330 -83217 -16819 -73668 3542 -46500 -74353 107152 -119352 -84972
1900 -84972 -179216 -130518 -253825 -245323 -130672 -11673 -69043 -204733 -189135 -224054 -298439
1889 -298439 -254231 -116888 15952 -152804 -213096 -163432 119204 155976 -30782 37070 12903
1878 12903 -152428 -50256 -42405 -19616 -179859 -163712 8170 74131 6294 -2349 24287
1867 24287 53820 -71386 -136637 -10808 -136339 -352548 61416 120540 13922 -173795
1857 -173795 -44242 19314 -190480 -210107 -76293 1156 -25223 -104587 -47662 -62821 -31489
1846 -31489 8932 -113956 -127286 -45408 -44755 -87689 40443 -57628 -18561 163611 232491 160871
1834 160871 -15233 -136824 -205863 -107876 -45671 5220 137412 213621 232998 68906 -192695
1823 -192695 -155450 -208188 -183449 -75455 12119 61003 20219 63149 203358 287413 217083
1812 217083 125712 191461 128813 -90463 -29581 -14529 47579 114779 55952 226009 271744
1801 271744 59365 5924 -77873 -134459 -170817 -36121 30752 -11200 74402 -212282 -187060
1790 -187060 -51690 -51313 21652 91726 95701 7665 1985 14439 -133854 -147231 -83328 45480
1778 45480 -3122 -161378 -103188 -106458 -137703 -137668 -102599 -30594 8637 140538 143470 -45538
1766 -45538 15335 55921 92460 180230 263180 30263 -239172 -314036 -109338 -94633 34921
1755 34921 38376 45834 -97599 -101971 -103173 -40535 66352 117050 119026 -86124 -99702 -47345
1743 -47345 62434 -73931 -37951 115737 -124644 -79397 -9764 46904 -98935 -243317 -254135
1732 -254135 -211225 -215453 -239095 -230855 -157681 -171077 -20206 -1740 -165340 -107920 60592
1721 60592 -60243 -237253 -198453 80189 115620 -5528 -66730 -3851 -104364 -168302 -30092
1710 -30092 -117738 -258919 -86310 -14615 -91345 -46735 -225550 -346707 -92310 105881 -91954
1699 -91954 -192772 -29975 14640 -119987 -84988 56250 48744 -25272 21846 -121318 -249793
1688 -249793 -287144 -164899 -154683 -104742 -117326 -56316 -266436 -239004 -81755 -11323 -93422
1677 -93422 -106138 116454 -103497 -154856 -86173 -139404 2609 97174 241458 275650 217230
1666 217230 94987 39181 60338 75919 -99947 27781 135435 97603 68779 -60237 52947
1655 52947 -46466 -61086 -125660 -301133 -13777 -168939 -172175 -150622 -51914 -18606 -57301
1644 -57301 -72094 -268560 -64157 53651 -83153 10128 94401 68665 -74605 -65303 -89208
1633 -89208 -75149 126447 80796 -7422 56737 -29666 -24385 98961 85470 -12384 -155866
1622 -155866 -253877 -245145 -74385 -58578 -78225 115584 85932 29352 25165 -241996 47390
1611 47390 103807 101735 97348 82328 -5219 38711 -190817 -168325 24141 206884 147685 -87083
1599 -87083 -81247 35531 -95139 -167007 12394 -78020 -118550 -244769 -250543 -176655 -56998
1588 -56998 -44693 -151421 -277221 -116515 15951 75610 91325 156963 -20963 -152606 -282902
1577 -282902 -321275 -59262 49031 -84485 -164026 -82107 23483 -6383 31723 16079 83899
1566 83899 -72558 -224684 -377542 -585024 -443144 -241793 -28344 60007 102378 54957
1556 54957 118449 -26942 -144588 -157053 -119302 -313271 -369217 -193865 104179 118916 -271313
1545 -271313 -264126 -202539 -182081 -83299 125019 40720 -78396 -122731 -121953 -132339 50923 201674
1533 201674 117247 75196 -160090 -37786 96175 -124349 -228578 -104941 -171438 -148041
1523 -148041 56101 -36501 45858 19835 -95105 -216082 -212625 -203742 -92502 71406 63153
1512 63153 57554 -15529 106771 18820 -124315 -163148 -109550 -151628 -309378 -308967 -82494 -21331
1500 -21331 -301900 -202036 35746 85776 42227 -135284 -54028 -93975 -85614 -194 65207
1489 65207 18869 72159 113364 79100 14435 -35568 61975 168771 -36240 31796 -20243
1478 -20243 -21420 123682 -4236 36604 -39339 -231135 -126386 -235192 -80327 54098 196796
1467 196796 -33875 -233987 -29884 -10904 -244970 -206746 -133017 -167624 -171972 -125479 46239
1456 46239 32918 -51584 -102462 -154575 -136340 -167684 -63146 25976 -141830 -84509 -183227
1445 -183227 -234681 -357923 -116379 -88942 -191775 -305348 -286247 -196914 -118940 -95581 53594
1434 53594 -111020 52983 133244 160790 224028 113030 18413 114223 222674 205582 194861
1423 194861 85583 -24700 -190982 -223157 -244215 -179049 -55944 -150780 -62841 40602 -79563
1412 -79563 -101525 14113 51959 -62233 -260452 -414180 -480302 -268970 -67993 -10798 -80087
1401 -80087 -181208 -184104 -386651 -308949 -320838 -206130 -60926 -263677 -122644 13497 155403
1390 155403 -3969 57033 108395 -102648 -76081 -122033 -33610 82847 52333 -100695 -22108
1379 -22108 -49573 -46849 -198233 -12359 -16393 -108831 -108386 35364 164349 23774 28172 9219
1367 9219 -10044 -24101 110497 97486 166793 161708 78492 -127743 52344 72654 -5289 -76278
1355 -76278 25526 92771 89587 -17049 6520 40112 55376 1614 -26354 -50892 -404686
1344 -404686 -330858 -253091 -85538 -148444 -110532 -119118 -34388 -71715 -186569 -178367 -69835
1333 -69835 89347 -24650 -85239 93198 133237 120683 142460 47266 69124 173552 233229
1322 233229 93389 216739 315001 107404 6456 37958 106452 -46812 101779 124435
1312 124435 153323 54844 -66825 271514 146754 129492 21684 26118 103955 -27793 -65805
1301 -65805 97010 104543 25318 237793 39730 -89710 21408 -84631 -276265 -215946 -232008
1290 -232008 -39037 147266 382783 70333 -173307 49742 -12190 -140255 -82209 28517
1280 28517 -7588 -48928 -78150 -136665 -80629 -324874 -274939 -252894 -228523 -97731 -94782 -108634
1268 -108634 -39395 114877 51816 118031 348777 215111 47119 126138 31776 -39488 -53433
1257 -53433 29255 -95206 54540 -382 60064 7179 -38702 -253857 -225958 -8702 13633
1246 13633 95593 110993 89423 -62285 -55777 -150855 -141598 -9846 -60401 -153389 80042 219341
1234 219341 60627 -87592 -121756 -79733 -107972 -165418 -201684 -177259 -37302 -67523 -28008
1223 -28008 -5799 48948 17618 22785 -117252 -188841 -161880 -172843 -273934 -156714 -51943
1212 -51943 -90757 10065 -86181 -63523 141033 156584 -33520 44302 -30665 -4634 175218
1201 175218 -76023 -116958 -18336 -173751 -85703 -15132 -126450 -238232 -372491 -515752
1191 -515752 -181203 68880 81407 98094 224896 269585 31307 -165585 -49112 196244
1181 196244 240362 -2721 -33498 -42713 -95835 -34820 -97078 -54800 -94066 -78335 -33719 -43635
1169 -43635 128665 -46577 -217401 -232745 -73182 74126 -83862 -140311 152046 134297
1159 134297 -118379 -133513 -230376 -126216 -5418 -131579 -14622 194592 385799 174588
1149 174588 18101 85100 -25465 -2670 -47236 -9230 82058 196573 38015 69507 198852
1138 198852 67794 -20959 -6729 -27428 -126239 23771 -56236 49348 84829 78641 -87959
1127 -87959 -128190 -81569 -120599 -92343 -107032 -278134 -378874 -442476 -196826 -71369 -151
1116 -151 200894 -83126 -240563 -182531 -173604 -237958 -311881 -201561 -101202 -86603 -217788
1105 -217788 -260468 -229424 -209302 2300 -8306 91360 132749 -33880 -162531 -385386 -404693
1094 -404693 -200848 -225929 -304953 -455572 -184990 -142758 -107534 16851 -37530 -138605 -103852
1083 -103852 -176916 -100199 -73565 -202617 -336371 -309235 -266154 -78870 12856 84683 115441
1072 115441 123077 -20841 165700 431955 189850 25637 -44434 -130568 -162812 -105757 -86117
1061 -86117 26624 205231 192577 216246 159075 119871 29607 -50193 -45706 82411 136123
1050 136123 151758 140408 114911 -46925 -99398 -148166 -64278 -17639 132220 70711 58519
1039 58519 50433 19826 328826 155922 -21003 -14532 227239 180984 118409 103608 168724
1028 168724 163499 194396 194954 143281 -154463 -168330 -105517 -40903 126451 1827 -144047
1017 -144047 -72688 -1497 -40360 -166836 -73764 -33379 54738 -57406 -130237 128798 69517
1006 69517 103460 100296 129555 120711 -44045 -372016 -18804 169301 74269 -24029 36669
995 36669 105295 7235 -22132 -243983 -230726 -145444 -49716 -43473 55476 97594 171102 82502
983 82502 -3158 -72960 -131646 -364047 -281787 34395 178128 32772 -41268 -264407 -311450
972 -311450 -115947 -55800 -89068 -19346 -13634 85784 -9089 99963 191809 253299 70976
961 70976 -103229 -69927 -172996 -260811 -85541 -40686 46508 -34375 -19995 26680 23866 12179
949 12179 -55373 102063 -12409 71169 24602 139227 -46880 -19291 -50424 67489 108180
938 108180 -15407 -61097 91240 -15805 -107824 -40134 -141156 -151412 -55784 7909 -147143
927 -147143 -87622 -9349 46566 200389 103095 41698 73135 69787 50760 19120 5319 -61495
915 -61495 -14970 -128335 -67000 -208012 -163604 123308 -16790 -69977 -129833 -120577 -45055
904 -45055 -45071 -67306 15254 -57495 -119947 -183007 -175529 -96212 -34430 -51080 -308619 -39218
892 -39218 41228 -10173 92953 72224 64338 -45198 -21201 -35056 66114 104662 -26823
881 -26823 -234365 -244839 -37887 26882 -119773 22100 95806 165316 70453 -91361 146836
870 146836 185532 105399 -46310 -47418 -128367 -63946 -155532 -42668 93581 111121 71511
859 71511 -61653 -26026 -60207 -178765 -154569 24716 71399 13189 -17679 125460 237105
848 237105 144493 56835 26075 -86655 -72822 60345 74525 93181 -454 72641 141037
837 141037 -70375 -29164 -111459 -180922 -59997 -7849 -131668 97922 112678 91808 42168
826 42168 183229 118866 63739 72646 147225 86292 -144588 -88186 -277896 -212627 -105410
815 -105410 -203763 -106096 -136642 -97925 -279351 -97803 -45403 -104023 122225 144511 -101915
804 -101915 -161059 155750 48228 181193 115051 28304 230507 87262 183126 -18864 -13811
793 -13811 70022 -1585 8235 31588 -39194 117145 124280 21416 190971 113001 22634 -26320
781 -26320 64119 96721 291552 177004 -14690 -40314 -39722 -35281 2228 24242 200 -39708
769 -39708 -31448 95380 -42943 -120313 -75533 -166561 19244 -27982 19467 101396 196448 17639
757 17639 93051 37721 83836 95589 74810 42987 -196312 -219188 -126357 -180819 -117371 132872
745 132872 315708 155425 42861 122600 214458 112349 116298 6780 154246 232932 252427
734 252427 325252 57163 -122552 -30938 84188 64695 -284066 -330262 23777 -46384 10236
723 10236 275256 225014 73847 190538 132776 33682 92052 94574 -34316 -90786 -7234
712 -7234 7672 151358 109260 -49947 -67430 33336 60483 16558 -20297 -81468 -45289 -82138
700 -82138 -121479 -181757 -89388 -77396 -38332 70867 247282 39096 -134134 -221606 -48859
689 -48859 31930 50530 219962 264432 285254 60276 -38639 118105 25758 -48230 121952
678 121952 76700 23918 21996 44186 -49251 230744 191986 34998 -121828 25940 -58698
667 -58698 -257308 70304 50098 4821 129705 251909 -11913 -160511 -1962 231961
657 231961 131198 -27372 -145292 -177743 -362616 -189201 -135047 79393 -58189 -101062
647 -101062 -141269 -71079 -11073 55812 -91022 -20136 120779 -60240 -88501 65109 35879
636 35879 -50103 17917 141384 294877 182817 135463 296834 152739 230627 128612 95897
625 95897 54793 35287 87823 3782 -110390 96794 118130 -95081 -27307 -166202 -100746
614 -100746 -19669 159057 140856 -102362 -298776 -196838 -122275 -178683 24661 23566 66335
603 66335 259432 34225 125922 -105849 -39977 -146513 44161 117314 20878 -43884 155598
592 155598 140028 11181 -209993 -14799 271485 163514 103937 120929 193486 323687 166374
581 166374 11601 43172 1930 155666 22180 155408 109764 23897 -12817 -4926 60476
570 60476 6711 -16622 -117512 -175996 -195499 62894 167897 187200 290840 -2456 -22797
559 -22797 -35174 3162 194118 26853 -218154 27470 225478 108024 180205 214876 352124
548 352124 212269 36875 83473 107927 100754 15915 22145 100243 90766 39599 -52181 -48835
536 -48835 -105715 -114736 -61108 42184 -173274 5675 61487 130903 135077 131292 31906 63842
524 63842 -29641 73468 200803 -59156 -250722 -368456 -133320 124627 137082 127899 262947
513 262947 199138 297484 213476 196947 64335 68727 -61722 165594 80368 42565 86645
502 86645 193304 -30665 -50051 -60890 26640 10236 87716 106370 23045 37396 -145999
491 -145999 -50083 2357 5832 -73993 48631 78675 210591 128598 -23253 54666 34525
480 34525 4000 137718 97426 91551 112194 -11954 -38885 -10965 -61959 -65490 -3228 58030
468 58030 43600 -55723 -70692 118870 150823 38558 20153 117178 19935 -189262 -4598
457 -4598 -106826 -162030 -167552 -139413 -161718 -224583 -169246 135546 254733 -3739 -52152 -105714
445 -105714 -70748 -52101 86559 67699 101323 30781 -84415 -83229 -106851 -145864 -257555
434 -257555 -225818 -142498 -88561 -41465 60091 237783 84691 -169652 61668 139140 162710
423 162710 256171 182805 255211 196022 107161 15454 127013 135115 36523 99365 183642 180666
411 180666 149495 231891 40877 -84107 -22645 -12305 -48682 -22974 49532 12736 -10499
400 -10499 22374 176275 136296 12954 -20082 -227759 -157704 152847 -14355 -164711 125875
389 125875 173646 53559 63352 238854 171401 58739 34820 26035 -200885 -75684 231238
378 231238 201897 124739 -194349 -119612 88555 -48163 -62714 -10380 -155764 -202736 -134546
367 -134546 -75932 -172566 -162461 17672 124475 -35286 -70909 -46042 -157733 -92292 28094
356 28094 42952 1873 168144 117530 14434 56376 -129252 -124040 -137042 89614 153651
345 153651 111897 -120582 -156271 -141950 -95935 -183588 -225926 -122389 30130 38495 99346
334 99346 301251 345104 437865 333823 243641 124103 191924 112311 -16516 6754 -59301
323 -59301 84377 100033 -68393 -59425 15698 41744 -263455 -99590 80098 18576 19310 99156
311 99156 37849 -27997 -17563 25634 273845 189547 11073 23538 3575 11326 5108 54814
299 54814 -68793 122066 -63777 -16026 149218 226946 121969 -41838 -52090 56443 -71357
288 -71357 -53512 -48081 -98603 -229410 13585 110772 -52206 -69298 -91983 -186491 -110212 -26897
276 -26897 122758 309780 183784 378731 176878 161286 41241 29701 28345 40110 -85011
265 -85011 -36492 134947 77750 182145 -1627 -126893 54105 89416 61790 -50599 -240254
254 -240254 -220490 -107539 -283504 -211253 -139576 26828 -50994 77048 8274 -38918 -101171
243 -101171 -48378 -57907 -154018 -65044 -99625 -13388 -9574 89872 -62170 -168742 -168281 -163498
231 -163498 163291 51594 93095 158121 94860 14929 139209 246662 114207 108660 36990
220 36990 25325 3912 74022 -12729 -55212 -10445 -152910 -81114 -135 7066 -309667 -341999
208 -341999 -183136 -49626 188218 243137 331422 285601 135880 222016 108752 -173400 -154880
197 -154880 137355 197911 60990 167748 203819 118528 -79912 -239746 -261257 -213689 -267813
186 -267813 -139506 -65144 101956 55291 220305 178066 148883 174858 179240 100784 -2190
175 -2190 -87624 -52801 72713 -920 42805 173823 -1906 -61210 238915 115828 -75339
164 -75339 78132 21324 -170533 -129798 -3149 -25474 198714 212732 -44329 62525 140176
153 140176 -36696 -128790 -160100 -42262 -39435 -2142 -5321 30992 -5854 -70788 -159647 47370
141 47370 217360 150844 74117 185953 204697 125647 25833 -1125 -29400 21613 95760 -40267
129 -40267 -61790 -14214 99248 25614 -10053 -129128 -173164 -200286 -263665 -46243 11069
118 11069 -28495 -157310 -97482 120190 -25282 -56636 -20230 82837 27659 194729 117083
107 117083 188020 123160 132595 184942 103649 193432 179629 180072 144329 22605 -131456 3063
95 3063 -29184 33119 53384 -39338 -83226 198334 105282 -7466 79335 51017 78721 -24199
83 -24199 82794 23634 82946 5210 -21072 -105208 -135207 -190873 -74698 46667 -47892 3583
71 3583 90534 68020 5106 -4509 96507 -65541 -96825 126611 123898 -123226 4881 19032
59 19032 -21055 -95024 -46815 28893 65834 115997 -104029 -124515 74786 183866 202089 -25174
47 -25174 -45715 29557 88328 -55418 -115399 -24454 -151889 -134863 -39018 -90214 116700 189031
35 189031 92756 189486 119176 112899 97050 183322 109938 62276 158024 63970 -108375 -84382
23 -84382 -29749 40750 -46676 12816 118014 58621 1954 -81581 -9675 -77544 -16759 55001
11 55001 -14856 13425 56882 11495 58806 150741 -49281 80057 52636 50130 17169
0 17169
$$ Imaginary data points
##PAGE= N=2
##DATA TABLE= (X++(I..I)), XYDATA
16383 -3172248 -3144117 -3079729 -3122508 -3147845 -3091282 -2922149 -2930159 -2907084 -2843723 -2804564 -2640555
16372 -2640555 -2581950 -2483987 -2570460 -2470923 -2408508 -2402751 -2381226 -2322309 -2098766 -2228205 -2296555
16361 -2296555 -2183000 -2126842 -2030394 -1927048 -1891546 -1845984 -1789239 -1568140 -1593295 -1651845 -1639685
16350 -1639685 -1636643 -1647236 -1477473 -1334012 -1325634 -1373311 -1270363 -1182362 -1097459 -1284173 -1088708
16339 -1088708 -984900 -813171 -913930 -862061 -808640 -721515 -594884 -723450 -550338 -438902
16329 -438902 -341228 -498419 -434541 -534890 -579542 -548685 -509746 -501835 -416108 -289501 -185809
16318 -185809 -21945 10987 103699 164660 42641 14775 99321 145336 181362 95910 336429
16307 336429 343326 469073 531558 549293 634196 540980 705398 720198 710296 724176 717448 665758
16295 665758 849075 916714 904812 989835 927735 1059835 1176968 1195454 1166792 1299366 1345129
16284 1345129 1230980 1205957 1198109 1378216 1579313 1468810 1568057 1669724 1675008 1751626 1731519
16273 1731519 1798594 1843341 1784261 1777197 1766095 1824907 1999761 2071583 2107309 2138214 2032926
16262 2032926 2093115 2237861 2111565 2079872 2207878 2217176 2287720 2281852 2167511 2276262 2388524
16251 2388524 2509002 2538044 2495979 2524769 2596686 2546204 2375663 2584444 2586294 2671744 2892944
16240 2892944 2836160 2779299 2893226 2924674 2823909 2716232 2883581 2895018 2995993 3002960
16230 3002960 2947389 3065750 3039642 2966515 2952372 3226250 3271650 3249015 3332908 3219216 3042079
16219 3042079 3255402 3277635 3247307 3258785 3304481 3377164 3527031 3588902 3719018 3556764
16209 3556764 3445944 3385199 3439827 3517657 3845750 3711318 3539514 3547227 3531403 3646855
16199 3646855 3601169 3584742 3698860 3668764 3675156 3618622 3638675 3554693 3665610 3714168 3599733
16188 3599733 3662161 3909899 3979538 3994585 4019235 3871628 3919731 4042428 4002821 4004594 3990311
16177 3990311 4057579 4079397 4150284 4105302 3997098 4038310 4018511 4186885 4163572 4267465 4168589
16166 4168589 4091129 4374912 4409253 4299156 4259480 4022020 4293297 4181837 4024642 4035423
16156 4035423 4011154 4131208 4166500 4194093 4362582 4374806 4288683 4430166 4339532 4207366
16146 4207366 4304546 4348701 4532374 4285439 4327463 4367588 4381732 4356289 4334090 4335295 4374966
16135 4374966 4371623 4280365 4438684 4416471 4250594 4417797 4356798 4407993 4433992 4504140 4527480
16124 4527480 4601285 4356688 4529342 4671871 4542556 4678609 4386936 4448465 4410201 4369681
16114 4369681 4474067 4597749 4612243 4475152 4279524 4499252 4403093 4387573 4544560 4396256
16104 4396256 4608387 4586684 4700772 4761653 4624075 4648023 4509550 4580924 4609670 4518380
16094 4518380 4464971 4455587 4258643 4406254 4564858 4618682 4770080 4769882 4774286 4830736 4932971
16083 4932971 4733978 4736221 4628133 4539488 4815754 4661970 4833671 4868817 4916566 4787953
16073 4787953 4737125 4783308 4710195 4673485 4657544 4659608 4883541 4772615 4727305 4606080 4515072
16062 4515072 4623899 4801683 4698893 4643077 4664141 4571254 4664083 4525946 4495978 4469763
16052 4469763 4611332 4646825 4503032 4475479 4632511 4693010 4744646 4462651 4633631 4953350
16042 4953350 5052060 5028330 4954464 5209016 5193230 5043701 4894136 4681642 4716530 4597702
16032 4597702 4725746 4920501 4753817 4574698 4660551 4859135 4674169 4520326 4672049 4650054
16022 4650054 4829716 4663847 4586774 4864732 4868376 4737049 4631780 4607525 4715332 4715798 4815987
16011 4815987 4855138 4655950 4613049 4613289 4580999 4572212 4620207 4835055 4900137 4741940 4815525
16000 4815525 4849872 4787346 4811099 4927611 4838488 4886611 4854614 4775584 4784230 4970698 5192015
15989 5192015 4876028 4675193 4645806 4581166 4671741 4778826 4794811 4989136 4812650 4832376
15979 4832376 4975909 4789953 4842478 4768130 4834390 4821492 4775157 4730957 4774679 4796302 4812411
15968 4812411 4687393 4651483 4667643 4636043 4746673 4781748 4726988 4641210 4735897 4826713 4757407
15957 4757407 4772279 4740642 4852730 4904094 4746957 4634083 4771913 4687957 4783136 4837954
15947 4837954 4869901 4829242 4748427 4862643 4867419 4838340 4707082 4695775 4654432 4685842 4807583
15936 4807583 4985599 4955150 4843158 4614372 4979272 5041258 4896201 4877955 4734864 4779530
15926 4779530 4787397 4716780 4615224 4657275 4718406 4789972 4849847 4657669 4720881 4893691 4729768
15915 4729768 4582495 4441644 4541080 4851207 4897188 4873960 4868289 4967615 5032750 4920656 4715932
15904 4715932 4688327 4771358 4667332 4773101 4627640 4770487 4733069 4646452 4635529 4662675
15894 4662675 4709378 4740071 4936612 4866374 4829191 4820255 4696006 4895536 4816854 4620819 4691033
15883 4691033 4829137 5053290 4862887 4851545 4935526 4795371 4781782 4754962 4650546 4793680
15873 4793680 4634358 4798259 5006464 5069829 5028447 5083573 4844778 4776015 4709664 4678478
15863 4678478 4788205 4714431 4750267 4856249 4761680 4723244 4839704 4665603 4631716 4653455
15853 4653455 4782717 4800279 4772523 4701133 4736581 4817176 4797651 4803281 4766425 4698819 4972676
15842 4972676 4850779 4771832 4649236 4592394 4778042 4917828 4644131 4489869 4435133 4506618
15832 4506618 4827992 4754987 4607695 4650265 4942828 4749930 4679866 4774129 4767222 4661812
15822 4661812 4695571 4774493 4816690 4693196 4698706 4875983 4971206 4851164 4908780 4959562 4793175
15811 4793175 4777742 4813190 4919498 5068388 4939925 4854653 4885233 4917990 4965043 4903400 4936298
15800 4936298 5007526 4926366 5100512 5143656 4992186 4855337 4968779 5305547 5023784 4903179
15790 4903179 4919588 4814263 4951495 4944663 4907193 5053945 4924637 5057024 5005655 4947413
15780 4947413 4848252 4911531 4869285 4894143 4698065 4750984 4922841 4868476 4914743 5024260 4927354
15769 4927354 4642283 4822710 4978010 4871331 5040081 5013980 5038764 4991454 5119608 4979929
15759 4979929 4814130 4895459 4975488 5104711 4870677 4709643 4701980 4806151 4719724 4898047
15749 4898047 4665607 4766416 4899895 4904356 4809839 4821179 4889364 4921841 4899188 4835796 5019043
15738 5019043 5101302 4805742 4876307 5038705 5037660 4940958 4784507 4843039 4922338 4990322 5055652
15727 5055652 4897860 4926320 4895087 4911693 5034083 5095468 5045183 5100201 5110199 5112754 5106077
15716 5106077 5146947 5073941 4711921 4884725 5068469 5159404 5021691 4956738 5023196 5301648
15706 5301648 5200726 4832821 4850030 4909833 4829233 4947251 5042304 5131824 5091768 5013430 4853532
15695 4853532 4957040 5072695 5079835 5083673 4956681 5014330 4862238 4921448 5011076 5055728 4915883
15684 4915883 4972491 4961674 4799247 4892978 4973442 4861817 4901337 4954620 4942083 4998398 4939911
15673 4939911 5033273 5035989 4962252 4892155 4994002 5021286 5087590 4951571 5029485 4905287 4735249
15662 4735249 4855422 4848957 4778374 4823599 5006640 4870381 4732481 4912667 4915227 5013192 5111000
15651 5111000 5005945 4918637 4844156 4991507 4934578 5180693 5156120 5127702 5125244 5132632 4966452
15640 4966452 4866391 5098360 4910201 4837601 4965271 4908942 4977663 4938817 4893791 4912183
15630 4912183 4952904 4954935 4873917 4863488 4822747 5095777 5232023 5155864 5010988 5104307 5078902
15619 5078902 5208822 5109519 5021983 4958354 4805587 4733450 4789031 4912149 5001521 5130399
15609 5130399 5030677 5121325 5212524 5126901 4976875 4904429 4908028 5067588 5032226 5106134 4953119
15598 4953119 4900844 4782541 4867300 4776384 4857822 4960093 4862533 4907591 4832723 5041326 5135893
15587 5135893 5196560 5195890 5100525 4855941 4869706 4947604 5151524 5076070 5149620 5112979 5114585
15576 5114585 5163436 5093897 5049814 5094886 5362674 5124240 5086606 5063595 5035471 4976667 4884674
15565 4884674 4886131 5007878 5061828 4942749 5009449 4882028 5010933 5074190 4950195 4950499 5025628
15554 5025628 5012416 4989445 5022038 5064711 4961252 4876239 5092720 5009537 5081870 5011894 5049276
15543 5049276 5030659 4996949 4972371 5001093 4985886 4879618 5032355 5080802 5094375 5203860 5090553
15532 5090553 4858738 5057865 5248614 5195255 4912504 4968992 4885271 5025495 5217637 5124797
15522 5124797 5106254 5065644 5112956 5040909 5031880 4992754 5008068 5043405 5016903 4959757 4916284
15511 4916284 5101332 5026995 4926234 4848564 4758524 4763283 4961503 5197993 5295754 5231943 5206554
15500 5206554 5081601 4999299 4999729 5075204 5107682 4955336 4997114 4896179 4961942 4859408 4907361
15489 4907361 5115833 5230730 5189459 4931516 4991122 5114242 5266635 5113012 5024383 5030084
15479 5030084 5160664 5099580 5135545 5223267 4902129 4921025 5119595 5318642 5074881 4941603
15469 4941603 4885900 4966245 5002709 4927281 5044441 5162510 5083638 4997681 5099330 5106984 5109305
15458 5109305 5119963 5142196 5147257 5171476 5201103 5123510 5237332 5168728 5012162 5014837 5084877
15447 5084877 5272895 5223512 4937667 4905373 5008359 5104494 5326920 5249490 5111127 4993845
15437 4993845 4842271 4951277 4993463 4852474 4991549 5007201 5248242 5287682 4953386 4870135
15427 4870135 4925241 5020352 4949906 4784237 4894825 5132441 5042864 4924872 4971443 5034657
15417 5034657 4966905 4842408 4882818 5019988 5078375 5103590 5062252 5071820 4989429 4981328 5044776
15406 5044776 5184201 5076373 4940250 5010550 5124376 5095044 4838951 4906681 4927870 4997178
15396 4997178 4943679 5000656 5045352 5061962 4883351 5075071 5347395 5304637 5316298 5182930
15386 5182930 5303858 5238831 5310737 5073485 4965479 4987079 4950142 5130114 5265176 5213063
15376 5213063 5323417 5246961 5261162 5298428 5264189 5076607 5114348 5155883 5167334 5319152 5296888
15365 5296888 5133884 4961957 4926490 5115369 4962841 4826195 4951196 5098781 5076416 5074645
15355 5074645 5124180 5061049 5140585 5085510 5176320 5124468 5027914 5083083 5207576 5179033 5167175
15344 5167175 5153807 5133783 5039108 5054488 5130009 4993379 4991205 4865083 4833887 4958577 4993365
15333 4993365 5065743 5044918 5234881 5177335 4957690 5093310 5205568 4906190 5054058 4913007
15323 4913007 4893212 4939810 5129158 4995293 4834916 4883850 5044798 5070736 5152053 5081830
15313 5081830 4911148 5044955 5177946 5067961 5073791 5213843 5211140 5058120 5041988 5144380
15303 5144380 5135743 5059960 5119987 5078142 5094478 5102212 5180051 5121623 4958890 5160851 5258645
15292 5258645 5263929 5065104 5226376 5472342 5360880 5153176 5021618 4995693 5042298 5020604
15282 5020604 5160297 5188231 5068011 5175628 5089801 4975092 5020734 5098076 5196080 5346144
15272 5346144 5344980 5020648 5046386 5120949 5137331 5210164 5283219 5078327 4975225 4918759 4973320
15261 4973320 4987067 5138712 5246949 5187513 5026600 4924271 4960700 4989210 4816945 4883312
15251 4883312 5068580 5257085 5283958 5330762 5236611 5093270 4982003 5010852 5139490 5163639
15241 5163639 5154175 5254588 5253987 5134312 5099229 5259156 5185518 5276555 5276784 5302007 5194675
15230 5194675 5262680 5381018 5309334 5150011 5070508 5124481 5281782 5175245 5297649 5225626
15220 5225626 5214176 5385613 5260958 5362978 5422371 5326320 5287003 5432355 5419961 5295631
15210 5295631 5015453 4984800 5071965 5263132 5208348 5161705 5205437 5045912 4924372 5124854
15200 5124854 5082561 5312965 5288608 5140252 5181916 5198777 5218722 5286180 5202859 5291173 5440356
15189 5440356 5444594 5446204 5479033 5252165 5329832 5275275 5587667 5485140 5371428 5450461 5331174
15178 5331174 5201129 5204444 5170749 4998588 4831952 4856282 5278581 5406006 5328097 5314198
15168 5314198 5283793 5275585 5259338 5091008 5185630 5206052 5312097 5238000 5308053 5247434 5291497
15157 5291497 5283876 5153322 5086326 5130373 5228726 5295069 5171644 5412065 5563694 5391385
15147 5391385 5319576 5112100 5034576 5073196 5307477 5144256 5362760 5496130 5295710 5287780
15137 5287780 5351834 5106646 5139968 5342189 5277172 5325278 5208391 5077167 5204631 5280023
15127 5280023 5291046 5325685 5424112 5297648 5128596 5117220 5193485 5215228 5086278 5005938 5023202
15116 5023202 5246299 5209959 5179565 5105210 5264919 5170051 5226278 5325283 5185032 5050869
15106 5050869 5120577 5163586 5186765 5260927 5144277 5239140 5205381 5214568 5088211 5177483 5264615
15095 5264615 5219397 5279065 5301730 5133889 5375685 5395015 5367205 5432658 5420099 5311219 5060290
15084 5060290 5125041 5236202 5233140 5267714 5241193 4979313 5018559 5152649 5285778 5343918 5440044
15073 5440044 5486408 5379781 5243686 5307923 5274865 5179270 5165040 5267548 5339721 5200360
15063 5200360 5215015 5185653 5276291 5429845 5286370 5269906 5138599 5153434 5249401 5329001 5245913
15052 5245913 5323916 5277932 5275571 5302498 5398717 5452744 5312434 5267035 5217296 5221457 5165077
15041 5165077 5319455 5153617 5115992 5203625 5304697 5400077 5257414 5249859 5376397 5424588
15031 5424588 5335611 5313298 5109860 5010799 4996743 5174805 5262278 5230823 5272105 5157897 5024555
15020 5024555 5206800 5142684 5227075 5260342 5215314 4938176 5028284 5264135 5245136 5286110 5266186
15009 5266186 5254394 5346423 5433421 5413266 5637280 5387531 5289829 5254440 5281858 5301748 5320685
14998 5320685 5241931 5235890 5143088 5311385 5182210 5204109 5623341 5524260 5342196 5410019 5378557
14987 5378557 5402702 5294193 5299313 5309121 5284452 5198464 5078161 5141885 5179970 5307710 5363226
14976 5363226 5359447 5395850 5484686 5380382 5417670 5434410 5503287 5397602 5420500 5346998 5290592
14965 5290592 5263400 5323837 5444748 5435378 5537532 5399342 5430956 5545485 5443455 5566392
14955 5566392 5513971 5136527 5284686 5323084 5361758 5451614 5332156 5421941 5543572 5479144
14945 5479144 5404253 5427415 5384878 5500619 5625977 5252175 4981645 4943711 5141836 5278766
14935 5278766 5231921 5383823 5296025 5335147 5453125 5316605 5260181 5305913 5334338 5262157 5417711
14924 5417711 5454695 5389587 5303117 5267820 5351219 5359957 5230139 5501549 5515741 5426081 5494000
14913 5494000 5429718 5224193 5251086 5453429 5457291 5373407 5380279 5316469 5359412 5600333 5614480
14902 5614480 5482547 5428271 5306158 5055535 5218671 5333183 5368206 5245563 5422472 5396186
14892 5396186 5284278 5261731 5299875 5204902 5236328 5438864 5563193 5629657 5440768 5352053
14882 5352053 5371954 5389936 5267710 5156264 5457850 5560413 5405847 5300376 5236232 5363943
14872 5363943 5356297 5163948 4980921 5185165 5265446 5289793 5462128 5476959 5386748 5080225
14862 5080225 5242992 5331864 5394813 5556650 5565363 5473961 5396883 5454931 5356755 5455327 5643102
14851 5643102 5581781 5496123 5560096 5578083 5604296 5498305 5552347 5631452 5359552 5255598 5381208
14840 5381208 5470438 5382043 5402636 5521580 5268902 5396834 5463679 5587176 5694575 5581035
14830 5581035 5412494 5620901 5579812 5300208 5363257 5208288 5155584 5313242 5438392 5542527
14820 5542527 5497336 5456151 5597039 5684695 5519367 5184049 5253272 5312664 5464748 5463566 5381412
14809 5381412 5484868 5432335 5494084 5640206 5589681 5530465 5497440 5554909 5449388 5379128 5495805
14798 5495805 5583842 5449260 5237336 5153503 5217846 5277264 5312236 5370929 5488223 5389494 5386270
14787 5386270 5487139 5558747 5334573 5399529 5534933 5581930 5537730 5424511 5401309 5280084
14777 5280084 5190129 5337187 5402466 5357665 5322272 5315875 5341466 5475316 5418088 5381218 5325348
14766 5325348 5423702 5535279 5392258 5456510 5362762 5451672 5421633 5324349 5325498 5359545 5458105
14755 5458105 5528288 5610226 5512657 5533300 5592590 5584308 5689594 5596870 5667195 5571844 5536421
14744 5536421 5534156 5587239 5471698 5584722 5547683 5462210 5359050 5371215 5362844 5325573 5449540
14733 5449540 5433618 5459800 5511903 5386814 5362622 5439484 5419839 5635608 5707415 5418588 5470475
14722 5470475 5494692 5505251 5501879 5435820 5447730 5410982 5440203 5309576 5187753 5338412 5505287
14711 5505287 5350703 5318521 5420189 5600279 5590949 5557966 5431989 5228942 5117850 5454812
14701 5454812 5470052 5299476 5424940 5580817 5627696 5149628 5190656 5204022 5304046 5474355
14691 5474355 5432833 5474081 5541796 5452927 5624533 5658569 5579199 5586475 5488489 5443984 5484077
14680 5484077 5499928 5638488 5556454 5277871 5540541 5632198 5717709 5769655 5787390 5753129 5637726
14669 5637726 5619990 5454360 5462566 5417614 5268972 5359387 5575999 5486564 5525691 5554664 5692378
14658 5692378 5710478 5636689 5535185 5516445 5616245 5578432 5485907 5459580 5644427 5610697 5567069
14647 5567069 5385767 5451511 5448704 5543683 5662798 5654444 5749695 5691062 5619074 5636161 5514651
14636 5514651 5690490 5654490 5466743 5470313 5541116 5471500 5422100 5470653 5511063 5468873 5401711
14625 5401711 5400825 5569645 5552778 5458579 5335705 5506427 5628262 5522896 5532308 5504656 5586724
14614 5586724 5588695 5602463 5586368 5432205 5559453 5568102 5550843 5613757 5745968 5871086 5741295
14603 5741295 5782605 5853305 5715559 5681651 5702002 5609345 5557358 5657518 5512481 5473436 5584765
14592 5584765 5821606 5804725 5791646 5613780 5536266 5579316 5665280 5686502 5661903 5737367 5541821
14581 5541821 5496860 5536653 5713374 5742034 5645493 5605971 5586098 5636872 5776288 5808531 5859634
14570 5859634 5650316 5520734 5646023 5657883 5549601 5607256 5653845 5710726 5541086 5742151
14560 5742151 5720366 5607761 5540262 5479168 5633925 5575710 5460855 5422469 5410316 5385070 5578962
14549 5578962 5471827 5704664 5597736 5710019 5770470 5501752 5536523 5724263 5845482 5669987
14539 5669987 5667973 5599256 5563224 5429850 5536460 5557795 5581536 5589958 5757849 5744021 5624686
14528 5624686 5531659 5594015 5646254 5578012 5549892 5651259 5515689 5486520 5666338 5702949 5796939
14517 5796939 5713290 5497157 5626492 5634496 5622736 5541585 5519954 5486944 5364110 5616327 5780676
14506 5780676 5773177 5654020 5423590 5490608 5478452 5727787 5610735 5559150 5584321 5587476 5743625
14495 5743625 5660364 5680212 5789990 5870108 5754130 5705839 5469923 5462267 5585368 5696393
14485 5696393 5758886 5485062 5590872 5654884 5549367 5466457 5491350 5503075 5519572 5636921
14475 5636921 5663708 5841956 5939597 5867806 5820369 5939049 5840282 5752838 5447176 5693975
14465 5693975 5764167 5567839 5562997 5506833 5453238 5445320 5375041 5769555 5858843 5739138 5749760
14454 5749760 5620477 5677989 5750183 5524065 5440138 5447325 5400704 5466446 5349288 5509129 5666090
14443 5666090 5537752 5562866 5624623 5745264 5823122 5935940 5880914 5678306 5600793 5661754
14433 5661754 5657761 5498452 5523001 5716036 5645017 5658364 5833456 5759785 5800604 5606733 5644201
14422 5644201 5732473 5819114 5833685 5642846 5710770 5614305 5598434 5467032 5444707 5639380 5728626
14411 5728626 5511829 5630095 5741520 5414925 5416892 5504601 5479637 5729963 5778459 5786482 5781600
14400 5781600 5641660 5671831 5678745 5638153 5544151 5590218 5722084 5749213 5711051 5579174 5654320
14389 5654320 5654866 5673942 5709914 5594979 5766471 5843100 5878228 5738151 5666324 5756393 5860982
14378 5860982 5903885 5836892 5637783 5599658 5900108 5849913 5730958 5792609 5851492 5919004 5772293
14367 5772293 5881455 5653424 5513226 5621648 5768412 5794211 5862687 5632992 5801130 5750295
14357 5750295 5790476 5768590 5495372 5535284 5691569 5784821 5688165 5788820 5843505 5925838 5674522
14346 5674522 5620966 5658602 5800100 5743847 5651051 5612537 5821652 5826044 5963221 5796810 5739599
14335 5739599 5792417 5959024 5915613 5774808 5718168 5810814 5811534 5660091 5803686 5728169 5780443
14324 5780443 5807234 5838548 5936482 6147553 5838517 5770807 5911671 5914943 5754447 5552881
14314 5552881 5567296 5639073 5672072 5881839 6175000 5918012 5887467 5903205 5777993 5904686
14304 5904686 5793846 5955407 6080896 5871880 5968441 5976103 5815248 5849278 5783930 5872454
14294 5872454 5730393 5660755 5715265 5733373 5648713 5795841 5873258 5840463 5922305 6021001 5890851
14283 5890851 5699970 5792509 6050355 5962183 5891728 5762951 5704854 5775584 5915799 6041285
14273 6041285 5906604 5853064 5899676 5850722 5728913 5660997 5650026 5823426 5790110 6081227
14263 6081227 5972160 5864762 5929798 5880449 5741543 5571436 5547240 5719274 5564387 5486979
14253 5486979 5606823 5742640 5872369 5769635 5917928 5681513 5821447 5972294 5937673 5731755
14243 5731755 5576127 5718667 5783115 5748546 5538608 5643834 5771834 5641458 5766416 5930761
14233 5930761 5770386 5735901 5916519 5819268 5734851 5830820 5942975 5986042 5769704 5746092
14223 5746092 5803481 5853078 5844020 5779451 5685144 5811885 5679003 5819583 5819012 5823819 5813424
14212 5813424 5725825 5650779 5813324 6003139 5950054 5965664 5824584 5854362 5913881 6008552 5962655
14201 5962655 5744912 5791003 5819231 5746268 5606150 5665221 5631271 5605210 5910289 5947597 5702734
14190 5702734 5894245 5921818 5993679 5897819 5635623 5591322 5770870 5769773 5664727 5898469
14180 5898469 6052389 6131656 6068169 5923613 5808038 5997459 5877695 5935526 6068900 6102979
14170 6102979 6018640 6078593 5944931 5877237 5923446 5970578 6003171 5910998 5988887 5897207 5870834
14159 5870834 5782733 5854566 5933857 5981090 5996239 6095522 5977950 5803341 5892112 5865045 5849501
14148 5849501 5847172 6004590 5925357 5933737 5904355 5749007 6020690 5825507 5634392 5643538 5802063
14137 5802063 5881855 5803920 5958216 5908290 6096229 5942085 5843658 5799387 5867275 5961398 5898286
14126 5898286 5811045 5916086 5729739 5768048 5856003 5906395 5986132 5954233 5953730 5947152 5823982
14115 5823982 6010184 6112572 6111327 5936943 5873778 6038477 6047892 6206863 5975200 5818930
14105 5818930 5598259 5711141 5847906 5739217 5967758 6143820 6056129 6016665 5888917 5786964
14095 5786964 5801950 5764608 5762405 5879121 6131686 6124087 5851118 5730113 5856988 5951183 5975091
14084 5975091 6103630 6077140 6215052 6149184 5977281 5916885 5992316 5904985 5854132 5906538 6005972
14073 6005972 6011878 5867395 5857319 5763126 5804285 5949109 5965527 6126887 6168340 6087070 5996401
14062 5996401 5912875 5731716 5574851 5869508 6091989 5947228 6020379 5923710 5953234 6012424
14052 6012424 6069534 6124478 5962418 6033328 5994298 6131626 6097664 5755997 6049741 6051071 5831880
14041 5831880 5907512 5871102 5833648 5788064 5729417 5672964 5801371 5676124 5650125 5781470 5912370
14030 5912370 6186565 6145592 6048126 6024487 5782001 5854135 5838705 5892927 5847748 5641777 5832882
14019 5832882 5914146 6040985 6122634 5993755 5961460 5961952 5976699 6030420 6020096 6005172 6046611
14008 6046611 6187298 6308777 6035267 5806739 6007945 6276166 6196201 5973456 6025407 6016883
13998 6016883 5977230 5814392 5741026 5920037 5877267 6173692 6223804 6195987 6199073 6088225 6155759
13987 6155759 6202824 6151639 6123539 5996675 5964145 5915301 5973512 6045887 6023046 5938670 5932732
13976 5932732 5933083 5929892 6177400 6105372 6065689 6077586 6038314 6047437 5993309 5997111 5958464 5909015
13964 5909015 5936141 5805728 5951841 6148235 6080975 6080278 6090217 5827253 5996946 6069063 6087607
13953 6087607 6128985 6182703 6036263 5996510 5975518 5981376 5987760 5933230 5991318 5992719 6070301 6139666
$$ [...]
##END NTUPLES=NMR SPECTRUM
##END=
