##TITLE=1H_CG-1233
 200.13Hz, DMSO-d6CCl4.
 8 sc
 26.6.2026
##JCAMPDX= 6.0         $$ Bruker NMR JCAMP-DX V2.0
##DATA TYPE= NMR SPECTRUM
##DATA CLASS= NTUPLES
##ORIGIN= UXNMR, Bruker Analytische Messtechnik GmbH
##OWNER= pz
$$ XWIN-NMR		Version 3.5
$$ Fri Jun 26 13:09:46 2026 Russian Standard Time (UT+4h)  she@DPX200
##.OBSERVE FREQUENCY= 200.1313
##.OBSERVE NUCLEUS= ^1H
##.ACQUISITION MODE= SIMULTANEOUS
##.ACQUISITION SCHEME= undefined
##.AVERAGES= 8
##.DIGITISER RES= 18
##SPECTROMETER/DATA SYSTEM= spect
##.PULSE SEQUENCE= zg30
##.SOLVENT NAME= DMSO
##.SHIFT REFERENCE= (INTERNAL, DMSO, 0, 15.5001)
##AUDIT TRAIL= $$ (NUMBER, WHEN, WHO, WHERE, WHAT)
$$ ##TITLE= Audit trail, XWIN-NMR		Version 3.5
$$ ##JCAMPDX= 5.01
$$ ##ORIGIN= Bruker BioSpin GmbH
$$ ##OWNER= she
$$ F:/spectra/data/she/nmr/H-C/1/pdata/1/auditp.txt
$$ ##AUDIT TRAIL=  $$ (NUMBER, WHEN, WHO, WHERE, WHAT)
(   1,<2026-06-26 13:08:27.43 +0400>,<she>,<DPX200>,
      <created by zg, POWCHK disabled, PULCHK disabled
       configuration hash MD5:
       00 E9 B6 7A A2 85 ED C7 34 08 36 98 17 FE 4E 26
       data hash MD5: 16K
       74 6E C3 5F 29 E1 5B 63 7A 2C B3 98 7A 1E 3E 4D>)
(   2,<2026-06-26 13:08:29.79 +0400>,<she>,<DPX200>,
      <Start of raw data processing
       efp BC_mod = 2 LB = 0.25 FT_mod = 6 PKNL = 1 PHC0 = -4231.226 PHC1 = 22.5923 SI = 16K 
       data hash MD5: 16K
       09 BE 96 C3 13 0C 8C 1B 15 CF CD A8 A0 90 82 60>)
(   3,<2026-06-26 13:08:57.73 +0400>,<she>,<DPX200>,
      <pk PHC0 = 14.84755 PHC1 = -15.8 
       data hash MD5: 16K
       6E 04 71 AE 1F B6 BA B6 1D 3F A8 E0 3C 14 5B D5>)
(   4,<2026-06-26 13:09:01.51 +0400>,<she>,<DPX200>,
      <abs ABSG = 5 
       data hash MD5: 16K
       9F 21 75 5D BF 56 EF 1F 16 9A F4 FF 2A 4E 8A A3>)
$$ ##END=
$$ 
$$ hash MD5
$$ 5F 80 93 00 69 DA 17 BC D5 FB 0D 56 F2 E4 E3 E1
##$RELAX= 
##$RELAX= 
##$RELAX= 
##$RELAX= 
##$RELAX= 
##$RELAX= 
$$ Bruker specific parameters
$$ --------------------------
##$DU= <F:/spectra>
##$EXPNO= 1
##$NAME= <H-C>
##$PROCNO= 1
##$TYPE= <nmr>
##$USER= <she>
##$AMP= (0..31)
100 100 100 100 100 100 100 100 100 100 100 100 100 100 100 100 100 100 
100 100 100 100 100 100 100 100 100 100 100 100 100 100 
##$AQSEQ= 0
##$AQ_mod= 1
##$AUNM= <au_zg>
##$AUTOPOS= <>
##$BF1= 200.13
##$BF2= 200.13
##$BF3= 200.13
##$BF4= 200.13
##$BF5= 200.13
##$BF6= 200.13
##$BF7= 200.13
##$BF8= 200.13
##$BYTORDA= 1
##$CFDGTYP= 0
##$CFRGTYP= 5
##$CHEMSTR= <none>
##$CNST= (0..31)
1 1 145 1 1 1 1 1 1 1 1 1 1 1 1 1 1 1 1 1 1 1 1 1 1 1 1 1 1 1 1 1 
##$CPDPRG= <>
##$CPDPRG1= <>
##$CPDPRG2= <>
##$CPDPRG3= <>
##$CPDPRG4= <mlev>
##$CPDPRG5= <mlev>
##$CPDPRG6= <mlev>
##$CPDPRG7= <mlev>
##$CPDPRG8= <mlev>
##$CPDPRGB= <>
##$CPDPRGT= <>
##$D= (0..31)
0 0.7 0 0 0 0 0 0 0 0 0 0.03 0 0 0 0 0 0 0 0 0 0 0 0 0 0 0 0 0 0 0 0 
##$DATE= 1782464906
##$DBL= (0..7)
120 120 120 120 120 120 120 120 
##$DBP= (0..7)
150 150 150 150 150 150 150 150 
##$DBP07= 0
##$DBPNAM0= <>
##$DBPNAM1= <>
##$DBPNAM2= <>
##$DBPNAM3= <>
##$DBPNAM4= <>
$$ [...]
##$SUBNAM3= <"">
##$SUBNAM4= <"">
##$SUBNAM5= <"">
##$SUBNAM6= <"">
##$SUBNAM7= <"">
##$SUBNAM8= <"">
##$SUBNAM9= <"">
##$SW= 18.0517328524113
##$SWIBOX= (0..15)
0 0 2 0 0 0 0 0 0 0 0 0 0 0 0 0 
##$SW_h= 3612.71676300578
##$TD= 16384
##$TD0= 1
##$TE= 0
##$TE2= 300
##$TE3= 300
##$TEG= 300
##$TL= (0..7)
0 120 120 120 120 120 120 120 
##$TP= (0..7)
150 150 150 150 150 150 150 150 
##$TP07= 0
##$TPNAME0= <>
##$TPNAME1= <>
##$TPNAME2= <>
##$TPNAME3= <>
##$TPNAME4= <>
##$TPNAME5= <>
##$TPNAME6= <>
##$TPNAME7= <>
##$TPOAL= (0..7)
0.5 0.5 0.5 0.5 0.5 0.5 0.5 0.5 
##$TPOFFS= (0..7)
0 0 0 0 0 0 0 0 
##$TUNHIN= 0
##$TUNHOUT= 0
##$TUNXOUT= 0
##$USERA1= <user>
##$USERA2= <user>
##$USERA3= <user>
##$USERA4= <user>
##$USERA5= <user>
##$V9= 5
##$VALIST= <valist>
##$VCLIST= <CCCCCCCCCCCCCCC>
##$VD= 0
##$VDLIST= <DDDDDDDDDDDDDDD>
##$VPLIST= <PPPPPPPPPPPPPPP>
##$VTLIST= <TTTTTTTTTTTTTTT>
##$WBST= 1024
##$WBSW= 4
##$XGAIN= (0..3)
0 0 0 0 
##$XL= 0
##$YL= 0
##$YMAX_a= 225192
##$YMIN_a= -203042
##$ZGOPTNS= <>
##$ZL1= 120
##$ZL2= 120
##$ZL3= 120
##$ZL4= 120
##$ABSF1= 15.50449
##$ABSF2= -2.547359
##$ABSG= 5
##$ABSL= 3
##$ALPHA= 0
##$AQORDER= 0
##$ASSFAC= 0
##$ASSFACI= 0
##$ASSFACX= 0
##$ASSWID= 0
##$AUNMP= <proc_1d>
##$AZFE= 0.1
##$AZFW= 0.1
##$BCFW= 0
##$BC_mod= 2
##$BYTORDP= 0
##$COROFFS= 0
##$CY= -3
##$DATMOD= 1
##$DC= 0
##$DFILT= <>
##$DTYPP= 0
##$F1P= 0
##$F2P= 0
##$FCOR= 1
##$FTSIZE= 16384
##$FT_mod= 6
##$GAMMA= 0
##$GB= 0
##$INTBC= 1
##$INTSCL= 3.241238e-09
##$ISEN= 128
##$LB= 0.25
##$LEV0= 0
##$LPBIN= 0
##$MAXI= 10000
##$MC2= 0
##$MEAN= 0
##$ME_mod= 0
##$MI= 1.114404
##$NCOEF= 0
##$NC_proc= -6
##$NLEV= 6
##$NOISF1= 3.799351
##$NOISF2= 2.8
##$NSP= 0
##$NTH_PI= 0
##$NZP= 0
##$OFFSET= 15.50009
##$PC= 1
##$PHC0= -4216.378
##$PHC1= 6.7923
##$PH_mod= 1
##$PKNL= yes
##$PPARMOD= 0
##$PSCAL= 0
##$PSIGN= 0
##$REVERSE= no
##$SF= 200.1300043259
##$SI= 16384
##$SIGF1= 3
##$SIGF2= 2
##$SINO= 0.751879
##$SIOLD= 32768
##$SREGLST= <19F.Aceton>
##$SSB= 0
##$STSI= 16384
##$STSR= 0
##$SW_p= 3612.71676300578
##$SYMM= 0
##$S_DEV= 0
##$TDeff= 16384
##$TDoff= 0
##$TI= <>
##$TILT= no
##$TM1= 0
##$TM2= 0
##$TOPLEV= 0
##$USERP1= <user>
##$USERP2= <user>
##$USERP3= <user>
##$USERP4= <user>
##$USERP5= <user>
##$WDW= 1
##$XDIM= 16384
##$YMAX_p= 304765940
##$YMIN_p= -529480
$$ End of Bruker specific parameters
$$ ---------------------------------
##NTUPLES= NMR SPECTRUM
##VAR_NAME=  FREQUENCY,     SPECTRUM/REAL,   SPECTRUM/IMAG
##SYMBOL=    X,             R,               I
##VAR_TYPE=  INDEPENDENT,   DEPENDENT,       DEPENDENT
##VAR_FORM=  AFFN,          ASDF,            ASDF
##VAR_DIM=   16384,         16384,           16384
##UNITS=     HZ,            ARBITRARY UNITS, ARBITRARY UNITS
##FACTOR=    0.220516191357247, 1,           1
##FIRST=     3102.03300778289, 0,            0
##LAST=      -510.683755222894, 0,           0
##MIN=       -510.683755222894, -529480,     0
##MAX=       3102.03300778289, 304765940,    0
$$ Real data points
##PAGE= N=1
##DATA TABLE= (X++(R..R)), XYDATA
$$ [...]
$$ plain form
9499 153519 146719 71154 166772 122384 162438 338722 268836 383219 493071 553448 523101
9488 523101 548833 573358 637355 722457 781642 862594 681119 792603 854644 673661 618218
9477 618218 566725 443863 370795 334673 365171 350851 126170 210893 298343 131519 115988
9466 115988 225936 192357 316607 293403 198486 182013 181115 176224 90423 -59069 121444
9455 121444 210800 209109 96547 90094 106554 36971 28773 43086 152901 24945 15751 92813
9443 92813 158313 5806 -2954 130795 191299 75017 9171 133522 66875 50052 -25110
9432 -25110 -43352 -27861 32336 -65652 -22154 170043 200779 164827 96032 -111053 -66640
9421 -66640 -150841 -156998 -6341 111694 114612 142276 120734 78971 -23221 -67150 -127920 -198322
$$ packed form
9499A53519o800p5565R5618m4388M0054J76284o9886J14383J09852O0377l0347
9488E23101K5732K4525O3997Q5102N9185Q0952j81475J11484O2041j80983n5443
9477F18218n1493j22862p3068l6122L0498j4320k24681Q4723Q7450j66824j5531
9466A15988J09948l3579J24250k3204r4917j6473q98m891q5801j49492J80513
9455A21444Q9356j691j12562o453J6460o9583q198J4313J09815j27956r194P7062
9443I2813O5500j52507q760J33749O0504j16282o5846J24351o6647j6823p5162
9432b5110j8242J5491O0197r7988M3498J92197L0736l5952o8795k07085M4413
9421f6640q4201o157J50657J18035K918K7664k1542m1763j02192m3929o0770p0402
$$ plain form
9409 -198322 -77655 -32709 143138 102735 -17104 -145363 -190672 -154934 -45824 -18179 117696
9398 117696 110123 170098 189930 150497 24384 -71143 -49000 -13700 127156 229318 213620
9387 213620 18510 -183804 -214457 -189289 -183006 -177597 -12804 -44686 14791 19362 1584 58432
9375 58432 -71634 -38464 61961 60004 48454 68580 47149 -10922 -134085 -197104 -107577
9364 -107577 -129068 -9173 68437 112704 102987 118612 10773 7070 83816 151335 109202 198316
9352 198316 186836 178873 223920 109602 -23693 -106987 -50463 86812 8836 107378 207726
9341 207726 48913 -86277 -83006 63464 97518 139603 154080 141166 198187 143647 -30820
9330 -30820 -140406 -99504 -37357 -111000 116167 215096 270437 130238 -114194 -156026 -224903
$$ packed form
9409a98322J20667M4946J75847m0403j19839j28259m5309L5738J09110K7645J35875
9398A17696p573N9975J9832l9433j26113r5527K2143L5300J40856J02162j5698
9387B13620j95110k02314l0653K5168O283N409J64793l1882N9477M571j7778N6848
9375E8432j30066L3170J00425j957j1550K0126k1431n8071j23163o3019Q9527
9364a07577k1491J19895P7610M4267r717J5625j07839l703P6746O7519m2133Q9114
9352A98316j1480p963M5047j14318j33295q3294N6524J37275p7976R8542J00348
9341B07726j58813j35190L271J46470L4054M2085J4477j2914N7021n4540j74467
9330c0820j09586M0902O2147p3643K27167R8929N5341j40199k44432m1832o8877
$$ plain form
9319 -224903 -188029 -41518 2337 -30430 -14327 76859 -2484 -86760 -110191 -45423 -33949
9308 -33949 12058 66385 -38825 -124937 -63427 -116314 -143278 -125923 -108723 11091 -91919
9297 -91919 -26114 28044 22919 80994 119170 1921 327 30103 96315 114909 87430 169196
9285 169196 62654 108389 -23047 -2463 11247 93502 47705 24618 -35382 -239657 -138210
9274 -138210 -92492 -138514 78498 33183 119341 91970 42062 14280 -58479 -36820 52888
9263 52888 54411 31939 -24186 -196353 -112246 92556 -11229 -91307 84994 90707 -64595
9252 -64595 -32920 -137559 -99174 -20626 136890 72964 110161 221553 10799 66536 16039
9241 16039 67150 -46951 -13092 46925 36091 81511 172767 -1867 -79604 -189196 -101093
$$ packed form
9319b24903L6874J46511M3855l2767J6103R1186p9343q4276k3431O4768J1474
9308c3949M6007N4327j05210q6112O1510n2887k6964J7355J7200J19814j03010
9297i1919O5805N4158n125N8075L8176j17249j594K9776O6212J8594k7479Q1766
9285A69196j06542M5735j31436K0584J3710Q2255m5797k3087o0000k04275J01447
9274a38210M5718m6022K17012m5315Q6158k7371m9908k7782p2759K1659Q9708
9263E2888J523k2472n6125j72167Q4107K04802j03785q0078J76301N713j55302
9252f4595L1675j04639L8385P8548J57516o3926L7197J11392k10754N5737n0497
9241A6039N1111j14101L3859O0017j0834M5420R1256j74634p7737j09592Q8103
$$ plain form
9230 -101093 4006 -16811 64807 70008 -5504 34383 -32408 -2438 111879 123359 158660
9219 158660 135081 103427 118271 10379 -43763 -75897 -25656 29892 -26522 19641 80730
9208 80730 37913 40232 82310 -29996 17321 117731 166633 231020 192015 296281 85862
9197 85862 -37543 41160 -42801 18978 33358 19701 55004 34762 35037 939 -49745 -91240
9185 -91240 -167566 -75322 -9545 44376 111618 221476 73877 81260 77330 88186 88495 132437
9173 132437 168830 215150 260573 199881 161799 150629 206388 296387 140202 28318 6993
9162 6993 -17547 18609 -70065 -48694 -42763 -73905 27514 30941 -33074 3302 -117041 -103674
9150 -103674 -153323 -221590 -144337 43199 87349 15941 54014 30393 -12562 -21877 -12568 66365
$$ packed form
9230a01093J05099k0817Q1618N201p5512L9887o6791K9970J14317J1480L5301
9219A58660k3579l1654J4844j07892n4142l2134N0241N5548n6414M6163O1089
9208H0730m2817K319M2078j12306M7317J00410M8902O4387l9005J04266k10419
9197H5862j23405P8703q3961O1779J4380j3657L5303k0242K75l4098n0684m1495
9185i1240p6326R2244O5777N3921O7242J09858j47599P383l930J0856L09M3942
9173A32437L6393M6320M5423o0692l8082j1170N5759Q9999j56185j11884k1325
9162F993k4540L6156q8674K1371N931l1142J01419L427o4015L6376j20343J3367
9150a03674m9649o8267P7253J87536M4150p1408L8073k3621m2955r315R309P8933
$$ plain form
9138 66365 30040 73660 71618 65366 106305 155035 -9557 29576 35459 130330 171491 146979
9126 146979 93511 5716 7002 73367 38540 67098 57122 33545 -78929 -140170 44785 112548
9114 112548 8331 -68404 42222 -68730 -172862 -188008 -74872 -185458 -169049 -67161
9104 -67161 107593 200479 195537 56231 -47188 -25079 41521 13883 16426 96959 26696 -95392
9092 -95392 -162495 -153570 -264 -1902 30177 -33862 -123488 -54421 -185380 -128071 153754 75231
9080 75231 68213 141651 119483 31392 -59287 32054 -49119 -23450 19725 -27588 -54846 -35387
9068 -35387 60422 71352 38198 -12802 54461 -21020 15554 -60157 -33565 15019 40203 107479
9056 107479 14186 -90056 120427 185944 122611 57354 -55308 93670 -43826 18480 172582
$$ packed form
9138F6365l6325M3620k042o252M0939M8730j64592L9133N883R4871M1161k4512
9126A46979n3468q7795J286O6365l4827K8558r976k3577j12474o1241J84955O7763
9114A12548j04217p6735J10626j10952j04132j5146J13136j10586J6409J01888
9104f7161J74754R2886m942j39306j03419K2109O6600k7638K543Q0533p0263j22088
9092i5392o7103Q925J53306j638L2079o4039q9626O9067j30959N7309K81825p8523
9080G5231p018P3438k2168q8091r0679R1341q1173K5669M3175m7313k7258J9459
9068c5387R5809J0930l3154n1000O7263p5481L6574p5711K6592M8584K5184O7276
9056A07479r3293j04242K10483O5517o3333o5257j12662J48978j37496O2306J54102
$$ plain form
9045 172582 6248 -74282 -156639 -93316 117379 99394 7469 -8216 108708 12232 -154485
9034 -154485 -136518 44130 110367 46543 89558 261146 237871 242144 -22860 -33184 -37071
9023 -37071 -63446 32305 160859 81836 43350 82568 57446 5014 -65021 53040 103209
9012 103209 38947 46757 139342 144610 162683 66360 -22286 23046 -83395 -58461 15270 41690
9000 41690 20598 -36648 6473 14628 -16755 -118481 -17799 131460 205944 121003 76204
8989 76204 43531 9515 -26303 27235 59912 77675 132577 128056 19933 32243 128532 46138
8977 46138 39944 74252 226456 204961 74931 38373 74410 19454 -108582 -23108 13149
8966 13149 118657 70209 25942 -4491 -1300 -101975 -201459 93364 243962 206041 112469
$$ packed form
9045A72582j66334q0530q2357O3323K10695j7985r1925j5685J16924r6476j66717
9034a54485J7967J80648O6237o3824M3015J71588k3275M273k65004j0324l887
9023c7071k6375R5751J28554p9023l8486L9218k5122n2432p0035J18061N0169
9012A03209o4262P810R2585N268J8073r6323q8646M5332j06441K4934P3731K6420
9000D1690k1092n7246M3121Q155l1383j01726J00682J49259P4484q4941m4799
8989G6204l2673l4016l5818N3538L2677J7763N4902m521j08123J2310R6289q2394
8977D6138o194L4308J52204k1495j30030l6558L6037n4956j28036Q5474L6257
8966A3149J05508m8448m4267l0433L191j00675r9484K94823J50598l7921r3572
$$ plain form
8955 112469 46525 -22953 -85579 4915 -83451 82909 219477 247865 267636 301720 169042
8944 169042 128077 42942 822 4864 60366 33983 68770 33316 -32669 -108656 -198389 -105131
8932 -105131 -39571 -14526 -70158 26213 74019 119210 151273 91033 49742 -8688 -34720 -4730
8920 -4730 22026 114448 138988 119158 -21569 -55545 -26764 -70666 -4423 137786 79005 -57687
8908 -57687 -150947 39696 -64956 -62805 11960 79806 84467 20757 84469 98916 184834 137193
8896 137193 240806 142363 -32742 20454 96474 -46798 -66949 -35086 -14814 33022 -15086
8885 -15086 73013 -12804 26614 65644 70230 48563 58941 71579 54755 144667 78446 23682
8873 23682 -112887 -192922 -95092 -177926 -753 39587 71060 170548 92032 -67722 -142531
$$ packed form
8955A12469o5944o9478o2626R0494q8366J66360J36568K8388J9771L4084j32678
8944A69042m0965q5135m2120M042N5502k6383L4787l5454o5985p5987q9733R3258
8932a05131O5560K5045n5632R6371M7806M5191L2063o0240m1291n8430k6032K9990
8920d730K6756R2422K4540j9830j40727l3976K8781m3902O6243J42209n8781j36692
8908e7687r3260J90643j04652K151P4765O7846M661o3710O3712J4447Q5918m7641
8896A37193J03613r8443j75105N3196P6020j43272k0151L1863K0272M7836m8108
8885a5086Q8099q5817L9418L9030M586k1667J0378J2638j6824Q9912o6221n4764
8873B3682j36569q0035R7830q2834J77173M0340L1473R9488p8516j59754p4809
$$ plain form
8862 -142531 -97874 94192 40875 63945 29500 18570 -61797 15471 57289 55022 89047 186313
8850 186313 288666 249175 59133 -123916 44422 105717 60619 72990 79731 179609 234639
8839 234639 107771 59715 25738 -3409 -29841 -30878 -183332 -44872 123461 182263 137094
8828 137094 37581 -3893 16280 10992 -56396 -67273 74660 89212 133417 125215 92495 3008
8816 3008 -121949 14598 3307 -110248 30470 153908 258433 161780 -24686 -32956 -60559
8805 -60559 -76575 43090 214931 305865 218352 123558 37576 110155 -11780 61685 9646
8794 9646 67724 51881 196242 191301 57730 5519 -31409 -25304 -34393 97294 189274 79803
8782 79803 58457 111409 91772 59074 -97010 -92356 24336 223966 317539 240617 97091
$$ packed form
8862a42531M4657J92066n3317K3070l4445j0930q0367P7268M1818k267L4025R7266
8850A86313J02353l9491j90042j83049J68338O1295m5098J2371O741R9878N5030
8839B34639j26868m8056l3977k9147k6432j037j52454J38460J68333N8802m5169
8828A37094r9513m1474K0173n288o7388j0877J41933J4552M4205q202l2720q9487
8816C008j24957J36547j1291j13555J40718J23438J04525r6653j86466q270k7603
8805f0559j6016J19665J71841R0934q7513r4794q5982P2579j21935P3465n2039
8794I646N8078j5843J44361m941j33571n2211l6928O105r089J31687R1980j09471
8782G9803k1346N2952j9637l2698j56084M654J16692J99630R3573p6922j43526
$$ plain form
8771 97091 -69664 -151933 1119 47110 49153 82410 120147 171186 131847 -11518 -71266
8760 -71266 38537 30231 71266 123858 50107 179232 233740 214339 126994 85780 41844 22175
8748 22175 81483 105351 131161 190466 96996 37706 -89215 -135552 -48864 129125 117199
8737 117199 187657 304169 129065 -12829 99226 185929 122536 169790 190941 158467 198961
8726 198961 127808 95299 43752 131538 197634 223829 206865 97060 211434 337041 99441
8715 99441 73426 50065 -1160 -62188 32155 225908 211782 300067 354759 252144 280220
8704 280220 167653 59815 56222 90896 225940 132746 201679 310005 278965 270687 227465
8693 227465 209552 185959 200600 223034 184513 121107 -27121 -11179 24667 98809 202538
$$ packed form
8771I7091j66755q2269J53052M5991K043L3257L7737N1039l9339j43365n9748
8760g1266J09803q306M1035N2592p3751J29125N4508j9401q7345m1214m3936j9669
8748B2175N9308K3868K5810N9305r3470n9290j26921m6337Q6688J77989j1926
8737A17199P0458J16512j75104j41894J12055Q6703o3393M7254K1151l2474M0494
8726A98961p1153l2509n1547Q7786O6096K6195j6964j09805J14374J25607k37600
8715I9441k6015k3361n1225o1028R4343J93753j4126Q8285N4692j02615K8076
8704B80220j12567j07838l593L4674J35044r3194O8933J08326l1040q278m3222
8693B27465j7913k3593J4641K2434l8521o3406j48228J5942L5846P4142J03729
$$ plain form
8682 202538 159746 149544 175147 103817 231325 235478 258661 165064 49457 12219 39712
8671 39712 162524 207378 141852 31503 -3583 -57339 -26763 134095 30926 36844 98587
8660 98587 138483 65883 164099 175857 39062 30629 -13300 -15870 21190 252233 255760 238797
8648 238797 279309 158262 -30013 62259 138014 184644 153451 167862 77163 144930 98915
8637 98915 -55420 -81264 10782 151024 304205 274087 210868 191195 128165 155950 256371
8626 256371 264165 110964 153983 194990 300820 366775 266463 171693 213861 88324 260166
8615 260166 374065 488052 528620 573241 487648 404490 342337 375579 524840 612662 647510
8604 647510 844738 893949 883365 924237 1062669 1274032 1444310 2039584 2832177 3959415
$$ packed form
8682B02538m2792j0202K5603p1330J27508M153K3183r3597j15607l7238K7493
8671C9712J22812M4854o5526j10349l5086n3756L0576J60858j03169N918O1743
8660I8587L9896p2600R8216J1758j36795q433m3929k570L7060K31043L527j6963
8648B38797M0512j21047j88275R2272P5755M6630l1193J4411r0699O7767m6015
8637I8915j54335k5844R2046J40242J53181l0118o3219j9673o3030K7785J00421
8626B56371P794j53201M3019M1007J05830O5955j00312r4770M2168j25537J71842
8615B60166J13899J13987M0568M4621q5593q3158o2153L3242J49261Q7822L4848
8604F47510J97228M9211j0584M0872J38432K11363J70278N95274P92593J127238
$$ plain form
8594 3959415 5170932 6428839 7397661 7815417 7708246 7047066 6098210 5208227 4361582
8585 4361582 3598563 2810875 1973738 1650858 1421683 1156738 1050113 800042 713021 762274
8575 762274 695285 528313 580815 627949 601174 601053 551273 487582 421779 519710 493545 390195
8563 390195 388237 386754 369339 267141 316641 317679 129723 168669 302242 406788 441221
8552 441221 246614 191759 95152 264640 260077 146089 248179 132786 215162 219334 234373
8541 234373 196781 42854 182022 165781 183617 135802 73782 165875 182625 46703 -3931
8530 -3931 -33611 22366 15976 15789 53262 116922 191559 35251 -101816 2544 184574 202858
8518 202858 179930 209848 228746 20753 -200688 -169400 5480 33902 59940 66879 211551
$$ packed form
8594C959415J211517J257907R68822M17756j07171o61180r48856q89983q46645
8585D361582p63019p87688q37137l22880k29175k64945j06625k50071q7021M9253
8575G62274o6989j66972N2502M7134k6775j21m9780o3691o5803R7931k6165j03350
8563C90195j958j483j7415j02198M9500J038j87956L8946J33573J04546L4433
8552D41221j94607n4855r6607J69488m563j13988J02090j15393Q2376M172J5039
8541B34373l7592j53927J39168j6241J7836m7815o2020R2093J6750j35922n0634
8530c931k9680N5977o390j87L7473O3660P4637j56308j37067J04360J82030J8284
8518B02858k2928K9918J8898k07993k21441L1288J74880K8422K6038O939J44672
$$ plain form
8507 211551 274271 157354 23154 82608 205917 256104 115903 185616 301286 193442
8497 193442 111260 34136 93045 97264 14120 68995 133208 179588 181488 332328 194560 -16257
8485 -16257 -54023 -89995 -19169 173942 276122 197597 157382 54864 81142 34214 -1623
8474 -1623 -86535 5916 102019 150709 97520 38698 22289 -87468 24835 63941 -75652
8463 -75652 16957 19017 -82009 -80884 -80285 -77971 -96187 -105310 24259 107924 114539 -68029 -94016
8450 -94016 -30202 -26133 -69528 -48112 117458 97088 116651 258936 149997 80837 270921
8439 270921 146957 136928 164779 139162 170551 195112 168338 -37930 20929 20018 20921 170624
8427 170624 38211 115021 100436 147520 14098 25286 6002 -27442 -46437 -58158 -13684
$$ packed form
8507B11551O2720j16917j34200N9454J23309N0187j40201O9713J15670j07844
8497A93442q2182p7124N8909M219q3144N4875O4213M6380J900J50840j37768k10817
8485a6257l7766l5972P0826J93111J02180p8525m0215j02518K6278m6928l5837
8474a623q4912R2451R6103M8690n3189n8822j6409j09757J12303L9106j39593
8463g5652R2609K060j01026J125N99K314j8216r123J29569Q3665O615j82568k5987
8450i4016O3814M069m3395K1416J65570k0370J9563J42285j08939o9160J90084
8439B70921j23964j0029K7851k5617L1389K4561k6774k06268N8859r11R03J49703
8427A70624j32413P6810j4585M7084j33422J1188j9284l3444j8995j1721M4474
$$ plain form
8416 -13684 -18903 5627 -113097 -85026 -47178 10855 24772 -60505 -30647 20916 -5724 26215
8404 26215 29926 86955 34159 -44690 14025 75124 190052 230422 67097 103827 135425 -22221
8392 -22221 54906 152091 86358 38175 44782 14275 67846 128056 53211 67018 26474 69856
8380 69856 166460 137971 259157 160196 26033 14876 -95571 -96699 -117547 19176 138994
8369 138994 35378 28977 62216 -35423 85647 85080 15964 -154915 -117850 -179265 -58760
8358 -58760 101014 81940 95828 -45598 -116430 9862 38421 78635 201543 10595 20497
8347 20497 79401 50307 152910 55513 -30390 -43125 -39261 49218 119023 -46070 -112498 34922
8335 34922 49335 -22181 -92529 30666 84232 108054 62562 13783 -57171 -1327 1179 -44706
$$ packed form
8416a3684n219K4530j18724K8071L7848N8033J3917q5277K9858N1563k6640L1939
8404B6215L711N7029n2796p8849N8715O1099J14928M0370j63325L6730L1598j57646
8392b2221P7127R7185o5733m8183O607l0507N3571O0210p4845J3807m0544M3382
8380F9856R6604k8489J21186r8961j34163j1157j10447j128k0848J36723J19818
8369A38994j03616o401L3239r7639J21070n67o9116j70879L7065o1415J20505
8358e8760J59774j9074J3888j41426p0832J26292K8559M0214J22908j90948R902
8347B0497N8904k9094J02603r7397q5903j2735L864Q8479O9805j65093o6428J47420
8335C4922J4413p1516p0348J23195N3566K3822m5492m8779p0954N5844K506m5885
$$ plain form
8323 -44706 -95434 -163689 -157367 -122823 -171104 -155388 -82990 21664 -3556 92131 82938 189957
8311 189957 195871 94803 -64624 -164833 -39968 -16028 103293 135172 88767 -95033 -47993
8300 -47993 -103484 -58946 -60003 -142179 -16679 44988 -82089 -68188 -133037 -248504 -369851
8289 -369851 -173983 -60193 -181637 -7553 -3527 -36261 -98868 -175239 -159957 -95614 -43544
8278 -43544 97290 59027 17909 171891 104893 -54012 -203109 -276902 -17475 26124 6556
8267 6556 -53452 8522 126489 138348 73910 -36454 13534 -24496 -111319 -100477 7525
8256 7525 67363 -26577 -180827 -276076 -204484 -191665 -84329 4758 -22510 -2809 -86938 -173027
8244 -173027 -194970 -318451 -241460 -113603 -118488 -33432 -39486 4976 -86192 -204583 -186607
$$ packed form
8323d4706n0728o8255O322L4544m8281J5716P2398J04654k5220R5687r193J07019
8311A89957N914j01068j59427j00209J24865K3940J19321L1879m6405j83800M7040
8300d7993n5491M4538j057q2176J25500O1667j27077J3901o4849j15467j21347
8289c69851J95868J13790j21444J74084M026l2734o2607p6371J5282O4343N2070
8278d3544J40834l8263m1118J53982o6998j58905j49097p3793K59427M3599j9568
8267F556o0008O1974J17967J1859o4438j10364M9988l8030q6823J0842J08002
8256G525N9838r3940j54250r5249P1592J2819J07336Q9087k7268J9701q4129q6089
8244a73027k1943j23481P6991J27857m885Q5056o054M4462r1168j18391J7976
$$ plain form
8233 -186607 -194515 -44353 -62541 -127001 -82680 -158032 -114888 -96451 -229289 -211404 -136324
8222 -136324 41730 63994 -74952 -85141 -70779 -28329 45699 133334 10593 54763 110619
8211 110619 71997 -69608 -96281 -72739 -37131 -120864 -34363 -52376 -56650 -114328 94470
8200 94470 79719 7048 -65362 -142266 -37815 120076 179571 349220 95114 -529480 -377973
8189 -377973 -323566 -229435 -314573 -181484 -205725 -165210 -166576 -279720 -353163 -91928 12329
8178 12329 -6463 -108992 -74899 -42490 -15127 -26137 -27661 -19516 -109740 -30421 -29896 -10734
8166 -10734 30491 -71437 -95174 -77959 -44195 -94218 -220895 -71636 -71905 -47455 -168151
8155 -168151 -233022 -192712 -151078 -133578 -156632 -240045 -74642 -68178 -93982 -1105 -44552 -10333
$$ packed form
8233a86607p908J50162j8188o4460M4321p5352M3144J8437j32838J7885P5080
8222a36324J78054K2264j38946j0189J4362M2450P4028Q7635j22741M4170N5856
8211A10619l8622j41605k6673K3542L5608q3733Q6501j8013m274n7678K08798
8200I4470j4751p2671p2410p6904J04451J57891N9495J69649k54106o24594J51507
8189c77973N4407R4131q5138J33089k4241M0515j366j13144p3443K61235J04257
8178A2329j8792j02529L4093L2409K7363j1010j524Q145r0224P9319N25J9162
8166a0734M1225j01928k3737J7215L3764n0023j26677J49259k69K4450j20696
8155a68151o4871M0310M1634J7500k3054q3413J65403O464k5804R2877m3447L4219
$$ plain form
8143 -10333 -32380 -124691 -77928 -75190 -96176 -49959 -97579 -180649 -78216 -80630 18180 -104561
8131 -104561 7825 -37556 -160743 -53304 -105648 -93777 108653 161152 172393 188185 -8899
8120 -8899 -102732 -123861 -49299 -105214 -96484 -85467 -51041 -39627 8181 -61213 1347 6455
8108 6455 -31404 -12718 -80380 -48095 -50513 -23525 4573 -35535 -66948 -123051 -85086 -104420
8096 -104420 -169335 -100721 -90243 -119402 -25606 -69978 -182396 -114730 -101741 -29391 -91009
8085 -91009 -237956 -195787 -211321 -127885 -81491 -14133 75758 -38486 -17716 33354 45613
8074 45613 44727 29207 -48837 69243 29509 74182 12289 -88306 -25524 18435 65923 -69548
8062 -69548 13281 -31257 57420 66275 19512 30662 -50277 -116197 -145427 -145905 -135459 -19005
$$ packed form
8143a0333k2047r2311M6763K738k0986M6217m7620q3070J02433k414R8810j22741
8131a04561J12386m5381j23187J07439n2344J1871K02430N2499J1241J5792j97084
8120h899r3833k1129P4562n5915Q730J1017L4426J1414M7808o9394O2560N108
8108F455l7859J8686o7662L2285k418K6988K8098m0108l1413n6103L7965j9334
8096a04420o4915O8614J0478k9159R3796m4372j12418O7666J2989P2350o1618
8085i1009j46947M2169j5534Q3436M6394O7358Q9891j14244K0770N1070J2259
8074D5613q86j5520p8044J18080l9734M4673o1893j00595O2782M3959M7488j35471
8062f9548Q2829m4538Q8677Q855m6763J1150q0939o5920k9230m78J0446J16454
$$ plain form
8050 -19005 -18775 -18375 11562 -120469 -7037 56721 -47753 -82116 -2545 32408 -7704 8810
8038 8810 1911 -166055 -227196 -127681 -27216 24543 -20920 -50238 -3679 -82141 -184822 -131515
8026 -131515 -112581 -86865 -210789 -80374 105050 -175100 -229516 -120412 -87370 -40684 -72006
8015 -72006 -293887 -161410 -29779 -23822 65185 57641 -55029 -195377 -96943 91643 20546
8004 20546 12326 -77760 -83846 -51056 21787 68773 76061 10787 -85789 51174 88661 27960
7992 27960 -91575 -168646 -194267 -109088 -108653 -47908 -102128 -50215 755 -27612 7640 2023
7980 2023 53238 18577 -122627 -131450 5362 -17738 -16877 -48207 -269628 -282751 -227264 -41895
7968 -41895 -63470 -145415 -127553 -9214 -37897 16921 12596 -90264 -18857 -43085 -53970 32286
$$ packed form
8050a9005K30M00K9937j32031J13432O3758j04474l4363P9571L4953m0112J6514
8038H810o899j67966o1141R9515J00465N1759m5463k9318M6559p8462j02681N3307
8026a31515J8934K5716j23924J30415J85424k80150n4416J09104L3042M6686l1322
8015g2006k21881J32477J31631N957Q9007p544j12670j40348R8434J88586p1097
8004B0546q220r0086o086L2790P2843M6986P288o5274r6576J36963L7487o0701
7992B7960j19535p7071k5621Q5179M35O0745n4220N1913N0970k8367L5252n617
7980B023N1215l4661j41204q823J36812k3100Q61l1330k21421j3123N5487J85369
7968d1895k1575q1945J7862J18339k8683N4818m325j02860P1407k4228j0885Q6256
$$ plain form
7956 32286 106639 -102051 -179088 -67893 -148337 -102502 30287 111367 150613 52325 28483
7945 28483 17632 65551 -90083 -54762 105171 98364 46458 15894 -33327 -87047 -21275 -66449
7933 -66449 -22366 83384 -1763 37458 115276 96452 73932 -29051 -14914 -29063 161990
7922 161990 129216 80685 108876 175646 165808 29132 -223225 -196687 38279 118872 133554
7911 133554 69660 25281 -101761 -179681 -98545 -12128 96256 92041 8713 -36154 3213
7900 3213 -26989 95730 -6586 46598 75033 -15080 7652 143720 137819 -14836 -135281
7889 -135281 -260422 -248776 -139078 -1329 91235 83823 73921 85968 36212 -69396 -1160
7878 -1160 -73754 -228422 -50352 -78128 43538 21937 -20973 -79283 -75063 -8404 56193 21852
$$ packed form
7956C2286P4353k08690p7037J11195q0444M5835J32789Q1080L9246r8288k3842
7945B8483j0851M7919j55634L5321J59933o807n1906l0564m9221n3720O5772m5174
7933f6449M4083J05750q5147L9221P7818j8824k2520j02983J4137j4149J91053
7922A61990l2774m8531K8191O6770r838j36676k52357K6538K34966Q0593J4682
7911A33554o3894m4379j27042p7920Q1136Q6417J08384m215q3328m4867L9367
7900C213l0202J22719j02316N3184K8435r0113K2732J36068n901j52655j20445
7889a35281j25141J1646J09698J37749R2564p412r902J2047m9756j05608O8236
7878a160p2594j54668J78070k7776J21666k1601m2910n8310M220O6659O4597l4341
$$ plain form
7866 21852 -78121 -103631 -118224 -220694 -163836 -161786 -36326 54782 5243 51212 141330 57869
7854 57869 -76388 -162019 -99907 -178755 -61936 -64710 51987 46490 -72561 -66890 52005
7843 52005 -41002 65842 191467 224489 125414 65876 7471 -109733 -15081 -116531 -80241
7832 -80241 -90029 50747 104045 48758 -83139 -110698 -86758 -68487 40424 133164 162785
7821 162785 167935 122532 63318 -52607 -61673 -81481 -85306 -83375 -41881 102695 30658 29820
7809 29820 -115086 -227309 -315200 -181256 14186 53847 114892 34241 -20396 -74500 -212713
7798 -212713 -138287 -80223 68996 150358 177625 118532 52965 15426 -18888 55032 221488
7787 221488 310623 355547 347952 296907 374168 319726 251420 58198 142490 85240 252900
$$ packed form
7866B1852r9973k5510j4593j02470N6858K050J25460R1108m9539M5969R0118q3461
7854E7869j34257q5631O2112p8848J16819k774J16697n497j19051N671J18895
7843E2005r3007J06844J25625L3022r9075n9538n8405j17204R4652j01450L6290
7832h0241r788J40776N3298n5287j31897k7559K3940J8271J08911R2740K9621
7821A62785N150m5403n9214j15925r066j9808l825J931M1494J44576p2037q38
7809B9820j44906j12223q7891J33944J95442L9661O1045q0651n4637n4104j38213
7798b12713P4426N8064J49219Q1362K7267n9093o5567l7539l4314P3920J66456
7787B21488Q9135M4924p595n1045P7261n4442o8306j93222Q4292n7250J67660
$$ plain form
7776 252900 165923 214416 332270 197539 200331 82243 68901 248781 146824 154752 234756
7765 234756 174045 63532 -30994 28372 240880 329058 421764 555944 562693 583487 661330
7754 661330 703711 1022590 1053609 966989 974261 792550 673492 615821 445926 334995 302065
7743 302065 187413 239148 329706 381341 320309 252370 287032 153754 70710 24950 108765
7732 108765 142732 310174 257146 261084 329608 326272 500180 657512 763758 917689 1217100
7721 1217100 1147105 931270 735497 671085 587689 439736 357950 337641 222292 128309 49582
7710 49582 55657 6019 43378 76450 4879 78857 220097 184258 223780 248176 201419 272547
7698 272547 246555 125792 120343 201786 258886 333419 355911 298755 350174 401382 460883 516584
$$ packed form
7776B52900q6977M8493J17854j34731K792j18088j3342J79880j01957P928Q0004
7765B34756o0711j10513r4526N9366K12508Q8178R2706J34180O749K0794P7843
7754F61330M2381L18879L1019q6620P272j81711j19058n7671j69895j10931l2930
7743C02065j14652N1735R0558N1635o1032o7939L4662j33278q3044m5760Q3815
7732A08765L3967J67442n3028L938O8524l336J73908J57332J06246J53931K99411
7721A217100o9995k15835j95773o4412q3396j47953q1786k0309j15349r3983p8727
7710D9582O075m9638L7359L3072p1571P3978J41240l5839L9522K4396m6757P1128
7698B72547k5992j20763n449Q1443N7100P4533K2492n7156N1419N1208N9501N5701
$$ plain form
7686 516584 255868 151838 43209 -124341 52468 116754 126910 106896 89373 105411 72057
7675 72057 19120 83598 90286 119753 113149 -24327 -33026 105599 96918 88227 61068 -60927
7663 -60927 88530 196676 205522 17497 -90225 -147544 -78156 65587 72895 16660 55390
7652 55390 120117 -106060 -20889 103718 81764 -30428 10678 134768 -63404 -15630 8223
7641 8223 -106386 -81851 -11120 -3470 -50121 -24262 101843 147232 126414 6389 -56669 85924
7629 85924 -77905 -79043 17527 90334 28136 -9003 34158 90614 -52214 -120061 -186792 -34278
7617 -34278 -14010 59215 -59535 -71998 -81425 -177449 -152847 -177755 -117217 69508 41011 -98306
7605 -98306 -130843 -12258 20040 -2158 -69194 -52754 -3781 -104770 -29873 -6122 -67069
$$ packed form
7686E16584k60716j04030j08629j67550J76809O4286J0156k0014j7523J6038l3354
7675G2057n2937O4478O688K9467o604j37476q699J38625q681q691k7159j21995
7663f0927J49457J08146Q846j88025j07722n7319O9388J43743P308n6235L8730
7652E5390O4727k26177Q5171J24607k1954j12192M1106J24090j98172M7774K3853
7641H223j14609K4535P0731P650m6651K5859J26105M5389k0818j20025o3058J42593
7629H5924j63829j138R6570P2807o2198l7139M3161N6456j42828o7847o6731J52514
7617c4278K0268P3225j18750j2463r427r6024K4602k4908O0538J86725k8497j39317
7605i8306l2537J18585L2298k2198o7036J6440M8973j00989P4897K3751o0947
$$ plain form
7594 -67069 -141918 -50703 91330 26337 -55014 8168 36222 68469 -20452 54968 101054 -10250
7582 -10250 -122765 -24688 89678 177946 115559 108373 -3028 -117650 -34054 16937 10345
7571 10345 -56258 -86505 14244 1024 54756 32284 -66557 -59957 65386 9228 -75235 -127771
7559 -127771 -102186 -196251 -82192 -98885 4565 -67785 -51567 -29010 -122747 -183001 -9770
7548 -9770 -31870 -135120 -99769 -79660 2184 -17119 -9559 -76574 4216 72297 -4514 -45721
7536 -45721 -123076 -52205 16686 -47075 -37407 25629 123945 68838 29537 834 -43741 -90747
7524 -90747 -139115 -6057 -62881 57850 103635 28614 13431 14294 -90853 -117416 -134927 -156473
7512 -156473 -110859 -143891 27645 25420 7890 -23669 -18809 -59467 -50595 -156783 -205303 -51981
$$ packed form
7594f7069p4849R1215J42033o4993q1351O3182K8054L2247q8921P5420M6086j11304
7582a0250j12515R8077J14366Q8268o2387p186j11401j14622Q3596N0991o592
7571A0345o6603l0247J00749j3220N3732k2472r8841O600J25343n6158q4463n2536
7559a27771K5585r4065J14059j6693J03450p2350J6218K2557r3737o0254J73231
7548i770k2100j03250L5351K0109Q1844j9303P560o7015Q0790O8081p6811m1207
7536d5721p7355P0871O8891o3761R668O3036R8316n5107l9301k8703m4575m7006
7524i0747m8368J33058n6824J20731M5785p5021j5183Q63j05147k6563j7511k1546
7512a56473M5614l3032J71536k225j7530l1559M860m0658Q872j06188m8520J53322
$$ plain form
7500 -51981 -56656 -96367 -57110 -79270 -51950 -85404 -17926 25842 63495 -62356 -92348 -117468
7488 -117468 59605 119214 21754 21650 22300 106212 106309 -8891 -9979 -45562 -25983 -56814 -78387
7475 -78387 -22003 -46808 -2196 -75799 -142927 -33570 -51263 -40962 50995 120626 102327 147600
7463 147600 64058 -31209 4381 3969 8190 139238 182891 266850 170503 94602 -16152 -87489
7451 -87489 -25490 -59332 -156135 -118334 -47060 -139756 -209279 -212200 -95036 -121384 -43211 19621
7439 19621 67243 102614 -12912 -1333 -44858 14279 18523 -51809 -102184 -8739 -19427 1820
7427 1820 21956 -14834 -157788 -85362 -18165 -1246 90725 23122 51238 72973 46140 -49627
7415 -49627 10101 -50250 -68793 -139242 -264291 -231487 34158 -72117 -121037 -181870 -107532
$$ packed form
7500e1981m675l9711L9257k2160K7320l3454O7478M3768L7653j25851k9992k5120
7488a17468J77073N9609r7460j04O50Q3912R7j15200j088l5583J9579l0831k1573
7475g8387N6384k4805M4612p3603o7128J09357j7693J0301R1957O9631j8299M5273
7463A47600q3542r5267L5590m12M221J31048M3653Q3959r6347p5901j10754p1337
7451h7489O1999l3842r6803L7801P1274r2696o9523k921J17164k6348P8173O2832
7439A9621M7622L5371j15526J1579m3525N9137M244p0332n0375R3445j0688K1247
7427A820K0136l6790j42954P2426O7197J6919R1971o7603K8116K1735k6833r5767
7415d9627N9728o0351j8543p0449j25049L2804K65645j06275m8920o0833P4338
$$ plain form
7404 -107532 -83706 -12195 -15405 62073 102068 60438 50314 37338 89863 -44505 -126031 -93951
7392 -93951 -66893 -138469 -213667 -285285 -315127 -252572 -79178 44063 -19831 42583 25310
7381 25310 -65952 -139145 -80130 -41679 -80621 49908 78888 120741 89909 -39504 -149748
7370 -149748 -92376 -88162 7392 -5170 -21586 21086 -23344 31620 79658 62216 -4793 64202
7358 64202 18025 -5692 -59494 -133341 -250760 -85400 -34907 -42032 22464 184995 161898
7347 161898 37584 36195 -36961 -836 -92908 -4158 -44224 46832 116547 150504 129541 76747
7335 76747 168596 101327 118968 107887 68226 197200 223995 282686 388657 423675 571064
7324 571064 759833 1002518 1134264 1175452 1104069 925657 765036 612452 585179 501499
$$ packed form
7404a07532K3826P1511l210P7478L9995m1630j0124j2976N2525j34368q1526L2080
7392i3951K7058p1576p5198p1618k9842O2555J73394J23241o3894O2414j7273
7381B5310r1262p3193N9015L8451l8942J30529K8980M1853l0832j29413j10244
7370a49748N7372M214R5554j2562j6416M2672m4430N4964M8038j7442o7009O8995
7358F4202m6177k3717n3802p3847j17419J65360N0493p125O4496J62531k3097
7347A61898j24314j389p3156L6125r2072Q8750m0066R1056O9715L3957k0963n2794
7335G6747R1849o7269J7641j1081l9661J28974K6795N8691J05971L5018J47389
7324E71064J88769K42685J31746M1188p1383j78412j60621j52584k7273q3680
$$ plain form
7314 501499 409932 358781 355271 183338 58636 37375 -98359 -69996 6188 136715 188819
7303 188819 141528 26687 -56825 -77873 -173524 -101479 -125545 -61111 89992 129401 102909
7292 102909 17477 -91024 -25637 -81266 23640 -19149 -36325 65344 27869 43606 -1513
7281 -1513 46325 -9178 4644 -15555 -89952 -56998 -190 14641 49835 -18543 -29027 -31581
7269 -31581 87670 -12669 54005 -45976 -59774 12 -236539 -187491 -21673 94928 11481
7258 11481 26546 -45428 61712 24287 -166254 -67218 -23539 -138036 -120893 -82363 16806
7247 16806 -63722 -151944 -148541 -46228 -12888 -81047 -105654 -58124 -42999 46017 -52302 -211203
7235 -211203 -58566 -85967 -70763 -102950 -150573 10099 -32030 82582 27540 -116419 -9865
$$ packed form
7314E01499r1567n1151l510j71933j24702k1261j35734K8363P6184J30527N2104
7303A88819m7291j14841q3512k1048r5651P2045k4066O4434J51103L9409k6492
7292A02909q5432j08501O5387n5629J04906m2789j7176J01669l7475J5737m5119
7281a513M7838n5503J3822k0199p4397L2954N6808J4831L5194o8378j0484k554
7269c1581J19251j00339O6674r9981j3798N9786k36551M9048J65818J16601q3447
7258A1481J5065p1974J07140l7425j90541R9036M3679j14497J7143L8530R9169
7247A6806q0528q8222L403J02313L3340o8159k4607M7530J5125Q9016r8319j58901
7235b11203J52637k7401J5204l2187m7623J60672m2129J14612n5042j43959J06554
$$ plain form
7224 -9865 -130756 -213337 -104085 -2510 -14813 -168631 -81356 -5596 -60655 -22580 -81684
7213 -81684 -1792 -5959 -50450 -111352 -74536 -29799 -48041 -6655 31203 17695 89393 88458
7201 88458 116141 90301 -5959 -136435 -200290 -191293 -125505 -130527 -248590 -170120 -44760 -100715
7189 -100715 -136280 -161558 -121635 -105826 -111348 -102897 -74836 -124834 -155928 -98440 -90964 54328
7177 54328 -24949 -50882 25015 -56261 5983 -4712 77868 52204 45870 110504 -34591 3138
7165 3138 24913 78187 112497 -95294 -179914 -191338 -149075 -96812 17253 78510 -30220
7154 -30220 -5765 97478 96003 25539 33042 -124806 -55774 24563 -49983 -8193 -44999 -41584
7142 -41584 -129044 -31817 -18124 -49385 -55386 -133085 -71939 6553 -17667 33039 -48841 12556
$$ packed form
7224i865j20891q2581J09252J01575j2303j53818Q7275P5760n5059L8075n9104
7213h1684P9892m167m4491o0902L6816M4737j8242M1386L7858j3508P1698r35
7201H8458K7683k5840r6260j30476o3855Q997O5788n022j18063P8470J25360n5955
7189a00715l5565k5278L9923J5809n522Q451K8061m9998l1094N7488P476J45292
7177E4328p9277k5933P5897q1276O2244j0695Q2580k5664o334O4634j45095L7729
7165C138K1775N3274L4310k07791q4620j1424M2263N2263J14065O1257j08730
7154c0220K4455J03243j475p0464P503j57848O9032Q0337p4546M1790l6806L415
7142d1584q7460R7227J3693l1261o001p7699O1146P8492k4220N0706q1880O1397
$$ plain form
7130 12556 -133012 -166468 14569 30984 19631 83733 121762 21401 66798 -82677 -1439
7119 -1439 -187857 -81700 59959 104392 1550 -49608 -17264 -134540 -40241 26459 2061
7108 2061 27893 20558 -12277 -76792 -33841 10974 -38020 -42666 16681 -23427 -14148 -46386 42218
7095 42218 47907 72348 126847 60113 131260 166797 179503 45088 -21447 1385 36251 -45463
7083 -45463 -94818 -40629 19679 131215 75076 37911 110229 25672 -129354 -169858 -86104
7072 -86104 -50226 -5309 -14404 15476 28379 -35994 10253 50270 28144 44671 58920 51488
7060 51488 3437 43670 59303 -16675 -16525 39353 557 -12502 -162562 -172713 -87916 41349
7048 41349 97707 -5284 -129594 -131270 -88747 -58981 -52288 -26471 22113 81949 -73503 -98216
$$ packed form
7130A2556j45568l3456J81037J6415j1353O4102L8029j00361M5397j49475Q1238
7119a439j86418J06157J41659M4433j02842n1158L2344j17276R4299O6700k4398
7108B061K5832p335l2835o4515M2951M4815m8994m646N9347m0108R279l2238Q8604
7095D2218N689K4441N4499o6734P1147L5537J2706j34415o6535K2832L4866q1714
7083d5463m9355N4189O0308J11536n6139l7165P2318q4557j55026m0504Q3754
7072h6104L5878M4917r095K9880J2903o4373M6247M0017k2126J6527J4249p432
7060E1488m8051M0233J5633p5978J50N5878l8796j3059j50060j0151Q4797J29265
7048D1349N6358j02991j24310j676M2523K9766O693K5817M8584N9836j55452k4713
$$ plain form
7036 -98216 -43079 25086 -50525 -33692 88567 81558 93497 121751 -8148 -96301 -81391 -51668
7024 -51668 69602 48103 83637 -2109 103463 -8111 67306 128352 36823 -5107 -3365
7013 -3365 45916 76440 52477 -121709 -124002 -2178 30915 112014 34117 114664 55667 -76522
7001 -76522 -3844 5399 93206 47704 44291 54272 217910 120315 15571 -23012 -9712 -90171
6989 -90171 -33441 85458 67002 104611 33297 -32142 -100484 19692 44454 144030 156081
6978 156081 72632 30141 10999 61535 -118734 -160049 -507 31115 38086 88994 9931
6967 9931 1962 73849 31223 -9899 -29618 -3446 139465 167507 31047 -23780 5491 -156730
6955 -156730 -112490 113532 -89220 -172363 -132257 -174875 -109586 -163572 -161570 -242239 -162720
$$ packed form
7036i8216N5137O8165p5611J6833J22259p009J1939K8254j29899q8153J4910K9723
7024e1668J21270k1499L5534q5746J05572j11574P5417O1046r1529m1930J742
7013c365M9281L0524k3963j74186k293J21824L3093Q1099p7897Q0547n8997j32189
7001g6522P2678R243Q7807m5502l413R981J63638r7595j04744l8583J3300q0459
6989i0171N6730J18899j8456L7609p1314o5439o8342J20176K4762R9576J2051
6978A56081q3449m2491j9142N0536j80269m1315J59542L1622O971N0908p9063
6967I931p969P1887m2626m1122j9719K6172J42911K8042j36460n4827K9271j62221
6955a56730M4240K26022k02752q3143M0106m2618O5289n3986K002q0669P9519
$$ plain form
6944 -162720 -19106 106619 150561 73146 5523 -21609 -87703 -176989 -96699 -53709 162641
6933 162641 245505 74605 -68847 -111011 -76502 -156963 -96561 26498 82972 110782 82712
6922 82712 2690 -138969 -233291 -346917 -300426 -167680 18260 148506 26790 -57248 162377
6911 162377 256139 234482 169938 125729 144789 160719 153161 85745 119671 78609 -23326 33360
6899 33360 24867 52187 18992 29014 -13977 34041 -17689 62396 182698 160309 -37024 -101547
6887 -101547 -35901 78847 82538 -3279 70127 977 -145943 -163708 -84260 -50532 26703
6876 26703 -4877 -374 60007 132468 165139 60490 99647 127956 53850 5842 -89753 -58360
6864 -58360 4771 -21473 -48844 -154809 -95572 -18181 -55581 4161 15009 58139 -58029
$$ packed form
6944a62720J43614J25725M3942p7415o7623k7132o6094q9286Q0290M2990K16350
6933A62641Q2864j70900j43452m2164L4509q0461O0402J23059N6474K7810k8070
6922H2712q0022j41659r4322j13626M6491J32746J85940J30246j21716q4038K19625
6911A62377R3762k1657o4544m4209J9060J5930p558o7416L3926m1062j01935N6686
6899C3360q493K7320l3195J0022m2991M8018n1730Q0085J20302k2389j97333o4523
6887a01547O5646J14748L691q5817P3406o9150j46920j7765P9448L3728P7235
6876B6703l1580M503O0381P2461L2671j04649L9157K8309p4106m8008r5595L1393
6864e8360O3131k6244k7371j05965N9237P7391l7400N9742J0848M3130j16168
$$ plain form
6853 -58029 10007 -8838 -196508 -112632 -159987 -272715 -122700 -62884 -9720 -47668 -120564
6842 -120564 -122995 -186677 -241752 -151299 -123219 -111767 -89376 3879 84003 122068 62212 17916
6830 17916 -43689 8721 -64540 -57036 22307 37264 65524 35926 50213 28662 16230 64172
6818 64172 123887 2534 -37002 -5097 -9262 -117497 -150734 -10520 68537 95142 174744
6807 174744 182604 -77421 -205183 -44573 -46421 -140135 -69074 -19297 94685 76963 11383
6796 11383 -38721 -30370 -216476 -203896 -160306 -100397 4615 -96853 -53766 -87253 -62689
6785 -62689 -113738 -116808 -103797 -31016 40252 158941 232018 5079 -103648 -178512 -208233
6774 -208233 -226806 -131189 -31890 -21582 100936 89129 49831 66992 118134 122899 78758 -45775
$$ packed form
6853e8029O8036j8845j87670Q3876m7355j12728J50015N9816N3164l7948p2896
6842a20564k431o3682n5075R0453K8080J1452K2391R3255Q0124L8065n9856m4296
6830A7916o1605N2410p3261P504P9343J4957K8260k9598J4287k1551j2432M7942
6818F4172N9715j21353l9536L1905m165j08235l3237J40214P9057K6605P9602
6807A74744P860k60025j27762J60610j848r3714P1061M9777J13982j7722o5580
6796A1383n0104Q351j86106J2580M3590N9909J05012j01468M3087l3487K4564
6785f2689n1049l070J3011P2781P1268J18689P3077k26939j08727p4864k9721
6774b08233j8573R5617R9299J0308J22518j1807l9298J7161N1142M765m4141j24533
$$ plain form
6762 -45775 13310 118147 178343 85498 -131829 -188562 -80326 -67656 -83723 8965 11898
6751 11898 -12378 112242 146723 113191 89470 75136 -14890 37099 207265 191861 184923 64758
6739 64758 -28116 -8768 86382 79767 -24411 -9549 -79676 -93208 -11408 74130 -30680 -7101
6727 -7101 -76185 -140444 17594 67019 99791 108656 22193 117829 128523 54765 -27642 64492
6715 64492 35510 7813 -30817 -134801 -151867 -138893 -90749 2559 48089 182051 251025
6704 251025 185060 97497 32342 14262 -47893 -23634 56080 -22127 35789 132264 76542 28537
6692 28537 4545 -13639 45515 82829 182492 148729 76740 226363 178309 151957 111919 83239
6680 83239 60690 82641 7174 153111 174435 186630 115996 142469 72378 138580 130607 163310
$$ packed form
6762d5775N9085J04837O0196r2845k17327n6733J08236J2670j6067R2688K933
6751A1898k4276J24620L4481l3532k3721j4334r0026N1989J70166j5404o938j20165
6739F4758r2874J9348R5150o615j04178J4862p0127j3532Q1800Q5538j04810K3579
6727g101o9084o4259J58038M9425L2772Q865q6463R5636J0694p3758q2407R2134
6715F4492k8982k7697l8630j03984j7066J2974M8144R3308M5530J33962O8974
6704B51025o5965q7563o5155j8080o2155K4259P9714p8207N7916R6475n5722m8005
6692B8537k3992j8184N9154L7314R9663l3763p1989J49623m8054k6352m0038k8680
6680H3239k2549K1951p5467J45937K1324J2195p0634K6473p0091O6202p973L2703
$$ plain form
6668 163310 129731 122339 157384 289351 355902 167065 79372 129028 134415 129041 107269 180354
6656 180354 166157 106365 171858 88837 41636 64892 134658 191842 204062 232711 180845 48031
6644 48031 45425 -52929 121269 153210 137047 229554 229836 198351 148533 146697 59394 29252
6632 29252 62972 68534 266690 349126 208299 148900 121033 79664 110979 63782 77215 188768
6620 188768 217555 302351 273510 180059 243875 216553 260562 353913 354375 387608 422773 324985
6608 324985 271420 193814 250313 215043 158101 166656 243172 243185 135090 114216 101846 82618
6596 82618 150944 214917 318025 386454 393948 301070 124512 138981 114140 75990 170798 265512
6584 265512 485740 515044 375616 403033 497852 483342 532396 562041 531348 553417 493871
$$ packed form
6668A63310l3579p392L5045J31967O6551j88837q7693M9656N387n374k1772P3085
6656A80354j4197n9792O5493q3021m7201K3256O9766N7184J2220K8649n1866j32814
6644D8031k606r8354J74198L1941j6163R2507K82l1485m9818j836q7303l0142
6632B9252L3720N562J98156Q2436j40827n9399k7867m1369L1315m7197J3433J11553
6620A88768K8787Q4796k8841r3451O3816k7322M4009R3351M62L3233L5165r7788
6608C24985n3565p7606N6499l5270n6942Q555P6516J3j08095k0874j2370j9228
6596H2618O8326O3973J03108O8429P494r2878j76558J4469k4841l8150R4808R4714
6584B65512K20228K9304j39428K7417R4819j4510M9054K9645l0693K2069n9546
$$ plain form
6573 493871 447711 405639 364513 418198 242237 153729 274347 367678 423886 355099 353305
6562 353305 365567 360312 385586 474560 436795 554140 600965 726102 733175 593360 537760
6551 537760 649322 835488 919226 1039876 1155092 1151560 1143301 1085216 1311779 1452147 1570265
6540 1570265 1652106 1616130 1592408 1471155 1220084 1041770 1006565 943325 847523 809552 693096
6529 693096 628630 511297 505336 557212 442148 461523 568818 553608 544266 499518 315570
6518 315570 321730 508333 382454 479982 553880 572940 587682 446617 430490 283530 333336
6507 333336 294380 242839 210881 297779 370965 273765 246461 225045 287789 274845 223666 326800
6495 326800 296012 305061 410905 439162 362059 354074 317067 288533 374539 543861 444102 253802
$$ packed form
6573D93871m6160m2072m1126N3685j75961q8508J20618R3331N6208o8787j794
6562C53305J2262n255K5274Q8974l7765J17345M6825J25137P073j39815n5600
6551E37760J11562J86166Q3738J20650J15216l532q259n8085K26563J40368J18118
6540A570265Q1841l5976k3722j21253k51071j78314l5205o3240r5802l7971j16456
6529F93096o4466j17333n961N1876j15064J9375J07295j5210r342m4748j83948
6518C15570O160J86603j25879R7528P3898J9060J4742j41065j6127j46960M9806
6507C33336l8956n1541l1958Q6898P3186r7200k7304k1416O2744j2944n1179J03134
6495C26800l0788R049J05844K8257p7103p985l7007k8534Q6006J69322r9759j90300
$$ plain form
6483 253802 319372 250814 106845 249231 240553 211106 216826 217373 288294 239186 130640 200780
6471 200780 342715 373816 247280 378663 366714 223409 223687 358651 369958 278612 216328
6460 216328 233109 197185 347437 275722 266547 445747 388424 426840 415629 356642 373281
6449 373281 345067 406150 314076 241233 293880 302371 271889 327477 305945 315130 408666 445948
6437 445948 407920 346496 434137 484930 578744 579296 458324 404269 480862 424365 426962 532772
6425 532772 636072 637303 551377 549107 565397 585665 595972 695299 626996 473452 548339 547437
6413 547437 615411 650995 543749 495063 518627 525353 699189 668840 597146 618061 665349
6402 665349 571509 505840 554525 627194 689519 705411 733999 833754 786603 708988 664965 809405
$$ packed form
6483B53802O5570o8558j43969J42386q678k9447N720N47P0921m9108j08546P0140
6471B00780J41935L1101j26536J31383j1949j43305K78J34964J1307r1346o2284
6460B16328J6781l5924J50252p1715r175J79200n7323L8416j1211n8987J6639
6449C73281k8214O1083r2074p2843N2647Q491l0482N5588k1532R185R3536L7282
6437D45948l8028o1424Q7641N0793R3814N52j20972n4055P6593n6497K597J05810
6425E32772J03300J231q5926k270J6290K0268J0307R9327o8303j53544P4887r02
6413E47437O7974L5584j07246m8686K3564O726J73836l0349p1694K0915M7288
6402F65349r3840o5669M8685P2669O2325J5892K8588R9755m7151p7615m4023J44440
$$ plain form
6390 809405 796162 863165 976833 1027085 911793 783874 889452 784028 779443 868365 950207
6379 950207 997747 1004968 1093118 1131501 987812 887927 993415 949731 945201 933239 985870 1064622
6367 1064622 1136176 1128736 1096637 1084963 1225082 1338366 1359050 1415371 1471585 1619150 1621431
6356 1621431 1600259 1529910 1580884 1730657 1794359 1744404 1877143 1911690 1873099 1833908 1931893
6345 1931893 2041039 1820392 1931918 1920518 1991277 2116344 2053592 2021797 1949512 2014656 2043348
6334 2043348 1972791 2029140 2037260 2117817 2255327 2252663 2246118 2293292 2351965 2443870 2611487 2855318
6322 2855318 2908484 2957765 3033837 3059796 3090357 3131985 3193168 3304888 3545308 3592667 3673825
6311 3673825 3839835 3952016 4039417 4092927 4141415 4175628 4323550 4447807 4532245 4671940
$$ packed form
6390H09405j3243O7003J13668N0252j15292j27919J05578j05424m585Q8922Q1842
6379I50207M7540P221Q8150L8383j43689r9885J05488m3684m530j1962N2631P8752
6367A064622P1554p440l2099j1674J40119J13284K0684N6321N6214J47565K281
6356A621431k1172p0349N0974J49773O3702m9955J32739L4547l8591l9191R7985
6345A931893J09146k20647J11526j1400P0759J25067o2752l1795p2285O5144K8692
6334B043348p0557N6349Q120Q0557J37510k664o545M7174N8673R1905J67617K43831
6322B855318N3166M9281P6072K5959L0561M1628O1183J11720K40420M7359Q1158
6311C673825J66010J12181Q7401N3510M8488L4213J47922J24257Q4438J39695
$$ plain form
6301 4671940 4752370 4929247 5082987 5359382 5551773 6031425 6415359 6703445 7117608 7700032
6291 7700032 8346063 8978141 9639960 10523413 11717679 13052876 14790688 17153421 20187087
6282 20187087 23868473 27512817 30788398 32999858 33973693 33543880 31744594 29318962
6274 29318962 26721596 24212731 22029476 20073851 18381173 17224730 16384528 16086737
6266 16086737 16050914 15942239 16078450 16457331 17051591 17875244 18863603 20009543 21587735
6257 21587735 23425736 25623789 28270608 31869487 36900260 43409314 52095681 63069031
6249 63069031 75504218 87512892 95963085 99311856 97974843 92471228 84423881 75820156
6241 75820156 67436011 59643921 52640419 46936056 42479941 39551830 37746955 36724855
$$ packed form
6301D671940Q0430J76877J53740K76395J92391M79652L83934K88086M14163N82424
6291G700032O46031O32078O61819Q83453J194266J335197J737812K362733L033666
6282B0187087L681386L644344L275581K211460R73835m29813j799286k425632
6274B9318962k597366k508865k183255j955625j692678j156443q40202k97791
6266A6086737l5823j08675J36211L78881N94260Q23653R88359J145940J578192
6257B1587735J838001K198053K646819L598879N030773O509054Q686367J0973350
6249F3069031J2435187J2008674Q450193L348771j337013n503615q047347q603725
6241G5820156q384145p792090p003502n704363m456115k928111j804875j022100
$$ plain form
6233 36724855 36404901 36860952 37932903 39557539 41854767 44480325 47786139 51703610
6225 51703610 56313070 61971617 68919057 77665426 89039730 104135269 124267645 150717430
6217 150717430 183527321 220547910 257004022 286017910 302846089 304765940 292786619
6210 292786619 270396963 241963980 211497556 181598364 153730500 129247628 108811648
6203 108811648 92315815 79430410 69427102 61579334 55251062 50211024 46154145 42826566
6195 42826566 40231731 38188216 36551604 35245055 34392409 33817864 33636704 34037049 35172689
6186 35172689 36993572 39518916 42225075 44433788 45227223 44654817 42722195 39577148
6178 39577148 36152106 32785718 29426080 26398989 23658955 21306745 19317408 17842445
$$ packed form
6233C6724855l19954M56051J071951J624636K297228K625558L305814L917471
6225E1703610M609460N658547O947440Q746369J1374304J5095539K0132376K6449785
6217A50717430L2809891L7020589L6456112K9013888J6828179J919851j1979321
6210B92786619k2389656k8432983l0466424k9899192k7867864k4482872k0435980
6203A08811648j6495833j2885405j0003308p847768o328272n040038m056879l327579
6195D2826566k594835k043515j636612j306549q52646n74545j81160M00345J135640
6186C5172689J820883K525344K706159K208713P93435n72406j932622l145047
6178C9577148l425042l366388l359638l027091k740034k352210j989337j474963
$$ plain form
6170 17842445 16760954 15746612 14924746 14280318 13672447 13056670 12639550 12117128 11640067
6161 11640067 11188463 10767750 10325749 10115896 9773333 9446904 9148346 8796490 8520455
6152 8520455 8096548 7873668 7605351 7455338 7174482 7022220 6793288 6535396 6438305 6289084
6142 6289084 6162355 6018514 5722795 5700592 5613309 5535486 5475957 5260756 5207691 5066418
6132 5066418 5004656 4828648 4724878 4624447 4521679 4416031 4340612 4260575 4213748 4117877
6122 4117877 3929081 3783605 3765488 3621703 3534543 3495511 3461064 3465071 3389228 3295974 3126115
6111 3126115 3082559 3210841 3237835 3136623 3196708 3287141 3159644 3032051 2977046 3010020 2979635
6100 2979635 3025780 2905212 2823418 2903897 2796044 2686718 2556378 2498409 2509268 2547165 2442338
$$ packed form
6170A7842445j081491j014342q21866o44428o07871o15777m17120n22422m77061
6161A1640067m51604m20713m42001k09853l42563l26429k98558l51856k76035
6152H520455m23907k22880k68317j50013k80856j52262k28932k57892r7091j49221
6142F289084j26729j43841k95719k2203q7283p7823n9529k15201n3065j41273
6132E066418o1762j76008j03770j00431j02768j05648p5419q0037m6827r5871
6122D117877j88796j45476j8117j43785q7160l9032l4447M007p5843r3254j69859
6111C126115m3556J28282K6994j01212O0085R0433j27497j27593n5005L2974l0385
6100B979635M6145j20568q1794Q0479j07853j09326j30340n7969J0859L7897j04827
$$ plain form
6089 2442338 2319696 2352179 2229394 2070505 2056574 2024152 1870255 1873395 1872211 1842738 1810234
6078 1810234 2028385 2195980 2271538 2081049 1991113 1938847 1827965 1688963 1730851 1692615
6068 1692615 1550775 1423074 1424497 1312899 1273343 1405043 1378598 1408281 1457041 1476064 1429116
6057 1429116 1356807 1372072 1384036 1627267 1612355 1391788 1324979 1234838 1252536 1278667 1320158
6046 1320158 1221556 1085171 1190700 1160892 1203461 1213671 1054134 981086 976577 1072510 1049814
6035 1049814 1069322 1136160 1134506 1004411 930062 897545 937217 843794 906334 797329 821376
6024 821376 797228 954069 947920 830825 851428 835484 795086 931622 854768 730788 834601
6013 834601 708557 763073 761054 712478 725003 620039 471453 417613 642571 584931 504469
$$ packed form
6089B442338j22642L2483j22785j58889j3931l2422j53897L140j184k9473l2504
6078A810234K18151J67595P5558j90489q9936n2266j10882j39002M1888l8236
6068A692615j41840j27701J423j11598l9556J31700k6445K9683M8760J9023m6948
6057A429116p2309J5265J1964K43231j4912k20567o6809r0141J7698K6131M1491
6046A320158r8602j36385J05529k9808M2569J0210j59537p3048m509R5933k2696
6035A049814J9508O6838j654j30095p4349l2517L9672r3423O2540j09005K4047
6024H21376k4148J56841o149j17095K0603j5944m0398J36536p6854j23980J03813
6013H34601j26044N4516k019m8576J2525j04964j48586n3840K24958n7640q0462
$$ plain form
6002 504469 673840 736101 702940 706813 674790 767355 861352 787646 666354 667527 760703 756493
5990 756493 772257 583362 560844 691819 740786 735045 793612 752416 696926 690771 719787 694395
5978 694395 618240 709974 841567 738361 529255 609090 615548 577318 567301 478071 575842
5967 575842 626590 738337 767103 737536 693549 599682 492620 464470 521619 515907 474590
5956 474590 403577 528523 478616 498150 506225 502015 539318 518938 548186 598462 623358 495399
5944 495399 466157 419667 456931 583144 506914 666052 578633 578005 573398 696750 588933
5933 588933 433677 407248 349728 349990 422551 500540 415902 394771 349681 292741 332475 487156
5921 487156 504239 462526 542832 639099 501199 344070 457493 528760 424037 583888 779836
$$ packed form
6002E04469J69371O2261l3161L873l2023R2565R3997p3706j21292J173R3176m210
5990G56493J5764j88895k2518J30975M8967n741N8567m1196n5490o155K9016k5392
5978F94395p6155R1734J31593j03206k09106P9835O458l8230j0017q9230R7771
5967E75842N0748J11747K8766k9567m3987r3867j07062k8150N7149n712m1317
5956D74590p1013J24946m9907J9534Q075m210L7303k0380K9248N0276K4896j27959
5944D95399k9242m6490L7264J26213p6230J59138q7419o28m607J23352j07817
5933E88933j55256k6429n7520K62P2561P7989q4638k1131m5090n6940L9734J54681
5921D87156J7083m1713Q0306R6267j37900j57129J13423P1267j04723J59851J95948
$$ plain form
5910 779836 915314 1009880 964032 739848 678804 675921 559523 490980 563638 561126 568564 638974
5898 638974 599562 447954 368099 352513 478103 471761 647236 612387 697818 869649 772439
5887 772439 904104 970468 1078798 1357764 1492928 1593639 1648252 1664906 1632793 1592664 1477512
5876 1477512 1348282 1313658 1309483 1231755 1065912 962047 814752 710684 611521 627898 477340
5865 477340 525099 615429 581546 660281 542695 445158 274168 263203 266237 264712 357462 564088
5853 564088 547003 456022 481231 476545 441885 419499 618409 707607 558061 681689 689789
5842 689789 665603 552289 580778 584700 594608 522124 552515 623666 660239 682839 509239 508972
5830 508972 420595 430778 464819 443138 524329 521195 452558 457575 406361 405973 449354 463205
$$ packed form
5910G79836J35478R4566m5848k24184o1044k883j16398o8543P2658k512P438P0410
5898F38974l9412j51608p9855j5586J25590o342J75475l4849Q5431J71831r7210
5887G72439J31665O6364J08330K78966J35164J00711N4613J6654l2113m0129j15152
5876A477512j29230l4624m175p7728j65843j03865j47295j04068r9163J6377j50558
5865D77340M7759R0330l3883P8735j17586r7537j70990j0965L034j525R2750K06626
5853E64088j7085r0981K5209m686l4660k2386J98910Q9198j49546J23628Q100
5842F89789k4186j13314K8489L922R908p2484L0391P1151L6573K2600j73600k67
5830E08972q8377J0183L4041k1681Q1191l134o8637N017n1214l88M3381J3851
$$ plain form
5818 463205 433713 539234 568108 619055 563910 382988 368864 479540 437812 502913 735192
5807 735192 813128 746236 835228 626988 454281 535130 495515 532698 659147 791988 790620
5796 790620 734207 839762 804159 708002 837368 898950 897851 973975 1058247 1067323 1201279
5785 1201279 1332985 1221457 1228377 1357981 1475498 1516389 1612023 1717000 1858741 1964510
5775 1964510 2212729 2335970 2581447 2815553 3178597 3478929 3808913 4177320 4712943 5366177
5765 5366177 6480365 7908061 9978235 13444172 18262113 24087322 30289688 34873385
5757 34873385 36129508 35190257 31782330 27319092 22970084 19148090 15553750 12107229
5749 12107229 9447338 7587225 6366209 5319242 4421214 3817235 3605917 3331176 3098999
$$ packed form
5818D63205k9492J05521K8874N0947n5145j80922j4124J10676m1728O5101K32279
5807G35192P7936o6892Q8992k08240j72707Q0849l9615L7183J26449J32841j368
5796G90620n6413J05555l5603r6157J29366O1582j099P6124Q4272R076J33956
5785A201279J31706j11528O920J29604J17517M0891R5634J04977J41741J05769
5775A964510K48219J23241K45477K34106L63044L00332L29984L68407N35623O53234
5765E366177J114188J427696K070174L465937M817941N825209O202366M583697
5757C4873385J256123r39251l407927m463238m349008l821994l594340l446521
5749A2107229k659891j860113j221016j046967q98028o03979k11318k74741k32177
$$ plain form
5740 3098999 2680695 2464552 2479218 2321820 2190554 2072280 1948953 1889111 1867280 1713398
5730 1713398 1621003 1468941 1396195 1354833 1229073 1182081 1077875 1175200 1157535 1144524 1182160
5719 1182160 1146022 1081644 1095398 1013543 901297 958084 1011830 1017875 861025 845434 852981
5708 852981 869303 850881 757619 730731 741539 666556 712678 751719 654497 624737 600189 551532
5696 551532 614474 635405 670863 673195 824784 793045 729448 563797 499331 576960 610923
5685 610923 506151 501309 546060 589702 606461 573240 463466 444217 509930 447537 455008 457913
5673 457913 521719 544419 393307 312587 331351 286657 367825 445817 427376 393952 314235
5662 314235 297733 354574 371252 395505 363861 413107 402892 312971 306964 338941 337688 287752
$$ packed form
5740C098999m18304k16143J4666j57398j31266j18274j23327n9842k1831j53882
5730A713398r2395j52062p2746m1362j25760m6992j04206R7325j7665j3011L7636
5719A182160l6138o4378J3754q1855j12246N6787N3746O045j56850j5591P547
5708H52981J6322j8422r3262k6888J0808p4983M6122L9041r7222k9760k4548m8657
5696E51532O2942K0931L5458K332J51589l1739o3597j65651o4466P7629L3963
5685F10923j04772m842M4751M3642J6759l3221j09774j9249O5713o2393P471K905
5673D57913O3806K2700j51112q0720J8764m4694Q1168P7992j8441l3424p9717
5662C14235j6502N6841J6678K4253l1644M9246j0215q9921o007L1977j253m9936
$$ plain form
5650 287752 301250 405488 474058 374910 434440 421804 316864 327158 435595 460918 415422
5639 415422 393421 448719 463556 451898 349976 422828 382689 345589 408377 320026 294135
5628 294135 364324 421064 478040 445409 459758 530969 420215 390626 323962 315896 264196 290316
5616 290316 311479 442721 483535 668377 586723 360606 197082 136054 210167 363415 589321
5605 589321 439817 276349 232916 404957 355853 289547 323367 246044 362529 408027 473972
5594 473972 264288 247489 240189 235774 340395 302071 294429 207915 275118 458484 232201
5583 232201 251798 285127 289658 325680 213424 237043 292034 258601 134738 160226 194433
5572 194433 219382 298669 348355 392865 479889 440489 303355 192621 194656 172036 172040 277405
$$ packed form
5650B87752J3498J04238O8570r9148N9530j2636j04940J0294J08437K5323m5496
5639D15422k2001N5298J4837j1658j01922P2852m0139l7100O2788q8351k5891
5628B94135P0189N6740N6976l2631J4349P1211j10754k9589o6664q066n1700K6120
5616B90316K1163J31242M0814J84842q1654k26117j63524o1028P4113J53248K25906
5605E89321j49504j63468m3433J72041m9104o6306L3820p7323J16485M5498O5945
5594D73972k09684j6799p300m415J04621l8324p642q6514O7203J83366k26283
5583B32201J9597L3329M531L6022j12256K3619N4991l3433j23863K5488L4207
5572A94433K4949P9287M9686M4510Q7024l9400j37134j10734K035k2620MJ05365
$$ plain form
5560 277405 365115 207542 66168 137976 262746 340360 316549 207004 331744 460338
5550 460338 437375 373427 334105 304416 277846 165694 166812 347708 418523 371598 349890
5539 349890 342403 209546 154666 108560 157488 159767 180669 257990 231253 252263 327307 358844
5527 358844 311600 288204 332181 397740 303566 269607 348477 335026 242780 317598 330109 288558
5515 288558 208339 203830 298423 310470 334783 269810 285427 273644 225300 195615 292420 247599
5503 247599 326399 333415 302742 317190 229767 238102 252540 346191 349996 405763 533095 358927
5491 358927 237310 190723 172250 300809 356733 309473 237538 340734 405429 480533 513881
5480 513881 434298 346266 324783 236219 342852 405378 349332 308365 369244 392349 338588
$$ packed form
5560B77405Q7710j57573j41374P1808J24770P7614k3811j09545J24740J28594
5550D60338k2963o3948l9322k9689k6570j12152J118J80896P0815m6925k1708
5539C49890p487j32857n4880m6106M8928K279K0902P7321k6737K1010P5044L1537
5527C58844m7244k3396M3977O5559r4174l3959P8870j3451r2246P4818J2511m1551
5515B88558q0219m509R4593J2047K4313o4973J5617j1783m8344k9685R6805m4821
5503B47599P8800P016l0673J4448q7423Q335J4438R3651L805N5767J27332j74168
5491C58927j21617m6587j8473J28559N5924m7260p1935J03196O4695P5104L3348
5480E13881p9583q8032k1483q8564J06633O2526n6046m0967O0879K3105n3761
$$ plain form
5469 338588 454118 466939 391708 450171 429936 452399 400474 382011 356077 422209 486008
5458 486008 497812 470678 390264 333061 363380 410828 493486 436450 465526 407022 453948 548725
5446 548725 528202 468945 527386 556699 488004 510909 489441 574688 608794 543680 427126
5435 427126 541238 445255 423083 534826 583979 565914 522432 390876 531424 530959 616297
5424 616297 653213 656259 691782 656984 673524 628810 571711 706399 623963 627844 549203 470757
5412 470757 512082 480033 549304 646548 800824 787550 732463 793416 736996 712399 748829
5401 748829 613332 577825 595335 646698 562394 655574 708344 646442 700835 663405 615058
5390 615058 520391 493152 657803 676385 781158 620061 604007 504401 567994 685082 561743
$$ packed form
5469C38588J15530J2821p5231N8463k0235K2463n1925j8463k5934O6132O3799
5458D86008J1804k7134q0414n7203L0319M7448Q2658n7036K9076n8504M6926R4777
5446E48725k0523n9257N8441K9313o8695K2905k1468Q5247L4106o5114j16554
5435D27126J14112r5983k2172J11743M9153j8065m3482j31556J40548m65Q5338
5424F16297L6916L046L5523l4798J6540m4714n7099J34688q2436L881p8641p8446
5412D70757M1325l2049O9271R7244J54276j3274n5087O0953n6420k4597L6430
5401G48829j35497l5507J7510N1363q4304R3180N2770o1902N4393l7430m8347
5390F15058r4667k7239J64651J8582J04773j61097j6054r9606O3593J17088j23339
$$ plain form
5379 561743 532881 594968 694381 609033 569513 593734 663150 545790 647580 760287 715536
5368 715536 685241 626288 670311 672271 690255 761234 791646 811398 738116 870109 852319 671272
5356 671272 655170 666200 679815 678603 821008 930177 871679 796662 753452 726480 677264
5345 677264 645445 628422 697809 840546 706870 612390 676094 838162 1001878 1164795 1013792
5334 1013792 858650 918918 855358 835566 955058 970914 946579 929859 931181 1000031 974413
5323 974413 997417 979783 1023361 968288 934460 1004492 937138 938476 892949 939578 894440 874562
5311 874562 990035 980356 1063495 1060352 1154809 1123540 1123042 1012585 942644 1012981 1056706 1066056
5299 1066056 1236692 1201975 1223964 1247679 1195448 1122780 1096640 1151444 1139301 1145954 1161734
$$ packed form
5379E61743k8862O2087R9413q5348l9520K4221O9416j17360J01790J12707m4751
5368G15536l0295n8953M4023J960J7984P0979L0412J9752p3282J31993j7790j81047
5356F71272j6102J1030J3615j212J42405J09169n8498p5017m3210k6972m9216
5345F77264l1819j7023O9387J42737j33676r4480O3704J62068J63716J62917j51003
5334A013792j55142O0268o3560j9792J19492J5856k4335j6720J322O8850k5618
5323I74413K3004j7634M3578n5073l3828P0032o7354J338m5527M6629m5138j9878
5311H74562J15473r679Q3139l143R4457l1269m98j10457o9941P0337M3725R350
5299A066056J70636l4717K1989K3715n2231p2668k6140N4804j2143O653J5780
$$ plain form
5288 1161734 1248008 1266060 1339413 1301864 1200355 1290203 1435590 1496721 1531835 1562738 1376912
5277 1376912 1241677 1392218 1272440 1262960 1486279 1540131 1360199 1376448 1371030 1404476 1454745
5266 1454745 1542519 1571450 1635781 1645835 1610061 1622347 1580150 1641983 1713890 1879711 1872320
5255 1872320 1855444 1880749 1881730 2019067 2145522 2025959 1852177 1927701 2109127 2234876 2360781
5244 2360781 2308810 2148875 2083587 2012085 2065916 2266450 2350555 2411553 2471465 2429430 2558268
5233 2558268 2433085 2354390 2383713 2602056 2590818 2535391 2614952 2731175 2662070 2639590 2824114
5222 2824114 2811886 2894843 3029002 3175100 3174342 3321213 3293855 3337619 3390999 3472831 3522140
5211 3522140 3579695 3601177 3550756 3635073 3596951 3661479 3698862 3769071 3961123 4152957 4207572
$$ packed form
5288A161734Q6274J8052P3353l7549j01509Q9848J45387O1131L5114L0903j85826
5277A376912j35235J50541j19778r480K23319N3852j79932J6249n418L3446N0269
5266A454745Q7774K8931O4331J0054l5774J2286m2197O1833P1907J65821p391
5255A872320j6876K5305R81J37337J26455j19563j73782P5524J81426J25749J25905
5244B360781n1971j59935o5288p1502N3831K00534Q4105O0998N9912m2035J28838
5233B558268j25183p8695K9323K18343j1238n5427P9561J16223o9105k2480J84524
5222B824114j2228Q2957J34159J46098p58J46871k7358M3764N3380Q1832M9309
5211C522140N7555K1482n0421Q4317l8122O4528L7383P0209J92052J91834N4615
$$ plain form
5200 4207572 4245338 4513725 4691757 4590033 4497938 4594554 4772741 4896392 5057333 5133208
5190 5133208 5087953 5258559 5295482 5341000 5467831 5671889 5796714 5957385 6171013 6316377
5180 6316377 6356809 6571093 6659121 6899775 7179064 7277460 7562291 7755592 7944579 8126511
5170 8126511 8338840 8478896 8735877 8977293 9250702 9515155 9890789 10149967 10556684 10962929
5160 10962929 11191908 11543026 11916608 12280183 12743944 13173620 13675663 14319288 14891656
5151 14891656 15586545 16176736 16825245 17446038 18032065 18744280 19653655 20658324 21536583
5142 21536583 22398359 23458756 24599017 25507599 26905097 28367908 29760675 31239405
5134 31239405 32828713 34519530 36295693 38255373 40269992 42340426 44583249 46971153
$$ packed form
5200D207572L7766K68387J78032j01724r2095R6616J78187J23651J60941P5875
5190E133208m5255J70606L6923M5518J26831K04058J24825J60671K13628J45364
5180F316377M0432K14284Q8028K40654K79289R8396K84831J93301J88987J81932
5170H126511K12329J40056K56981K41416K73409K64453L75634K59178M06717M06245
5160A0962929K28979L51118L73582L63575M63761M29676N02043O43625N72368
5151A4891656O94889N90191O48509O20793N86027P12215R09375J004669Q78259
5142B1536583Q61776J060397J140261R08582J397498J462811J392767J478730
5134C1239405J589308J690817J776163J959680K014619K070434K242823K387904
$$ plain form
5126 46971153 49339379 51741039 54379600 56963188 59351196 61774576 64100929 66244432
5118 66244432 68185319 69959960 71333917 72318551 72924809 73263889 73091596 72529838 71610533
5109 71610533 70311844 68744731 66754546 64673931 62426915 60013415 57600376 55084836
5101 55084836 52470050 50069694 47582518 45361792 43299418 41254664 39360156 37408585
5093 37408585 35697195 34062951 32491543 30927118 29551199 28154094 26895064 25792521
5085 25792521 24889150 23849166 22919129 21949115 21071715 20225856 19466696 18773396 18143109
5076 18143109 17435680 16920050 16230547 15646974 15221521 14815480 14471676 13908108 13603339
5067 13603339 13171790 12735193 12268343 11906624 11469355 11070098 10857960 10746036 10428180
$$ packed form
5126D6971153K368226K401660K638561K583588K388008K423380K326353K143503
5118F6244432J940887J774641J373957R84634O06258L39080j72293n61758r19305
5109G1610533j298689j567113j990185k080615k247016k413500k413039k515540
5101E5084836k614786k400356k487176k220726k062374k044754j894508j951571
5093C7408585j711390j634244j571408j564425j375919j397105j259030j102543
5085B5792521r03371j039984r30037r70014q77400q45859p59160o93300o30287
5076A8143109p07429n15630o89503n83573m25453m06041l43804n63568l04769
5067A3603339m31549m36597m66850l61719m37269l99257k12138j11924l17856
$$ plain form
5058 10428180 10199439 9966382 9593560 9292136 9074769 8853569 8584054 8363151 8200556
5049 8200556 7959778 7684411 7489708 7408463 7414206 7287754 7059722 6951219 6652567 6440527
5039 6440527 6337419 6219387 6096289 5973478 5819374 5606359 5603458 5490724 5342684 5421915
5029 5421915 5447602 5395132 5299010 5128839 4986268 4889145 4879722 4740694 4678172 4588458 4584709
5018 4584709 4461834 4487782 4477246 4396221 4389334 4326173 4252106 4245765 4270325 4076680 4171989
5007 4171989 4200622 4127279 4086775 4107535 4187132 4231063 4204277 4252714 4286238 4352119 4361251 4440031
4995 4440031 4719145 5127318 5649188 6228694 6693527 6968335 6928418 6704613 6386693 5932626
4985 5932626 5452005 5005693 4630171 4421332 4138732 3827639 3383396 3244476 3024140 2975314
$$ packed form
5058A0428180k28741k33057l72822l01424k17367k21200k69515k20903j62595
5049H200556k40778k75367j94703q1245N743j26452k28032j08503k98652k12040
5039F440527j03108j18032j23098j22811j54104k13015k901j12734j48040P9231
5029E421915K5687n2470r6122j70171j42571r7123r423j39028o2522q9714l749
5018D584709j22875K5948j0536q1025o887o3161p4067o341K4560j93645R5309
5007D171989K8633p3343m0504K0760P9597M3931k6786M8437L3524O5881R132P8780
4995D440031K79114M08173N21870N79506M64833K74808l9917k23805l17920m54067
4985E932626m80621m46312l75522k08839k82600l11093m44243j38920k20336m8826
$$ plain form
4975 2975314 3025849 3032647 3167796 3159686 3092858 2955957 2762618 2768974 2828548 2792627 2750884
4964 2750884 2739177 2799690 2692301 2584934 2476509 2456059 2563402 2586264 2517704 2505293 2647513
4953 2647513 2626438 2610124 2605586 2516086 2561851 2439809 2482956 2547770 2596956 2538129 2421087
4942 2421087 2385501 2381061 2405098 2388071 2374750 2528633 2546299 2526151 2439584 2495423 2505437
4931 2505437 2374422 2423797 2405416 2461825 2509935 2547994 2576002 2530449 2449532 2365905 2429239
4920 2429239 2379288 2323471 2375232 2653010 2744107 2771320 2533635 2340730 2471008 2540579 2658412
4909 2658412 2786768 2779155 2790262 2862996 2917534 2837633 2852595 2798954 2938758 3016496 3091832
4898 3091832 3120331 3110133 3158131 3249500 3343388 3273345 3284241 3403473 3434491 3364380 3361826
$$ packed form
4975B975314N0535O798J35149q110o6828j36901j93339O356N9574l5921m1743
4964B750884j1707O0513j07389j07367j08425k0450J07343K2862o8560j2411J42220
4953B647513k1075j6314m538q9500M5765j22042M3147O4814M9186n8827j17042
4942B421087l5586m440K4037j7027j3321J53883J7666k0148q6567N5839J0014
4931B505437j31015M9375j8381N6409M8110L8059K8008m5553q0917q3627O3334
4920B429239m9951n5817N1761K77778R1097K7213k37685j92905J30278O9571J17833
4909B658412J28356p613J1107P2734N4538p9901J4962n3641J39804P7738P5336
4898C091832K8499j0198M7998R1369R3888p0043J0896J19232L1018p0111k554
$$ plain form
4887 3361826 3434122 3585988 3550790 3592463 3641748 3727092 3822956 3895281 4039002 4237149 4327189
4876 4327189 4419543 4369743 4337201 4511734 4761441 4809264 4889903 5081931 5215981 5463404
4866 5463404 5527925 5604328 5830808 6023457 6182235 6457417 6765514 7020181 7402518 7800748
4856 7800748 8060896 8355912 8879241 9722964 10751878 11601728 12510706 13167982 13638882
4847 13638882 13951764 14141458 14333533 14616640 15061672 15642630 16483439 17338216 18292593
4838 18292593 19324339 20441565 21811802 23250264 24689472 26251548 27995968 29699276
4830 29699276 31547975 33594001 35958639 39022553 43336210 48523052 54050837 58442328
4822 58442328 60568675 60982311 59707580 57250169 54903536 53067755 51539498 50343144
$$ packed form
4887C361826P2296J51866l5198M1673M9285Q5344R5864P2325J43721J98147R0040
4876D327189R2354m9800l2542J74533K49707M7823Q0639J92028J34050K47423
4866E463404O4521P6403K26480J92649J58778K75182L08097K54667L82337L98230
4856G800748K60148K95016N23329Q43723J028914Q49850R08978O57276M70900
4847A3638882L12882J89694J92075K83107M45032N80958Q40809Q54777R54377
4838A8292593J031746J117226J370237J438462J439208J562076J744420J703308
4830B9699276J848699K046026K364638L063914M313657N186842N527785M391491
4822E8442328K126347M13636j274731k457411k346633j835781j528257j196354
$$ plain form
4814 50343144 49752950 50059571 50978595 52178311 53723246 55346623 57224273 59034755 60974456
4805 60974456 63003197 64737257 66397764 68028471 69499240 70673289 71645515 72100898
4797 72100898 72151994 71914200 71237905 70358808 69158977 67972730 66651759 65195449 63866404
4788 63866404 62528518 61232649 59950853 58802633 57977918 57246966 56312237 55395546 54409435
4779 54409435 53503914 52414402 51280984 50176052 49023234 47655308 46061157 44484572
4771 44484572 42910213 41222808 39651162 38010442 36232796 34652689 33245974 31793875
4763 31793875 30416670 29207879 28097182 27153305 26292102 25593818 24857188 24227006 23869530
4754 23869530 23499937 23193862 23095878 23062333 22929231 23030137 23220466 23498682 23738125 24030420
$$ packed form
4814E0343144n90194L06621R19024J199716J544935J623377J877650J810482J939701
4805F0974456K028741J734060J660507J630707J470769J174049R72226M55383
4797G2100898N1096k37794o76295q79097j199831j186247j320971j456310j329045
4788F3866404j337886j295869j281796j148220q24715p30952r34729r16691r86111
4779E4409435r05521j089512j133418j104932j152818j367926j594151j576585
4771D4484572j574359j687405j571646j640720j777646j580107j406715j452099
4763C1793875j377205j208791j110697r43877q61203o98284p36630o30182l57476
4754B3869530l69593l06075r7984l3545j33102J00906J90329K78216K39443K92295
$$ plain form
4744 24030420 24543274 25140728 25887909 26851251 27721574 28545819 29674857 30879716 32215967
4735 32215967 33763424 35260157 36783189 38464479 39981776 41326885 42724740 44017234
4727 44017234 45438208 46831729 48051947 49180746 50207421 51282782 52253323 53045467
4719 53045467 53986677 55059307 56130507 57381132 58791252 60224705 61763309 63190344
4711 63190344 64687703 66043812 67427544 68943327 70074382 71169993 71818493 72085788
4703 72085788 72119101 71555798 70717647 69717695 68534825 67149460 65560538 63745734 61904371
4694 61904371 59972591 57846157 55712614 53589243 51538358 49730263 48058519 46636003
4686 46636003 45314233 44165696 43202867 42232356 41357932 40546400 39923780 39189226 38297057
$$ packed form
4744B4030420N12854N97454P47181R63342Q70323Q24245J129038J204859J336251
4735C2215967J547457J496733J523032J681290J517297J345109J397855J292494
4727D4017234J420974J393521J220218J128799J026675J075361R70541P92144
4719E3045467R41210J072630J071200J250625J410120J433453J538604J427035
4711F3190344J497359J356109J383732J515783J131055J095611O48500K67295
4703G2085788L3313n63303q38151r99952j182870j385365j588922j814804j841363
4694F1904371j931780k126434k133543k123371k050885j808095j671744j422516
4686D6636003j321770j148537r62829r70511q74424q11532o22620p34554q92169
$$ plain form
4677 38297057 37342925 36329607 35232038 34056106 32908037 31635105 30225992 28916948
4669 28916948 27587084 26184297 24643528 23190781 21818033 20647006 19452678 18375613
4661 18375613 17320149 16324613 15430663 14625070 14032780 13327826 12647632 12078648 11563020
4652 11563020 11167014 10730476 10366642 9968929 9438942 9130613 8935234 8733139 8627005
4643 8627005 8494262 8429665 8380670 8211085 7925085 7666285 7722174 7710011 7694597 7680296 7813565
4632 7813565 7962032 8021303 8300623 8752074 9466333 10597466 11749962 12847440 13437492
4623 13437492 13414379 12967704 12014930 11113549 10364674 9630918 9052479 8649894 8468134 8419812
4613 8419812 8424666 8596964 8836703 9515337 10175370 10892061 11661660 12305910 12718664 13162898
$$ packed form
4677C8297057r54132j013318j097569j175932j148069j272932j409113j309044
4669B8916948j329864j402787j540769j452747j372748j171027j194328j077065
4661A8375613j055464r95536q93950q05593n92290p04954o80194n68984n15628
4652A1563020l96006m36538l63834l97713n29987l08329j95379k02095j06134
4643H627005j32743o4597m8995j69585k86000k58800N5889j2163j5414j4301J33269
4632G813565J48467N9271K79320M51451P14259J131133J152496J097478N90052
4623A3437492k3113m46675r52774r01381p48875p33756n78439m02585j81760m8322
4613H419812M854J72298K39739O78634O60033P16691P69599O44250M12754M44234
$$ plain form
4603 13162898 13771183 14660698 15775868 16980183 18006425 18741502 19109212 19321643 19701063
4594 19701063 20128702 20818985 21757102 22648442 23059154 23004270 22542371 21909948 21210420 20668686
4584 20668686 20216823 19854461 19366897 18732524 17854830 16836667 15772960 14746982 13882464
4575 13882464 12984656 12353483 11678842 10858647 9860897 9120801 8390282 7468325 6778102
4566 6778102 6136112 5711772 5207300 4754705 4414991 4213249 3979568 3846650 3831870 3729005
4556 3729005 3602377 3485113 3235337 3132902 3210143 2945138 2794204 2789385 2799780 2821050
4546 2821050 2703056 2582875 2389347 2410979 2438670 2387927 2390716 2502900 2455745 2380013 2294690
4535 2294690 2229345 2132033 2084454 1998465 2043024 2149961 2106978 2177935 2097084 2004095 2048365
$$ packed form
4603A3162898O08285Q89515J115170J204315J026242P35077L67710K12431L79420
4594A9701063M27639O90283R38117Q91340M10712n4884m61899o32423o99528n41734
4584B0668686m51863l62362m87564o34373q77694j018163j063707j025978q64518
4575A3882464q97808o31173o74641q20195r97750p40096p30519r21957o90223
4566F778102o41990m24340n04472m52595l39714k01742k33681j32918j4780j02865
4556C729005j26628j17264k49776j02435P7241k65005j50934m819J0395K1270
4546B821050j17994j20181j93528K1632K7691n0743K789J12184m7155p5732q5323
4535B294690o5345r7312m7579q5989M4559J06937m2983P0957q0851r2989M4270
$$ plain form
4524 2048365 2074957 1930831 2038399 2006817 1947701 2026033 1962091 1880883 1869129 1921241 1880547
4513 1880547 1686698 1667068 1631582 1644239 1672913 1623239 1437996 1484856 1601471 1485492 1491555
4502 1491555 1640541 1620177 1508222 1535310 1412101 1424726 1395667 1382342 1479956 1525695 1390220
4491 1390220 1219527 1081856 1070935 1043357 1104639 1173668 1161984 1138686 1134014 1198682 1065859
4480 1065859 1036836 1089572 1107567 1190312 1203684 1202355 1193926 1141144 959342 800098 850127
4469 850127 726757 845088 1009217 1025594 950918 857927 783471 746174 663854 505737 741804
4458 741804 824752 779212 845842 756144 686218 581512 657740 668168 715619 825958 803615
4447 803615 767625 818917 657809 595735 731102 804430 794681 726810 760732 845774 827111
$$ packed form
4524B048365K6592j44126J07568l1582n9116P8332o3942q1208j1754N2112m0694
4513A880547j93849j9630l5486J2657K8674m9674j85243M6860J16615j15979O063
4502A491555J48986k0364j11955K7088j23209J2625k9059j3325R7614M5739j35475
4491A390220j70693j37671j0921k7578O1282O9029j1684k3298m672O4668j32823
4480A065859k9023N2736J7995Q2745J3372j329q429n2782j81802j59244N0029
4469H50127j23370J18331J64129J6377p4676r2991p4456l7297q2320j58117K36067
4458G41804Q2948m5540O6630q9698o9926j04706P6228J0428M7451J10339k2343
4447H03615l5990N1292j61108o2074J35367P3328r749o7871L3922Q5042j8663
$$ plain form
4436 827111 693597 619839 574919 710827 816584 873988 968038 823822 720348 734114 697923
4425 697923 648702 640278 791443 782002 827477 863826 802373 770280 949502 768064 886271
4414 886271 898348 888427 845109 826952 800732 734857 764313 841031 891771 809081 785354 858167
4402 858167 787276 684104 545403 590752 785692 874107 977375 823237 783958 711569 701619
4391 701619 681641 674768 625886 656262 541274 633123 678096 615831 509205 526477 707959
4380 707959 700519 659126 583586 615083 853951 627025 460847 417180 497848 559677 654734
4369 654734 701117 742615 630591 487689 497193 479425 441650 385621 511484 675504 546615
4358 546615 556246 540636 511626 499424 466488 493600 503730 467002 468529 502731 438293 443249
$$ packed form
4436H27111j33514p3758m4920J35908J05757N7404R4050j44216j03474J3766l6191
4425F97923m9221q424J51165r441M5475L6349o1453l2093J79222j81438J18207
4414H86271J2077r921m3318j8157k6220o5875K9456P6718N0740q2690k3727P2813
4402H58167p0891j03172j38701M5349J94940Q8415J03268j54138l9279p2389r950
4391G01619j9978o873m8882L0376j14988R1849M4973o2265j06626J7272J81482
4380G07959p440m1393p5540L1497K38868k26926j66178m3667Q0668O1829R5057
4369F54734M6383M1498j12024j42902R504j7768l7775n6029J25863J64020j28889
4358E46615R631j5610k9010j2202l2936K7112J0130l6728J527L4202o4438M956
$$ plain form
4346 443249 571367 484379 593005 841756 810477 740262 608320 628107 643296 581711 506076
4335 506076 589811 586982 614781 720849 787730 618621 502173 641299 653712 524185 571699
4324 571699 610398 604653 576090 629261 596479 493741 436739 560156 537670 559980 670400
4313 670400 652629 627100 637606 546089 552206 582316 747874 789120 912210 967428 847188
4302 847188 738553 871281 930563 939747 908394 900004 933527 806149 798024 750141 698439 622456
4290 622456 568617 676848 782043 855365 807685 769108 862888 853495 849973 764081 855251 933311
4278 933311 917933 889073 861982 986767 923945 839514 766906 811063 969918 1084263 1089473
4267 1089473 1145022 1129145 991575 1114160 1195363 1141034 1156485 1204594 1118418 1057355 960023
$$ packed form
4346D43249J28118q6988J08626K48751l1279p0215j31942J9787J5189o1585p5635
4335E06076Q3735k829K7799J06068O6881j69109j16448J39126J2413j29527M7514
4324E71699L8699n745k8563N3171l2782j02738n7002J23417k2486K2310J10420
4313F70400j7771k5529J0506r1517O117L0110J65558M1246J23090N5218j20240
4302H47188j08635J32728N9282R184l1353q390L3523j27378q125m7883n1702p5983
4290F22456n3839J08231J05195P3322m7680l8577R3780r393l522q5892R1170P8060
4278I33311j5378k8860k7091J24785o2822q4431p2608M4157J58855J14345N210
4267A089473N5549j5877j37570J22585Q1203n4329J5451M8109q6176o1063r7332
$$ plain form
4256 960023 913994 841141 877438 893237 808120 895469 1030474 1022292 1078900 1013647 941302 883843
4244 883843 898184 958857 988332 1060201 1070260 971982 1037081 1080400 1177598 1182904 1038220 1042639
4232 1042639 982838 1130475 1228637 1109968 1092667 925142 958105 1065095 961849 942288
4222 942288 920902 894432 1000160 1169110 1147248 1027416 945559 914256 929926 1005631 1134718
4211 1134718 1096982 1232978 1274247 1149292 1085282 1092080 1106376 1077704 1114052 1081792 954970
4200 954970 966279 937646 950907 1025569 934832 971126 1037476 1035510 1025896 1064735 1051689 973234
4188 973234 966294 1058031 977659 959067 998573 1078468 1054514 878740 827380 918154 850095 788051
4176 788051 814883 882278 960147 821486 843381 824293 840625 989236 920138 785123 738195
$$ packed form
4256I60023m6029p2853L6297J5799q5117Q7349J35005q182N6608o5253p2345n7459
4244H83843J4341O0673K9475P1869J0059r8278O5099M3319R7198N306j44684M419
4232A042639n9801J47637R8162j18669j7301j67525L2963J06990j03246j9561
4222I42288k1386k6470J05728J68950k1862j19832q1857l1303J5670P5705J29087
4211A134718l7736J35996M1269j24955o4010O798J4296k8672L6348l2260j26822
4200I54970J1309k8633J3261P4662r0737L6294O6350j966r614L8839j3046p8455
4188I73234o940R1737q0372j8592L9506P9895k3954j75774n1360R0774o8059o2044
4176G88051K6832O7395P7869j38661K1895j9088J6332J48611o9098j35015m6928
$$ plain form
4165 738195 855134 861811 876190 906488 881848 877986 878941 832586 731753 741373 783727 775741
4153 775741 868146 915307 902877 852910 839788 904711 911656 927473 894409 895495 970562 950562
4141 950562 876739 884336 1009874 1160084 1133820 1078527 981883 950684 859247 893022 907601
4130 907601 1044117 940452 950610 1071759 1042353 1064829 1053862 1103378 932668 974414 1182559
4119 1182559 1227650 1207417 1205654 1191036 1216790 1232803 1288086 1249059 1172438 1205005 1261471 1312831
4107 1312831 1410358 1419936 1327728 1372533 1506220 1424163 1291828 1307010 1399601 1417099 1506073
4096 1506073 1449102 1441913 1468543 1437824 1461232 1548055 1635295 1697369 1820469 1894551 1844678
4085 1844678 1723602 1746603 1802291 1979874 1993735 1941201 2001115 1955274 2121064 2174244 2155057
$$ packed form
4165G38195J16939O677J4379L0298k4640l862R55m6355j00833R620M2354p986
4153G75741R2405M7161j2430m9967j3122O4923O945J5817l3064J086P5067k0000
4141I50562p3823P597J25538J50210k6264n5293r6644l1199r1437L3775J4579
4130I07601J36516j03665J0158J21149k9406K2476j0967M9516j70710M1746K08145
4119A182559M5091k0233j763j4618K5754J6013N5283l9027p6621L2567N6466N1360
4107A312831R7527R578r2208M4805J33687q2057j32335J5182R2591J7498Q8974
4096A506073n6971p189K6630l0719K3408Q6823Q7240O2074J23100P4082m9873
4085A844678j21076K3001N5688J77583J3861n2534N9914m5841J65790N3180j9187
$$ plain form
4074 2155057 2141493 2244023 2316524 2333559 2388464 2630960 2752744 2670464 2613380 2809901 2919880
4063 2919880 2821721 2841782 2896580 2986093 3077452 3233644 3358437 3535027 3932429 4373125
4053 4373125 4979974 5632315 6469042 7243875 7682745 7799701 7563957 7268611 6856303 6361832
4043 6361832 5835689 5444217 5198845 4978546 4812217 4969336 4860307 4832182 4888458 4926405
4033 4926405 4953073 4968171 5078178 5188688 5240475 5443669 5612700 5642271 5805145 5734330
4023 5734330 5808460 5969656 6152731 6367376 6502972 6784674 6945396 7211632 7563004 7820498
4013 7820498 8149286 8454038 8968274 9356354 9632115 9994488 10377712 10744384 10997085 11433185
4003 11433185 11875958 12524444 13042080 13510534 13991093 14370334 14827266 15301561 15816861
$$ packed form
4074B155057j3564J02530P2501J7035N4905K42496J21784q2280n7084J96521J09979
4063B919880r8159K0061N4798Q9513R1359J56192J24793J76590L97402M40696
4053D373125O06849O52341Q36727P74833M38870J16956k35744k95346m12308m94471
4043F361832n26143l91472k45372k20299j66329J57119j09029k8125N6276L7947
4033D926405K6668J5098J10007J10510N1787K03194J69031K9571J62874p0815
4023E734330P4130J61196J83075K14645J35596K81702J60722K66236L51372K57494
4013G820498L28788L04752N14236L88080K75761L62373L83224L66672K52701M36100
4003A1433185M42773O48486N17636M68454M80559L79241M56932M74295N15300
$$ plain form
3994 15816861 16251883 16781999 17188863 17566018 17931273 18276152 18590438 18979472 19353959
3985 19353959 19809267 20426534 21006064 21696276 22456080 23433814 24425978 25570429 26948754
3976 26948754 28359246 29809113 31492650 33185167 35102287 37280373 39617809 42211888
3968 42211888 44869291 47404181 50185107 52655498 54936153 57319511 59496675 61394294
3960 61394294 63406596 65358857 67372772 69420581 71770504 74208840 77059951 80370180
3952 80370180 83971279 87927554 92172313 96290518 100143394 103611768 106654669 109220849
3944 109220849 111161506 112930835 114522314 116298338 118505730 120907839 123175311 125544955
3936 125544955 127596440 129207778 130371405 130870848 130402250 129461451 127701759 125424051
$$ packed form
3994A5816861M35022N30116M06864L77155L65255L44879L14286L89034L74487
3985A9353959M55308O17267N79530O90212P59804R77734R92164J144451J378325
3976B6948754J410492J449867J683537J692517J917120K178086K337436K594079
3968D2211888K657403K534890K780926K470391K280655K383358K177164J897619
3960F1394294K012302J952261K013915K047809K349923K438336K851111L310229
3952H0370180L601099L956275M244759M118205L852876L468374L042901K566180
3944A09220849J940657J769329J591479J776024K207392K402109K267472K369644
3936A25544955K051485J611338J163627M99443m68598r40799j759692k277708
$$ plain form
3928 125424051 122816135 120050916 117216333 114652504 112246353 110291718 108468689 106824997
3920 106824997 104972493 102643641 99945077 97076423 94141917 91140239 87961040 84558471
3912 84558471 81062626 77793860 74564518 71656590 69228569 66795207 64611614 62416969
3904 62416969 60092864 57889522 55711778 53616462 51375116 49090691 46823089 44576181
3896 44576181 42416396 40289505 38313014 36309932 34424124 32753914 31229678 29783476
3888 29783476 28283484 26955582 25887888 24909174 23993028 23166669 22623527 22008496 21482987
3879 21482987 21053717 20444161 19886488 19678941 19361380 19006475 18628746 18106254 17591069
3870 17591069 17078731 16569037 16216303 15659642 15240619 14987424 14659416 14281994 13928159
$$ packed form
3928A25424051k607916k765219k834583k563829k406151j954635j823029j643692
3920A06824997j852504k328852k698564k868654k934506l001678l179199l402569
3912H4558471l495845l268766l229342k907928k428021k433362k183593k194645
3904F2416969k324105k203342k177744k095316k241346k284425k267602k246908
3896D4576181k159785k126891j976491k003082j885808j670210j524236j446202
3888B9783476j499992j327902j067694r78714r16146q26359n43142o15031n25509
3879B1482987m29270o09556n57673k07547l17561l54905l77729n22492n15185
3870A7591069n12338n09694l52734n56661m19023k53195l28008l77422l53835
$$ plain form
3861 13928159 13518327 13128304 12691667 12113071 11574976 11063664 10666536 10353745 9940262
3852 9940262 9671620 9246528 8845139 8488149 8159423 7848532 7518936 7362234 7113700 6975281
3842 6975281 6827558 6520278 6150843 6056543 6000347 5869461 5752147 5688229 5556200 5517342
3832 5517342 5440673 5381241 5492628 5380404 5199664 5065235 5007934 5004559 4830433 4638148
3822 4638148 4554833 4407271 4273151 4233144 4205257 4025472 3920092 3883059 3691065 3625624
3812 3625624 3591232 3602475 3565230 3445055 3435983 3315771 3282258 3274863 3235475 3090966 3121368
3801 3121368 3045095 3054376 3185631 3106576 2968891 2854868 2787411 2787283 2840074 2634905 2646144
3790 2646144 2805679 2757907 2762106 2727401 2799258 2581690 2532489 2521845 2511359 2510504 2471515 2523933
$$ packed form
3861A3928159m09832l90023m36637n78596n38095n11312l97128l12791m13483
3852I940262k68642m25092m01389l56990l28726l10891l29596j56702k48534j38419
3842F975281j47723l07280l69435r4300n6196j30886j17314o3918j32029l8858
3832E517342p6669n9432J11387j12224j80740j34429n7301l375j74126j92285
3822D638148q3315j47562j34120m0007k7887j79785j05380l7033j91994o5441
3812C625624l4392J1243l7245j20175r072j20212l3513p395l9388j44509L0402
3801C121368p6273R281J31255p9055j37685j14023o7457j28N2791k05169J1239
3790B646144J59535m7772M199l4705P1857k17568m9201j0644j0486q55l8989N2418
$$ plain form
3778 2523933 2443532 2361784 2311348 2254133 2289168 2389665 2307510 2365955 2314628 2277901 2316554
3767 2316554 2349063 2373760 2295800 2293835 2339485 2198677 2147114 2202123 2190243 2117090 2267051
3756 2267051 2267941 2249874 2339599 2404053 2389065 2316436 2201388 2229059 2236715 2167693 2142477 2091335
3744 2091335 1989562 2016165 2074681 2096161 2089072 2045327 2116931 2152486 2200337 2140408 2036488
3733 2036488 2104502 2142095 2262184 2164506 2026495 2136139 2200604 2132550 2143733 2063854 2077641
3722 2077641 2057135 2121794 2294714 2219560 2186643 2214414 2275671 2278845 2294393 2297759 2358511 2482106
3710 2482106 2554115 2546228 2605574 2648892 2641148 2691518 2741680 2642116 2617829 2614533 2739492 2674088
3698 2674088 2701564 2562497 2430105 2437959 2641447 2711333 2658149 2747899 2712226 2706141 2796387
$$ packed form
3778B523933q0401q1748n0436n7215L5035J00497q2155N8445n1327l6727L8653
3767B316554L2509K4697p7960j965M5650j40808n1563N5009j1880p3153J49961
3756B267051Q90j8067Q9725O4454j4988p2629j15048K7671P656o9022k5216n1142
3744B091335j01773K6603N8516K1480p089m3745P1604L5555M7851n9929j03920
3733B036488O8014L7593J20089r7678j38011J09644O4465o8054J1183p9879J3787
3722B077641k0506O4659J72920p5154l2917K7771O1257L174J5548L366O0752J23595
3710B482106P2009p887N9346M3318p744N0370N0162r9564k4287l296J24959o5404
3698B674088K7476j39067j32392P854K03488O9886n3184Q9750l5673o085R0246
$$ plain form
3687 2796387 3022318 3145754 3118931 3108007 3046213 3098105 3182384 3215640 3242948 3183777 3329705
3676 3329705 3358244 3429151 3593031 3735666 3750982 3714691 3635000 3590405 3552772 3612311 3628523
3665 3628523 3601830 3831870 3847300 3942060 3812721 3810389 3996314 4100630 4105374 4184497 4503787
3654 4503787 4494287 4465270 4633511 4708828 4894424 5062242 5173647 5448884 5510834 5727875
3644 5727875 5801561 6022595 6172792 6393656 6483225 6542194 6792195 6978686 7293269 7533982
3634 7533982 7636938 7733378 7987893 8128738 8368111 8884193 9379053 9937832 10691138 11497795
3624 11497795 12187776 13015522 14011891 15288314 16615911 18179014 20032685 22321864 25135073
3615 25135073 28855985 33988444 40850582 50192057 62169369 75320514 87478605 95849099
$$ packed form
3687B796387K25931J23436k6823j0924o1794N1892Q4279L3256K7308n9171J45928
3676C329705K8539P0907J63880J42635J5316l6291p9691m4595l7633N9539J6212
3665C628523k6693K30040J5430R4760j29339k332J85925J04316M744P9123L19290
3654D503787r500k9017J68241P5317J85596J67818J11405K75237O1950K17041
3644E727875P3686K21034J50197K20864Q9569N8969K50001J86491L14583K40713
3634G533982J02956R6440K54515J40845K39373N16082M94860N58779P53306Q06657
3624A1497795O89981Q27746R96369J276423J327597J563103J853671K289179K813209
3615B5135073L720912N132459O862138R341475J1977312J3151145J2158091Q370494
$$ plain form
3607 95849099 98870854 96801858 90371752 81715408 72447815 63516292 54999715 47487566
3599 47487566 41524594 37035266 33691002 31381200 29797418 28912438 28612145 28712458 29385654
3590 29385654 30325208 31656113 33422328 35694697 38552009 41912634 46304502 52494642
3582 52494642 60919493 72827418 89619430 112032874 138341234 164538416 183455186
3575 183455186 190976084 188155374 175435450 156866903 136896750 117644938 99568590
3568 99568590 83279553 69397483 58520515 50738254 44924794 40224384 36984502 34448248
3560 34448248 32691741 31420892 30427104 29946885 30004874 30442323 30996742 32021238 33621893
3551 33621893 36001266 39090129 43746801 50670613 59791017 70846930 82302801 91679053
$$ packed form
3607I5849099L021755k068996o430106q656344r267593q931523q516577p512149
3599D7487566n962972m489328l344264k309802j583782q84980l00293J00313O73196
3590B9385654R39554J330905J766215K272369K857312L360625M391868O190140
3582E2494642Q424851J1907925J6792012K2413444K6308360K6197182J8916770
3575A83455186P520898k820710j2719924j8568547j9970153j9251812j8076348
3568I9568590j6289037j3882070j0876968p782261n813460m700410l239882k536254
3560C4448248j756507j270849r93788m80219N7989M37449N54419J024496J600655
3551C3621893K379373L088863M656672O923812R120404J1055913J1455871R376252
$$ plain form
3543 91679053 96232721 95581263 90610402 82339212 72898593 63408227 54353042 46122825
3535 46122825 39018261 33270745 28839480 25373703 22723948 20524991 18834856 17477571
3527 17477571 16393603 15361526 14593187 13795567 13073646 12563270 12127830 11745124 11173199
3518 11173199 10770306 10468876 10123536 9773344 9426612 8938119 8612456 8390249 8202003
3509 8202003 8112819 7925276 7771228 7723359 7580559 7598644 7550493 7415759 7361056 7217035
3499 7217035 7282117 7109684 7021060 7059578 6965148 6821380 6567480 6381428 6436106 6331963
3489 6331963 6152158 6143604 6152040 6011207 6058893 6030202 5841667 5791429 5689876 5653411 5626935
3478 5626935 5588902 5552460 5657768 5635397 5579615 5658491 5809002 5860612 5958869 6139911 6311891
$$ packed form
3543I1679053M553668o51458m970861q271190r440619r490366r055185q230217
3535D6122825p104564n747516m431265l465777k649755k198957j690135j357285
3527A7477571j083968j032077p68339p97620p21921n10376m35440l82706n71925
3518A1173199m02893l01430l45340l50192l46732m88493l25663k22207j88246
3509H202003q9184j87543j54048m7869j42800J8085m8151j34734n4703j44021
3499G217035O5082j72433q8624L8518r4430j43768k53900j86052N4678j04143
3489F331963j79805q554Q436j40833M7686k8691j88535n0238j01553l6465k6476
3478E626935l8033l6442J05308k2371n5782P8876J50511N1610R8257J81042J71980
$$ plain form
3467 6311891 6403250 6301531 6241698 6289416 6374865 6592169 6747542 6790146 7077189 7225866
3457 7225866 7304731 7464179 7557066 7598109 7876206 8128288 8438648 8855007 8985430 9265379
3447 9265379 9530464 9677644 9931588 10100473 10242099 10164415 9940790 9808971 9546341 8890158
3437 8890158 8118764 7516872 7119595 6571282 6116510 5789819 5486173 5122975 4816995 4699478
3427 4699478 4475720 4180415 4230981 4137167 3972403 3885470 3859980 3738100 3508277 3362966
3417 3362966 3269706 3321680 3283967 3256503 3304694 3225822 3088940 3111146 2996165 2893922 2828959
3406 2828959 2814222 2815437 2729413 2693528 2574658 2472620 2429600 2219108 2257857 2379180 2322096
3395 2322096 2257198 2378795 2355695 2344785 2252144 2163966 2107347 1980828 2154771 2129822 2042810
$$ packed form
3467F311891R1359j01719n9833M7718Q5449K17304J55373M2604K87043J48677
3457G225866P8865J59448R2887M1043K78097K52082L10360M16359J30423K79949
3447I265379K65085J47180K53944J68885J41626p7684k23625j31819k62630o56183
3437H890158p71394o01892l97277n48313m54772l26691l03646l63198l05980j17517
3427D699478k23758k95305N0566r3814j64764q6933k5490j21880k29823j45311
3417C362966r3260N1974l7713k7464M8191p8872j36882K2206j14981j02243o4963
3406B828959j4737J215q6024l5885j18870j02038m3020k10492L8749J21323n7084
3395B322096o4898J21597k3100j0910r2641q8178n6619j26519J73943k4949q7012
$$ plain form
3384 2042810 2061684 1972515 2018071 2013074 2019648 1995298 2027175 2073376 2042932 2055908 1949255 1778935
3372 1778935 1829079 1788136 1728960 1696600 1741778 1724969 1768547 1724275 1565530 1536412 1551079
3361 1551079 1627378 1584716 1742768 1784295 1694454 1674977 1493041 1399409 1411919 1447814 1495215
3350 1495215 1459283 1417173 1512087 1490605 1546061 1379270 1303898 1279099 1382070 1371651 1257453
3339 1257453 1263064 1287937 1367278 1337155 1294751 1205278 1244818 1405898 1446008 1359740 1520649
3328 1520649 1528881 1480929 1585785 1770260 1679713 1592611 1657432 1566750 1637394 1713790 1588709
3317 1588709 1427461 1547668 1574633 1483864 1322294 1138771 1063986 1116510 1258004 1237626
3307 1237626 1168245 1191562 1132480 1136792 1084526 1044425 1033674 1131703 1327850 1180365 1067392
$$ packed form
3384B042810J8874q9169M5556m997O574k4350L1877M6201l0444J2976j06653j70320
3372A778935N0144m0943n9176l2360M5178j6809M3578m4272j58745k9118J4667
3361A551079P6299m2662J58052M1527q9841j9477j81936r3632J2510L5895M7401
3350A495215l5932m2110R4914k1482N5456j66791p5372k4799J02971j0419j14198
3339A257453N611K4873P9341l0123m2404q9473L9540J61080M0110q6268J60909
3328A520649Q232m7952J04856J84475r0547q7102O4821r0682P0644P6396j25081
3317A588709j61248J20207K6965r0769j61570j83523p4785N2524J41494k0378
3307A237626o9381K3317n9082M312n2266m0101j0751R8029J96147j47485j12973
$$ plain form
3296 1067392 1146969 1193244 1217162 1279838 1339167 1299336 1245519 1479842 1757654 1950769 1936662
3285 1936662 1890377 1874858 1794886 1706362 1634705 1450618 1400069 1236789 1079085 986775 1116336
3274 1116336 1108912 1017321 889406 909845 901997 925047 1012711 910442 785411 807054 874547
3263 874547 973527 818432 738484 823641 808130 820469 1032524 1042815 1095893 1167248 1119028
3252 1119028 1168687 1030541 990097 936686 982415 932936 773988 857116 808538 740138 699867
3241 699867 673395 721698 589150 654789 559585 561133 621095 760212 718508 674283 803814
3230 803814 696535 793664 814049 725433 589231 457579 553265 584379 447860 554001 697841
3219 697841 742933 726999 660180 653704 669441 748516 755071 718399 794305 900447 854592 749452
$$ packed form
3296A067392P9577M6275K3918O2676N9329l9831n3817K34323K77812J93115j4107
3285A936662m6285j5519p9972q8524p1657j84087n0549j63280j57704r2310J29561
3274A116336p424r1591j27915K0439p848K3050Q7664j02269j25031K1643O7493
3263H74547R8980j55095p9948Q5157j5511J2339K12055J0291N3078P1355m8220
3252A119028M9659j38146m0444n3411M5729m9479j58948Q3128m8578o8400m0271
3241F99867k6472M8303j32548O5639r5204J548N9962J39117m1704m4225J29531
3230H03814j07279R7129K0385q8616j36202j31652R5686L1114j36519J06141J43840
3219F97841M5092j5934o6819o476J5737P9075O555l6672P5906J06142m5855j05140
$$ [...]
##END NTUPLES=NMR SPECTRUM
##END=
