##TITLE=1H_CG-1232
 200.13Hz, DMSO.
 8 sc
 24.6.2026
##JCAMPDX= 6.0         $$ Bruker NMR JCAMP-DX V2.0
##DATA TYPE= NMR SPECTRUM
##DATA CLASS= NTUPLES
##ORIGIN= UXNMR, Bruker Analytische Messtechnik GmbH
##OWNER= pz
$$ XWIN-NMR		Version 3.5
$$ Wed Jun 24 14:13:16 2026 Russian Standard Time (UT+4h)  she@DPX200
##.OBSERVE FREQUENCY= 200.1313
##.OBSERVE NUCLEUS= ^1H
##.ACQUISITION MODE= SIMULTANEOUS
##.ACQUISITION SCHEME= undefined
##.AVERAGES= 8
##.DIGITISER RES= 18
##SPECTROMETER/DATA SYSTEM= spect
##.PULSE SEQUENCE= zg30
##.SOLVENT NAME= DMSO
##.SHIFT REFERENCE= (INTERNAL, DMSO, 0, 15.499)
##AUDIT TRAIL= $$ (NUMBER, WHEN, WHO, WHERE, WHAT)
$$ ##TITLE= Audit trail, XWIN-NMR		Version 3.5
$$ ##JCAMPDX= 5.01
$$ ##ORIGIN= Bruker BioSpin GmbH
$$ ##OWNER= she
$$ F:/spectra/data/she/nmr/H-C/1/pdata/1/auditp.txt
$$ ##AUDIT TRAIL=  $$ (NUMBER, WHEN, WHO, WHERE, WHAT)
(   1,<2026-06-24 14:11:52.46 +0400>,<she>,<DPX200>,
      <created by zg, POWCHK disabled, PULCHK disabled
       configuration hash MD5:
       00 E9 B6 7A A2 85 ED C7 34 08 36 98 17 FE 4E 26
       data hash MD5: 16K
       5E 35 96 D5 8E B8 01 8D 78 B2 18 C4 89 BA 6C 68>)
(   2,<2026-06-24 14:11:54.81 +0400>,<she>,<DPX200>,
      <Start of raw data processing
       efp BC_mod = 2 LB = 0.25 FT_mod = 6 PKNL = 1 PHC0 = -4225.362 PHC1 = 11.79229 SI = 16K 
       data hash MD5: 16K
       87 04 A5 1C 83 8C 96 89 F7 CA FB DE 3C 37 1F 52>)
(   3,<2026-06-24 14:12:20.67 +0400>,<she>,<DPX200>,
      <pk PHC0 = 7.276782 PHC1 = -3.8 
       data hash MD5: 16K
       92 CC 5E E1 44 A9 03 F3 2D 50 FE F0 EE AD 62 E1>)
(   4,<2026-06-24 14:12:24.67 +0400>,<she>,<DPX200>,
      <abs ABSG = 5 
       data hash MD5: 16K
       54 70 D9 C2 59 8C 4A B0 DF 95 91 EB 9D 23 8F DE>)
$$ ##END=
$$ 
$$ hash MD5
$$ 89 3F DA 2E 73 92 3A 8D 8E 7E 57 81 1D 73 E8 EF
##$RELAX= 
##$RELAX= 
##$RELAX= 
##$RELAX= 
##$RELAX= 
##$RELAX= 
$$ Bruker specific parameters
$$ --------------------------
##$DU= <F:/spectra>
##$EXPNO= 1
##$NAME= <H-C>
##$PROCNO= 1
##$TYPE= <nmr>
##$USER= <she>
##$AMP= (0..31)
100 100 100 100 100 100 100 100 100 100 100 100 100 100 100 100 100 100 
100 100 100 100 100 100 100 100 100 100 100 100 100 100 
##$AQSEQ= 0
##$AQ_mod= 1
##$AUNM= <au_zg>
##$AUTOPOS= <>
##$BF1= 200.13
##$BF2= 200.13
##$BF3= 200.13
##$BF4= 200.13
##$BF5= 200.13
##$BF6= 200.13
##$BF7= 200.13
##$BF8= 200.13
##$BYTORDA= 1
##$CFDGTYP= 0
##$CFRGTYP= 5
##$CHEMSTR= <none>
##$CNST= (0..31)
1 1 145 1 1 1 1 1 1 1 1 1 1 1 1 1 1 1 1 1 1 1 1 1 1 1 1 1 1 1 1 1 
##$CPDPRG= <>
##$CPDPRG1= <>
##$CPDPRG2= <>
##$CPDPRG3= <>
##$CPDPRG4= <mlev>
##$CPDPRG5= <mlev>
##$CPDPRG6= <mlev>
##$CPDPRG7= <mlev>
##$CPDPRG8= <mlev>
##$CPDPRGB= <>
##$CPDPRGT= <>
##$D= (0..31)
0 0.7 0 0 0 0 0 0 0 0 0 0.03 0 0 0 0 0 0 0 0 0 0 0 0 0 0 0 0 0 0 0 0 
##$DATE= 1782295911
##$DBL= (0..7)
120 120 120 120 120 120 120 120 
##$DBP= (0..7)
150 150 150 150 150 150 150 150 
##$DBP07= 0
##$DBPNAM0= <>
##$DBPNAM1= <>
##$DBPNAM2= <>
##$DBPNAM3= <>
##$DBPNAM4= <>
##$DBPNAM5= <>
$$ [...]
##$SUBNAM3= <"">
##$SUBNAM4= <"">
##$SUBNAM5= <"">
##$SUBNAM6= <"">
##$SUBNAM7= <"">
##$SUBNAM8= <"">
##$SUBNAM9= <"">
##$SW= 18.0517328524113
##$SWIBOX= (0..15)
0 0 2 0 0 0 0 0 0 0 0 0 0 0 0 0 
##$SW_h= 3612.71676300578
##$TD= 16384
##$TD0= 1
##$TE= 0
##$TE2= 300
##$TE3= 300
##$TEG= 300
##$TL= (0..7)
0 120 120 120 120 120 120 120 
##$TP= (0..7)
150 150 150 150 150 150 150 150 
##$TP07= 0
##$TPNAME0= <>
##$TPNAME1= <>
##$TPNAME2= <>
##$TPNAME3= <>
##$TPNAME4= <>
##$TPNAME5= <>
##$TPNAME6= <>
##$TPNAME7= <>
##$TPOAL= (0..7)
0.5 0.5 0.5 0.5 0.5 0.5 0.5 0.5 
##$TPOFFS= (0..7)
0 0 0 0 0 0 0 0 
##$TUNHIN= 0
##$TUNHOUT= 0
##$TUNXOUT= 0
##$USERA1= <user>
##$USERA2= <user>
##$USERA3= <user>
##$USERA4= <user>
##$USERA5= <user>
##$V9= 5
##$VALIST= <valist>
##$VCLIST= <CCCCCCCCCCCCCCC>
##$VD= 0
##$VDLIST= <DDDDDDDDDDDDDDD>
##$VPLIST= <PPPPPPPPPPPPPPP>
##$VTLIST= <TTTTTTTTTTTTTTT>
##$WBST= 1024
##$WBSW= 4
##$XGAIN= (0..3)
0 0 0 0 
##$XL= 0
##$YL= 0
##$YMAX_a= 250221
##$YMIN_a= -221026
##$ZGOPTNS= <>
##$ZL1= 120
##$ZL2= 120
##$ZL3= 120
##$ZL4= 120
##$ABSF1= 15.52102
##$ABSF2= -2.530829
##$ABSG= 5
##$ABSL= 3
##$ALPHA= 0
##$AQORDER= 0
##$ASSFAC= 0
##$ASSFACI= 0
##$ASSFACX= 0
##$ASSWID= 0
##$AUNMP= <proc_1d>
##$AZFE= 0.1
##$AZFW= 0.1
##$BCFW= 0
##$BC_mod= 2
##$BYTORDP= 0
##$COROFFS= 0
##$CY= -3
##$DATMOD= 1
##$DC= 0
##$DFILT= <>
##$DTYPP= 0
##$F1P= 0
##$F2P= 0
##$FCOR= 1
##$FTSIZE= 16384
##$FT_mod= 6
##$GAMMA= 0
##$GB= 0
##$INTBC= 1
##$INTSCL= 3.241238e-09
##$ISEN= 128
##$LB= 0.25
##$LEV0= 0
##$LPBIN= 0
##$MAXI= 10000
##$MC2= 0
##$MEAN= 0
##$ME_mod= 0
##$MI= 1.114404
##$NCOEF= 0
##$NC_proc= -7
##$NLEV= 6
##$NOISF1= 3.799351
##$NOISF2= 2.8
##$NSP= 0
##$NTH_PI= 0
##$NZP= 0
##$OFFSET= 15.49899
##$PC= 1
##$PHC0= -4218.085
##$PHC1= 7.99229
##$PH_mod= 1
##$PKNL= yes
##$PPARMOD= 0
##$PSCAL= 0
##$PSIGN= 0
##$REVERSE= no
##$SF= 200.130004546747
##$SI= 16384
##$SIGF1= 3
##$SIGF2= 2
##$SINO= 0.751879
##$SIOLD= 32768
##$SREGLST= <19F.Aceton>
##$SSB= 0
##$STSI= 16384
##$STSR= 0
##$SW_p= 3612.71676300578
##$SYMM= 0
##$S_DEV= 0
##$TDeff= 16384
##$TDoff= 0
##$TI= <>
##$TILT= no
##$TM1= 0
##$TM2= 0
##$TOPLEV= 0
##$USERP1= <user>
##$USERP2= <user>
##$USERP3= <user>
##$USERP4= <user>
##$USERP5= <user>
##$WDW= 1
##$XDIM= 16384
##$YMAX_p= 469612944
##$YMIN_p= -643283
$$ End of Bruker specific parameters
$$ ---------------------------------
##NTUPLES= NMR SPECTRUM
##VAR_NAME=  FREQUENCY,     SPECTRUM/REAL,   SPECTRUM/IMAG
##SYMBOL=    X,             R,               I
##VAR_TYPE=  INDEPENDENT,   DEPENDENT,       DEPENDENT
##VAR_FORM=  AFFN,          ASDF,            ASDF
##VAR_DIM=   16384,         16384,           16384
##UNITS=     HZ,            ARBITRARY UNITS, ARBITRARY UNITS
##FACTOR=    0.220516191357247, 1,           1
##FIRST=     3101.81295095743, 0,            0
##LAST=      -510.903812048352, 0,           0
##MIN=       -510.903812048352, -643283,     0
##MAX=       3101.81295095743, 469612944,    0
$$ Real data points
##PAGE= N=1
##DATA TABLE= (X++(R..R)), XYDATA
$$ [...]
$$ plain form
9401 -576 -234072 -165297 -193338 -111100 -59882 -404987 -361583 -152952 -245023 -225380 89267
9390 89267 20361 -110561 175324 142013 -16672 96137 110245 98751 49923 184755 -37395
9379 -37395 125546 129525 -43531 -39445 28504 -225791 -145247 179644 -48770 -56591 96870
9368 96870 -73493 -145717 264100 357087 143740 147520 -25617 -88705 -37927 -94064 -101129
9357 -101129 196380 370667 306867 124953 104010 280575 152789 46545 -65903 -76799
9347 -76799 42518 13232 19127 -40933 58655 -38701 -10036 102334 -130720 -180046 -297118
9336 -297118 -135431 -33104 -85162 49158 256843 159662 117230 -45893 30045 43341 62760
9325 62760 -99347 -276282 -166118 -302087 -419679 -266767 -254399 -354659 -183197 -175060
$$ packed form
9401e76k33496O8775k8041Q2238N1218l45105M3404K08631r2071J9643L14647
9390H9267o8906j30922K85885l3311j58685J12809J4108j1494m8828J34832k22150
9379c7395J62941L979j73056M086O7949k54295Q0544L24891k28414p821J53461
9368I6870j70363p2224M09817R2987k13347L780j73137o3088N0778n6137p065
9357a01129K97509J74287o3800j81914k0943J76565j27786j06244j12448j0896
9347g6799J19317k9286N895o0060R9588r7356K8665J12370k33054m9326j17072
9336b97118J61687J02327n2058J34320K07685r7181m2432j63123P5938J3296J9419
9325F2760j62107j76935J10164j35969j17592J52912J2368j00260J71462Q137
$$ plain form
9315 -175060 -223380 -551715 -311520 -109570 -227067 -282670 -134031 2711 13319 -68370
9305 -68370 58179 29815 -50368 -108439 4612 135772 -16112 -166385 -77425 -57924 -275097
9294 -275097 -291419 -145541 -277610 -139926 35195 -107299 -31823 -103092 -163257 -91078 192448
9283 192448 82649 -763 46619 5668 -155995 57430 -204390 -321491 -184249 -14901
9273 -14901 -169189 -14928 -3638 -108238 308338 284070 -46997 -69424 -352437 -342090 21342
9262 21342 -104079 55756 5060 123051 -262164 -226300 -34407 -95661 -50714 14582 63654
9251 63654 135756 46788 -97397 31750 272754 34884 -53235 129327 146561 -111829 -226362
9240 -226362 -350755 -281696 76224 178188 196602 315633 203554 62004 94328 67743
$$ packed form
9315a75060m8320l28335K40195K01950j17497n5603J48639J36742J0608q1689
9305f8370J26549k8364q0183n8071J13051J31160j51884j50273Q8960J9501k17173
9294b75097j6322J45878j32069J37684J75121j42494P5476p1269o0165P2179K83526
9283A92448j09799q3412M7382m0951j61663K13425k61820j17101J37242J69348
9273a4901j54288J54261J1290j04600M16576k4268l31067k2427k83013J0347L63432
9262B1342j25421J59835n0696J17991l85215L5864J91893o1254M4947O5296M9072
9251F3654P2102q8968j44185J29147K41004k37870q8119J82562J7234k58390j14533
9240b26362j24393O9059L57920J01964J8414J19031j12079j41550L2324k6585
$$ plain form
9230 67743 -121382 -137534 -9157 66895 69314 72180 -70492 -20303 311910 136122 126145
9219 126145 -62165 -31413 294293 488426 230895 -83108 -2232 12065 -236970 247425
9209 247425 188698 -6545 -131080 -268575 -161627 31617 45128 242396 195583 225064
9199 225064 249644 82766 21348 -118874 111579 -80387 -145463 -27111 -103637 26890
9189 26890 -80658 -185750 -88664 45115 149250 -122040 -264369 -70107 56363 67898
9179 67898 246007 177176 54840 -122576 99919 -6678 -253830 149386 192603 -92642
9169 -92642 -268422 -108043 -46846 211799 107773 -251621 -96195 -47889 -65893 -82879 492505
9158 492505 144733 -153904 -46988 -76771 -163588 -50596 116253 -71984 -222392 -361460
$$ packed form
9230F7743j89125j6152J28377P6052K419K866j42672N0189L32213j75788r977
9219A26145j88310L0752L25706J94133k57531l14003Q0876J4297k49035M84395
9209B47425n8727j95243j24535j37495J06948J93244J3511J97268m6813K9481
9199B25064K4580j66878o1418j40222K30453j91966o5076J18352p6526J30527
9189B6890j07548j05092R7086J33779J04135k71290j42329J94262J26470J1535
9179F7898J78109o8831j22336j77416K22495j06597k47152M03216M3217k85245
9169i2642j75780J60379O1197K58645j04026l59394J55426M8306j8004j6986N75384
9158D92505l47772k98637J06916k9783q6817J12992J66849j88237j50408j39068
$$ plain form
9148 -361460 -427933 -101372 87335 -172435 -142255 -334324 -478505 -296776 64618 -168006
9138 -168006 -2976 42860 45566 161540 217852 -41483 246560 415866 151664 -18745
9128 -18745 134032 -21553 -52046 223412 126831 24702 -72466 239784 21279 -29771 -78448
9117 -78448 68483 30959 121696 -134392 -96109 32652 -380484 -106631 175810 -56853
9107 -56853 -352163 -356158 -102677 6069 84760 39790 -59241 -185748 -247159 -164306 23717
9096 23717 120378 115854 97218 -99113 -93077 -74169 -50475 -301364 -78120 68814 -131094
9085 -131094 271601 240274 160007 204854 -93083 -254259 -16266 -70256 -3392 253089 377719
9074 377719 106602 -116179 -187584 33943 7292 -3161 -176398 -263195 -158118 -117695 175444
$$ packed form
9148c61460o6473L26561J88707k59770L0180j92069j44181J81729L61394k32624
9138a68006J65030M5836K706J15974N6312k59335K88043J69306k64202j70409
9128a8745J52777j55585l0493K75458r6581j02129r7168L12250k18505n1050m8677
9117g8448J46931l7524R0737k56088L8283J28761m13136K73853K82441k32663
9107e6853k95310l995K53481J08746P8691m4970r9031j26507o1411Q2853J88023
9096B3717R6661m524j8636j96331O036J8908K3694k50889K23244J46934j99908
9085a31094M02695l1327q0267M4847k97937j61176K37993n3990O6864K56481J24630
9074C77719k71117k22781p1405K21527k6651j0453j73237q6797J05077M0423K93139
$$ plain form
9063 175444 50108 62660 105713 110266 213583 309628 54654 61482 236257 59373 177530
9052 177530 51046 -85448 19599 131180 197008 254840 190948 168386 238304 51477 41874
9041 41874 67254 206855 234891 17212 -158213 -263282 48713 145593 51656 91883 81058
9030 81058 -11732 -56135 -126151 -218018 -293622 -389075 -119161 -349576 -321016 -213482 -226816
9019 -226816 -132066 24654 64944 198668 211585 201832 11823 -50002 -151423 -118392 88216
9008 88216 -23739 -26559 201168 -8499 -238976 -59455 -62306 36486 254174 -133713 -435490
8997 -435490 -405313 -418466 -556280 -524274 -63054 19363 45629 197082 130863 11006 -52277
8986 -52277 -71427 97672 -18696 46689 -17538 -306256 4116 142996 8588 89510 -145653
$$ packed form
9063A75444j25336J2552M3053M553J03317R6045k54974O828J74775j76884J18157
9052A77530j26484j36494J05047J11581O5828N7832o3892k2562O9918j86827r603
9041D1874K5380J39601K8036k17679j75425j05069L11995R6880r3937M0227j0825
9030H1058r2790m4403p0016r1867p5604r5453K69914k30415K8560J07534j3334
9019b26816R4750J56720M0290J33724J2917r753j90009o1825j01421L3031K06608
9008H8216j11955k820K27727k09667k30477J79521k851R8792K17688l87887l01777
8997d35490L0177j3153j37814L2006M61220Q2417K6266J51453o6219j19857o3283
8986e2277j9150J69099j16368O5385o4227k88718L10372J38880j34408Q0922k35163
$$ plain form
8975 -145653 -213169 93484 8227 -127905 -73172 -413644 -139489 -74661 -190761 37917
8965 37917 30117 25423 -132139 -77320 -300466 -115891 357499 161241 28399 -85349 -27440
8954 -27440 81399 -119774 35790 72686 187803 150671 71241 -52244 -160655 -123559 -76595
8943 -76595 -55518 84047 148724 415145 339491 -23828 96330 244118 90456 -142460
8933 -142460 9325 281471 314490 163776 7829 -137985 -8953 -83968 -59931 57050
8923 57050 185436 2929 147991 21027 -270470 -182273 107985 31683 -110337 -147696
8913 -147696 -108774 -162628 -129092 12246 148899 58026 114232 119126 -100054 1220 -102032
8902 -102032 238731 189795 -107778 -313393 -243440 -122913 130257 -3836 -134862 32021
$$ packed form
8975a45653o7516L06653q5257j36132N4733l40472K74155O4828j16100K28678
8965C7917p800m694j57562N4819k23146J84575M73390j96258j32842j13748N7909
8954b7440J08839k01173J55564L6896J15117l7132p9430j23485j08411L7096M6964
8943g6595K1077J39565O4677K66421p5654l63319J20158J47788j53662k32916
8933a42460J51785K72146L3019j50714j55947j45814J29032p5015K4037J16981
8923E7050J28386j82507J45062j26964k91497Q8197K90258p6302j42020l7359
8913a47696L8922n3854L3536J41338J36653r0873N6206M894k19180J01274j03252
8902a02032L40763m8936k97573k05615O9953J20527K53170j34093j31026J66883
$$ plain form
8892 32021 -127933 51320 169973 105890 143184 112226 -19533 -118142 -234164 -397126 -284914
8881 -284914 -21319 13285 -183526 -271355 -13536 -217174 -211131 58614 -91848 -140922 37279
8870 37279 37505 141835 253301 172308 -97981 -42641 -143573 -352912 -23170 10027 -224563
8859 -224563 53273 293997 -89635 22996 122579 -81170 -97883 50458 291900 275137
8849 275137 129271 -126759 131517 82167 -39592 174606 133555 54851 20870 216420
8839 216420 252462 75700 325585 36767 41352 39750 -93998 -192888 -269654 -233 -2299
8828 -2299 107684 -69063 191803 309097 212886 64547 -32788 33991 79249 3976 42006
8817 42006 -105183 113878 78316 60978 -64289 216965 392363 280613 -231790 -238498 -4705
$$ packed form
8892C2021j59954J79253J18653o4083L7294l0958j31759r8609j16022j62962J12212
8881b84914K63595L4604j96811q7829K57819k03638O043K69745j50462m9074J78201
8870C7279K26J04330J11466q0993k70289N5340j00932k09339L29742L3197k34590
8859b24563K77836K40724l83632J12631R9583k03749j6713J48341K41442j6763
8849B75137j45866k56030K58276m9350j21759K14198m1051p8704l3981J95550
8839B16420L6042j76762K49885k88818M585j602j33748r8890p6766K69421k066
8828b299J09983j76747K60866J17294r6211j48339r7335O6779M5258p5273L8030
8817D2006j47189K19061l5562j7338j25267K81254J75398j11750n12403o708K33793
$$ plain form
8806 -4705 113850 322322 266942 111309 -49304 148965 154689 269608 123152 -294845 -44215
8795 -44215 146903 -133635 -9165 1116 -22706 -146326 77089 238037 132255 100059
8785 100059 -15146 15684 197501 181572 247106 30418 86498 130558 64496 -111330 82509
8774 82509 56835 308996 308389 263653 197226 348924 145920 -77971 58482 -172775 -113181
8763 -113181 66547 180833 27363 -187462 -203538 -116648 5233 216292 198826 354244
8753 354244 201010 41544 105566 85848 102979 325941 299715 170406 115454 314071 142876
8742 142876 331344 527076 418782 395201 358120 301752 311516 186620 144649 250006 267626
8731 267626 59204 139891 13323 -51071 57462 -62715 194484 457140 291689 172585
$$ packed form
8806d705J18555K08472n5380j55633j60613J98269N724J14919j46456m17997K50630
8795d4215J91118k80538J24470J0281k3822j23620K23415J60948j05782l2196
8785A00059j15205L0830J81817j5929O5534k16688N6080M4060o6062j75826J93839
8774H2509k5674K52161o07m4736o6427J51698k03004k23891J36453k31257N9594
8763a13181J79728J14286j53470k14825j6076Q6890J21881K11059j7466J55418
8753C54244j53234j59466O4022j9718J7131K22962k6226j29309n4952J98617j71195
8742A42876J88468J95732j08294k3581l7081n6368R764j24896m1971J05357J7620
8731B67626k08422Q0687j26568o4394J08533j20177K57199K62656j65451j19104
$$ plain form
8721 172585 -74100 -127633 302353 304229 233061 511094 395361 24401 148165 34712
8711 34712 -67257 122936 150689 69362 297567 230890 -139731 -132057 233710 313112 -11572
8700 -11572 9475 149923 390359 370753 240240 376614 267153 94532 255832 127684
8690 127684 -191659 66863 208956 11851 120665 161255 279794 364748 438663 487138
8680 487138 211074 190134 393509 204867 15721 -29961 -119838 47808 282567 307358
8670 307358 21141 354165 398503 470658 721665 558788 181578 308306 62139 83309
8660 83309 220394 292611 192686 297195 484004 213908 518991 412642 86756 260094
8650 260094 258688 236532 522404 246558 -20773 68544 245283 157551 -37907 165543 234026
$$ packed form
8721A72585k46685n3533M29986J876p1168K78033j15733l70960J23764j13453
8711C4712j01969J90193K7753q1327K28205o6677l70621P674L65767P9402l24684
8700a1572K1047J40448K40436j9606j30513J36374j09461j72621J61300j28148
8690A27684l19343K58522J42093j97105J08814M0590J18539Q4954P3915M8475
8680D87138k76064k0940K03375j88642j89146m5682q9877J67646K34759K4791
8670C07358k86217L33024M4338P2155K51007j62877l77210J26728k46167K1170
8660H3309J37085P2217r9925J04509J86809k70096L05083j06349l25886J73338
8650B60094j406k2156K85872k75846k67331Q9317J76739q7732j95458K03450O8483
$$ plain form
8639 234026 386683 314670 93235 266349 315462 287992 -10726 16476 278513 154403
8629 154403 33036 17293 87632 214131 274791 200862 272296 430475 282703 241860 496510
8618 496510 464897 443944 755279 571913 436815 627754 766941 482512 868781 1256204
8608 1256204 1311920 1530319 1623517 1760191 1963275 2307276 2617393 2962724 3404540 4096095
8598 4096095 4996656 6225574 7426152 8633732 9841985 10631157 11125973 11477538 10807641
8589 10807641 10256967 9288119 8274706 7023534 5853579 5136672 4303526 3256851 2350500
8580 2350500 2470098 2063718 2006823 1919164 1728593 1873996 1677759 1366836 1761855 1687190
8570 1687190 1405136 1476957 1604394 1522800 1670138 1459076 1525506 1638951 1334415 1046026
$$ packed form
8639B34026J52657p2013k21435J73114M9113k7470k98718K7202K62037j24110
8629A54403j21367j5743P0339J26499O0660p3929P1434J58179j47772m0843K54650
8618D96510l1613k0953L11335j83366j35098J90939J39187k84429L86269L87423
8608A256204N5716K18399R3198J36674K03084L44001L10117L45331M41816O91555
8598D096095R00561J228918J200578J207580J208253P89172M94816L51565o69897
8589A0807641n50674r68848j013413j251172j169955p16907q33146j046675r06351
8580B350500J19598m06380n6895q7659j90571J45403j96237l10923L95019p4665
8570A687190k82054P1821J27437q1594J47338k11062O6430J13445l04536k88389
$$ plain form
8560 1046026 830312 1033692 903968 826633 832926 530472 599755 801148 560835 683854
8550 683854 796203 422992 380306 434256 383427 435290 434302 138231 184057 218203 97882
8539 97882 222420 262905 473522 345527 366525 398866 320892 372804 760044 508109 310233
8528 310233 380567 294679 142393 298360 313250 366653 360135 202335 264067 275715 392231
8517 392231 -4233 -62551 26770 168541 245854 220908 79185 -111696 32366 -160669
8507 -160669 -85516 135863 -51421 -276922 -84595 -44418 161593 384775 73603 38322
8497 38322 90007 -25982 -95175 -3473 -106828 -318258 139344 118716 -91631 -75190 -18605
8486 -18605 -25229 -165409 91194 173101 173900 180181 85838 -328317 -207276 183858 84611 173479
$$ packed form
8560A046026k15714K03380j29724p7335O293l02454O9283K01393k40313J23019
8550F83854J12349l73211m2686N3950n0829N1863r88k96071M5826L4146j20321
8539I7882J24538M0485K10617j27995K0998L2341p7974N1912L87240k51935j97876
8528C10233P0334q5888j52286J55967J4890N3403o518j57800O1732J1648J16516
8517C92231l96464n8318Q9321J41771P7313k4946j41723j90881J44062j93035
8507a60669P5153K21379j87284k25501J92327M0177K06011K23182l11172l5281
8497C8322N1685j15989o9193R1702j03355k11430M57602k0628k10347J6441N6585
8486a8605o624j40180K56603Q1907P99O281r4343m14155J21041L91134r9247Q8868
$$ plain form
8474 173479 398981 76843 166030 201736 66905 198300 147073 104772 39896 16407 -63409
8463 -63409 -126389 124299 54970 -294376 -148472 -194406 -83205 140573 80971 -215871 -323561
8452 -323561 -99506 -172988 -274359 93807 -120273 -122394 -58378 -347768 -204691 -17780
8442 -17780 56750 -10602 125646 67844 -7852 81853 -37965 -120333 84231 19629 46325
8431 46325 56970 -102938 -84010 54782 15947 49549 99135 -29100 -47287 -164517 -111398
8420 -111398 38726 31457 115697 157416 199255 197973 205711 -62324 10919 86404 8352 -412190
8408 -412190 -428346 -340261 -242887 -290533 -324968 26014 174559 312147 -39061 -19179 -388871
8397 -388871 -514659 -118743 -217102 -217757 307671 164187 116648 441953 44724 -153935 44340
$$ packed form
8474A73479K25502l22138Q9187L5706j34831J31395n1227m2301o4876k3489p9816
8463f3409o2980K50688o9329l49346J45904m5934J11201K23778n9602k96842j07690
8452c23561K24055p3482j01371L68166k14080k121O4016k89390J43077J86911
8442a7780P4530o7352J36248n7802p5696Q9705j19818q2368K04564o4602K6696
8431D6325J0645j59908J8928J38792l8835L3602M9586j28235j8187j17230N3119
8420a11398J50124p269Q4240M1719M1839j282P738k68035P3243P5485p8052m20542
8408d12190j6156Q8085R7374m7646l4435L50982J48545J37588l51208J9882l69692
8397c88871j25788L95916r8359o55N25428j43484m7539L25305l97229j98659J98275
$$ plain form
8386 44340 -258499 -183279 117045 -174522 49952 57741 -169029 -137005 133746 161275 -12875
8375 -12875 -283174 -305510 -185250 -40979 305673 65705 33186 175149 -32511 -35338 255519
8364 255519 -141144 -299609 -426486 -169976 23035 -68157 14696 -29004 -129692 103726
8354 103726 -158308 -379592 57576 134480 62885 308172 44380 -95845 263201 48776
8344 48776 11080 30482 -163256 -272017 -55502 -108591 -120118 -58872 -158373 -10077 115243
8333 115243 -73152 -41187 124105 118178 5487 31327 -445328 -420960 -83975 -115559 9284
8322 9284 165942 116861 51040 124679 281693 242970 -76466 -99535 -119044 -84083 43464
8311 43464 -69419 -14421 -2300 23798 -7666 -70070 278017 224669 109173 7597 -4222
$$ packed form
8386D4340l02839P5220L00324k91567K24474P789k26770L2024K70751K7529j74150
8375a2875k70299k2336J20260J44271L46652k39968l2519J41963k07660k827K90857
8364B55519l96663j58465j26877K56510J93011r1192Q2853m3700j00688K33418
8354A03726k62034k21284M37168P6904p1595K45287k63792j40225L59046k14425
8344D8776l7696J9402j93738j08761K16515n3089j1527O1246r9501J48296J25320
8333A15243j88395L1965J65292n927j12691K5840m76655K4368L36985l1584J24843
8322I284J56658m9081o5821P3639J57014l8723l19436k3069j9509L4961J27547
8311D3464j12883N4998J2121K6098l1464o2404L48087n3348j15496j01576j1819
$$ plain form
8300 -4222 158572 175310 26996 76945 326851 127388 -230980 -15089 -35289 -161332 244823
8289 244823 215347 23454 123176 77094 -121949 -196724 -164158 75453 166250 1511 85237
8278 85237 357587 103621 90914 249596 -53068 -243128 -141022 -105207 -170743 29604
8268 29604 321254 274241 63783 -118310 80634 -131129 -274433 32944 34916 -31452 -56170
8257 -56170 -111825 -141025 -323081 -306628 98888 263188 202156 -170512 -8698 -82623 -159352
8246 -159352 -346238 -197196 -40257 -42097 -261637 -352543 130829 -90456 -206792 22866
8236 22866 339596 341269 300608 196032 101384 293924 374474 -31888 -79887 -118888 -451226
8225 -451226 -17837 104637 -330095 -41248 120965 -49608 -313323 -168471 -4096 -137949
$$ packed form
8300d222J62794J6738j48314M9949K49906j99463l58368K15891k0200j26043M06155
8289B44823k9476j91893R9722m6082j99043p4775L2566K39611R0797j64739Q3726
8278H5237K72350k53966j2707J58682l02664j90060J02106L5815o5536K00347
8268B9604K91650m7013k10458j82093J98944k11763j43304L07377J972o6368k4718
8257e6170n5655k9200j82056J6453M05516J64300o1032l72668J61814p3925p6729
8246a59352j86886J49042J56939j840k19540r0906M83372k21285j16336K29658
8236B2866L16730J673m0661j04576r4648J92540Q0550m06362m7999l9001l32338
8225d51226M33389J22474m34732K88847J62213j70573k63715J44852J64375j33853
$$ plain form
8215 -137949 12860 -215941 -269599 -226227 -73715 227996 148759 208335 130633 66311 49338
8204 49338 -137294 -262231 75438 104826 -32970 -6880 -136574 -154901 -301815 -323949 -255603
8193 -255603 -225054 694976 608526 216764 128979 37917 253350 -121612 -202045 -7819 287876
8182 287876 2818 53684 103794 -7396 221746 192595 -156990 -195285 -90636 5547 284671
8171 284671 330111 199276 348470 113140 -64766 -43076 -58410 -89382 -74086 -191872 7571
8160 7571 16675 121051 -111731 -249536 33420 29134 43349 -234647 -144625 -325960 -177554
8149 -177554 -89767 -165134 -72698 -62170 -138552 -15387 18660 -380649 -374928 -193640 -306479
8138 -306479 -296223 160783 270386 145030 175088 125117 205317 132746 -167655 -213534 11963
$$ packed form
8215a37949J50809k28801n3658M3372J52512L01711p9237N9576p7702o4322j6973
8204D9338j86632j24937L37669K9388j37796K6090j29694j8327j46914k2134O8346
8193b55603L0549R20030q6450l91762q7785r1062K15433l74962q0433J94226K95695
8182B87876k85058N0866N0110j11190K29142k9151l49585l8295J04649R6183K79124
8171B84671M5440j30835J49194k35330j77906K1690j5334l0972J5296j17786J99443
8160G571R104J04376k32782j37805K82956m286J4215k77996R0022j81335J48406
8149a77554Q7787p5367R2436J0528p6382J23165L4047l99309N721J81288j12839
8138c06479J0256M57006J09603j25356L0058m9971Q0200p2571l00401m5879K25497
$$ plain form
8127 11963 252491 101035 311080 119142 -11874 69760 -86800 -202774 -123335 29759
8117 29759 -210548 -216018 -77512 60403 -17897 -59572 -146983 -281112 -278424 56335 -19514
8106 -19514 26323 240738 -258367 -251026 82052 -123320 -334421 -131133 -91297 -267868 -135189
8095 -135189 15100 62191 13861 -128944 -94464 828 -351131 -305702 274302 198622 194225
8084 194225 244375 111925 75527 118432 -145444 -101855 238603 -11158 -138713 43425
8074 43425 150307 -63706 -75591 -106479 -65762 -44080 -78850 -60238 31906 163487 98169
8063 98169 146045 167139 -75744 -231370 137060 127761 -114742 18286 -67501 -286573 -372712
8052 -372712 -293629 -455445 -149234 3494 -181429 -84142 248065 -174826 68104 268507
$$ packed form
8127A1963K40528j51456K10045j91938j31016Q1634j56560j15974P9439J53094
8117B9759k40307n470J38506J37915p8300m1675q7411j34129K688L34759p5849
8106a9514M5837K14415m99105P341L33078k05372k11101K03288L9836j76571J32679
8095a35189J50289M7091m8330j42805L4480R5292l51959M5429N80004p5680m397
8084A94225N0150j32450l6398M2905k63876M3589L40458k49761j27555J82138
8074D3425J06882k14013j1885l0888M0717K1682l4770J8612R2144J31581o5318
8063I8169M7876K1094k42883j55626L68430r299k42503J33028q5787k19072q6139
8052c72712P9083j61816L06211J52728j84923R7287L32207m22891K42930K00403
$$ plain form
8042 268507 -164880 14211 310246 -45050 22877 98891 -68400 -218330 -64475 -264580
8032 -264580 -237324 123451 -85458 -126692 -29079 67481 75334 75667 5033 51243 -22226 -29039
8020 -29039 -155530 -174300 -102473 -25220 -135851 -10061 44899 87521 -9876 -130948 -237846
8009 -237846 26985 105732 -113234 -166575 98648 163126 283206 344204 1843 53856 59068
7998 59068 31146 -75936 6599 -203643 -88116 47476 -335432 -201078 74955 -48155
7988 -48155 -203261 137899 -201739 -96170 207841 76697 59881 142208 -194795 84883
7978 84883 233027 -19359 -42506 -257818 -252455 -3735 -41252 -292127 87391 77944 -88355
7967 -88355 245767 -43500 -16542 119155 -77909 -257660 -175500 -177607 167486 140815 33909
$$ packed form
8042B68507m33387J79091K96035l55296O7927P6014j67291j49930J53855k00105
8032b64580K7256L60775k08909m1234R7613R6560P853L33p0634M6210p3469o813
8020b9039j26491j8770P1827P7253j10631J25790N4960M2622r7397j21072j06898
8009b37846K64831P8747k18966n3341K65223O4478J20080O0998l42361N2013N212
7998E9068k7922j07082Q2535k10242J15527J35592l82908J34354K76033j23110
7988d8155j55106L41160l39638J05569L04011j31144j6816Q2327l37003K79678
7978H4883J48144k52386k3147k15312N363K48720l7517k50875L79518r447j66299
7967h8355L34122k89267K6958J35697j97064j79751Q2160k107L45093k6671j06906
$$ plain form
7956 33909 339717 429031 188369 180229 88860 -83260 375144 438488 299065 38021 118914
7945 118914 -85352 -46445 14933 -26826 -44147 146117 237977 -61949 68549 -11312 28793
7934 28793 59922 -2547 87498 -81055 59093 70102 -172321 -91002 8107 -52283 -102357
7923 -102357 31016 -107446 26236 -119045 -92033 19262 -90421 -129290 -98187 -88902 -352307
7912 -352307 -397380 -71384 -74351 -125021 219264 142836 -163703 185547 -75290 -169852 145572
7901 145572 -92987 6309 285697 395263 -49656 171381 69221 -51959 11789 -60590
7891 -60590 74671 445097 163181 55848 276115 147991 -103478 -226748 -290976 -321904
7881 -321904 -128835 -115012 -126427 302040 119916 77344 -15187 -237915 -322611 1367 -158575
$$ packed form
7956C3909L05808Q9314k40662q140r1369j72120M58404O3344j39423k61044Q0893
7945A18914k04266L8907O1378m1759j7321J90264R1860k99926J30498p9861M0105
7934B8793L1129o2469R0045j68553J40148J1009k42423Q1319R9109o0390n0074
7923a02357J33373j38462J33682j45281K7012J11295j09683l8869L1103R285k63405
7912c52307m5073L25996k967n0670L44285p6428l06539L49250k60837r4562L15424
7901A45572k38559R9296K79388J09566m44919K21037j02160j21180O3748p2379
7891f0590J35261L70426k81916j07333K20267j28124k51469j23270o4228l0928
7881c21904J93069J3823j1415M28467j82124m2572r2531k22728q4696L23978j59942
$$ plain form
7870 -158575 80828 194555 -32248 -98603 -90934 24519 -58176 -267221 -124376 -59288 146755
7859 146755 -46259 -150346 -102927 -88275 160250 424654 431162 178999 180688 48949 20067
7848 20067 -36556 -142398 -205103 -59253 -89789 -3259 -7808 47254 59232 -349491 -328156
7837 -328156 181170 26740 75243 -93956 -153944 -77034 45423 -21572 9638 229633 275576
7826 275576 175419 232768 -80230 -100720 4029 -154929 -334377 -237130 -71938 -47075
7816 -47075 -67138 23836 18298 254572 94108 -242136 -73745 -67632 42773 313642 -35046
7805 -35046 158632 35917 288460 462154 584888 353752 -71125 203249 -60459 27634
7795 27634 58579 -140082 84361 131424 168330 -48014 60293 97334 344780 579402 195054
$$ packed form
7870a58575K39403J13727k26803o6355P669J15453q2695k09045J42845O5088K06043
7859A46755j93014j04087M7419J4652K48525K64404O508k52163J689j31739k8882
7848B0067n6623j05842o2705J45850l0536Q6530m549N5062J1978m08723K1335
7837c28156N09326j54430M8503j69199n9988P6910J22457o6995L1210K19995M5943
7826B75576j00157N7349l12998k0490J04749j58958j79448R7247J65192K4863
7816d7075k0063R0974n538K36274j60464l36244J68391O113J10405K70869l48688
7805c5046J93678j22715K52543J73694J22734k31136m24877K74374k63708Q8093
7795B7634L0945j98661K24443M7063L6906k16344J08307L7041K47446K34622l84348
$$ plain form
7784 195054 365277 527682 614361 702221 705517 711875 544194 465340 506274 567273 592489
7773 592489 360517 411007 374539 224371 333605 468306 254918 465494 208445 214387
7763 214387 342651 548975 471832 563984 804405 943026 1015398 1168226 1242418 1253086 1427445
7752 1427445 1559206 1415910 1322100 1383986 1391799 1289392 1218459 952895 830020 800272 579654
7741 579654 943782 972869 559761 600021 404682 403044 675351 480369 312291 269110 351717
7730 351717 554007 860837 1001271 1132242 1298455 1584731 1454342 1399379 1594557 1714925
7720 1714925 1563500 1561282 1356317 1286444 1183494 605922 172807 215028 399378 399236 494993
7709 494993 293791 -141750 7215 226127 -244448 -14236 344525 386144 611761 307530
$$ packed form
7784A95054J70223J62405Q6679Q7860L296O358j67681p8854M0934O0999K5216
7773E92489k31972N0490l6468j50168J09234J34701k13388K10576k57049N942
7763B14387J28264K06324p7143R2152K40421J38621P2372J52828P4192J0668J74359
7752A427445J31761j43296r3810O1886P813j02407p0933k65564j22875k9748k20618
7741E79654L64128K9087m13108M0260j95339j638K72307j94982j68078m3181Q2607
7730C51717K02290L06830J40434J30971J66213K86276j30389n4963J95178J20368
7720A714925j51425k218k04965o9873j02950n77572m33115M2221J84350j42R5757
7709D94993k01202m35541J48965K18912m70575K30212L58761M1619K25617l04231
$$ plain form
7699 307530 318633 450683 633180 366690 519269 751222 735079 717655 677679 613659 401863
7688 401863 636622 646005 468876 191302 235613 213598 328070 224193 15235 72068 406658
7677 406658 348130 41679 138219 124854 197806 158483 18463 -76077 -70183 -188087 -358447
7666 -358447 -309792 -185771 -12074 -66539 -123047 -95204 68034 95695 131011 -52032 2815
7655 2815 -101246 87594 -36556 -12450 -85845 -301293 90399 72796 -150535 -291942 -72352
7644 -72352 -94492 -130401 71838 -170743 -79042 223797 171473 17004 89220 76649 71730
7633 71730 103863 -53524 161001 216452 -32267 -79406 -74374 -151983 -207121 -96554 4235
7622 4235 233799 362341 213782 -122363 -133418 -309556 -364788 -391106 -331863 -216168 50265
$$ packed form
7699C07530J1103J32050J82497k66490J52579K31953j6143j7424l9976o4020k11796
7688D01863K34759R383j77129k77574M4311k2015J14472j03877k08958N6833L34590
7677D06658n8528l06451R6540j3365P2952l9323j40020r4540N894j17904j70360
7666c58447M8655J24021J73697n4465n6508K7843J63238K7661L5316j83043N4847
7655B815j04061J88840j24150K4106p3395k15448L91692j7603k23331j41407K19590
7644g2352k2140l5909K02239k42581R1701L02839n2324j54469P2216j2571m919
7633G1730L2133j57387K14525N5451k48719m7139N032p7609n5138J10567J00789
7622D235K29564J28542j48559l36145j1055j76138n5232k6318N9243J15695K66433
$$ plain form
7611 50265 20089 -45822 66734 48540 183822 3243 13776 -157648 150239 237328 -276716
7600 -276716 -68168 71101 -32458 137536 95738 234353 156197 323733 -15432 154213
7590 154213 165785 -22844 -22154 112332 -70232 -38459 -83279 -181395 -389818 -263864 -121195
7579 -121195 -317737 -53650 18437 -58968 221484 483781 131516 145754 -93624 -345040
7569 -345040 -420319 -238122 -358422 -451693 -243179 -114325 60305 125828 -135729 -182291
7559 -182291 205625 278772 612 -143065 -10103 -189866 -83707 -204263 -31564 -15025
7549 -15025 -226231 -34666 209744 212430 185559 10030 7198 175184 262138 310038 57035
7538 57035 131331 -29538 -103538 -105746 -25364 91435 -331254 -244588 42264 125282 -89014
$$ packed form
7611E0265l0176o5911J12556j8194J35282j80579J0533j71424L07887Q7089n14044
7600b76716K08548J39269j03559J69994m1798J38615p8156J67536l39165J69645
7590A54213J1572j88629O90J34486j82564L1773m4820r8116k08423J25954J42669
7579a21195j96542K64087P2087p7405K80452K62297l52265J4238k39378k51416
7569c45040p5279J82197j20300r3271K08514J28854J74630O5523k61557m6562
7559a82291L87916P3147k78160j43677J32962j79763J06159j20556J72699J6539
7549a5025k11206J91565K44410K686k6871j75529k832J67986Q6954M7900k53003
7538E7035P4296j60869p4000k208Q0382J16799m22689Q6666K86852Q3018k14296
$$ plain form
7527 -89014 -59679 -94679 -141098 -180536 -193331 -149666 -4125 -82652 -200429 -6500 65847
7516 65847 -62180 20209 333862 877 224515 460321 491397 481303 307522 91180
7506 91180 -128859 -27270 144164 126847 95180 39497 -135941 -200057 -316792 -205019 270757
7495 270757 271203 140908 27823 -167721 -241798 -382985 -397317 -126933 -7387 295434 -30408
7484 -30408 -114721 -298630 -115524 -170336 112890 130306 149489 256843 -40426 637 206926
7473 206926 -31724 -329434 -292900 -39699 41300 108033 -43281 -242274 173698 392965
7463 392965 -11017 95637 270257 318851 316787 229598 63479 -15631 15312 36024 -76424
7452 -76424 -238512 -252865 -215231 -91360 -269017 -325228 -175530 -35384 -109794 71212 -115360
$$ packed form
7527h9014K9335l5000m6419l9438j2795M3665J45541p8527j17777J93929P2347
7516F5847j28027Q2389L13653l32985K23638K35806L1076j0094j73781k16342
7506I1180k20039J01589J71434j7317l1667n5683j75438o4116j16735J11773M75776
7495B70757M46j30295j13085j95544p4077j41187j4332K70384J19546L02821l25842
7484c0408q4313j83909J83106n4812K83226J7416J9183J07354k97269M1063K06289
7473B06926k38650k97710L6534K53201Q0999O6733j51314j98993M15972K19267
7463C92965m03982J06654J74620M8594k064q7189j66119p9110L0943K0712j12448
7452g6424j62088j4353L7634J23871j77657n6211J49698J40146p4410J81006j86572
$$ plain form
7441 -115360 -164519 -230379 51322 -8035 -122075 -206192 -215765 -3198 57797 138635 65071
7430 65071 -224093 838 -23309 -141705 148845 309761 16546 -151009 129569 98250
7420 98250 -155671 -114206 151841 245169 322997 -9695 -252309 -114014 -31186 30084 -292338
7409 -292338 -224183 86993 94452 195467 125605 167933 -108686 -378854 -79479 -130106 -23031
7398 -23031 -52524 -80594 -77130 22758 -90829 -41850 157338 -22946 91657 -21576 -105375
7387 -105375 -301537 -558794 -189142 -148040 -133128 -109806 -237214 -135318 11381 -5513
7377 -5513 12906 -106866 -54081 215815 327616 58319 132494 -90456 -133812 -89086 -34588
7366 -34588 -51786 -61308 44261 2758 -128964 -169071 -281044 -275352 49698 230006 196964
$$ packed form
7441a15360m9159o5860K81701n9357j14040q4117r573K12567O0995Q0838p3564
7430F5071k89164K24931k4147j18396K90550J60916k93215j67555K80578l1319
7420I8250k53921M1465K66047R3328P7828l32692k42614J38295Q2828O1270l22422
7409b92338O8155L11176P459J01015o9862M2328k76619k70168K99375n0627J07075
7398b3031k9493k8070L464R9888j13587M8979J99188j80284J14603j13233q3799
7387a05375j96162k57257L69652M1102J4912K3322j27408J01896J46699j6894
7377e513J8419j19772N2785K69896J11801k69297P4175k22950m3356M4726N4498
7366c4588j7198r522J05569m1503j31722m0107j11973N692L25050J80308l3042
$$ plain form
7355 196964 153095 119449 8738 70115 -117126 50744 271883 81951 -308410 -160862
7345 -160862 -187223 -163716 -53022 -212938 -162089 -188697 -140778 32531 63389 125988 204511
7334 204511 335883 77688 129369 498887 545277 516921 993420 1356689 1541122 1790716
7324 1790716 1876102 1525044 1509267 1720749 1632524 1581807 1470564 1081806 931701 789876
7314 789876 668351 597069 387954 467236 229225 103508 188122 74859 193211 197925 311327
7303 311327 328467 215218 215749 287415 235368 17861 107716 296403 203771 173680 9529
7292 9529 -78063 206993 21351 -135561 -225964 -204196 39690 185000 201048 210641 235149
7281 235149 149305 260765 258364 376666 136002 30421 143269 152545 85053 100454 17911
$$ packed form
7355A96964m3869l3646j10711O1377j87241J67870K21139j89932l90361J47548
7345a60862k6361K3507J10694j59916N0849k6608M7919J73309L0858O2599P8523
7334B04511J31372k58195N1681L69518M6390k8356M76499L63269J84433K49594
7324A790716Q5386l51058j5777K11482q8225n0717j11243l88758j50105j41825
7314G89876j21525p1282k09115P9282k38011j25717Q4614j13263J18352M714J13402
7303C11327J7140j13249N31P1666n2047k17507Q9855J88687r2632l0091j64151
7292I529q7592K85056j85642j56912r0403K1768K43886J45310J6048R593K4508
7281B35149q5844J11460k401J18302k40664j05581J12848R276o7492J5401q2543
$$ plain form
7270 17911 -159638 -183916 -171846 -42458 223795 358388 176490 -39037 88561 32784
7260 32784 -71218 -7913 -9720 -73850 -72429 60003 -85994 96266 64866 147397 408973
7249 408973 264876 179405 312034 188090 -262003 -201119 -215245 -411212 -58800 95611
7239 95611 -69931 -34258 201272 203230 341093 233610 27836 35668 154789 190671 147509
7228 147509 161036 25902 -62432 231708 85924 1882 -55611 -25652 -18165 57779 90771
7217 90771 -87637 151347 131827 -113844 185167 114275 -65171 -26290 -29226 96857 178083
7206 178083 424840 52373 -262747 20415 82281 119297 172668 -8864 14594 214009
7196 214009 154706 38000 127021 81485 161384 196086 -142840 -35208 138088 88713 -57962
$$ packed form
7270A7911j77549k4278J2070J29388K66253J34593j81898k15527J27598n5777
7260C2784j04002O3305j807o4130J421J32432j45997J82260l1400Q2531K61576
7249D08973j44097q5471J32629j23944m50093O0884j4126j95967L52412J54411
7239I5611j65542L5673K35530J958J37863j07483k05774P832J19121L5882m3162
7228A47509J3527j35134q8334K94140j45784q4042n7493K9959P487P5944L2992
7217I0771j78408K38984j9520k45671K99011p0892j79446L8881k936J26083Q1226
7206A78083K46757l72467l15120K83162O1866L7016N3371j81532K3458J99415
7196B14009n9303j16706Q9021m5536P9899L4702l38926J07632J73296m9375j46675
$$ plain form
7185 -57962 -47118 -77322 -60759 180201 81374 102546 -38134 51522 -61769 -138769 20687
7174 20687 114701 -34549 -80761 -69415 -327402 -197317 -111120 -255958 19654 241314 86990
7163 86990 -95032 166368 21311 -91276 114730 199805 152552 88340 106433 35299 191119
7152 191119 243395 151772 74902 -187477 -137341 69432 -37350 -46160 326407 353327 21169
7141 21169 548093 584679 159550 108198 25360 66804 184797 147719 200440 225642 24024
7130 24024 54768 175405 132598 373153 348290 213612 338537 201444 104546 253862 89747
7119 89747 -237352 -287455 14978 291501 236833 -102405 68603 358508 433505 310880
7109 310880 371934 327179 319711 184375 -98659 -132405 -163579 -188264 -73534 -218401 -309128
$$ packed form
7185e7962J0844l0204J6563K40960r8827K1172j40680Q9656j13291p7000J59456
7174B0687R4014j49250m6212J1346k57987J30085Q6197j44838K75612K21660j54324
7163H6990j82022K61400j45057j12587K06006Q5075m7253o4212J8093p1134J55820
7152A91119N2276r1623p6870k62379N0136K06773j06782q810L72567K6920l32158
7141B1169N26924L6586m25129n1352q2838M1444J17993l7078N2721K5202k01618
7130B4024L0744J20637m2807K40555k4863j34678J24925j37093r6898J49316j64115
7119H9747l27099n0103L02433K76523n4668l39238J71008K89905P4997j22625
7109C10880O1054m4755p468j35336k83034l3746l1174k4685J14730j44867r0727
$$ plain form
7098 -309128 -90394 38196 -6371 -157422 6638 55404 123126 10544 -391011 -47878
7088 -47878 146784 -259397 -404535 -152002 69557 353350 349488 79498 58106 -81837
7078 -81837 -122148 94386 -152711 -265157 166388 -117208 -128440 56689 -167416 -80584
7068 -80584 88346 -81170 -98684 204804 72827 -303520 19652 -4983 -164412 -118911
7058 -118911 -310849 -421223 -298880 -35703 -116213 -96874 -290520 -264498 171250 -125363
7048 -125363 -261776 -545981 -467588 -213653 -119797 -93660 -234098 -191635 -125231 -271907 -222049
7037 -222049 -282918 -264133 45687 84684 -154998 -61761 -180710 -203597 -190605 -281500 -183339
7026 -183339 -289280 -426901 -377726 -429997 -313952 -92105 -53669 -183222 -158218 -383829
$$ packed form
7098c09128K18734J28590m4567j51051J64060M8766O7722j12582m01555L43133
7088d7878J94662m06181j45138K52533K21559K83793l862k69990k1392j39943
7078h1837m0311K16534k47097j12446M31545k83596j1232J85129k24105Q6832
7068h0584J68930j69516j7514L03488j31977l76347L23172k4635j59429M5501
7058a18911j91938j10374J22343K63177q0510J9339j93646K6022M35748k96613
7048a25363j36413k84205P8393K53935R3856K6137j40438M2463O6404j46676M9858
7037b22049o0869J8785L09820L8997k39682R3237j18949k2887J2992r0895R8161
7026a83339j05941j37621M9175n2271J16045K21847L8436j29553K5004k25611
$$ plain form
7016 -383829 -367177 -109726 -53927 -133316 -215714 -219238 -32590 -115219 -304975 -42350 25842
7005 25842 -182163 -190627 63902 -244139 -220090 -263300 -212527 -133378 55729 17871 -14948
6994 -14948 -72633 11108 -113300 -85285 -118253 -20360 197396 55188 53988 90260 -229686
6983 -229686 -380070 -52702 -43779 163866 10691 -275632 -132747 -132988 -257466 -175175 129635
6972 129635 22688 -111704 -215639 53923 145445 169522 243405 10815 67121 -77090
6962 -77090 233950 60617 -92681 68324 -90809 -40704 47746 89658 -135504 101158
6952 101158 87751 -90350 -89689 36064 16610 -141746 -284806 -7236 227981 22172 -1646
6941 -1646 65457 -92494 -278636 8264 -311392 -268325 52006 -119249 -142354 249 -56998
$$ packed form
7016c83829J6652K57451N5799p9389q2398l524J86648q2629j89756K62625O8192
7005B5842k08005q464K54529l08041K4049m3210N0773P9149J89107l7858l2819
6994a4948n7685Q3741j24408K8015l2968R7893K17756j42208j200L6272l19946
6983b29686j50384L27368Q923K07645j53175k86323J42885k41j24478Q2291L04810
6972A29635j06947j34392j03935K69562R1522K4077P3883k32590N6306j44211
6962g7090L11040j73333j53298J61005j59133N0105Q8450M1912k25162K36662
6952A01158j3407j78101O61J25753j9454j58356j43060K77570K35217k05809k3818
6941a646O7103j57951j86142K86900l19656M3067L20331j71255k3105J42603n7247
$$ plain form
6930 -56998 -60347 58296 57267 -179577 -143207 -123013 -232180 -146507 41342 187766 -26242
6919 -26242 -121574 -208057 -20456 20310 -38908 -60778 -84593 -31886 -179838 -137036 151978
6908 151978 182814 220508 15077 -59233 134429 181756 29156 -44175 145548 128469 238099
6897 238099 43182 -116786 110805 194236 253366 130723 33507 -135002 -101048 250154
6887 250154 -174448 -155966 196097 182502 -54382 -13865 -86632 -87953 -132043 99852 103421
6876 103421 111989 -28140 -111940 -142787 -6119 86537 140959 200678 -131029 -211895 70152
6865 70152 57372 25600 273068 23950 -130952 -349242 11217 -66596 65874 -102757
6855 -102757 -290304 -94151 55073 49358 266421 356886 150665 -123496 34125 44933
$$ packed form
6930e6998l349J18643j029k36844L6370K0194j09167Q5673J87849J46424k14008
6919b6242r5332q6483J87601M0766n9218k1870k3815N2707j47952M2802K89014
6908A51978L0836L7694k05431p4310J93662M7327j52600p3331J89723j7079J09630
6897B38099j94917j59968K27591Q3431N9130j22643r7216j68509L3954L51202
6887B50154m24602J8482L52063j3595k36884M0517p2767j321m4090K31895L569
6876A03421Q568j40129q3800l0847J36668R2656N4422N9719l31707q0866K82047
6865G0152j2780l1772K47468k49118j54902k18290L60459p7813J32470j68631
6855a02757j87547J96153J49224n715K17063R0465k06221k74161J57621J0808
$$ plain form
6845 44933 229837 50333 -236142 -62296 107290 91846 -61383 -45819 -179465 -371261
6835 -371261 -288118 -224657 -221627 -56890 -9322 -48738 116192 188850 -17163 40274 144103
6824 144103 95762 -49738 67757 -299463 -337654 -180573 -258566 -76309 158505 -114581
6814 -114581 126409 123658 5205 164775 245983 307278 276789 53759 -133044 -229098 99459
6803 99459 104351 -229071 -7786 -4654 -130888 293163 147386 68140 58537 206811 127195
6792 127195 48211 102433 -206889 -182953 33669 198892 132033 88636 126545 134385 246045
6781 246045 316610 209319 169789 52516 300655 468500 676460 485229 169582 352548
6771 352548 395232 304716 462761 498399 335857 419313 529791 303792 228450 286066 69193
$$ packed form
6845D4933J84904j79504k86475J73846J69586j5444j53229J5564j33646j91796
6835c71261Q3143O3461L030J64737M7568l9416J64930P2658k06013N7437J03829
6824A44103m8341j45500J17495l67220l8191J57081p7993J82257K34814k73086
6814a14581K40990k751j18453J59570Q1208O1295l0489k23030j86803r6054L28557
6803I9459M892l33422K21285L132j26234M24051j45777p9246r603J48274p9616
6792A27195p8984N4222l09322K3936K16622J65223o6859m3397L7909P840J11660
6781B46045P0565j07291l9530j17273K48139J67845K07960j91231l15647J82966
6771C52548M2684r0516J58045L5638j62542Q3456J10478k25999p5342N7616k16873
$$ plain form
6760 69193 112614 73180 -243042 173961 391387 261990 314340 367720 143619 105462 203705
6749 203705 153930 69698 230654 223607 106883 316711 559217 426140 302801 296672 96090
6738 96090 109489 416981 464516 485592 168208 405836 324543 37302 345003 371236 611310
6727 611310 603096 476610 361575 538975 160709 301392 513040 415466 471460 373090 277601
6716 277601 306265 250723 175860 355342 229396 293229 377719 319445 76459 159662 234776
6705 234776 235705 394360 659085 648332 631727 696820 656797 819638 845193 476475 371785
6694 371785 790602 413731 248948 152634 29676 203701 382441 81920 140096 456726
6684 456726 347155 172033 -109404 133328 99029 191711 117959 287779 387711 318353 175496
$$ packed form
6760F9193M3421l9434l16222M17003K17426j29397N2350N3380k24101l8157R8243
6749B03705m9775q4232J60956p047j16724K09828K42506j33077j23339o129k00582
6738I6090J3399L07492M7535K1076l17384K37628q1293k87241L07701K6233K40074
6727F11310q214j26486j15035J77400l78266J40683K11648r7574N5994r8370r5489
6716B77601K8664n5542p4863J79482j25946O3833Q4490n8274k42986Q3203P5114
6705B34776R29J58655K64725j0753j6605O5093m0023J62841K5555l68718j04690
6694C71785M18817l76871j64783r6314j22958J74025J78740l00521N8176L16630
6684D56726j09571j75122k81437K42732l4299R2682p3752J69820R9932o9358j42857
$$ plain form
6673 175496 22911 183124 77859 325841 477843 317589 288256 326196 365507 480949
6663 480949 276327 188966 328607 513528 492694 593066 530966 382242 519400 498794
6653 498794 341673 307725 259010 190224 236996 289318 304365 328388 649588 495380 786897
6642 786897 1049134 1262475 1392428 1693460 2118046 2182752 2745261 2404663 2379315 2499473
6632 2499473 2499029 2481025 2211462 1833697 1767948 1633289 1525783 1362426 1329242 1357989 1161582
6621 1161582 1197001 785159 979246 1246059 1234029 1076788 1185053 987801 834463 874799
6611 874799 973253 914936 1074813 924315 566566 577181 736329 601776 473284 731441
6601 731441 592255 664256 779751 589075 723179 963682 715872 767731 910133 699698
$$ packed form
6673A75496j52585J60213j05265K47982J52002j60254k9333L7940L9311J15442
6663D80949k04622q7361J39641J84921k0834J00372o2100j48724J37158k0606
6653D98794j57121l3948m8715o8786M6772N2322J5047K4023L21200j54208K91517
6642G86897K62237K13341J29953L01032M24586O4706N62509l40598k5348J20158
6632B499473m44j8004k69563l77765o5749j34659j07506j63357l3184K8747j96407
6621A161582L5419m11842J94087K66813j2030j57241J08265j97252j53338M0336
6611H74799R8454n8317J59877j50498l57749J0615J59148j34553j28492K58157
6601G31441j39186P2001J15495j90676J34104K40503k47810N1859J42402k10435
$$ plain form
6591 699698 856272 941118 699593 726379 910994 933812 953280 907352 944045 1127212 1084536
6580 1084536 1105232 957065 1040430 1022957 876136 782592 857282 898779 686766 557251 522431
6569 522431 597472 799429 695238 508250 539372 767303 880178 717035 814596 1050983
6559 1050983 931012 972227 1205867 1067007 1103878 1231753 1113292 1259516 1289462 1483389
6549 1483389 1535029 1586614 1422847 1166125 1321192 1325932 1319479 1172412 1001651 848310 773189
6538 773189 1022349 831730 728552 719410 613334 743179 827078 732558 1065731 1070400 808966
6527 808966 700402 996271 1241497 1143764 1183876 1154279 1113270 1303818 1438835 1359615 1686083
6516 1686083 1679316 1430730 1427055 1634122 1701847 1773152 1615810 1551561 1723304 1735713 1472257
$$ packed form
6591F99698J56574Q4846k41525K6786J84615K2818J9468m5928L6693J83167m2676
6580A084536K0696j48167Q3365j7473j46821r3544P4690M1497k12013j29515l4820
6569E22431P5041K01957j04191j86988L1122K27931J12875j63143R7561K36387
6559A050983j19971M1215K33640j38860L6871J27875j18461J46224K9946J93927
6549A483389N1640N1585j63767k56722J55067M740o453j47067j70761j53341p5121
6538G73189K49160j90619j03178r142j06076J29845Q3899r4520L33173M669k61434
6527H08966j08564K95869K45226r7733M0112k9597m1009J90548J35017p9220L26468
6516A686083o767k48586l675K07067O7725P1305j57342o4249J71743J2409k63456
$$ plain form
6505 1472257 1374162 1181286 1210937 1466331 1342415 1194681 1368885 1443775 1251950 1131968
6495 1131968 947775 973128 1409286 1156543 1198858 1479490 1499763 1537339 1533121 1601714 1565687
6484 1565687 1559557 1816033 1871141 1733628 1761679 1867881 1988939 2211809 2274849 2333534 2326993
6473 2326993 2250146 2373270 2713761 2631838 2161940 2247823 2056349 2175556 2251607 2235897
6463 2235897 2228599 2142057 2382914 2225036 2208418 2147090 2073865 2342522 2595489 2422241 2184783
6452 2184783 2168732 2130782 1881932 2123827 2178703 1925066 2305112 2256393 2215334 2632152
6442 2632152 2477381 2667800 2948318 2476327 2392577 2441328 2666480 2702633 2649609 2646296 2751679
6431 2751679 2942062 2865488 2869448 2948492 2949577 2840903 3134515 3301050 3220406 3180011 3182804
$$ packed form
6505A472257r8095j92876K9651K55394j23916j47734J74204P4890j91825j19982
6495A131968j84193K5353M36158k52743M2315K80632K0273L7576m218O8593l6027
6484A565687o130K56476N5108j37513K8051J06202J21058K22870O3040N8685o541
6473B326993p6847J23124L40491q1923m69898Q5883j91474J19207P6051j5710
6463B235897p298q6542K40857j57878j6618o1328p3225K68657K52967j73248k37458
6452B184783j6051l7950k48850K41895N4876k53637L80046m8719m1059M16818
6442B632152j54771J90419K80518m71991q3750M8751K25152L6153n3024l313J05383
6431B751679J90383p6574L960P9044J085j08674K93612J66535q0644m0395K793
$$ plain form
6420 3182804 3327593 3370684 3249658 3197777 3363767 3303656 3379952 3788174 3859265 4072557
6410 4072557 4140106 3937360 4124973 4147217 4322965 4623827 4434405 4339610 4370399 4296620
6400 4296620 4534512 4654079 4914361 4791084 4992288 5407231 5491577 5690107 5729897 5904313
6390 5904313 6030143 6115984 6206190 6325162 6594522 7012451 7121926 7043433 6909149 6972042
6380 6972042 7140180 7342727 7282923 7427379 7335695 7410691 7458150 7728462 7926178 7750219
6370 7750219 7986541 8094988 8057738 8289444 8384559 8276815 8376901 8293237 8299775 8396058 8441709
6359 8441709 8349452 8432931 8496542 8614581 8990553 9126588 9076086 9547492 9464261 9451491 9488447
6348 9488447 9829160 9779290 9993230 10183370 10012103 9928835 10334040 10621079 10828465 11399746
$$ packed form
6420C182804J44789M3091j21026n1881J65990o0111P6296M08222P1091K13292
6410D072557O7549k02746J87613K2244J75748L00862j89422r4795L0789p3779
6400D296620K37892J19567K60282j23277K01204M14943Q4346J98530L9790J74416
6390E904313J25830Q5841R0206J18972K69360M17929J09475p8493j34284O2893
6380F972042J68138K02547n9804J44456r1684P4996M7459K70312J97716j75959
6370G750219K36322J08447l7250K31706R5115j07744J00086q3664O538R6283M5651
6359H441709r2257Q3479O3611J18039L75972J36035n0502M71406q3231j2770L6956
6348I488447L40713m9870K13940J90140j71267q3268M05205K87039K07386N71281
$$ plain form
6338 11399746 11835187 12333942 12910574 13220600 13294139 13825623 14423851 15046914 15527637 16157235
6328 16157235 16925144 17919633 18754150 19658762 20862287 21892511 22844387 23935844 24713828
6319 24713828 25896121 26975302 27607876 28210688 29227951 30917730 32835894 34863821
6311 34863821 37137974 40085754 43946297 48579257 53714506 59556717 66349209 73787527
6303 73787527 82110784 92056470 103471271 116690880 132618109 152137382 176615997
6296 176615997 207142459 244023989 287649213 334717560 380415120 421062469 450956097
6289 450956097 467154620 469612944 459744020 440653660 414376079 382350075 347317627
6282 347317627 312340558 280094129 251740482 227084205 205537131 186215307 168212760
$$ packed form
6338A1399746M35441M98755N76632L10026P3539N31484N98228O23063M80723O29598
6328A6157235P67909R94489Q34517R04612J203525J030224R51876J091457P77984
6319B4713828J182293J079181O32574O02812J017263J689779J918164K027927
6311C4863821K274153K947780L860543M632960N135249N842211O792492P438318
6303G3787527Q323257R945686J1414801J3219609J5927229J9519273K4478615
6296A76615997L0526462L6881530M3625224M7068347M5697560M0647349K9893628
6289D50956097J6198523K458324r868924j9090360k6277581l2026004l5032448
6282C47317627l4977069l2246429k8353647k4656277k1547074j9321824j8002547
$$ plain form
6275 168212760 152034265 137807843 125419763 115161259 106365661 99350654 93661664
6268 93661664 89162380 85940413 83681551 82388311 81336244 80935684 81204157 81975702 83425796
6259 83425796 85800487 89790386 95518359 103271933 113459733 126250880 141562908 157901255
6251 157901255 173299083 185670119 193916804 196876847 194193402 186974504 176505298 163912459
6243 163912459 149477306 134787972 120976871 109121602 99433045 91729953 85649345
6236 85649345 80760247 76859017 74062530 72382564 71203379 70862079 71053203 72239385
6228 72239385 74359203 77633603 81656608 87414482 95324812 105196770 117786964 132770978
6220 132770978 148670816 163985583 176902034 185779932 189578729 187746306 180961035 171045156
$$ packed form
6275A68212760j6178495j4226422j2388080j0258504q795598p015007n688990
6268I3661664m499284l221967k258862j293240j052067m00560K68473P71545J450094
6259H3425796K374691L989899N727973P753574J0187800J2791147J5312028J6338347
6251A57901255J5397828J2371036Q246685K960043k683445p218898j0469206j2592839
6243A63912459j4435153j4689334j3811101j1855269r688557p703092o080608
6236H5649345m889098l901230k796487j679966j179185l41300J91124J186182
6228G2239385K119818L274400M023005N757874P910330R871958J2590194J4984014
6220A32770978J5899838J5314767J2916451Q877898L798797j832423o785271r915879
$$ plain form
6212 171045156 158716817 144497773 129089240 114319800 101148471 89977760 80818991
6205 80818991 73261647 67116702 62031713 57739901 53899694 51216063 49193949 47634340
6197 47634340 46453078 45892198 45812062 46160965 47303260 48814043 50946113 54144535 58104941
6188 58104941 62411288 66466383 70206421 72768055 73787970 72838247 70629387 67321623
6180 67321623 63006508 57961202 53006562 48161607 43425077 38976292 35344959 32228073
6172 32228073 29431720 27334703 25247761 23286063 22015016 20874631 19911722 19167368
6164 19167368 18284241 17319282 16817727 16419701 15414505 14994085 14286669 13402971 12909747
6155 12909747 12229771 11762216 11142306 10687620 10264824 9875283 9740762 9584532 9479039
$$ packed form
6212A71045156j2328339j4219044j5408533j4769440j3171329j1170711r158769
6205H0818991p557344o144945n084989m291812l840207k683631k022114j559609
6197D7634340j181262n60880q0136L48903J142295J510783K132070L198422L960406
6188E8104941M306347M055095L740038K561634J019915r49723k208860l307764
6180F7321623m315115n045306m954640m844955m736530m448785l631333l116886
6172C2228073k796353k097017k086942j961698j271047j140385r62909p44354
6164A9167368q83127r64959n01555l98026j005196m20420p07416q83698m93224
6155A2909747o79976m67555o19910m54686m22796l89541j34521j56230j05493
$$ plain form
6146 9479039 9291554 9141523 8746768 8868537 8589649 8348453 8080640 7844655 8032061 7958928
6136 7958928 7454614 7127250 7150805 6905838 6553366 6452552 6286307 6008180 5997965 5509869
6126 5509869 5362127 5234375 5048460 4970972 4783889 4665175 4401735 4152826 4198289 4178790
6116 4178790 3898369 3661843 3800407 3570868 3457156 3485338 3474541 3518032 3595162 3641614
6106 3641614 3516078 3537985 3538776 3379345 3390985 3096756 2809539 3207814 2730967 2562882
6096 2562882 2474426 2412367 2710409 2767738 2751899 2563056 2605969 2436132 2353670 2257591 2184045
6085 2184045 2139122 2339645 2263685 2053779 2252692 2214193 2403865 2259562 2220077 2370317
6075 2370317 2388351 2364726 2383605 2233451 2218884 2147376 1858853 1808616 1654410 1280908 1094261
$$ packed form
6146I479039j87485j50031l94755J21769k78888k41196k67813k35985J87406p3133
6136G958928n04314l27364K3555k44967l52472j00814j66245k78127j0215m88096
6126E509869j47742j27752j85915p7488j87083j18714k63440k48909M5463j9499
6116D178790k80421k36526J38564k29539j13712K8182j0797M3491P7130M6452
6106C641614j25536K1907P91j59431J1640k94229k87217L98275m76847j68085
6096B562882q8456o2059K98042N7329j5839j88843M2913j69837q2462r6079p3546
6085B184045m4923K00523p5960k09906J98913l8499J89672j44303l9485J50240
6075B370317J8034k3625J8879j50154j4567p1508k88523n0237j54206l73502j86647
$$ plain form
6064 1094261 1345971 1421101 1250394 1212145 1108142 1062202 1318766 1258078 1123648 1429905
6054 1429905 1599976 1409132 1562060 1723409 1761083 1795585 1597057 1526050 1718519 1606592
6044 1606592 1476809 1549451 1676812 1614361 1576756 1457935 1307476 1425872 1267185 843407
6034 843407 957563 933720 1069023 1271604 1015026 999204 1142596 903242 652739 875484
6024 875484 768386 788345 778757 753182 744148 844863 934958 789755 1181220 1119237 891725
6013 891725 976545 1034508 1213549 964341 1265451 1281573 1151182 1069723 1384014 1571736
6003 1571736 1241653 1043791 1154868 1087558 1165086 1131432 1022562 1146531 1008336 1072715
5993 1072715 1141140 1209933 1154151 1015565 896789 747882 814421 902188 795702 1057699
$$ packed form
6064A094261K51710P5130j70707l8249j04003m5940K56564o0688j34430L06257
6054A429905J70071j90844J52928J61349L7674L4502j98528p1007J92469j11927
6044A606592j29783P2642J27361o2451l7605j18821j50459J18396j58687m23778
6034H43407J14156k3843J35303K02581k56578j5822J43392k39354k50503K22745
6024H75484j07098J9959r588k5575r034J00715R0095j45203L91465o1983k27512
6013H91725Q4820N7963J79041k49208L01110J6122j30391q1459L14291J87722
6003A571736l30083j97862J11077o7310P7528l3654j08870J23969j38195O4379
5993A072715O8425O8793n5782j38586j18776j48907O6539Q7767j06486K61997
$$ plain form
5983 1057699 849545 617693 619240 797118 913271 860764 787538 943180 1016777 931865 875236
5972 875236 1151021 1198355 993381 1059843 995768 984451 868058 928905 760148 671302 618410
5961 618410 675843 867000 671939 657540 932643 929905 1225004 1196266 1290541 1221820 1454890
5950 1454890 1467950 1441237 1838454 2174143 2028489 2249955 2442595 2795790 3148685 3391995
5940 3391995 3306859 3557468 3725022 3677116 3688668 3416176 3488298 3271745 3077990 2717323
5930 2717323 2552129 2048271 2247559 2194052 2226397 2021239 2160994 2079353 1917563 1723158
5920 1723158 1759472 1757897 1724652 1614867 1806549 1709152 1785760 1983392 1861505 1794854 1983504
5909 1983504 1931939 1440486 1581810 1584809 1429042 1527195 1531302 1273916 1335324 1484781 1398770
$$ packed form
5983A057699k08154k31852J547J77878J16153n2507p3226J55642P3597q4912n6629
5972H75236K75785M7334k04974O6462o4075j1317j16393O0847j68757q8846n2892
5961F18410N7433J91157j95061j4399K75103k738K95099k8738R4275o8721K33070
5950A454890J3060k6713L97217L35689j45654K21466J92640L53195L52895K43310
5940C391995q5136K50609J67554m7906J1552k72492P2122k16553j93755l60667
5930B717323j65194n03858J99288n3507L2345k05158J39755q1641j61790j94405
5920A723158L6314j575l3245j09785J91682r7397P6608J97632j21887o6651J88650
5909A983504n1565m91453J41324K999j55767R8153M107k57386O1408J49457q6011
$$ plain form
5898 1398770 1396925 1296496 1124481 1283375 1395851 1075310 1125926 1292156 1428654 1221854
5888 1221854 1014597 1098678 1349562 1357756 1274495 1491356 1565807 1868285 1912689 2063749 1783258
5877 1783258 1568438 1734088 1731037 1484965 1210608 1409563 1296466 1134096 1041429 1129918
5867 1129918 1165755 1118595 1077438 709381 701693 901913 889094 1003614 1055820 895549 1289323
5856 1289323 1062404 912495 1348413 1375649 1152033 1269095 1547852 1361056 1275490 1319080
5846 1319080 1097639 1146646 1313463 1302041 1243654 1392527 1061808 1142562 1313732 1134130
5836 1134130 1122411 978740 758324 802424 923317 1060165 977562 963928 908732 976416 1079194
5825 1079194 1053324 1000392 857982 780969 645842 653035 1007742 1255745 1220766 1243800 1431724
$$ packed form
5898A398770j845j00429j72015J58894J12476l20541N0616J66230J36498k06800
5888A221854k07257Q4081K50884Q194q3261K16861P4451L02478M4404J51060k80491
5877A783258k14820J65650l051k46072k74357J98955j13097j62370r2667Q8489
5867A129918L5837m7160m1157l68057p688K00220j2819J14520N2206j60271L93774
5856A289323k26919j49909M35918K7236k23616J17062K78757j86796q5566M3590
5846A319080k21441M9007J66817j1422n8387J48873l30719Q0754J71170j79602
5836A134130j1719j43671k20416M4100J20893J36848q2603j3634n5196O7684J02778
5825A079194k5870n2932j42410p7013j35127P193L54707K48003l4979K3034J87924
$$ plain form
5814 1431724 1041067 847907 960919 990721 797961 840502 846931 977682 1254505 1230171
5804 1230171 1394417 1533677 1281306 1393142 1575393 1241306 1107159 1147949 1448428 1665717
5794 1665717 1844662 1945822 1928546 2041319 2019446 2155959 2295942 2492783 2698934 2584809
5784 2584809 2489479 2495399 2560059 2611692 3102302 3416080 3535903 4072614 4709708 5076991
5774 5076991 5707577 6357085 7007190 7808958 8768382 9966371 11558754 13270830 15173156
5765 15173156 18205727 22020173 27132235 33193360 38791586 44658683 49068321 51399652
5757 51399652 51665083 50033428 47126076 43200373 38535500 33325931 28242561 23739977
5749 23739977 20214613 17599867 15478285 13660069 12100888 10945131 9765111 8688875
$$ packed form
5814A431724l90657j93160J13012K9802j92760M2541O429J30751K76823k4334
5804A230171J64246J39260k52371J11836J82251l34087j34147M0790L00479K17289
5794A665717J78945J01160j7276J12773k1873J36513J39983J96841K06151j14125
5784B584809r5330N920O4660N1633M90610L13778J19823N36711O37094L67283
5774E076991O30586O49508O50105Q01768R59424J197989J592383J712076J902326
5765A5173156L032571L814446N112062O061125N598226N867097M409638K331331
5757E1399652K65431j631655k907352l925703m664873n209569n083370m502584
5749B3739977l525364k614746k121582j818216j559181j155757j180020j076236
$$ plain form
5741 8688875 8045847 7444991 6901393 6421575 5969247 5681224 5197261 5277012 5205832 4990490
5731 4990490 4537114 4069893 3971867 3710597 3567101 3425804 3341113 2947694 2817461 2728718
5721 2728718 2692372 2691041 2594103 2523903 2855691 2805035 2628677 2443404 2381910 2177084 2169667
5710 2169667 2244387 2299002 2203718 2310039 2177445 1623966 1886020 2159144 2229497 2258794
5700 2258794 1967590 1937050 1948757 1697092 1652795 1400595 1492002 1287527 1159895 1224810
5690 1224810 1087068 1205658 1435921 1087619 1198116 1229203 1176849 1098171 1300134 1114606
5680 1114606 1228692 1272077 1185757 1111226 967652 839157 947988 910980 951035 901126 704953
5669 704953 597312 501159 462153 749136 887053 774724 980392 698150 916173 825626
$$ packed form
5741H688875o43028o00856n43598m79818m52328k88023m83963P9751p1180k15342
5731D990490m53376m67221r8026k61270j43496j41297q4691l93419j30233q8743
5721B728718l6346j331r6938p0200L31788n0656j76358j85273o1494k04826p417
5710B169667P4720N4615r5284J06321j32594n53479K62054K73124P0353K9297
5700B258794k91204l0540J1707k51665m4297k52200R1407k04475j27632O4915
5690A224810j37742J18590K30263l48302J10497L1087n2354p8678K01963j85528
5680A114606J14086M3385q6320p4531j43574j28495J08831l7008M0055m9909j96173
5669G04953j07641r6153l9006K86983J37917j12329K05668k82242K18023r0547
$$ plain form
5659 825626 784617 869878 676166 536139 849858 1056589 1102535 977615 1063162 1007912 1128511
5648 1128511 1154363 1177699 980373 1003618 1124046 1267984 1121007 907504 777997 903682
5638 903682 958765 737245 837905 964192 784557 807586 822958 751303 605418 834767
5628 834767 837640 729611 816281 922318 923858 1008983 727048 607752 797556 876270 815928
5617 815928 826047 733043 622311 712072 828013 776679 544268 777089 726843 894623 937882
5606 937882 1142302 1071051 1340110 1229836 915238 1088471 1069661 1005435 995909 1122358 897887
5595 897887 1030116 1217330 852134 832599 791031 514875 797811 816716 774426 886112
5585 886112 863307 905247 848593 857705 790193 1092935 988026 957957 671326 692421 702050
$$ packed form
5659H25626m1009Q5261j93712j40027L13719K06731M5946j24920Q5547n5250J20599
5648A128511K5852K3336j97326K3245J20428J43938j46977k13503j29507J25685
5638I03682N5083k21520J00660J26287j79635K3029J5372p1655j45885K29349
5628H34767K873j08029Q6670J06037J540Q5125k81935j19296J89804P8714o0342
5617H15928J0119r3004j10732Q9761J15941n1334k32411K32821n0246J67780M3259
5606I37882K04420p1251K69059j10274l14598J73233j8810o4226r526J26449k24471
5595H97887J32229J87214l65196j9535m1568k76156K82936J8905m2290J11686
5585H86112k2805M1940n6654R112o7512L02742j04909l0069k86631K1095R629
$$ plain form
5574 702050 761705 725259 917372 1020231 733416 739790 426261 460354 614463 618231 410907
5563 410907 478633 610940 508175 650469 754909 576898 503257 540572 528575 767530
5553 767530 813929 859417 1045228 759270 739089 852698 758043 739235 771880 770348 536667
5542 536667 779106 726140 572881 968764 1126363 797330 985031 1067423 920697 1080072
5532 1080072 804530 759275 908523 904343 951281 911916 835951 777889 863097 1059295 778112
5521 778112 780961 818540 827011 922959 879423 918312 872163 752061 644274 753058 1045821
5510 1045821 892213 862098 771228 797986 792217 661056 725494 939735 798049 926334 910743
5499 910743 660824 693828 870952 938442 971526 1111252 942801 920313 918884 743847 732385
$$ packed form
5574G02050N9655l6446J92113J02859k86815O374l13529L4093J54109L768k07324
5563D10907O7726J32307j02765J42294J04440j78011p3641L7315j1997K38955
5553G67530M6399M5488J85811k85958k0181J13609r4655j8808L2645j532k33681
5542E36667K42439n2966j53259L95883J57599l29033J87701Q2392j46726J59375
5532A080072k75542m5255J49248m180M6938l9365p5965n8062Q5208J96198k81183
5521G78112K849L7579Q471R5948m3536L8889m6149j20102j07787J08784K92763
5510A045821j53608l0115r0870K6758n769j31161O4438K14241j41686J28285j5591
5499I10743k49919L3004J77124O7490L3084J39726j68451k2488j429j75037j1462
$$ plain form
5488 732385 749580 615096 709683 841533 522446 662928 678126 716363 987725 757376
5478 757376 826636 744523 763424 534588 505450 765795 808024 755861 959847 990912 844484
5467 844484 905493 656153 664439 635477 427375 410426 389340 604867 903350 752630 581490
5456 581490 810303 762526 917346 1046772 674583 738388 916804 852645 875038 996158
5446 996158 810447 802798 714212 754581 956328 1062153 1175552 1253579 998808 604840 751526
5435 751526 749405 920851 1008818 1387937 1203739 1025545 887544 621849 821262 813695 963441
5424 963441 1040262 1000560 873530 932506 1140532 988093 907080 1146143 1318566 1122232
5414 1122232 1010286 1098925 936478 998253 1355968 1401389 1530047 1618125 1360963 1557229
$$ packed form
5488G32385J7195j34484R4587J31850l19087J40482J5198L8237K71362k30349
5478G57376O9260q2113J8901k28836k9138K60345M2229n2163K03986L1065j46428
5467H44484O1009k49340Q286k8962k08102j6949k1086K15527K98483j50720j71140
5456E81490K28813m7777J54820J29426l72189O3805J78416o4159K2393J21120
5446I96158j85711p649q8586M0369K01747J05825J13399P8027k54771l93968J46686
5435G51526k121J71446Q7967L79119j84198j78194j38001k65695J99413p567J49746
5424I63441P6821l9702j27030N8976K08026j52439q1013K39063J72423j96334
5414A122232j11946Q8639j62447O1775L57715M5421J28658Q8078k57162J96266
$$ plain form
5404 1557229 1531241 1253179 1083646 1096963 1429008 1251189 1265817 1596227 1368229 1198417
5394 1198417 1309325 1111042 1142414 1222540 1052620 972651 930246 1112154 1144457 1233967 1279295
5383 1279295 1051217 1045652 1256996 1317236 1119811 1067071 1303875 1497532 1396677 1347090
5373 1347090 1160560 1331834 1433700 1287710 1453970 1445136 1281985 1207447 1450471 1360886
5363 1360886 1360138 1716912 1803354 1631486 1403987 1234181 1304893 1460841 1382745 1714352 2082861
5352 2082861 1701558 1417009 1520671 1870906 2129246 1889009 1823930 1979816 1968009 1922250
5342 1922250 1957966 1940229 1978889 2022586 2030013 1995659 1987543 2028341 1956709 1939283 1846613 1991619
5330 1991619 1963361 2088113 2180434 2091844 2169299 2128924 2227857 2319527 2185637 1963079 2004847
$$ packed form
5404A557229k5988k78062j69533J3317L32045j77819J4628L30410k27998j69812
5394A198417J10908j98283L1372Q0126j69920p9969m2405J81908L2303Q9510M5328
5383A279295k28078n565K11344O0240j97425n2740K36804J93657j00855m9587
5373A347090j86530J71274J01866j45990J66260q834j63151p4538K43024q9585
5363A360886p48L56774Q6442j71868k27499j69806P0712J55948p8096L31607L68509
5352B082861l81303k84549J03662L50235K58340k40237o5079J55886j1807m5759
5342A922250L5716j7737L8660M3697P427l4354q116M0798p1632j7426r2670J45006
5330A991619k8258J24752R2321q8590P7455m0375R8933R1670j33890k22558M1768
$$ plain form
5319 2004847 2487859 2341637 2069501 1985332 2162635 2422262 2179726 2201860 2490449 2387827
5309 2387827 2206734 2180311 2490495 2234033 2406834 2733191 2649048 2822659 2963742 2783761
5299 2783761 2610463 2731392 2830280 2940168 2939144 3080433 2913110 3179811 3224957 3040917
5289 3040917 3051677 3149275 3014120 3035578 3003765 2912105 2996645 3053412 2941652 3022738 3364568
5278 3364568 3398805 3425773 3515891 3291069 3155135 3177724 3283620 3394471 3476270 3318657
5268 3318657 3130455 3374350 3411257 3364297 3598682 3796813 3767241 3971692 3758573 3834893
5258 3834893 3956799 4003113 4174565 4140162 3955117 4165923 4188009 4149489 4264339 4512556
5248 4512556 4464783 4474872 4786353 4824214 4918830 5196128 5134728 5046078 5262805 5313119 5242699
$$ packed form
5319B004847M83012j46222k72136q4169J77303K59627k42536K2134K88589j02622
5309B387827j81093k6423L10184k56462J72801L26357q4143J73611J41083j79981
5299B783761j73298J20929R8888J09888j024J41289j67323K66701M5146j84040
5289C040917J0760R7598j35155K1458l1813r1660Q4540N6767j11760Q1086L41830
5278C364568L4237K6968R0118k24822j35934K2589J05896J10851Q1799j57613
5268C318657j88202K43895L6907m6960K34385J98131k9572K04451k13119P6320
5258C834893J21906M6314J71452l4403j85045K10806K2086l8520J14850K48217
5248D512556m7773J0089L11481L7861R4616K77298o1400q8650K16727N0314p0420
$$ plain form
5237 5242699 5464002 6075718 6176695 6368280 6624639 6835054 6798447 7170719 7534466 7890639
5227 7890639 8074043 8629417 9422532 10110067 11105418 12069257 12984602 13703374 14104949 13984077
5217 13984077 14129023 14108354 13692840 13255558 12633718 12314645 11342242 10810635 10487698 10369917
5207 10369917 10208104 10113299 10146252 9955212 9835080 9731370 9653229 9819282 9724892 9466885
5197 9466885 9640310 9980341 10210133 10307652 10326097 10546428 10645856 10570517 10881494 10881057 11288848
5186 11288848 11390294 11609119 11757974 11824636 12127490 12383329 12663998 12798021 12963674 13180132
5176 13180132 13708099 13841896 14029836 14714202 14905168 15128334 15676041 16076280 16563796
5167 16563796 16972492 17515736 17896853 18509784 19105727 19370262 20210021 20932039 21603507
$$ packed form
5237E242699K21303O11716J00977J91585K56359K10415l6607L72272L63747L56173
5227G890639J83404N55374P93115O87535R95351R63839R15345P18772M01575j20872
5217A3984077J44946k0669m15514m37282o21840l19073r72403n31607l22937j17781
5207A0369917j61813r4805L2953j91040j20132j03710p8141J66053r4390k58007
5197I466885J73425L40031K29792R7519J8445K20331R9428p5339L10977m37M07791
5186A1288848J01446K18825J48855O6662L02854K55839K80669J34023J65653K16458
5176A3180132N27967J33797J87940O84366J90966K23166N47707M00239M87516
5167A6563796M08696N43244L81117O12931N95943K64535Q39759P22018O71468
$$ plain form
5158 21603507 22526184 23394969 24028165 24716482 25638520 26596257 27485460 28537316 29507884
5149 29507884 30714488 32095748 33552279 34850047 36447696 37901073 39385751 40966255
5141 40966255 43106890 45225269 47136624 49451757 51737664 54453979 57026485 59517709
5133 59517709 62677190 65586037 68835957 72150096 75798632 79453615 83112205 87007368
5125 87007368 90762297 94544594 98295216 101797733 105223726 108718602 111392357 113913505
5117 113913505 116216469 118131226 119542995 120548913 120671491 120528898 119958233 118393669
5109 118393669 116852585 115044274 112619849 109586428 106596982 103363223 99819593 96473354
5101 96473354 93032351 89320704 85901841 82424148 78757411 75795280 72828319 69603832
$$ packed form
5158B1603507R22677Q68785O33196O88317R22038R57737Q89203J051856R70568
5149B9507884J206604J381260J456531J297768J597649J453377J484678J580504
5141D0966255K140635K118379J911355K315133K285907K716315K572506K491224
5133E9517709L159481K908847L249920L314139L648536L654983L658590L895163
5125H7007368L754929L782297L750622L502517L425993L494876K673755K521148
5117A13913505K302964J914757J411769J005918J22578j42593n70665j564564
5109A18393669j541084j808311k424425l033421k989446l233759l543630l346239
5101I6473354l441003l711647l418863l477693l666737k962131k966961l224487
$$ plain form
5093 69603832 66621369 63953543 61319067 58821386 56471892 54194208 51861941 49908958
5085 49908958 47921560 46138749 44131109 42294680 40978311 39641000 38285946 36945513
5077 36945513 35399894 34149264 33036398 32014897 31031100 29883120 28964194 27924639
5069 27924639 27150610 26206253 25259600 24711057 24010139 23545824 22898352 22443120 21781529
5060 21781529 21005740 20203755 19889320 19696813 18988110 18395210 18057720 17707075 17033828
5051 17033828 16478427 16356650 15991967 15462398 15041261 14574331 14450856 14324865 14126976
5042 14126976 13547005 13367776 13187046 12805151 12475110 12305540 11931364 11763656 11776519 11423161
5032 11423161 11129163 10725838 10417659 10536771 10703755 10274422 9797511 9797079 9631644 9349596
$$ packed form
5093F9603832k982463k667826k634476k497681k349494k277684k332267j952983
5085D9908958j987398j782811k007640j836429j316369j337311j355054j340433
5077C6945513j545619j250630j112866j021501r83797j147980r18926j039555
5069B7924639p74029r44357r46653n48543p00918m64315o47472m55232o61591
5060B1781529p75789q01985l14435j92507p08703n92900l37490l50645o73247
5051A7033828n55401j21777l64683n29569m21137m66930j23475j25991j97889
5042A4126976n79971j79229j80730l81895l30041j69570l74176j67708J2863l53358
5032A1423161k93998m03325l08179J19112J66984m29333m76911m32j65435k82048
$$ plain form
5022 9349596 9152263 9029758 9087682 8928007 8730737 8825306 8814807 8774866 8423800 8377733
5012 8377733 8332135 8399826 8203401 7912962 7915726 8085858 8057666 7742346 8004251 7927514 7874609
5001 7874609 7793350 7719434 7774103 7771772 8002909 7944547 8130069 8192433 8240175 8115656 8264599
4990 8264599 8280444 8061566 8011914 7873067 7991154 7626818 7238241 6978090 6847494 6481981
4980 6481981 6592751 6499151 6335908 6261272 6095741 5997366 5661057 5684079 5732275 5378187
4970 5378187 5448522 5495467 5485694 5759951 5719833 5329360 5536062 5643747 5490184 5445928 5471391
4959 5471391 5464212 5551296 5375857 5450115 5233961 5090114 5311175 5127272 5404443 5486893
4949 5486893 5317469 5182025 4935127 5031891 5282125 5431983 5595266 5660770 5514513 5391144
$$ packed form
5022I349596j97333j22505N7924j59675j97270R4569j0499l9941l51066m6067
5012H377733m5598O7691j96425k90439K764J70132k8192l15320K61905p6737n2905
5001G874609q1259p3916N4669k331K31137n8362J85522O2364M7742j24519J48943
4990H264599J5845k18878m9652j38847J18087l64336l88577k60151j30596l65513
4980F481981J10770r3600j63243p4636j65531r8375l36309K3022M8196l54088
4970E378187P0335M6945r773K74257m0118l90473K06702J07685j53563m4256K5463
4959E471391p179Q7084j75439P4258k16154j43847K21061j83903K77171Q2450
4949E486893j69424j35444k46898R6764K50234J49858J63283O5504j46257j23369
$$ plain form
4939 5391144 5534782 5585470 5639899 5530955 5647942 5715368 5427359 5680980 5939220 5684308
4929 5684308 6068306 5893732 5957125 6028501 5859418 6006886 6148238 6349370 6439904 6433785
4919 6433785 6418207 6573234 6686660 6791830 6968762 7053468 7018370 6884554 7211579 7207763
4909 7207763 7256484 7430515 7724044 7774251 7600888 7715398 7928341 8026039 8015726 8201411
4899 8201411 8228831 8329192 8321185 8701730 8592944 8955950 9134112 9064391 9215051 9093159
4889 9093159 9297075 9635154 9676410 9628491 9646068 9865044 10118292 10315902 10328567 10299271
4879 10299271 10592335 10752883 10822403 10926462 11243579 11239822 11645401 11975797 12216539 12449824
4869 12449824 12605687 13140330 13612368 13878892 14038890 14630136 15193280 15688526 16427685
$$ packed form
4939E391144J43638N0688N4429j08944J16987O7426k88009K53621K58240k54912
4929E684308L83998j74574O3393P1376j69083J47468J41352K01132R0534o119
4919F433785j5578J55027J13426J05170J76932Q4706l5098j33816L27025l816
4909G207763M8721J74031K93529N0207j73363J14510K12943R7698j0313J85685
4899H201411K7420J00361q007L80545j08786L63006J78162o9721J50660j21892
4889I093159K03916L38079M1256m7919J7577K18976K53248J97610J2665k9296
4879A0299271K93064J60548O9520J04059L17117l757M05579L30396K40742K33285
4869A2449824J55863N34643M72038K66524J59998N91246N63144M95246P39159
$$ plain form
4860 16427685 17234453 17754416 18292597 19292429 20069308 21309799 22489022 23674069 24954469
4851 24954469 26601048 28008992 29581706 31209023 32496350 34476160 36482823 38807981
4843 38807981 41293412 43711366 46743009 49844108 52821836 56121483 59191281 62512629
4835 62512629 66136452 69458111 72951925 76466619 80278097 84610684 89798198 95504341
4827 95504341 101497729 108204751 114615441 120097336 124686761 127914040 129716141 130718868
4819 130718868 131103420 131738667 132051794 132704542 133661326 135779021 138158864 140871613 144316587
4810 144316587 147479945 150752300 154102656 157125288 159786021 162458830 164446859 165662358
4802 165662358 166530241 166650829 166180488 165183024 163699536 161920239 159608801 156817177 153862142
$$ packed form
4860A6427685Q06768N19963N38181R99832P76879J240491J179223J185047J280400
4851B4954469J646579J407944J572714J627317J287327J979810K006663K325158
4843C8807981K485431K417954L031643L101099K977728L299647L069798L321348
4835F2512629L623823L321659L493814L514694L811478M332587N187514N706143
4827I5504341N993388O707022O410690N481895M589425L227279J802101J002727
4819A30718868L84552O35247L13127O52748R56784K117695K379843K712749L444974
4810A44316587L163358L272355L350356L022632K660733K672809J988029J215499
4802A65662358Q67883J20588m70341r97464j483488j779297k311438k791624k955035
$$ plain form
4793 153862142 151391071 148883427 146076176 143752529 141308844 138883988 136753862 134715718
4785 134715718 132676261 130515739 128043264 125329037 122704109 119986309 117119099 113881421
4777 113881421 110510721 107197315 103342410 99806082 96347074 92618918 88874475 85443274
4769 85443274 82228076 78946023 76283092 73680576 71079548 68914877 67046048 65179818
4761 65179818 63737459 62321508 60940949 60398541 59829397 59402238 59416563 59247369 59233962
4752 59233962 59783852 60605730 61265416 62498836 63743196 65128427 66868492 68897242 71177275
4743 71177275 74054959 76752379 79673923 82899875 85861460 88957716 92225235 95144980
4735 95144980 98481094 101715986 104434572 107406535 110090337 112841468 115477588 118007165
$$ packed form
4793A53862142k471071k507644k807251k323647k443685k424856k130126k038144
4785A34715718k039457k160522k472475k714227k624928k717800k867210l237678
4777A13881421l370700l313406l854905l536328l459008l728156l744443l431201
4769H5443274l215198l282053k662931k602516k601028k164671j868829j866230
4761F5179818j442359j415951j380559n42408n69144m27159J4325j69194j3407
4752E9233962N49890Q21878O59686J233420J244360J385231J740065K028750K280033
4743G1177275K877684K697420K921544L225952K961585L096256L267519K919745
4735I5144980L336114L234892K718586K971963K683802K751131K636120K529577
$$ plain form
4727 118007165 120347806 122973611 125389398 127819069 131006621 133784072 136608308 139700129
4719 139700129 142735963 145701928 148969869 152270190 154841957 157438946 159844667 161783221
4711 161783221 163167874 164232932 164600596 164256075 163386835 161621831 159618589 157141722
4703 157141722 153993264 150624194 146887770 143087846 138965303 134582310 130542636 126861995
4695 126861995 123082291 119046780 115619146 112434075 109546417 107044073 104574474 102240013
4687 102240013 99972348 97855495 95505492 93400831 91530526 89490003 86835510 84200956
4679 84200956 81326928 78326581 75358146 72272424 69042864 65633869 62753813 59836336
4671 59836336 56750885 53553853 50542085 47841529 45404179 42918009 40722763 38863961
$$ packed form
4727A18007165K340641K625805K415787K429671L187552K777451K824236L091821
4719A39700129L035834K965965L267941L300321K571767K596989K405721J938554
4711A61783221J384653J065058L67664l44521q69240j765004k003242k476867
4703A57141722l148458l369070l736424l799924m122543m382993m039674l680641
4695A26861995l779704m035511l427634l185071k887658k502344k469599k334461
4687A02240013k267665k116853k350003k104661j870305k040523k654493k634554
4679H4200956k874028l000347k968435l085722l229560l408995k880056k917477
4671E9836336l085451l197032l011768k700556k437350k486170k195246j858802
$$ plain form
4663 38863961 37179981 35028032 33289193 31852689 30464735 29056765 27886840 26555403
4655 26555403 25575308 24522739 23373566 22687624 21761536 20951202 20292834 19899763 19633059
4646 19633059 19115366 18355628 17836699 17346713 17001110 16712661 16666287 16181641 15830563 15932731
4636 15932731 15954488 15666055 15863433 16194160 16539711 17159466 17755428 18386360 19700694
4627 19700694 20625452 21316999 22039862 22141916 21978416 21449623 20639459 19667912 19017623
4618 19017623 17788252 16987604 16627263 15956609 16478267 17171488 17582400 18506026 19275868
4609 19275868 20094086 21367446 22468651 23290244 24629286 25790674 26899732 28307819
4601 28307819 29780403 31241742 32532043 33592368 34551908 35732388 36944668 37977003
$$ packed form
4663C8863961j683980k151949j738839j436504j387954j407970j169925j331437
4655B6555403r80095j052569j149173o85942r26088q10334o58368l93071k66704
4646A9633059n17693p59738n18929m89986l45603k88449m6374m84646l51078J02168
4636A5932731K1757k88433J97378L30727L45551O19755N95962O30932J314334
4627A9700694R24758O91547P22863J02054j63500n28793q10164r71547o50289
4618A9017623j229371q00648l60341o70654N21658O93221M10912R23626P69842
4609A9275868Q18218J273360J101205Q21593J339042J161388J109058J408087
4601B8307819J472584J461339J290301J060325R59540J180480J212280J032335
$$ plain form
4593 37977003 38743806 39478231 40102577 40217686 39914890 39511965 39201434 38584819 37628145
4584 37628145 36862516 35927081 34773142 33280633 31783789 30577172 29206547 27664962
4576 27664962 26084141 24692635 23446154 21992037 20370176 18857485 17765159 16375885
4568 16375885 15006337 13907023 12774258 11654316 11100588 10280784 9440782 8905322 8810461
4559 8810461 8209086 7791070 7753697 7162603 7002399 6730412 6489099 6222737 6034153 5708774
4549 5708774 5679667 5539529 5485689 5436916 5298196 4943296 5113664 5388494 5102177 4853886
4539 4853886 4749732 4735168 4680598 4745016 4633794 4613494 4495583 4321039 4370850 4387431 4175031
4528 4175031 4173027 4287267 4006551 3807702 3792997 3827417 3847679 3783103 3754053 3812302 3491807
$$ packed form
4593C7977003P66803P34425O24346J15109l02796m02925l10531o16615r56674
4584C7628145p65629r35435j153939j492509j496844j206617j370625j541585
4576B7664962j580821j391506j246481j454117j621861j512691j092326j389274
4568A6375885j369548j099314j132765j119942n53728q19804q40002n35460r4861
4559H810461o01375m18016l7373n91094j60204k71987k41313k66362j88584l25379
4549E708774k9107j40138n3840m8773j38720l54900J70368K74830k86317k48291
4539D853886j04154j4564n4570O4418j11222k0300j17911j74544M9811J6581k12400
4528D175031k004J14240k80716j98849j4705L4420K0262o4576k9050N8249l20495
$$ plain form
4517 3491807 3289354 3391040 3361183 3531588 3654774 3407416 3363769 3496201 3170074 2960125
4507 2960125 3115729 3239365 3135118 2904519 2785953 2850884 2670459 2441078 2580865 2546570
4497 2546570 2156332 2244412 2573113 2213890 2141949 2331639 2042232 1854935 2083753 2021627
4487 2021627 1939626 2095550 1845047 1901257 1744977 1698686 1895770 1848730 1619797 1708669
4477 1708669 1783807 1365698 1925629 2315556 2038498 1924724 1902635 1617722 1616090 1846483
4467 1846483 1832935 1713175 1633321 1659764 1584008 1565870 1449090 1509742 1526701 1579477 1606447
4456 1606447 1506727 1568180 1562451 1750119 1761472 1714495 1727955 1952275 1808300 1585398 1544680
4445 1544680 1670287 1848705 2148028 2286724 1940946 1865387 1963512 1846392 2038852 1917337
$$ packed form
4517C491807k02453J01686k9857J70405J23186k47358m3647J32432l26127k09949
4507B960125J55604J23636j04247k30599j18566O4931j80425k29381J39787l4295
4497B546570l90238Q8080L28701l59223p1941J89690k89407j87297K28818o2126
4487B021627q2001J55924k50503N6210j56280m6291J97084m7040k28933Q8872
4477A708669P5138m18109N59931L89927k77058j13774k2089k84913j632K30393
4467A846483j3548j19760p9854K6443p5756j8138j16780O0652J6959N2776K6970
4456A606447r9720O1453n729J87668J1353m6977J3460K24320j43975k22902m0718
4445A544680J25607J78418K99323J38696l45778p5559R8125j17120J92460j21515
$$ plain form
4435 1917337 1714903 2020188 2118295 1977677 1919620 2025077 2041865 1745513 1639654 1833150
4425 1833150 1791477 1885998 1971656 1961161 1820226 2037039 2017904 2433495 2317961 2207029
4415 2207029 1962519 1699087 1882485 2108390 1934869 1668380 1661144 1916800 1846502 1372499
4405 1372499 1563328 1796814 1851054 1772116 1767270 1738948 1724123 1597522 1595487 1792630 1834566
4394 1834566 1584151 1580721 1710082 1460028 1466018 1564023 1310141 1288270 1150128 1045197 943512
4383 943512 1047882 1134870 1086737 1130201 1293702 1145950 1233040 1397470 1374961 1402031 1159086
4372 1159086 1133720 1188703 1110698 1058190 988800 1228307 1165491 1215396 1051566 1324663 1490581
4361 1490581 1297819 1067742 791863 1160347 1008698 1161092 1140255 1064262 1048296 994740
$$ packed form
4435A917337k02434L05285R8107j40618n8057J05457J6788k96352j05859J93496
4425A833150m1673R4521Q5658j0495j40935K16813j9135M15591j15534j10932
4415B207029k44510k63432J83398K25905j73521k66489p236K55656p0298m74003
4405A372499J90829K33486N4240p8938m846k8322j4825j26601k035J97143M1936
4394A834566k50415l430J29361k50054N990R8005k53882k1871j38142j04931j01685
4383I43512J04370Q6988m8133M3464J63501j47752Q7090J64430k2509K7070k42945
4372A159086k5366N4983p8005n2508o9390K39507o2816M9905j63830K73097J65918
4361A490581j92762k30077k75879L68484j51649J52394k0837p5993j5966n3556
$$ plain form
4351 994740 1050074 1150280 1292228 1242069 1055065 1056021 994300 996066 1087272 826151 729584
4340 729584 935069 857390 857339 745461 807887 782801 824990 1202575 1028139 847324 619104
4329 619104 663606 795440 926680 874704 870412 907899 675920 647861 527929 874723 1058924
4318 1058924 1191889 1011524 865700 986149 986595 1007016 684879 921031 943145 1165360
4308 1165360 1274056 1013927 1024742 1083829 809352 844458 776316 709859 942215 1016550 905081
4297 905081 823136 703460 530469 439218 587890 671152 867585 792335 873737 862484 970289
4286 970289 885462 655680 959232 1019246 1064555 1196305 1289409 1270061 1301905 1309548 1229817
4275 1229817 872598 1287894 1444581 1232865 1211760 1213732 1082047 1233655 1245326 1379280
$$ packed form
4351I94740N5334J00206J41948n0159j87004R56o1721J766R1206k61121r6567
4340G29584K05485p7679n1j11878O2426k5086M2189L77585j74436j80815k28220
4329F19104M4502J31834J31240n1976m292L7487k31979k8059j19932L46794J84201
4318A058924J32965j80365j45824J20449M46K0421l22137K36152K2114K22215
4308A165360J08696k60129J0815N9087k74477L5106o8142o6457K32356P4335j11469
4297I05081q1945j19676j72991r1251J48672Q3262J96433p5250Q1402j1253J07805
4286I70289q4827k29782L03552O0014M5309J31750R3104j9348L1844P643p9731
4275A229817l57219M15296J56687k11716k1105J972j31685J51608J1671J33954
$$ plain form
4265 1379280 1420706 1396158 1205552 1354423 1507868 1481792 1251379 1324924 1461675 1591424
4255 1591424 1666903 1419321 1538224 1753509 1423158 1687330 2207345 2002216 1874140 1660406
4245 1660406 1845597 2074258 1871624 1736243 1781489 1998277 2007125 2044595 2212990 1955751
4235 1955751 1848313 2026332 1757437 1903318 1914781 1896338 1792828 1490336 1705000 1804590
4225 1804590 1913291 1783869 1644387 1433080 1679573 1740448 1512125 1688531 1857864 1934742
4215 1934742 2136723 2136595 2218035 2317982 2611682 2345640 2351651 2365436 2373529 2193238 2256795
4204 2256795 2313290 2052256 2092909 2128132 1858351 2064819 1970558 1982864 2008109 1684064 1929924
4193 1929924 2113102 2033695 1954193 1837354 1851337 2071514 2073965 1921771 1923905 1859447 2123813
$$ packed form
4265A379280M1426k4548j90606J48871J53445k6076k30413P3545J36751J29749
4255A591424P5479k47582J18903K15285l30351K64172N20015k05129j28076k13734
4245A660406J85191K28661k02634j35381M5246K16788Q848L7470J68395k57239
4235A955751j07438J78019k68895J45881J1463j8443j03510l02492K14664R9590
4225A804590J08701j29422j39482k11307K46493O0875k28323J76406J69333P6878
4215A934742K01981j28Q1440R9947K93700k66042O011J3785Q093j80291O3557
4204B256795N6495k61034M0653L5223k69781K06468r4261J2306K5245l24045K45860
4193A929924J83178p9407p9502j16839J3983K20177K451j52194K134o4458K64366
$$ plain form
4182 2123813 2286064 2221963 2133200 1897926 1973788 2108515 2240127 2130181 1910481 2058972
4172 2058972 2225064 2171579 2191307 2350858 2288812 2175454 2239012 2362120 2310132 2156648
4162 2156648 2270136 2405290 2569454 2638502 2550438 2268946 2407358 2492272 2414113 2445649
4152 2445649 2517627 2495143 2563684 2290738 2399860 2849814 2950412 2567078 2918652 3107913
4142 3107913 2686032 2409662 2674077 2722634 2810942 2980982 2910627 3069694 3035722 3020432
4132 3020432 3377686 3217658 3050975 3524495 3664125 3291869 3310919 3356206 3328765 3529763
4122 3529763 3615789 3996485 4122323 3972738 3831408 3692241 3528188 3394737 3550287 3568165
4112 3568165 3779950 4062323 3927685 3719838 3841727 3738969 3615255 3938543 3926241 3889623
$$ packed form
4182B123813J62251o4101q8763k35274P5862J34727J31612j09946k19700J48491
4172B058972J66092n3485J9728J59551o2046j13358O3558J23108n1988j53484
4162B156648J13488J35154J64164O9048q8064k81492J38412Q4914p8159L1536
4152B445649P1978k2484O8541k72946J09122M49954J00598l83334L51574J89261
4142C107913m21881k76370K64415M8557Q8308J70040p0355J59067l3972j5290
4132C020432L57254j60028j66683M73520J39630l72256J9050M5287k7441K00998
4122C529763Q6026L80696J25838j49585j41330j39167j64053j33451J55550J7878
4112C568165K11785K82373j34638k07847J21889j02758j23714L23288j2302l6618
$$ plain form
4102 3889623 3852240 3651692 4089747 4212147 3989312 4060210 4190964 4155793 4255551 4125428
4092 4125428 4044813 4286262 4361218 4552248 4714937 5054994 4948630 4913031 4950015 4658125
4082 4658125 4642953 4661367 4779261 5144896 5358758 5536414 5539312 5576135 5571161 5671833 6086908
4071 6086908 5996077 6213269 6418987 6415260 6702341 6616992 6885686 7273517 7554368 7857051
4061 7857051 8200812 8440712 8805079 9116016 9518636 10248328 11089603 11797554 12661392 13653173
4051 13653173 14525533 15023392 15474643 15561459 15611516 15264639 14843648 14535115 14100602 13617935
4041 13617935 13528131 13270673 13026573 13278536 13309173 13219983 13293166 13102446 13280844 13679972
4031 13679972 13793768 13988557 14038739 14352876 14920754 14783838 15192581 15608731 15864174 16588361
$$ packed form
4102C889623l7383k00548M38055J22400k22835P0898J30754l5171R9758j30123
4092D125428q0615K41449P4956J91030J62689L40057j06364l5599L6984k91890
4082D658125j5172J8414J17894L65635K13862J77656K898L6823m974J00672M15075
4071F086908r0831K17192K05718l727K87081q5349K68694L87831K80851L02683
4061G857051L43761K39900L64367L10937M02620P29692Q41275P07951Q63838R91781
4051A3653173Q72360M97859M51251Q6816N0057l46877m20991l08533m34513m82667
4041A3617935q9804k57458k44100K51963L0637q9190P3183j90720J78398L99128
4031A3679972J13796J94789N0182L14137N67878j36916M08743M16150K55443P24187
$$ plain form
4021 16588361 16921460 17210504 17761253 18297625 18889897 19307618 19983802 21076369 22049985
4012 22049985 22477241 23128879 23581711 24174394 25355578 26232381 27079691 28049875 29177940
4003 29177940 29926423 30945026 31813322 33021458 33982648 34893432 35942637 37104718 38083694
3994 38083694 39108506 39676841 40577690 41428951 42377914 43429682 44105322 45251391 47078546
3985 47078546 48588627 50194085 52404429 54447233 56836211 59318435 62311834 65583210
3977 65583210 68887726 72619148 77043722 81550082 86134136 91403772 96776919 102385492
3969 102385492 108160161 113666677 119065962 124779480 130247615 135351552 140417711 145236011
3961 145236011 150343993 155552039 160913927 166723142 172953173 179833367 187285374 195465369
$$ packed form
4021A6588361L33099K89044N50749N36372N92272M17721O76184J092567R73616
4012B2049985M27256O51638M52832N92683J181184Q76803Q47310R70184J128065
4003B9177940P48483J018603Q68296J208136R61190R10784J049205J162081R78976
3994C8083694J024812N68335R00849Q51261R48963J051768O75640J146069J827155
3985D7078546J510081J605458K210344K042804K388978K482224K993399L271376
3977F5583210L304516L731422M424574M506360M584054N269636N373147N608573
3969A02385492N774669N506516N399285N713518N468135N103937N066159M818300
3961A45236011N107982N208046N361888N809215O230031O880194P452007Q179995
$$ plain form
3953 195465369 203291027 211639091 219600266 226886402 234020817 240718714 247018404 253017657
3945 253017657 258756503 264293674 269729297 275131991 280446094 285469957 290206665 294252638
3937 294252638 297462647 299334956 300498047 300051544 298457648 295828315 291773176 287026986
3929 287026986 281972576 277166578 271770387 267025379 262179571 257606203 253011736 247719893
3921 247719893 242070158 236302736 230030228 223340080 216939628 210026693 203110928 196237401
3913 196237401 189840325 183582270 177641988 171864180 166250934 160598808 155396417 149893943
3905 149893943 144081021 138499686 133064619 127516845 122210770 116595286 111388281 106404675
3897 106404675 101469810 96761086 92430168 88036681 83647127 79983805 76741591 73532856
$$ packed form
3953A95465369P825658Q348064P961175P286136P134415O697897O299690N999253
3945B53017657N738846N537171N435623N402694N314103N023863M736708M045973
3937B94252638L210009J872309J163091m46503j593896k629333m055139m746190
3929B87026986n054410m805998n396191m745008m845808m573368m594467n291843
3921B47719893n649735n767422o272508o690148o400452o912935o915765o873527
3913A96237401o397076o258055n940282n777808n613246n652126n202391n502474
3905A49893943n812922n581335n435067n547774n306075n615484n207005m983606
3897A06404675m934865m708724m330918m393487m389554l663322l242214l208735
$$ plain form
3889 73532856 70516478 67590149 65296220 63108541 60832328 58621161 56934592 55439850
3881 55439850 53940573 52520008 50852510 49517679 48358185 47605912 46390068 45064671
3873 45064671 43593947 42157469 40989245 40035501 38745504 37333044 36091232 35032447
3865 35032447 33962521 32801257 31800773 30882975 29764667 28907680 28150087 27312950 26318834
3856 26318834 25475575 24630352 23789802 22823235 21554406 20633241 19719873 18566955 17790411
3847 17790411 16967881 16187143 15930245 15403100 14745692 14304602 13705274 13164031 12813056
3838 12813056 12378297 12082885 11772479 11655693 11254139 11118353 10830054 10706925 10677135 10379754
3828 10379754 10025762 9960246 10136351 9813992 9524452 9291901 9004511 8557069 8161575 7792013
$$ packed form
3889G3532856l016378k926329k293929k187679k276213k211167j686569j494742
3881E5439850j499277j420565j667498j334831j159494p52273j215844j325397
3873D5064671j470724j436478j168224r53744j289997j412460j241812j058785
3865C5032447j069926j161264j000484r17798j118308q56987p57593q37137r94116
3856B6318834q43259q45223q40550r66567j268829r21165r13368j152918p76544
3847A7790411q22530p80738k56898n27145o57408m41090n99328n41243l50975
3838A2813056m34759k95412l10406j16786m01554j35786k88299j23129k9790k97381
3828A0379754l53992o5516J76105l22359k89540k32551k87390m47442l95494l69562
$$ plain form
3818 7792013 7440370 7564776 7556887 7262818 7210179 7099912 7034800 6792456 6625185 6719131
3808 6719131 6665476 6399513 6165689 6080242 6179378 5783606 5691813 5873102 5975702 5939079
3798 5939079 5987684 6001163 5940810 5868258 5736524 5478101 5397643 5698122 5646669 5629133 5340057
3787 5340057 4923113 5026538 5098721 4950702 4990144 4972619 4870200 4790531 4663494 4614840
3777 4614840 4571313 4656597 4580485 4309716 4466021 4568806 4533233 4102244 3994348 4045935
3767 4045935 3889451 4147434 4225236 4177801 3945798 3974302 3823545 3799297 3919000 3953739
3757 3953739 3964430 3984451 4176722 3948100 3590001 3298491 3432542 3390186 3632276 3512050
3747 3512050 3625500 3568653 3398159 3635048 3596009 3601086 3495347 3731943 3720098 3688226 3692844
$$ packed form
3818G792013l51643J24406p889k94069n2639j10267o5112k42344j67271R3946
3808F719131n3655k65963k33824q5447R9136l95772r1793J81289J02600l6623
3798E939079M8605J3479o0353p2552j31734k58423q0458L00479n1453j7536k89076
3787E340057m16944J03425P2183j48019L9442j7525j02419p9669j27037m8654
3777D614840m3527Q5284p6112k70769J56305J02785l5573m30989j07896N1587
3767D045935j56484K57983P7802m7435k32003K8504j50757k4248J19703L4739
3757C953739J0691K0021J92271k28622l58099k91510J34051m2356K42090j20226
3747C512050J13450n6847j70494K36889l9039N077j05739K36596j1845l1872M618
$$ plain form
3736 3692844 3678055 3554540 3279454 3572047 3622836 3431063 3314359 3303434 3307889 3239126 3546572
3725 3546572 3562108 3466822 3517697 3524453 3582501 3874241 3831146 3640561 3497708 3781788 3896954
3714 3896954 3931497 3846103 3887204 4112921 4075680 4315144 4464271 4533088 4657650 4644422 4668821
3703 4668821 4927467 5054926 5110851 5148344 5123307 5226029 5205367 5412094 5560137 5537969
3693 5537969 5643315 5811941 5880594 5992769 6316113 6339809 6225778 6399402 6505949 6441577
3683 6441577 6662927 6667356 6481382 6802640 7153237 7218081 7196858 7248527 7360413 7521409
3673 7521409 7653427 7890238 7971066 7994511 8229325 8221900 8315210 8443757 8471805 8609909 8912886
3662 8912886 8914590 8857773 8984038 9255014 9380933 9563770 9669684 9871110 10017146 10151539
$$ packed form
3736C692844j4789j23515k75086K92593N0789j91773j16704j0925M455o8763L07446
3725C546572J5536r5286N0875O756N8048K91740m3095j90585j42853K84080J15166
3714C896954L4543q5394M1101K25717l7241K39464J49127O8817J24562j3228K4399
3703D668821K58646J27459N5925L7493k5037J02722k0662K06727J48043k2168
3693E537969J05346J68626O8653J12175L23344K3696j14031J73624J06547o4372
3683F441577K21350M429j85974L21258L50597O4844k1223N1669J11886J60996
3673G521409J32018K36811Q0828K3445K34814p425R3310J28547K8048J38104L02977
3662H912886J704n6817J26265K70976J25919J82837J05914K01426J46036J34393
$$ plain form
3652 10151539 10277597 10666594 10662325 10696189 10825170 11019787 11284583 11629643 11988893 12086826
3642 12086826 12458308 12560870 12864104 13319385 13704174 14230167 15040672 15110092 15356716 16048145
3632 16048145 16078429 16313436 16724786 17137628 17618565 18343852 19248579 20421285 22152638
3623 22152638 23714537 25736704 27913265 30174977 33196257 36396930 40078046 44389283
3615 44389283 49381226 55220815 62427167 71426756 82469681 96167503 112558676 130779616
3607 130779616 149175283 165653064 178456876 185970395 187621936 183930886 176169639 165243349
3599 165243349 151912681 137524821 123310524 110716846 100171526 91839766 86037930
3592 86037930 82153753 79234938 77768843 77808468 79023835 81361810 84581863 89013540
$$ packed form
3652A0151539J26058L88997m269L3864J28981J94617K64796L45060L59250R7933
3642A2086826L71482J02562L03234M55281L84789N25993Q10505O9420K46624O91429
3632A6048145L0284K35007M11350M12842M80937P25287R04727J172706J731353
3623B2152638J561899K022167K176561K261712L021280L200673L681116M311237
3615D4389283M991943N839589P206352Q999589J1042925J3697822J6391173J8220940
3607A30779616J8395667J6477781J2803812P513519J651541l691050p761247j0926290
3599A65243349j3330668j4387860j4214297j2593678j0545320q331760n801836
3592H6037930l884177k918815j466095L9625J215367K337975L220053M431677
$$ plain form
3584 89013540 94573274 101735118 110624909 122077757 136845020 156221759 180193811 209537438
3576 209537438 243930012 279171992 311871058 338042989 353900484 357970793 350626583
3569 350626583 334786110 313105914 286166114 255663770 224381231 195959181 172238517
3562 172238517 152511300 136733745 124365455 113927774 105185325 98418959 93604812
3555 93604812 89982897 87509551 86278848 85805791 86402615 88483172 92107727 97122286
3547 97122286 103964748 113432593 125048823 138717543 153236576 167252747 178304740
3540 178304740 185364336 187390242 183972885 176564374 166409388 153776809 139061642 123815963
3532 123815963 109406089 96848338 86201301 77029551 69187782 62497455 57020093 52424126
$$ packed form
3584H9013540N559734P161844Q889791J1452848J4767263J9376739K3972052K9343627
3576B09537438L4392574L5241980L2699066K6171931J5857495M070309p344210
3569C50626583j5840473k1680196k6939800l0502344l1282539k8422050k3720664
3562A72238517j9727217j5777555j2368290j0437681q742449o766366m814147
3555I3604812l621915k473346j230703m73057N96824K080557L624555N014559
3547I7122286O842462R467845J1616230J3668720J4519033J4016171J1051993
3540A78304740P059596K025906l417357p408511j0154986j2632579j4715167j5245679
3532A23815963j4409874j2557751j0647037r171750p841769o690327n477362m595967
$$ plain form
3524 52424126 48265495 44559815 41707806 39149169 36970004 34784220 32751489 31258083
3516 31258083 29983612 28649284 27432314 26264280 25026499 23795722 22575836 21569050
3508 21569050 20566946 19536618 18979333 18403465 17676467 17394533 16926206 16753945 16465089
3499 16465089 15919555 15484190 15282052 14582600 13885940 13241673 12949118 12579205 11880436
3490 11880436 11603991 11535471 10887258 10513547 10109801 9810811 9390277 9040007 9038786 8532937
$$ packed form
3524E2424126m158631l705680k852009k558637k179165k185784k032731j493406
3516C1258083j274471j334328j216970j168034j237781j230777j219886j006786
3508B1569050j002104j030328n57285n75868p26998k81934m68327j72261k88856
3499A6465089n45534m35365k02138o99452o96660o44267k92555l69913o98769
3490A1880436k76445o8520o48213l73711m03746k98990m20534l50270j221n05849
$$ [...]
##END NTUPLES=NMR SPECTRUM
##END=
