##TITLE=1H_CG-1228-1
 200.13MHz, CDCl3,
 8 sc
 
 3.10.2025
##JCAMPDX= 6.0         $$ Bruker NMR JCAMP-DX V2.0
##DATA TYPE= NMR SPECTRUM
##DATA CLASS= NTUPLES
##ORIGIN= UXNMR, Bruker Analytische Messtechnik GmbH
##OWNER= pz
$$ XWIN-NMR		Version 3.5
$$ Fri Oct  3 13:40:45 2025 Russian Standard Time (UT+4h)  she@DPX200
##.OBSERVE FREQUENCY= 200.1313
##.OBSERVE NUCLEUS= ^1H
##.ACQUISITION MODE= SIMULTANEOUS
##.ACQUISITION SCHEME= undefined
##.AVERAGES= 8
##.DIGITISER RES= 18
##SPECTROMETER/DATA SYSTEM= spect
##.PULSE SEQUENCE= zg30
##.SOLVENT NAME= CDCl3
##.SHIFT REFERENCE= (INTERNAL, CDCl3, 0, 15.488)
##AUDIT TRAIL= $$ (NUMBER, WHEN, WHO, WHERE, WHAT)
$$ ##TITLE= Audit trail, XWIN-NMR		Version 3.5
$$ ##JCAMPDX= 5.01
$$ ##ORIGIN= Bruker BioSpin GmbH
$$ ##OWNER= she
$$ F:/spectra/data/she/nmr/H-C/1/pdata/1/auditp.txt
$$ ##AUDIT TRAIL=  $$ (NUMBER, WHEN, WHO, WHERE, WHAT)
(   1,<2025-10-03 13:39:04.89 +0400>,<she>,<DPX200>,
      <created by zg, POWCHK disabled, PULCHK disabled
       configuration hash MD5:
       00 E9 B6 7A A2 85 ED C7 34 08 36 98 17 FE 4E 26
       data hash MD5: 16K
       89 73 88 6C 76 99 25 16 BB BC 92 FE 00 63 54 CC>)
(   2,<2025-10-03 13:39:07.29 +0400>,<she>,<DPX200>,
      <Start of raw data processing
       efp BC_mod = 2 LB = 0.25 FT_mod = 6 PKNL = 1 PHC0 = -2183.949 PHC1 = 7.592241 SI = 16K 
       data hash MD5: 16K
       CD 3D 7C 3A 3A 2B 2F C9 EC D1 5A 00 A7 CC 23 40>)
(   3,<2025-10-03 13:39:26.35 +0400>,<she>,<DPX200>,
      <pk PHC0 = -88.94421 PHC1 = 2.8 
       data hash MD5: 16K
       07 9D 89 C0 E1 AD 2B 9E 43 F7 3E B6 4D 01 34 18>)
(   4,<2025-10-03 13:39:31.12 +0400>,<she>,<DPX200>,
      <abs ABSG = 5 
       data hash MD5: 16K
       4F 21 8C 57 95 EE A7 8B 8E D5 FD 20 30 11 A0 7E>)
$$ ##END=
$$ 
$$ hash MD5
$$ 62 62 6F 31 86 95 FC 5A E8 AA 31 57 5C 76 AA 9B
##$RELAX= 
##$RELAX= 
##$RELAX= 
##$RELAX= 
##$RELAX= 
##$RELAX= 
$$ Bruker specific parameters
$$ --------------------------
##$DU= <F:/spectra>
##$EXPNO= 1
##$NAME= <H-C>
##$PROCNO= 1
##$TYPE= <nmr>
##$USER= <she>
##$AMP= (0..31)
100 100 100 100 100 100 100 100 100 100 100 100 100 100 100 100 100 100 
100 100 100 100 100 100 100 100 100 100 100 100 100 100 
##$AQSEQ= 0
##$AQ_mod= 1
##$AUNM= <au_zg>
##$AUTOPOS= <>
##$BF1= 200.13
##$BF2= 200.13
##$BF3= 200.13
##$BF4= 200.13
##$BF5= 200.13
##$BF6= 200.13
##$BF7= 200.13
##$BF8= 200.13
##$BYTORDA= 1
##$CFDGTYP= 0
##$CFRGTYP= 5
##$CHEMSTR= <none>
##$CNST= (0..31)
1 1 145 1 1 1 1 1 1 1 1 1 1 1 1 1 1 1 1 1 1 1 1 1 1 1 1 1 1 1 1 1 
##$CPDPRG= <>
##$CPDPRG1= <>
##$CPDPRG2= <>
##$CPDPRG3= <>
##$CPDPRG4= <mlev>
##$CPDPRG5= <mlev>
##$CPDPRG6= <mlev>
##$CPDPRG7= <mlev>
##$CPDPRG8= <mlev>
##$CPDPRGB= <>
##$CPDPRGT= <>
##$D= (0..31)
0 0.7 0 0 0 0 0 0 0 0 0 0.03 0 0 0 0 0 0 0 0 0 0 0 0 0 0 0 0 0 0 0 0 
##$DATE= 1759484344
##$DBL= (0..7)
120 120 120 120 120 120 120 120 
##$DBP= (0..7)
150 150 150 150 150 150 150 150 
##$DBP07= 0
##$DBPNAM0= <>
##$DBPNAM1= <>
##$DBPNAM2= <>
##$DBPNAM3= <>
##$DBPNAM4= <>
$$ [...]
##$SUBNAM3= <"">
##$SUBNAM4= <"">
##$SUBNAM5= <"">
##$SUBNAM6= <"">
##$SUBNAM7= <"">
##$SUBNAM8= <"">
##$SUBNAM9= <"">
##$SW= 18.0517328524113
##$SWIBOX= (0..15)
0 0 2 0 0 0 0 0 0 0 0 0 0 0 0 0 
##$SW_h= 3612.71676300578
##$TD= 16384
##$TD0= 1
##$TE= 0
##$TE2= 300
##$TE3= 300
##$TEG= 300
##$TL= (0..7)
0 120 120 120 120 120 120 120 
##$TP= (0..7)
150 150 150 150 150 150 150 150 
##$TP07= 0
##$TPNAME0= <>
##$TPNAME1= <>
##$TPNAME2= <>
##$TPNAME3= <>
##$TPNAME4= <>
##$TPNAME5= <>
##$TPNAME6= <>
##$TPNAME7= <>
##$TPOAL= (0..7)
0.5 0.5 0.5 0.5 0.5 0.5 0.5 0.5 
##$TPOFFS= (0..7)
0 0 0 0 0 0 0 0 
##$TUNHIN= 0
##$TUNHOUT= 0
##$TUNXOUT= 0
##$USERA1= <user>
##$USERA2= <user>
##$USERA3= <user>
##$USERA4= <user>
##$USERA5= <user>
##$V9= 5
##$VALIST= <valist>
##$VCLIST= <CCCCCCCCCCCCCCC>
##$VD= 0
##$VDLIST= <DDDDDDDDDDDDDDD>
##$VPLIST= <PPPPPPPPPPPPPPP>
##$VTLIST= <TTTTTTTTTTTTTTT>
##$WBST= 1024
##$WBSW= 4
##$XGAIN= (0..3)
0 0 0 0 
##$XL= 0
##$YL= 0
##$YMAX_a= 831604
##$YMIN_a= -1061545
##$ZGOPTNS= <>
##$ZL1= 120
##$ZL2= 120
##$ZL3= 120
##$ZL4= 120
##$ABSF1= 15.00317
##$ABSF2= -3.04867
##$ABSG= 5
##$ABSL= 3
##$ALPHA= 0
##$AQORDER= 0
##$ASSFAC= 0
##$ASSFACI= 0
##$ASSFACX= 0
##$ASSWID= 0
##$AUNMP= <proc_1d>
##$AZFE= 0.1
##$AZFW= 0.1
##$BCFW= 0
##$BC_mod= 2
##$BYTORDP= 0
##$COROFFS= 0
##$CY= -3
##$DATMOD= 1
##$DC= 0
##$DFILT= <>
##$DTYPP= 0
##$F1P= 0
##$F2P= 0
##$FCOR= 1
##$FTSIZE= 16384
##$FT_mod= 6
##$GAMMA= 0
##$GB= 0
##$INTBC= 1
##$INTSCL= 3.241238e-09
##$ISEN= 128
##$LB= 0.25
##$LEV0= 0
##$LPBIN= 0
##$MAXI= 10000
##$MC2= 0
##$MEAN= 0
##$ME_mod= 0
##$MI= 1.114404
##$NCOEF= 0
##$NC_proc= -6
##$NLEV= 6
##$NOISF1= 3.799351
##$NOISF2= 2.8
##$NSP= 0
##$NTH_PI= 0
##$NZP= 0
##$OFFSET= 15.48797
##$PC= 1
##$PHC0= -2272.893
##$PHC1= 10.39224
##$PH_mod= 1
##$PKNL= yes
##$PPARMOD= 0
##$PSCAL= 0
##$PSIGN= 0
##$REVERSE= no
##$SF= 200.130006750999
##$SI= 16384
##$SIGF1= 3
##$SIGF2= 2
##$SINO= 0.751879
##$SIOLD= 32768
##$SREGLST= <19F.Aceton>
##$SSB= 0
##$STSI= 16384
##$STSR= 0
##$SW_p= 3612.71676300578
##$SYMM= 0
##$S_DEV= 0
##$TDeff= 16384
##$TDoff= 0
##$TI= <>
##$TILT= no
##$TM1= 0
##$TM2= 0
##$TOPLEV= 0
##$USERP1= <user>
##$USERP2= <user>
##$USERP3= <user>
##$USERP4= <user>
##$USERP5= <user>
##$WDW= 1
##$XDIM= 16384
##$YMAX_p= 430796657
##$YMIN_p= -858535
$$ End of Bruker specific parameters
$$ ---------------------------------
##NTUPLES= NMR SPECTRUM
##VAR_NAME=  FREQUENCY,     SPECTRUM/REAL,   SPECTRUM/IMAG
##SYMBOL=    X,             R,               I
##VAR_TYPE=  INDEPENDENT,   DEPENDENT,       DEPENDENT
##VAR_FORM=  AFFN,          ASDF,            ASDF
##VAR_DIM=   16384,         16384,           16384
##UNITS=     HZ,            ARBITRARY UNITS, ARBITRARY UNITS
##FACTOR=    0.220516191357247, 1,           1
##FIRST=     3099.60761113963, 0,            0
##LAST=      -513.109151866155, 0,           0
##MIN=       -513.109151866155, -858535,     0
##MAX=       3099.60761113963, 430796657,    0
$$ Real data points
##PAGE= N=1
##DATA TABLE= (X++(R..R)), XYDATA
$$ [...]
6459E103912j91519k51436k55719k85422j95760k43957k08891j49728k04444m4005
6449C073031r5304q5949p0850j66838j65149r1438k3733m8992o6194N3528j30045
6438B182067j11560o4620p5373J258j94781j5048o3735K3958q3289j01795j9984
6427A477098q1750m9281o019p3597q6609p7106p0556M2007m8362N0985N2839n970
6415A123679l9863r8269J13217m0657j40094j9981K4832o7193L6970Q2372j6358
6404I58655j7760o0961r0331l944o5484j4889r1608P5574J32115q6108o265r2378
6392F36616L6978M0021R118O545L8091j7440j2418P0716r2110J4996p449k4910
6380F98754K4486M1013j6185l7056K9786P8474m2004n6841Q1995J1405J2178r9170
$$ plain form
6459 5103912 4912393 4660957 4405238 4119816 3924056 3680099 3471208 3321480 3117036 3073031
6449 3073031 2977727 2891778 2820928 2654090 2488941 2397503 2373770 2324778 2258584 2312112 2182067
6438 2182067 2070507 2005887 1930514 1931772 1736991 1721943 1658208 1682166 1598877 1497082 1477098
6427 1477098 1395348 1346067 1340048 1266451 1179842 1102736 1032180 1074187 1025825 1076810 1129649 1123679
6415 1123679 1083816 985547 1098764 1058107 918013 898032 922864 855671 892641 975013 958655
6404 958655 940895 879934 789603 785659 720175 705286 613678 689252 821367 735259 728994 636616
6392 636616 673594 713615 722733 729278 767369 749929 737511 808227 716117 731113 723664 698754
6380 698754 723240 764253 748068 711012 740798 819272 777268 720427 802422 813827 826005 726835
6368G26835M8296N6551q28K9092N8028p7098R5639N8097J07921j59997J6587j8901
6356I40222O4783k7073J8062L551j8876J45683K6182L1698l7373O7559P3333O074
6344A293825K4163m0897J3741k2880L7422R0706K0002J8246J41652o2843P7948
6333A591085N5673r22M4785k493Q8370o9214Q7134L4255p2119N3796O4597K3604
6321A898551r3687o761K10072J12810J74364P7324N2342N4646j10470N4440L692
6310B427323j98683k8157l4684L546o8901n2720j37202R9872L9132J60754J11285
6299B321565P5131J27980l6235N4832O908M4052J30380q2431N644o2039j27117
6288B458670L8437n3040o1487j01528j51816J1653o293P7781m5991m9843n3637
$$ plain form
6368 726835 775131 831682 830854 859946 917974 840876 936515 994612 1102533 942536 959123 940222
6356 940222 1005005 977932 995994 999545 980669 1126352 1152534 1184232 1146859 1214418 1287751 1293825
6344 1293825 1317988 1277091 1290832 1267952 1305374 1396080 1416082 1434328 1575980 1513137 1591085
6333 1591085 1646758 1645836 1690621 1688128 1776498 1707284 1794418 1828673 1756554 1810350 1874947 1898551
6321 1898551 1804864 1798103 2008175 2120985 2295349 2372673 2425015 2479661 2369191 2423631 2427323
6310 2427323 2228640 2200483 2165799 2169345 2100444 2047724 1910522 2010394 2049526 2210280 2321565
6299 2321565 2396696 2524676 2488441 2543273 2550181 2594233 2724613 2642182 2647826 2585787 2458670
6288 2458670 2497107 2444067 2382580 2281052 2129236 2140889 2134596 2212377 2166386 2116543 2062906
6277B062906J39235j08650N8618P9214J86072J88389j666o6508J3111P2646J75420
6266B798787P0892J59488J71928J14925K73792N2304M1088R6810J11927k6927
6256C865014K593L2994r4277j51429n4366O2902j20819q7144m4909M3942K9458
6245C483959O5879Q7847q2049M7275J27930K58980n5491P5835J38422j00188P5152
6234D123551J28104j25373P0956J08330K47662N6611R2576K33595J14443J1091
6224E061546J05994L3180Q823l9679j35928j70736n5463o0569l9122o2735j65475
6213D479836j00408l3931N428L672j05539P8798J00690J59243j0902j9836Q1537
6202D638588m5528r206J57437K52002K23111J25176M4612J64763J59493O2795
$$ plain form
6277 2062906 2202141 2093491 2152109 2231323 2417395 2605784 2604118 2537610 2550721 2623367 2798787
6266 2798787 2869679 3029167 3201095 3316020 3589812 3642116 3683204 3780014 3891941 3865014
6256 3865014 3867607 3900601 3806324 3654895 3600529 3663431 3542612 3455468 3410559 3454501 3483959
6245 3483959 3549838 3637685 3555636 3602911 3730841 3989821 3934330 4010165 4148587 4048399 4123551
6234 4123551 4251655 4126282 4197238 4305568 4553230 4609841 4702417 4936012 5050455 5061546
6224 5061546 5167540 5200720 5209543 5169864 5033936 4863200 4807737 4747168 4708046 4645311 4479836
6213 4479836 4379428 4345497 4350925 4354597 4249058 4327856 4428546 4587789 4576887 4557051 4638588
6202 4638588 4593060 4583854 4741291 4993293 5216404 5341580 5386192 5550955 5710448 5773243
6192E773243J94324K17107J42271J69979J2036j8875J47043L12588K36378K69160
6182G455254K59456J55852K24279R6445L8492J127J25541J17953J47927J2446
6172H634772M1695M7991K8768J01756q5319J77153J33246N2217L8544O4809J37675
6161I373307k9441J06618J9221K8864J17017K3826J98005M1630J08396R6849J29203
6150A0213495O0301J79153Q7126R7451k0287k1436J09007K20173J36677K59722
6140A1321382J16446K7206J15871L2122p6896j40843O2628k00352O745j16690
6130A1147619N2390J16571N6162J14504Q9359J32941K11668J27558J29086K51697
6120A2429555L16595K12495K50262M00052O01936O04679O95818P65128O79176
$$ plain form
6192 5773243 5967567 6184674 6326945 6496924 6508960 6490085 6637128 6949716 7186094 7455254
6182 7455254 7714710 7870562 8094841 8191286 8229778 8230905 8356446 8474399 8622326 8634772
6172 8634772 8676467 8724458 8753226 8854982 8769663 8946816 9080062 9132279 9170823 9235632 9373307
6161 9373307 9343866 9450484 9469705 9498569 9615586 9639412 9837417 9879047 9987443 10084292 10213495
6150 10213495 10273796 10452949 10540075 10637526 10617239 10595803 10704810 10924983 11061660 11321382
6140 11321382 11437828 11465034 11580905 11613027 11536131 11395288 11457916 11257564 11264309 11147619
6130 11147619 11200009 11316580 11372742 11487246 11576605 11709546 11921214 12048772 12177858 12429555
6120 12429555 12746150 12958645 13208907 13608959 14210895 14815574 15511392 16276520 16955696
6111A6955696Q76607J115631R73209R80675P95786N86721L76346O1340m1833l70018
6101B2310160l59285j37209j78290m8503N9582J14425K68880J76131L58109L39494
6091B2903494N66078O18402P85169R61323J085033J250059J604660J573189J913231
6082C3260638K075562K287623J993028J511596J135042M38978k74095q18414j141417
6073D0468541q03241n20600n42928l20306p7507J32237K36890M54465O40717R31152
6063D0599420J029861J307484J683958J816117K127290K515508K798836L038800
6055E6917274K904998K926275K333454J470763M15965m84109j151183j877976
6047F3455461k149106k211504k023505j712052j452254j189518p85051p31858
$$ plain form
6111 16955696 17832303 18947934 19921143 20901818 21697604 22284325 22660671 22722011 22680178 22310160
6101 22310160 21950875 21813666 21635376 21586873 21646455 21760880 22029760 22205891 22564000 22903494
6091 22903494 23469572 24087974 24873143 25834466 26919499 28169558 29774218 31347407 33260638
6082 33260638 35336200 37623823 39616851 41128447 42263489 42702467 42428372 41609958 40468541
6073 40468541 39665300 39144700 38601772 38281466 38203959 38336196 38573086 39027551 39668268 40599420
6063 40599420 41629281 42936765 44620723 46436840 48564130 51079638 53878474 56917274
6055 56917274 59822272 62748547 65082001 66552764 66968729 66484620 65333437 63455461
6047 63455461 61306355 59094851 57071346 55359294 53907040 52717522 51932471 51200613
6039E1200613m02214n4439K29978N90693N89647Q39466J004890J485103J731610
6030E7215347J873795K276259K650028L103193L657841M028036M143605L918624
6022H2866728L191922K183531J012239n95123j919430l114683l989851m135035
6014G5500298m064267l933979l663015l180066k881152k413967k165679j926417
6006E1271756j549067j381778j209155r54738o29181m94096j95732J4163L27062
5997D5199234O86877Q57618R62581J318424J597837J507823J729532J249874P25072
5988E5834872j2773q85397j373599j916670k335985k620573k441946k296169k332090
5979C9619670k115436k194765k024628j813633j681351j469101j337657j138434
$$ plain form
6039 51200613 50798399 50743960 50973938 51564631 52154278 52993744 53998634 55483737 57215347
6030 57215347 59089142 61365401 64015429 67118622 70776463 74804499 78948104 82866728
6022 82866728 86058650 88242181 89254420 88659297 86739867 83625184 79635333 75500298
6014 75500298 71436031 67502052 63839037 60658971 57777819 55363852 53198173 51271756
6006 51271756 49722689 48340911 47131756 46177018 45547837 45053741 44858009 44872172 45199234
5997 45199234 45886111 46743729 47706310 49024734 50622571 52130394 53859926 55109800 55834872
5988 55834872 55822099 54936702 53563103 51646433 49310448 46689875 44247929 41951760 39619670
5979 39619670 37504234 35309469 33284841 31471208 29789857 28320756 26983099 25844665
5971B5844665j092444p54862o37055n93116m58067k85653l33611k05903m0930
5962B1443024P2081j97111l0103Q8549K1224j17163R5943J29082Q6323J89266
5952B1781115k42413m69349o00807p09023n85077o69703n81702m59505n74749
5943A6888787k67329l72078k64353l9502j61339J0023l6323k13594j03364J30947
5933A5571875J06798M5365p4112L75761M73323M26346M62683N14234N20928J86264
5923A8609465j26916m79836q07301o60849n64005l38630l59762n43824m43501
5914A4284841l56574j85022k79950q1788j89892j03049J30264K42506p2139N6114
5904A3445311M522L06770L50687K39362M06675L65902M09834M26571Q590k86477
$$ plain form
5971 25844665 24752221 23997359 23360304 22767188 22309121 22023468 21689857 21483954 21443024
5962 21443024 21515105 21317994 21287891 21376440 21397664 21280501 21376444 21505526 21591849 21781115
5952 21781115 21538702 21069353 20468546 19759523 19174446 18504743 17923041 17463536 16888787
5943 16888787 16621458 16249380 15985027 15945525 15784186 15794209 15757886 15544292 15440928 15571875
5933 15571875 15678673 15724038 15649926 16025687 16499010 16925356 17388039 17902273 18423201 18609465
5923 18609465 18482549 18002713 17195412 16534563 15970558 15631928 15272166 14728342 14284841
5914 14284841 13928267 13743245 13463295 13381507 13191615 13088566 13218830 13461336 13389197 13445311
5904 13445311 13449833 13756603 14107290 14346652 14753327 15119229 15529063 15955634 15964224 15677747
5894A5677747o65468o17027m32786n25388n34384n92873l59097l24168l51867
5885A1274689l65656l39014r1619k06062j09370l6955N8910k5763j34430k42602
5875I782128K1196l5867l607L0406K13664J63127P8530J69037l24158k17948k21054
5864I655454k70844k39714j33006k88067l33598l38023k19047k05061k40951q2170
5854G304973r8069k66153j04654j50276j72268q8854j08116K1935j8281j13435
5844F206802j42123m1047j63363j19372P8785j90531j16142l0836j57691j32541
5834E191941r3765j66554L2497m1875o4844k27167o9328j0272j25045o7417o978
5823D351193P3482K7468j88920k5702N9160n8364N8911r8238o6782L1385K7019
$$ plain form
5894 15677747 15012279 14395252 13962466 13437078 12902694 12309821 11950724 11626556 11274689
5885 11274689 10909033 10570019 10478400 10272338 10162968 10126013 10184923 10159160 10024730 9782128
5875 9782128 9803324 9767457 9763850 9794256 10007920 10171047 10249577 10418614 10094456 9876508 9655454
5864 9655454 9384610 9144896 9011890 8723823 8390225 8052202 7833155 7628094 7387143 7304973
5854 7304973 7206904 6940751 6836097 6685821 6513553 6424699 6316583 6338518 6320237 6206802
5844 6206802 6064679 6023632 5860269 5740897 5819682 5629151 5513009 5482173 5324482 5191941
5834 5191941 5098176 4931622 4964119 4922244 4857400 4630233 4560905 4550633 4425588 4358171 4351193
5823 4351193 4424675 4452143 4263223 4237521 4296681 4238317 4297228 4198990 4132208 4163593 4190612
5812D190612M3797O8953k2852j7364j4169Q546j04226j49117j21900j1539L1645
5801C902386k4421M7906j28142J10888j899m8765m0740J8006R0503o8529P5929
5790C933122R3075l170j41345R8687q4693k2808O2135k12645j44787r2367J0242
5779C495446K08256R4779j20120J3349l228l5248j5854J6322K02992k2391o6939
5768C767364O576P8843l4520l3493N9441L0928J09261l597J32237M4062J29236
5757D286338k9125J3740J95968Q4175J07187O3412N4339m1631J00855R0275R3387
5746E018920R6359J27911O4420K37601N5208M8631K15633j5170Q1400R0618L3183
5735F054714k2905J11605K4260j39241P0591O8040N8186L898m1883J603m7679
$$ plain form
5812 4190612 4234409 4303362 4280510 4263146 4248977 4257523 4153297 4004180 3882280 3870741 3902386
5801 3902386 3877965 3925871 3797729 3908617 3906718 3857953 3817213 3835219 3925722 3857193 3933122
5790 3933122 4026197 4023027 3881682 3980369 3895676 3872868 3935003 3722358 3577571 3485204 3495446
5779 3495446 3703702 3798481 3678361 3691710 3688482 3653234 3637380 3653702 3856694 3834303 3767364
5768 3767364 3773940 3852783 3818263 3784770 3844211 3875139 3984400 3980803 4113040 4157102 4286338
5757 4286338 4257213 4270953 4466921 4551096 4658283 4721695 4776034 4734403 4835258 4925533 5018920
5746 5018920 5115279 5243190 5307610 5545211 5600419 5649050 5864683 5849513 5930913 6021531 6054714
5735 6054714 6031809 6143414 6167674 6028433 6099024 6167064 6225250 6229148 6187265 6188868 6141189
5724F141189j5060J914Q2073J39400J6356J25927K18317J61819J30107J39062
5714G141104J13987R9112n0737N3522J30542M9989J77037n8276P0074J8656j04146
5703G640864Q623K58070L3811P7339R7764N0262N1335o2543J01682R7322J01102
5692H455631J5345K02154L48940J46386J84367K58091n2543J52352J59402J93171
5682A0063296J00699J42408L61208O4181K10077L37575K70147L11668M05698N83008
5672A2849965O04414M23421O70265M62714N11760L32509o7778l3482J19996L19237
5662A6193021L28886J91168K28118L61011K55000M31641N20251O21652N98015
5653A9728763O63293Q12604P14908P85889Q63000R58071J145378R93217R67964
$$ plain form
5724 6141189 6126129 6128043 6210116 6349516 6365872 6491799 6710116 6871935 7002042 7141104
5714 7141104 7255091 7354203 7303466 7356988 7487530 7537519 7714556 7656280 7726354 7745010 7640864
5703 7640864 7649487 7907557 7941368 8018707 8116471 8166733 8218068 8155525 8257207 8354529 8455631
5692 8455631 8470976 8673130 9022070 9168456 9352823 9610914 9558371 9710723 9870125 10063296
5682 10063296 10163995 10306403 10667611 10731792 10941869 11279444 11549591 11861259 12266957 12849965
5672 12849965 13454379 13877800 14548065 15010779 15522539 15855048 15787270 15753788 15873784 16193021
5662 16193021 16521907 16713075 16941193 17302204 17557204 17988845 18509096 19130748 19728763
5653 19728763 20392056 21204660 21919568 22705457 23568457 24526528 25671906 26665123 27633087
5644B7633087J100497J235978J153921J273826J598304J602380J542294J456645
5636C8596932J291660P89517N70366J199359J225488J713441J804609J940625
5628D9131997K250494K591110K885757K937111L102729L034235L112490K950966
5620G1996889K851830K986353L301959L641131M229789M982786N609921O216624
5612A05817282O979372P781820Q617892R297264R838250J0102880J0272158R838608
5604A78545526R502214Q339911P116462O100855M596207K732821O99638j575242
5596B16058392l902770n496984o985934p993110r226532r766743r865426r571332
5588A53249561r113015q492345p897908p339286o721341o228664n658740n225793
$$ plain form
5644 27633087 28733584 29969562 31123483 32397309 33995613 35597993 37140287 38596932
5636 38596932 39888592 40678109 41248475 42447834 43673322 45386763 47191372 49131997
5628 49131997 51382491 53973601 56859358 59796469 62899198 65933433 69045923 71996889
5620 71996889 74848719 77835072 81137031 84778162 89007951 93990737 99600658 105817282
5612 105817282 112796654 120578474 129196366 138493630 148331880 158434760 168706918 178545526
5604 178545526 188047740 196387651 203504113 209604968 214201175 216933996 217633634 216058392
5596 216058392 212155622 206658638 199672704 191679594 182453062 172686319 162820893 153249561
5588 153249561 144136546 135644201 127746293 120407007 113685666 107457002 101798262 96572469
5580I6572469m692795m298346l718824l549972l350397l037693k810015k724815
5572F8389612k646550k388306k249000k112488k050308k288234k505924k581248
5564D9567554k746698k710516k510050k291961k220108j845147j753445j715767
5556C1773862j532688j475056j309915j150153r52063q84625r78840r79964p99095
5547B1711463p48973n95825o67035o38928o73777m94603n21295m63353m30591
5538A6477083l76743l86122l97327m91884m54219l36417m04699l63826k67476
5529A2998370m00897l49075j01859j49963k25469j93250k66700j21791j47688
5520A1041678l15552k96286j61258j48862j21727m6465k73094j54057j52383k62732
$$ plain form
5580 96572469 91879674 87581328 83862504 80312532 76962135 73924442 71114427 68389612
5572 68389612 65743062 63354756 61105756 58993268 56942960 54654726 52148802 49567554
5564 49567554 46820856 44110340 41600290 39308329 37088221 35243074 33489629 31773862
5556 31773862 30241174 28766118 27456203 26306050 25353987 24469362 23490522 22510558 21711463
5547 21711463 20962490 20366665 19699630 19060702 18386925 17892322 17371027 16907674 16477083
5538 16477083 16100340 15714218 15316891 14825007 14370788 14034371 13629672 13265846 12998370
5529 12998370 12597473 12248398 12146539 11996576 11771107 11577857 11311157 11189366 11041678
5520 11041678 10726126 10429840 10268582 10119720 9997993 9951528 9678434 9524377 9371994 9109262
5510I109262k51819M244k2660m630j71522j03377R9497p758j08272M883P4353
5499H622201K38114K43126M7919L4988Q1166L9211j74306k59003r2435j95894
5489H585087j65748k03693r5858k01716k13508r669r8653q4040o5540J33782J0327
5478G590771N5682Q2050J49262K52149K52971K65286L80357M96957M35963N22801
5468A0484249L53053K58856O3675j07935l99605m06545n55007n10889l14405j37799
5458H727648j74201k87541k35279r4968n273n9252J93128k0169L3312J64967K68736
5447H511108K50367M74650O11588N59482Q36999R12354P65086N63888K46063K208
5437A3733793l11097n58847p52152n52226o41859m73527m44249m67641l07465
$$ plain form
5510 9109262 8857443 8861687 8839027 8834397 8662875 8559498 8658995 8651237 8542965 8547848 8622201
5499 8622201 8860315 9103441 9151360 9186348 9267514 9306725 9132419 8873416 8780981 8585087
5489 8585087 8419339 8215646 8119788 7918072 7704564 7694895 7596242 7512202 7446662 7580444 7590771
5478 7590771 7646453 7728503 7877765 8129914 8382885 8648171 9028528 9525485 9961448 10484249
5468 10484249 10837302 11096158 11159833 11051898 10652293 10245748 9690741 9179852 8865447 8727648
5458 8727648 8553447 8265906 8030627 7935659 7930386 7871134 8064262 8044093 8077405 8242372 8511108
5447 8511108 8761475 9236125 9847713 10407195 11244194 12156548 12921634 13485522 13731585 13733793
5437 13733793 13422696 12863849 12111697 11559471 10917612 10444085 9999836 9532195 9224730
5428I224730p4971j90809p6053j7143J12830l3841O7103K06474K4801K39345M00750
5417I883216M62016K78409M96960M13570N35850L23563J49459o7108m17145m32986
5407A1625804m90105m99845l14552k69933q5141j68303j18780l0110Q6309O7353
5397I802697J44954L45669L70353L84746O15706M31142M51181P17736R14950J106275
5387A5285409J434012K033280K273618K151038J119006J49380k043818k836493
5379A9565432j925335j274364q00174j039517j176694j406126j151199j017809
5371I774214q72109o80744n40487n57535m21900l03127j88675m03306k87028j48351
5361E370952k42211k32263k13688p7232k1067k02751j25511r3258j32196j63029
$$ plain form
5428 9224730 9149759 8958950 8882897 8865754 8978584 8944743 9011846 9218320 9243121 9482466 9883216
5417 9883216 10345232 10623641 11120601 11534171 12070021 12393584 12543043 12475935 12058790 11625804
5407 11625804 11135699 10635854 10321302 10051369 9966228 9797925 9679145 9649035 9735344 9802697
5397 9802697 9947651 10293320 10663673 11048419 11664125 12095267 12546448 13264184 14179134 15285409
5387 15285409 16719421 18752701 21026319 23177357 24296363 24445743 22401925 19565432
5379 19565432 17640097 16365733 15565559 14526042 13349348 11943222 10792023 9774214
5371 9774214 8902105 8221361 7680874 7123339 6701439 6398312 6209637 5806331 5519303 5370952
5361 5370952 5128741 4896478 4682790 4605558 4584491 4381740 4256229 4162971 4030775 3867746
5351C867746r1239j07426k25536k4575r2882j07239j72800J5331j2762k5722L621
5340C026517j41528j46218l471n2069m5677l6445m3589o8423J7423o5534K0649
5329B461635l5269O0582J7446l1307J20714j27293o5227n5837j3009J03009N8802
5318B494246n2237j42597j6974O021L6716L9810M9759m5075R199J07475J33374
5307B619717L411j09888Q9151K51016O057j05066l6641J30210j3177k5159O6891
5296B876522m3932l3965O9771O7046J02717q8376n2650O4605m3839J4174p1976
5285B860097N0032K5898q2772q7983K19047O6562j54514j21138o8416K8793P5901
5274B811507J6707J1394j0926j15312P3832J0641j34959J4449k6799r7101K3313
$$ plain form
5351 3867746 3776507 3669081 3443545 3418970 3326088 3218849 3046049 3061380 3048618 3022896 3026517
5340 3026517 2884989 2738771 2735300 2683231 2637554 2601109 2557520 2489097 2506520 2440986 2461635
5329 2461635 2426366 2486948 2504394 2473087 2593801 2466508 2401281 2345444 2332435 2435444 2494246
5318 2494246 2442009 2299412 2282438 2288459 2325175 2364985 2414744 2369669 2378868 2486343 2619717
5307 2619717 2623128 2513240 2602391 2853407 2859464 2754398 2717757 2847967 2834790 2809631 2876522
5296 2876522 2832590 2798625 2868396 2935442 3038159 2949783 2897133 2961738 2917899 2932073 2860097
5285 2860097 2910129 2936027 2853255 2765272 2984319 3050881 2896367 2775229 2706813 2735606 2811507
5274 2811507 2828214 2839608 2828682 2713370 2787202 2797843 2662884 2677333 2650534 2553433 2576746
5263B576746j18138j1205J26742k9396L41j706j7168L2075p143N1218K2068L7101
5251B661535J48198J8109Q812M5212m6192P43J38718n6325o8450N1364o655m2739
5239B852330R7473q9538O58N3335p9894k7073J16209J8802O7277M115J4520j05124
5227B923090m9589K2932J82550k0744k5187J59463j3263k0004J0941J27058N8111
5216C355358l7144J01042O1605n5175p197J642m9768R027J73783j14340j03696
5205C335137M3339J14838N3307l1973m12n469J1340J3812M8690Q6815Q1355k7437
5193C723342k42767L0680J18000J8771l6453m646p6935j091J7311N2083o5794
5182C532501R1181J58791L6764r9587R0293J54696M1352j708N2666J09668Q0290
$$ plain form
5263 2576746 2458608 2447403 2574145 2544749 2545090 2543384 2526216 2558291 2551148 2602366 2624434 2661535
5251 2661535 2809733 2827842 2836654 2881866 2835674 2836417 2975135 2918810 2850360 2901724 2895069 2852330
5239 2852330 2949803 2860265 2860923 2914258 2834364 2807291 2923500 2942302 3009579 3013694 3028214 2923090
5227 2923090 2873501 2896433 3078983 3058239 3033052 3192515 3179252 3159248 3170189 3297247 3355358
5216 3355358 3318214 3419256 3480861 3425686 3418489 3420131 3370363 3379390 3553173 3438833 3335137
5205 3335137 3378476 3493314 3546621 3514648 3514236 3508767 3520107 3533919 3582609 3669424 3750779 3723342
5193 3723342 3480575 3511255 3629255 3648026 3611573 3606927 3529992 3528901 3546212 3598295 3532501
5182 3532501 3623682 3782473 3819237 3719650 3809943 3964639 4005991 4004283 4056949 4166617 4246907
5171D246907m2819n309R9383K09932M0404O009J90677o2963P5495L16702J46656
5160E221074R047J66533J6264J9750J86892K38897N3305J31446J87020n6002r3460
5149F080766N2802J01652K1397J9080J11047J82173P2338k474J86771K03947J13566
5138G143065L08062J83126J54725K77988L14150L89933K90717K67063J30404P0930
5128I530163j27452q9780p1459j16263n6843J4609n2350l8443Q2551J55345J75287
5117I405365K50877K87720K43488J58492J19957K87498J0983J77302J18728j12628
5107A0947782p7099L3573k1350L2094N7002M3222K63831K08800L95256K97400
5097A2180511K10907J12964J56513O852j79864k09792q7030j17737j93011k06687
$$ plain form
5171 4246907 4204088 4198779 4298162 4508094 4548498 4554507 4745184 4682221 4757716 5074418 5221074
5160 5221074 5230121 5396654 5412918 5432668 5619560 5858457 5911762 6043208 6230228 6174226 6080766
5149 6080766 6133568 6235220 6256617 6275697 6386744 6568917 6641255 6638781 6825552 7029499 7143065
5138 7143065 7451127 7634253 7788978 8066966 8381116 8771049 9061766 9328829 9459233 9530163
5128 9530163 9402711 9312931 9241472 9125209 9068366 9082975 9030625 8992182 9074733 9230078 9405365
5117 9405365 9656242 9943962 10187450 10345942 10465899 10753397 10764380 10941682 11060410 10947782
5107 10947782 10870683 10904256 10882906 10915000 10972002 11015224 11279055 11487855 11883111 12180511
5097 12180511 12391418 12504382 12660895 12667747 12487883 12278091 12191061 12073324 11880313 11673626
5087A1673626m3137q8310j07997m076L5594j0477J7665J5291j28133j40855J27407
5076A1346598q134p8323L143J30437R6739L3799J43627j083j8639J34105L108
5065A1785377K0270J12940o056j3634r5623k81466j82132n8766j16194Q2140o9223
5054A1177633j9470k65488J6045N1502n0732Q7171m5185R4044R3578K0404L5290
5043A1194792m822R6937L2938K23980K54023J46324K18575K28564J59490K90072
5033A2840873L49770K33596J93587L52761J73079K67574L79082N29777L12976
5024A5633075L20029L87504M96900L95053N41714N75549M87617O34240L23787
5015A9795468M84870O04735N34618M97117N23940N53856N97415N58497Q38114
$$ plain form
5087 11673626 11630489 11542179 11434182 11430106 11465700 11455223 11472888 11488179 11360046 11219191 11346598
5076 11346598 11338464 11260141 11263284 11393721 11490460 11524259 11667886 11666803 11648164 11782269 11785377
5065 11785377 11805647 11918587 11912531 11898897 11803274 11521808 11339676 11280910 11164716 11246856 11177633
5054 11177633 11158163 10892675 10908720 10960222 10909490 10996661 10951476 11045520 11139098 11159502 11194792
5043 11194792 11189970 11286907 11319845 11543825 11797848 11944172 12162747 12391311 12550801 12840873
5033 12840873 13190643 13424239 13617826 13970587 14143666 14411240 14790322 15320099 15633075
5024 15633075 15953104 16340608 16837508 17232561 17774275 18349824 18837441 19471681 19795468
5015 19795468 20280338 20885073 21419691 21916808 22440748 22994604 23592019 24150516 24988630
5006B4988630Q17033P88196Q32697Q59344Q74273J065670R07467J095963J276353
4997C3505626J235389J452899J465195J497522J627117J752147J927809J957773
4989D6421477K019470J961281K012541K174742K280111K438632K592406K683761
4981F4584421K848254K900831L226364L485098L576646M015233M045368L912322
4973I2594537L910626L405917K585337J933899J299602O24614K29384j29335m6516
4964A06408065K83603K66137N40006Q03515J026312J431453J659637J961923K320673
4955A16701324K516402K929707L495799L711098M019619M493819M883570N582949
4947A48334287N828648O126206O674986P231112P390631P226270O464649N292482
$$ plain form
5006 24988630 25805663 26593859 27426556 28285900 29160173 30225843 31133310 32229273 33505626
4997 33505626 34741015 36193914 37659109 39156631 40783748 42535895 44463704 46421477
4989 46421477 48440947 50402228 52414769 54589511 56869622 59308254 61900660 64584421
4981 64584421 67432675 70333506 73559870 77044968 80621614 84636847 88682215 92594537
4973 92594537 96505163 99911080 102496417 104430316 105729918 106354532 106583916 106454581 106408065
4964 106408065 106691668 106957805 107497811 108301326 109327638 110759091 112418728 114380651 116701324
4955 116701324 119217726 122147433 125643232 129354330 133373949 137867768 142751338 148334287
4947 148334287 154162935 160289141 166964127 174195239 181585870 188812140 195276789 200569271
4939B00569271L905231K141241N04354q81771j829893k121987j934913j571425
4931A98780108j078878n87782k12934J78067M19858O45756Q64309P85707N27836
4922B00322047M45530L77308J88624K12329L29321P85675R97436J619123K212394
4913B07489787K802006L333961L447430L354791K749058J521253j16319k083574
4905B22498393l819970n367681o622532p341949p306560p090771o327661n583524
4897A73037745m748397l889987k773229j858593j312067j228146j506315j831850
4889A53889161k709911l841108m741018n424039n786066n836080n857599n329750
4881A14363590n010004m484029l880612l371713k892928k458946k212217j923784
$$ plain form
4939 200569271 204474502 206615743 207120097 206238326 204408433 202286446 200351533 198780108
4931 198780108 197701230 197113448 196900514 197078581 197498439 198144195 199008504 199794211 200322047
4922 200322047 200767577 201144885 201333509 201545838 201875159 202660834 203658270 205277393 207489787
4913 207489787 210291793 213625754 217073184 220427975 223177033 224698286 224581967 222498393
4905 222498393 218678423 213310742 206688210 199346261 192039701 184948930 178621269 173037745
4897 173037745 168289348 164399361 161626132 159767539 158455472 157227326 155721011 153889161
4889 153889161 151179250 147338142 142597124 137173085 131387019 125550939 119693340 114363590
4881 114363590 109353586 104869557 100988945 97617232 94724304 92265358 90053141 88129357
4873H8129357j551278j323655j295992j316781j376971j170034j382355j368146
4865G7344145j585869j863612j866641j832015j749727j755960j630645j511246
4857F3548430j161523j094184j013964q31956r03412q11523j083233r71106j041181
4848E4636348j140834j183091j041622j166496j159754j158013j086672j069588
4840D5630278j042915q94304j122253r69003q56422q10230q97758p73954o78044
4831C7585395r33727q16448o32937n14477p41370p88289p16245p02650o41909
4822C1097343q28062p21969m85614n36768o40031o69841n37094l81050n09134
4813B5787780m54343n78991j98806l32759l53358k87293k02938p3041k70478j15675
$$ plain form
4873 88129357 86578079 85254424 83958432 82641651 81264680 80094646 78712291 77344145
4865 77344145 75758276 73894664 72028023 70196008 68446281 66690321 65059676 63548430
4857 63548430 62386907 61292723 60278759 59446803 58543391 57731868 56648635 55677529 54636348
4848 54636348 53495514 52312423 51270801 50104305 48944551 47786538 46699866 45630278
4840 45630278 44587363 43693059 42570806 41601803 40745381 39935151 39037393 38263439 37585395
4831 37585395 36651668 35835220 35202283 34687806 33946436 33158147 32441902 31739252 31097343
4822 31097343 30269281 29547312 29061698 28524930 27884899 27215058 26677964 26296914 25787780
4813 25787780 25333437 24754446 24555640 24222881 23869523 23582230 23379292 23306251 23035773 22920098
4803B2920098j47595q6587j81600j15933j49965j08862R6830R3178M8674j21664
4793B2246574R9735Q7635J99706K31645K19359K75497J97765O7421J79735K31414
4783B4036486J60974N9000J2875Q0190N2159O5758J26770O7197J72226K04236
4773B5037871K76573J73151K12558L17580o145J11271J90249J41575J93897J59596
4763B6808176J37479K18259J50694J56706p1227q2320n4013O6506J8807k1517
4753B7327550J23540M1865L9030p0478N2897M1527k4009n347M2906l8695J52258
4742B7683044J47377J23326M9651J31724L7033j06319J12015J32189J02183q0786
4732B8331437k00923J01996j03930k24991j3506k01083j4714l513N5706l4133
$$ plain form
4803 22920098 22772503 22685916 22504316 22388383 22238418 22129556 22226386 22319564 22368238 22246574
4793 22246574 22346309 22433944 22633650 22865295 23084654 23360151 23557916 23625337 23805072 24036486
4783 24036486 24197460 24256460 24269335 24349525 24401684 24467442 24594212 24661409 24833635 25037871
4773 25037871 25314444 25487595 25700153 26017733 26011588 26122859 26313108 26454683 26648580 26808176
4763 26808176 26945655 27163914 27314608 27471314 27400087 27317767 27263754 27330260 27349067 27327550
4753 27327550 27451090 27492955 27531985 27461507 27514404 27555931 27531922 27526575 27569481 27530786 27683044
4742 27683044 27830421 27953747 28003398 28135122 28172155 28065836 28177851 28310040 28412223 28331437
4732 28331437 28130514 28232510 28128580 27903589 27890083 27689000 27674286 27670773 27726479 27692346
4722B7692346n6221m992K5015J08494J31167k2988K41799J13542J24363M4086
4712B8396611Q8065L03341K23486M19818L33817K82455K59421M86424M60655M73346
4702C1727439M78425O91595N99619P26837R44568J009023J057809Q57398P42531
4693C8835244O33506N26710N38252N95379P49134P42993P77584O39802O42057
4684D4680661P56501N37323N27732M17349M77088M96920N41162P54097R02179
4675E0091012J072120J159048J191112J325682J418969J779398J836142J963966
4667F1837449K210991K369794K624463L012088L260988L612685L861696M391608
4659H7181762M904276N059091N578967N968823O696194P211096Q010962R015632
$$ plain form
4722 27692346 27636125 27631133 27656148 27764642 27895809 27872821 28114620 28228162 28352525 28396611
4712 28396611 28484676 28788017 29011503 29431321 29765138 30047593 30307014 30793438 31254093 31727439
4702 31727439 32205864 32897459 33497078 34223915 35168483 36177506 37235315 38092713 38835244
4693 38835244 39468750 39995460 40533712 41129091 41878225 42621218 43398802 44038604 44680661
4684 44680661 45437162 45974485 46502217 46919566 47396654 47893574 48434736 49188833 50091012
4675 50091012 51163132 52322180 53513292 54838974 56257943 58037341 59873483 61837449
4667 61837449 64048440 66418234 69042697 72054785 75315773 78928458 82790154 87181762
4659 87181762 92086038 97145129 102724096 108692919 115389113 122600209 130611171 139626803
4651A39626803R844810J0831822J2067403J3610874J5665747J8307290K0959407
4644B40914156K3396754K4924469K4569769K1138894J5585835R650775K504094
4637C62684746n194745j1906220j6220339j7781347j8713812j9577905k0168117
4630B53122261j9650247j8173425j6373761j4871162j3560071j2691501j1712684
4623A46089410j0640870r375303q050274p028686o371770n616675n159096m793017
4615H9053719m311618m375660m128277l647039l568650l156789k786041k547486
4607F0532159k538072k322979k230592k129978j922142j822815j706821j911940
4599D3946820j644546j481902j354511j336741j243028j232685q94827j041245
$$ plain form
4651 139626803 149471613 160303435 172370838 185981712 201647459 219954749 240914156
4644 240914156 264310910 289235379 313805148 334944042 350529877 360180652 362684746
4637 362684746 357490001 345583781 329363442 311582095 292868283 273290378 253122261
4630 253122261 233472014 215298589 198924828 184053666 170493595 157802094 146089410
4623 146089410 135448540 126073237 118022963 110994277 104622507 99005832 93846736 89053719
4615 89053719 84742101 80366441 76238164 72591125 69022475 65865686 63079645 60532159
4607 60532159 57994087 55671108 53440516 51310538 49388396 47565581 45858760 43946820
4599 43946820 42302274 40820372 39465861 38129120 36886092 35653407 34758580 33717335
4591C3717335q24267p68131r20810q17104o01583o48493p45586m67521m59022
4582B7464818n21341n72052o29155m74654m24374m77810m04678l33149m40744
4573B3186861l57446m05748l80734m48179l76988l61156k58316l35204k79512
4564A9983578j56739k41846q3835n0510J7822r3720O0266J35632P4658k164J62320
4553A9805462K21921K72499K6055J32062L09516K57095L78533L15711M10956N96285
4543B2726095N83226N49692P73178J015045J163725J505963J532840J234553J319815
4534C2404132Q55242L96083J3705o17659p13978p63416p76339o75666p32730r28119
4524B8461255q65233q83337o18506o32838n46076m33964m50847k17955o0696J78818
$$ plain form
4591 33717335 32893068 32124937 31204127 30387023 29785440 29136947 28391361 27923840 27464818
4582 27464818 26943477 26371425 25742270 25267616 24843242 24365432 23960754 23627605 23186861
4573 23186861 22829415 22423667 22042933 21594754 21217766 20856610 20598294 20263090 19983578
4564 19983578 19826839 19584993 19501158 19450648 19468470 19374750 19435016 19570648 19645306 19643142 19805462
4553 19805462 20027383 20299882 20325937 20457999 20767515 21024610 21403143 21718854 22129810 22726095
4543 22726095 23309321 23859013 24632191 25647236 26810961 28316924 29849764 31084317 32404132
4534 32404132 33259374 33655457 33669162 33051503 32337525 31574109 30797770 30122104 29389374 28461255
4524 28461255 27596022 26712685 26094179 25461341 24915265 24481301 24030454 23812499 23751803 23930621
4514B3930621N0408O4994J62212j03160k67704j40007l39339n16455l59150m14808
4504B2067612m28459k81541l54221k72013k32563k24633j67495O1218J6870m2314
4494B0142461J13382K83106L68943J12333M02992M31586L36009M97355M13706
4485B3101873L22433L30244l146j41843l97884m99315l84418m76424n11726n30141
4475B0809653n43912n45027n96079n27122n35136n16837m22139m00588m19962
4466A6302851l56719l76116l36019k82635k75657j82467l31852k84498k34791
4457A3642097p0327q1954j50941k37000j86600l8693q7570k29450j19308n442
4447A2434812K9263r5915j53354j22194m8519O951j2701j9859M2482R7307N6341
$$ plain form
4514 23930621 23981029 24046023 24208235 24105075 23837371 23697364 23358025 22841570 22482420 22067612
4504 22067612 21639153 21357612 21003391 20731378 20498815 20274182 20106687 20167905 20184775 20142461
4494 20142461 20255843 20538949 20907892 21020225 21423217 21854803 22190812 22688167 23101873
4485 23101873 23424306 23754550 23751404 23609561 23211677 22712362 22327944 21851520 21339794 20809653
4475 20809653 20265741 19720714 19124635 18597513 18062377 17545540 17123401 16722813 16302851
4466 16302851 15946132 15570016 15233997 14951362 14675705 14493238 14161386 13876888 13642097
4457 13642097 13571770 13489816 13338875 13101875 12915275 12876582 12789012 12559562 12440254 12434812
4447 12434812 12464075 12368160 12214806 12092612 12044093 12051044 12038343 12018484 12060966 12158273 12214614
4436A2214614N1027K4852j21768n4735r3416k95220l59272k07843r0854j99699
4426A0867686k66082j51606j92927j33732k45559j24844j77994j37378m5211j63319
4416I229034K3426q1988k00973j39246M0786k1935J14317j27594j63707k5223
4406H646897k8329m3993p7069j02024j63309j6242q5447m0802j46360r8773m4607
4395G799942k0180r9630k7417l3606l2133k4335n1461k2245l7020O5721r1618
4384G426018Q3365m9304j02602M4089J85022M0757N0950j01298K4380J71078O6831
4373G839286K3955J77025J5788J581l0402j6097m3708n3545J27555J8881r6300
4362G964019N4882J23956L2213Q7707J96821L5028j74085L4208J87434l4753l5528
$$ plain form
4436 12214614 12265641 12290493 12168725 12113990 12020574 11725354 11366082 11158239 11067385 10867686
4426 10867686 10601604 10449998 10257071 10123339 9877780 9752936 9574942 9437564 9392353 9229034
4416 9229034 9252460 9170472 8969499 8830253 8871039 8849104 8963421 8835827 8672120 8646897
4406 8646897 8618568 8574575 8497506 8395482 8232173 8215931 8130484 8089682 7943322 7844549 7799942
4395 7799942 7779762 7680132 7652715 7619109 7586976 7562641 7511180 7488935 7451915 7517636 7426018
4384 7426018 7509383 7460079 7357477 7401566 7586588 7627345 7678295 7576997 7601377 7772455 7839286
4373 7839286 7863241 8040266 8056054 8057635 8027233 8011136 7967428 7913883 8041438 8060319 7964019
4362 7964019 8018901 8142857 8175070 8262777 8459598 8494626 8320541 8354749 8542183 8507430 8471902
4351H471902k14872q3797k3669o311l6686j57725K23131r2013J19015J90303j07221
4340H282057R0954J30679R7059K35036J73282K0228M4713Q0927m8544p0521L6
4329I035906l692j86436l1421K5180j37390L4428J14621r5804j77866l8087J32734
4318H672173k3922N3348n4477q9048J63005N0033l8505J34405j43897m4912k0571
4307H657632P5040R507P8538J9506M4855o0169O8117L7922N1535J41965l9636
4296I084812R9433n8126J13837J47677q0158q1949R2043J06306K82959P233j17232
4285I596835J02966J78940K5600q60m3836J39908P2534k9728p7433J53725J75493
4274A0294144L4379Q8741J79922J31195k8643J27608l1519J27901O5542J11414
$$ plain form
4351 8471902 8257030 8173233 8149564 8143253 8106567 7948842 8171973 8079960 8198975 8389278 8282057
4340 8282057 8373011 8503690 8600749 8835785 9009067 9029295 9074008 9154935 9106391 9035870 9035906
4329 9035906 9032214 8845778 8814357 8839537 8702147 8736575 8851196 8755392 8577526 8539439 8672173
4318 8672173 8648251 8701599 8647122 8558074 8721079 8771112 8732607 8867012 8723115 8678203 8657632
4307 8657632 8732672 8742179 8820717 8840223 8885078 8824909 8893026 8930948 8982483 9124448 9084812
4296 9084812 9184245 9126119 9239956 9387633 9307475 9225526 9317569 9423875 9706834 9714067 9596835
4285 9596835 9699801 9878741 9904341 9903481 9859645 9999553 10072087 10042359 9964926 10118651 10294144
4274 10294144 10328523 10417264 10597186 10728381 10699738 10827346 10795827 10923728 10989270 11100684
4264A1100684J29137O2562J97674J81726J96077N3913K52473K42905J11928J53980
4254A2683059J82029K61687L22613K56135J84320L97829L37123J40227L01356
4245A5066378K77234L05023K85186M10806M19958K99922L69888M52900N73702
4236A8460997L21751M23111M32578M82321O68894O36055O19285O00148O56770
4227B3301910N96748P48007Q31946P39099Q07835J072529J011448R17661J007538
4218C1034721J127058J156642J182845J472955J515858J335660J655994J756693
4210D2238426J794707J876288J959153J920715J940053K204956K296196K398824
4202E8629318K471251K707762K964885K774086K988596L035433L168494L310766
$$ plain form
4264 11100684 11229821 11292383 11490057 11671783 11867860 11921773 12174246 12417151 12529079 12683059
4254 12683059 12865088 13126775 13449388 13705523 13889843 14287672 14624795 14765022 15066378
4245 15066378 15343612 15648635 15933821 16344627 16764585 17064507 17434395 17887295 18460997
4236 18460997 18782748 19205859 19638437 20120758 20789652 21425707 22044992 22645140 23301910
4227 23301910 23898658 24646665 25478611 26217710 27025545 28098074 29109522 30027183 31034721
4218 31034721 32161779 33318421 34501266 35974221 37490079 38825739 40481733 42238426
4210 42238426 44033133 45909421 47868574 49789289 51729342 53934298 56230494 58629318
4202 58629318 61100569 63808331 66773216 69547302 72535898 75571331 78739825 82050591
4194H2050591L113864L303960L304806L423782L315745L479803L383413L332704
4186A08708668L559691L530119L390782L295111L250140L209847L170076K927451
4178A35041885K713262K552998K286109K152780J845272J684951J407859J337736
4170A51022852J322574J078071P30566N61712J75765j32247m53994p45212j088802
4161A52471285j390314j678007j912942k026914k387308k298553k482940k620880
4153A35673427k930054k999964l054947l098081l494135l642019l671180l707098
4145A09075949l758023l790292l683815l715839l633639l486799l563089l426260
4137H0018193l304209l364805l169409l053150l166360k996198k853282k976572
$$ plain form
4194 82050591 85164455 88468415 91773221 95197003 98512748 101992551 105375964 108708668
4186 108708668 112268359 115798478 119189260 122484371 125734511 128944358 132114434 135041885
4178 135041885 137755147 140308145 142594254 144747034 146592306 148277257 149685116 151022852
4170 151022852 152345426 153423497 154154063 154715775 154891540 154759293 154305299 153560087 152471285
4161 152471285 151080971 149402964 147490022 145463108 143075800 140777247 138294307 135673427
4153 135673427 132743373 129743409 126688462 123590381 120096246 116454227 112783047 109075949
4145 109075949 105317926 101527634 97843819 94127980 90494341 87007542 83444453 80018193
4137 80018193 76713984 73349179 70179770 67126620 63960260 60964062 58110780 55134208
4129E5134208k542670k384658k486407k311486k203768j998055k107826j739392
4121C7359946j594641j643396j535658j471448j355470j298496j201464j037419
4113B6221954j009836r55425p72517p55583q52944q25477o79331n78331m80871
4104A9311639m16629m44791l89854m06008m24738l09971k04943j83958l75645
4095A6155102j89102k53960j67354l64178k10710M3174j30469j96405j43240k45218
4085A4297640O4669m6542j53482j28662K6492k40366j64861m6960r2992J8344
4075A3533280l873r7076k42030k11346p3050J4908j72094r5479k4821q7923j29127
4064A2411369q2177k17811q1143j373p9189p0605j14725J3017n6700m3625l0727
$$ plain form
4129 55134208 52591538 50206880 47720473 45408987 43205219 41207164 39099338 37359946
4121 37359946 35765305 34121909 32586251 31114803 29759333 28460837 27259373 26221954
4113 26221954 25212118 24256693 23484176 22728593 21875649 21050172 20370841 19792510 19311639
4104 19311639 18895010 18450219 18060365 17654357 17229619 16919648 16714705 16530747 16155102
4095 16155102 15966000 15712040 15544686 15180508 14969798 15012972 14882503 14686098 14542858 14297640
4085 14297640 14362309 14315767 14162285 14033623 14060115 13819749 13654888 13607928 13514936 13533280
4075 13533280 13529407 13432331 13190301 12978955 12905905 12920813 12748719 12653240 12628419 12540496 12411369
4064 12411369 12329192 12111381 12030238 12028865 11949676 11879071 11764346 11777363 11720663 11677038 11646311
4053A1646311j25082K6449p0916n0832J2921j7695m8219L5871L2016o6672J753
4042A1375905N0887m4048L0759J62702O5102o1982l7503N3447L5695o0742J5177
4031A1585399J01271k9867M2560l1339j31829J36994K00725K01973J16414j08513
4021A2083788P8483J72104J89248N1461j756K85308J34134R7361N7389J13687
4011A3261207J77993R0332R9375J35813J61463J79551J01750J38499j0549J73845
4001A4509279J25613l0796J7140j6824m0374J39053o0126n913k4253L7152j1256
3990A4638695j5923j5133j41741O2680K2666k2842j3503Q679L3058n7470M4720
3979A4543886j009N6524J03663k7556J60119J90542J02319P4107l2991J23938
$$ plain form
4053 11646311 11521229 11547678 11476762 11425930 11438851 11421156 11372937 11408808 11440824 11374152 11375905
4042 11375905 11426792 11382744 11413503 11576205 11641307 11579325 11541822 11595269 11630964 11570222 11585399
4031 11585399 11686670 11656803 11699363 11668024 11536195 11673189 11873914 12075887 12192301 12083788
4021 12083788 12162271 12334375 12523623 12575084 12573328 12858636 12992770 13090131 13147520 13261207
4011 13261207 13439200 13529532 13628907 13764720 13926183 14105734 14207484 14345983 14335434 14509279
4001 14509279 14634892 14604096 14621236 14604412 14564038 14703091 14642965 14637052 14612799 14649951 14638695
3990 14638695 14622772 14607639 14465898 14528578 14551244 14528402 14514899 14523578 14556636 14499166 14543886
3979 14543886 14542877 14599401 14703064 14675508 14835627 15026169 15128488 15202595 15169604 15293542
3969A5293542K45186J767O066n6985K06411K85251K00346N2283J5534K31426J38231
3958A6619058J81742J07658O068K01888R2355P5644J70895N9713j05448J39993
3948A7549566J48182O7080J73544R2984K9271M7885J21933J62066P9845K55312
3938A8727668Q3237Q7937K94981J96811K40362J45367O0631J97537J07290P6017
3928B0217838K38964K00743K08254K01107J49254L19806L08728J76992K71886
3919B2293572M47747K29107K14074J17042K46473J42035J85603J96382K95174
3910B4367209L31050J59517R3100K79741L04783K73516L15433K62290K28426L77061
3900B6992126K82603K01660J69185J96408L12456L03838M95121K53138M05043
$$ plain form
3969 15293542 15538728 15540495 15546561 15489576 15695987 15981238 16181584 16233867 16249401 16480827 16619058
3958 16619058 16800800 16908458 16914526 17116414 17208769 17284413 17455308 17515021 17409573 17549566
3948 17549566 17697748 17764828 17938372 18031356 18060627 18108512 18230445 18392511 18472356 18727668
3938 18727668 18810905 18898842 19193823 19390634 19630996 19776363 19836994 20034531 20141821 20217838
3928 20217838 20456802 20657545 20865799 21066906 21216160 21535966 21844694 22021686 22293572
3919 22293572 22741319 22970426 23184500 23301542 23548015 23690050 23875653 24072035 24367209
3910 24367209 24698259 24857776 24950876 25230617 25535400 25808916 26124349 26386639 26615065 26992126
3900 26992126 27274729 27476389 27645574 27841982 28154438 28458276 28953397 29206535 29611578
3891B9611578L84797N81212M28690K03452L98014M67564O08067O21615N49697
3882C3854686P73048O83516N95748O50875P95372R39742J033456P45888J077257
3873D1149588J095358J122993J391492J381897J387643J493626J540620J543634
3865E2106851J470697J532497J941767J840181J549751J728287J801029J746575
3857F5717635J666215J855159J722748J563304J559903J583192J474658J441698
3849G8584512J300482J040495J020177J046083J015234P69550O23833N09825N96040
3840H6506231L80504K38274J06019K31645P2842M2610K31193O7483K56142L72229
3830H8505172K84166M90346M70244P10220P75809J113673J437954J430779J966582
$$ plain form
3891 29611578 29996375 30577587 31006277 31209729 31607743 32075307 32683374 33304989 33854686
3882 33854686 34627734 35311250 35906998 36557873 37353245 38292987 39326443 40072331 41149588
3873 41149588 42244946 43367939 44759431 46141328 47528971 49022597 50563217 52106851
3865 52106851 53577548 55110045 57051812 58891993 60441744 62170031 63971060 65717635
3857 65717635 67383850 69239009 70961757 72525061 74084964 75668156 77142814 78584512
3849 78584512 79884994 80925489 81945666 82991749 84006983 84776533 85400366 85910191 86506231
3840 86506231 86886735 87125009 87231028 87462673 87535515 87578125 87809318 87876801 88132943 88505172
3830 88505172 88789338 89279684 89749928 90460148 91235957 92349630 93787584 95218363 97184945
3821I7184945K183809K464956K810480K958121K823438L134999L484203L534113
3813A20579064L698737L957831M325860M602314N084364N342129N591510N677137
3805A58858946N989074N958632O116332O028178O158393O004739N908828N784082
3797B06807204N589392N684926N402991N477411N237109N001500M676028L967941
3789B47844502L425195K895827K380024J884431J185228R95381J055517Q72805
3781B62538910P77118O36372Q03464P65963Q87320J008563Q83850J017840J290426
3772B70609826J454393J687241K160408K490181K797661L173668L708402L975696
3764B92057476M596276N137938N521379O074554O266275O156320N878330N292047
$$ plain form
3821 97184945 99368754 101833710 104644190 107602311 110425749 113560748 117044951 120579064
3813 120579064 124277801 128235632 132561492 137163806 142248170 147590299 153181809 158858946
3805 158858946 164848020 170806652 176922984 182951162 189109555 195114294 201023122 206807204
3797 206807204 212396596 218081522 223484513 228961924 234199033 239200533 243876561 247844502
3789 247844502 251269697 254165524 256545548 258429979 259615207 260610588 261666105 262538910
3781 262538910 263316028 263952400 264755864 265521827 266409147 267417710 268301560 269319400 270609826
3772 270609826 272064219 273751460 275911868 278402049 281199710 284373378 288081780 292057476
3764 292057476 296653752 301791690 307313069 313387623 319653898 325810218 331688548 336980595
3756C36980595M687623M028321L151332K409729K115406J711879J540127J580514
3748C58205526J849641J912453J880403J991617K000090J971770J633811J689570
3740C73134881J759812J889448K575399L309228M218920N287779O146265O753039
3732D05074771O770859O387647N708531L929461K234965O90423r72949k331278
3724D27492430l278649l911583m137299m106411m031741m149332m856005n456898
3716C93564512o408600p950135r516649j1498768j3128560j4443565j5351294
3709C15266941j5980738j6105761j5845960j5185529j4244093j3240284j2092929
3702B12571647j1209207j0203925r424953q396412p765991p228010o748460o079424
$$ plain form
3756 336980595 341668218 345696539 348847871 351257600 353373006 355084885 356625012 358205526
3748 358205526 360055167 361967620 363848023 365839640 367839730 369811500 371445311 373134881
3740 373134881 374894693 376784141 379359540 382668768 386887688 392175467 398321732 405074771
3732 405074771 411845630 418233277 423941808 427871269 430106234 430796657 429823708 427492430
3724 427492430 424213781 420302198 416164899 412058488 408026747 403877415 399021410 393564512
3716 393564512 387155912 379205777 369689128 358190360 345061800 330618235 315266941
3709 315266941 299286203 283180442 267334482 252148953 237904860 224664576 212571647
3702 212571647 201362440 191158515 181733562 173337150 165571159 158343149 151594689 145515265
3694A45515265n785841n477492m988951m909132m632094m447737m096203l942579
3686A07235236l801163l443360l380684l238217l223161l064710k948854k935444
3678H1199643k776336k728437k604353k648564k507799k422265k142682k120966
3670F1248241k230627k007873j733160j620158j635860j611919j382431j257110
3662D7769103j347167j268377j067291r11868r07945r91599q99079r33997q26028
3653C8615752q33822o85612p16039p79638n31458o93610p44272p96712n55931
3644C2278658m58737o88051o67994n01932o71575n80808m45848l92815l70470
3635B7500428n34567n49679m85103k59024l36601m00690l45666l97161l38099
$$ plain form
3694 145515265 139729424 134251932 129262981 124353849 119721755 115274018 111177815 107235236
3686 107235236 103434073 99990713 96610029 93371812 90148651 87083941 84135087 81199643
3678 81199643 78423307 75694870 73090517 70441953 67934154 65511889 63369207 61248241
3670 61248241 59017614 57009741 55276581 53656423 52020563 50408644 49026213 47769103
3662 47769103 46421936 45153559 44086268 43174400 42266455 41274856 40375777 39441780 38615752
3653 38615752 37781930 37096318 36380279 35600641 35069183 34375573 33631301 32834589 32278658
3644 32278658 31819921 31131870 30463876 29961944 29290369 28709561 28263713 27870898 27500428
3635 27500428 26965861 26416182 25931079 25672055 25335454 24934764 24589098 24191937 23853838
3626B3853838l42374k56700k63595l21655l41041k05944j90815k69720l11959
3617B1350035l28998l14276j48286k68206k28575k61478k78940j31135j76681
3608A9213460j59521j93530k07712j76109j52676j29299k55783k84326j23991
3599A7530513M4559j67990j82363j48430j46896q6494j63545r7713j87311j46324
3589A6248006j21923k3164j21679j32579j18170k026R3075j33667o6504q2885
3579A5538484k39r29p4441n063j4018m7491j72711j02771j15751J07078J7742
3568A5129890o3314r156R888L9674n8662j06268j4553n0546Q0242L0841p872j8912
3556A4961252M9351J9024j05581Q1561L0108J35718j67837n5956J08871P5751
$$ plain form
3626 23853838 23511464 23254764 22991169 22669514 22328473 22122529 21931714 21661994 21350035
3617 21350035 21021037 20706761 20558475 20290269 20061694 19800216 19521276 19390141 19213460
3608 19213460 19053939 18860409 18652697 18476588 18323912 18194613 17938830 17654504 17530513
3599 17530513 17575072 17407082 17224719 17076289 16929393 16842899 16679354 16581641 16394330 16248006
3589 16248006 16126083 16102919 15981240 15848661 15730491 15728465 15821540 15687873 15621369 15538484
3579 15538484 15538245 15537316 15462875 15457812 15443794 15396303 15223592 15120821 15005070 15112148 15129890
3568 15129890 15066576 15057420 15067308 15106982 15048320 14942052 14927499 14876953 14957195 14988036 14980164 14961252
3556 14961252 15010603 15029627 14924046 15005607 15035715 15171433 15003596 14947640 15056511 15132262
3546A5132262j42636p1239M7628Q854j52402k1341K1098j41747k3591N2338L8573
3535A4747797m0784o7095P2667J02668O2797k0110l8015J08280P5429J70156K71751
3524A5445541l5731K4518Q7632J33583J1989J28530J65005j01440N9441Q8026
3514A6007094J52207K41576J34073J01276O0895r5371J94438J83619K02627K44678
3504A7427112J64417l5591K84940K29295Q8773L99003K40104K98208L17867L17090
3494A9731218L54162K68807L62250K41098K82621K43855L80434K57381L31800
3485B2453626N99054N57623M03708O08829O57001M36585O77922R45352Q04215
3476B8143915Q36761R07264J099916J138687J035315O92655P24581O27663O34986
$$ plain form
3546 15132262 14989626 14918387 14966015 14974869 14822467 14801126 14822224 14680477 14656886 14709224 14747797
3535 14747797 14707013 14639918 14712585 14815253 14878050 14857940 14819925 14928205 15003634 15173790 15445541
3524 15445541 15409810 15434328 15521960 15655543 15667532 15796062 15961067 15859627 15919068 16007094
3514 16007094 16159301 16400877 16534950 16636226 16697121 16601750 16796188 16979807 17182434 17427112
3504 17427112 17591529 17555938 17840878 18070173 18158946 18557949 18798053 19096261 19414128 19731218
3494 19731218 20085380 20354187 20716437 20957535 21240156 21484011 21864445 22121826 22453626
3485 22453626 23052680 23610303 24014011 24622840 25279841 25716426 26394348 27339700 28143915
3476 28143915 28980676 29887940 30987856 32126543 33161858 33854513 34579094 35206757 35841743
3467C5841743K38179J48049P6235O7508Q6753O9001N6421J03425J50290L91027
3457C7228631P55018P65605J099321R57684R08980P04953O17832M31660K56077
3448D3725761L23451O51987O82812P66350Q27573O12329K09848j90829n21387
3439D7087895m36323n14594m67066l33910j08299K25279L44268J78882O1118j0021
3429D6027229N9193J81452L15530N38950N73724L23356K80870M20048K63826K41185
3419D9225363N62017Q45588R20086R05955P53661N26822M06693N54015O31171
3410E5331371P32830J127317J315945J523850J867710K461346K788692L947420
3402G1096481N220436O901835P628575Q481704O297912J777236L11847l269741
$$ plain form
3467 35841743 36079922 36227971 36304206 36371714 36458467 36527468 36583889 36687314 36837604 37228631
3457 37228631 37983649 38749254 39848575 40806259 41715239 42420192 43038024 43469684 43725761
3448 43725761 44049212 44701199 45384011 46150361 46977934 47590263 47800111 47609282 47087895
3439 47087895 46651572 46136978 45669912 45336002 45227703 45452982 45797250 45976132 46037250 46027229
3429 46027229 46086422 46267874 46583404 47122354 47696078 48019434 48300304 48720352 48984178 49225363
3419 49225363 49787380 50632968 51553054 52459009 53212670 53739492 54146185 54700200 55331371
3410 55331371 56064201 57191518 58507463 60031313 61899023 64360369 67149061 71096481
3402 71096481 76316917 83218752 90847327 99329031 105626943 107404179 107716026 104446285
3394A04446285o659614p309463o452528n687414m815484m060421m237359l524727
3386F1699275k810231j974916j424177r63701m75607j30525K16981O08815R92420
3377E5738334J573894J900890K808362L927080N968355P450022Q183342N610003
3369I3160282K204704L79504m028989p102673p613731o884495o063156n045150
3361E9006296m784632m747204m331254l458173k828819k530213k228509j824705
3353C2272787j814611j774810j384284j180824r83768q41542p49018n79721l79626
3344B2584583l56673l70147k38685k24785l18140l47024k56423q3128j72350l37592
3334A9879636m06309k59086j45656o8009K1098M1858L3618L7449J45414J99083
$$ plain form
3394 104446285 97786671 90477208 84024680 78337266 73521782 69461361 65224002 61699275
3386 61699275 58889044 56914128 55489951 54526250 54050643 53920118 54137099 54745914 55738334
3377 55738334 57312228 59213118 62021480 65948560 71916915 79366937 87550279 93160282
3369 93160282 95364986 95744490 91715501 84612828 76999097 70114602 64051446 59006296
3361 59006296 54221664 49474460 45143206 41685033 38856214 36326001 34097492 32272787
3353 32272787 30458176 28683366 27299082 26118258 25134490 24292948 23543930 22964209 22584583
3344 22584583 22227910 21857763 21619078 21394293 21076153 20729129 20472706 20389578 20217228 19879636
3334 19879636 19473327 19214241 19068585 19000576 19021674 19063532 19097150 19134599 19280013 19479096
3324A9479096K37487J95478K70365L27757L67492O11794N83044O95061Q60713
3315B3628287R34446J121244J033039J024784J018870J346240J275278J304417
3307C2686605J334874J515941J826423K129387K347953K455345K982190L498354
3299E0777072M399807N306859O528267Q070202Q742976P659196M082178J917283
3291I7483840l52400l763336o602322p372861o097041m758858l566764k866969
3283F2103289k901940k653704k026164j445278r14255p51863k70169J44525P77330
3274E2061771J167255J749952K258540L335836M607794O037703P101619P655497
3266H5975967N634122K106154M23786k515639n670104p880748p868984o497770
$$ plain form
3324 19479096 19716583 19912061 20182426 20510183 20877675 21489469 22072513 22767574 23628287
3315 23628287 24562733 25683977 26717016 27741800 28760670 30106910 31382188 32686605
3307 32686605 34021479 35537420 37363843 39493230 41841183 44296528 47278718 50777072
3299 50777072 55176879 60483738 67012005 75082207 83825183 91484379 95566557 97483840
3291 97483840 97131440 93368104 86765782 79392921 73295880 68537022 64970258 62103289
3283 62103289 59201349 56547645 54521481 53076203 52161948 51410085 51139916 51284441 52061771
3274 52061771 53229026 54978978 57237518 60573354 65181148 71218851 78320470 85975967
3266 85975967 91610089 93716243 94140029 91624390 85954286 78073538 70204554 63706784
3258F3706784n418047m456232l992389m044041l726606l082460k672509k482197
3250C3832303k306024j929994j954159j476029j083465j084878p89940n50448
3242B2657366m52165l30464k37550n5364k32864j77356j84094l39235n65352n66011
3232A9516911p44810p90837p12874p39306p03816m81930n10492m99911l63707
3223A3969228k19972k18383k16111k53228j86594m7678K2900M9524r1660J10527
3213A2918553K75019K83271K96921M07789K20120Q3004q3563l62446k18338m94788
3203A3325542m19564m70623m59265l31546m19906l80761m50372k70333j80141
3194I943031k43934j91417k56240j29920l17990k56566k32296k63013N4750J59517
$$ plain form
3258 63706784 58288737 53832505 49840116 45796075 42069469 38987009 36314500 33832303
3250 33832303 31526279 29596285 27642126 26166097 25082632 23997754 23207814 22657366
3242 22657366 22205201 21874737 21637187 21581823 21348959 21171603 20987509 20648274 20082922 19516911
3232 19516911 18772101 17981264 17268390 16529084 15825268 15343338 14832846 14332935 13969228
3223 13969228 13749256 13530873 13314762 13061534 12874940 12827262 12850162 12899686 12808026 12918553
3213 12918553 13193572 13476843 13773764 14181553 14401673 14484677 14401114 14038668 13820330 13325542
3203 13325542 12905978 12435355 11976090 11644544 11224638 10843877 10393505 10123172 9943031
3194 9943031 9699097 9507680 9251440 9121520 8803530 8546964 8314668 8051655 8106405 8265922
3184H265922n8912k19892m3557M4584l6992j56656p0466P2934N0657M8573n3986
3173G842209j74395m944n0608n4037j3361n1703p1559L8282Q3016q797m1384J4668
3161G507387j6977m1541l6875O6120N9118p1797J6056K9493J1853L0286l1492
3150G521631j7170j8009N3989m1090N7303q7789o4466J00630K03780R1512k8794
3139G771527l7740J29522N3215J86040J15117n539K13864L06414K24036J51681
3129I108137J13334J88986K98082Q3646o3835j7129j47058o8174p7630n5580j58264
3118I204515j08750p8776O4273K8219j64260q417n0941J41642Q6809L444O1540
3107I179298N6401j23324l5692O6073O6896k0351J11903P1623m3591j36850o6497
$$ plain form
3184 8265922 8207010 7987118 7943561 7988145 7951153 7794497 7724031 7796965 7847622 7896195 7842209
3173 7842209 7667814 7662870 7612262 7558225 7544864 7493161 7421602 7459884 7542900 7534103 7492719 7507387
3161 7507387 7490410 7448869 7411994 7478114 7537232 7465435 7481491 7510984 7522837 7553123 7521631
3150 7521631 7504461 7486452 7540441 7499351 7556654 7468865 7404399 7505029 7708809 7800321 7771527
3139 7771527 7733787 7863309 7916524 8102564 8217681 8212142 8426006 8732420 8956456 9108137
3129 9108137 9221471 9410457 9708539 9792185 9728350 9711221 9564163 9495989 9418359 9362779 9204515
3118 9204515 9095765 9016989 9081262 9109481 8945221 8936804 8885863 9027505 9114314 9117758 9179298
3107 9179298 9235699 9112375 9076683 9142756 9209652 9189301 9301204 9372827 9329236 9192386 9125889
3096I125889P872q7978k05787j54669j55299j33696r6300m1255j36126k05015
3086G917636j72504j54871j25904j62614k4132k5840j11863p4505m3780j33830
3076F887793j01387j56714j83895q6997j79287k15631j01430n2038k17742j46632
3066E446040j37082r8437o0151k46262j40496j49743j72789j33708m5563j65356
3056D096453j34800j9604k5478k03996R416K2956j70074l9194p2960j00096n1311
3045C311312o5437n1978K8543j51172J3456n5411k03425j48684J79549j6925j48396
3034B691432M2459o5718n9482l6795n2381j36851J99495j19586J0038J322j79129
3023B294804l2855L6291L4796r2472p1632O0459Q3892k0752N6469o0708O7168
$$ plain form
3096 9125889 9133761 9045783 8839996 8685327 8530028 8396332 8300032 8258777 8122651 7917636
3086 7917636 7745132 7590261 7464357 7301743 7277611 7251771 7139908 7065403 7021623 6887793
3076 6887793 6786406 6629692 6445797 6358800 6179513 5963882 5862452 5810414 5592672 5446040
3066 5446040 5308958 5210521 5150370 4904108 4763612 4613869 4441080 4307372 4261809 4096453
3056 4096453 3961653 3942049 3916571 3712575 3721991 3744947 3574873 3535679 3462719 3362623 3311312
3045 3311312 3245875 3193897 3222440 3071268 3084724 3029313 2825888 2677204 2856753 2839828 2691432
3034 2691432 2733891 2668173 2608691 2571896 2519515 2382664 2582159 2462573 2472611 2473933 2294804
3023 2294804 2261949 2298240 2333036 2240564 2168932 2229391 2313283 2292531 2349000 2288292 2355460
3012B355460j9892r5779q1684Q0935Q6518l4081K8899k4809r626l7692j54228
3001B094021k0309K6878j2953k766j02883j66072o1101p8438J22573K0836j30361
2990A689425J130K3887n52j42564J25017J44310P6294P9238o1717J4613m9129
2979A899952J5540K8476J4529j28535j25454K5357j03891j36929l0712L3513o788
2968A485058n1137n0458k4658j17274K1329J07642o9944r1465R7267j0417j19847
2957A176096q1248K2256J32997O3462r6517j5405J7207q7138j21299J3542k4043
2946I99910k3222J1612O8270R966p1839K6539r5350l3350j7944M2080p241m4754
2934H64677J50149j31217J9320J19242N0153j05305j03110M4138n9885O2056p212
$$ plain form
3012 2355460 2335568 2239789 2158105 2239040 2325558 2291477 2320376 2295567 2285941 2248249 2094021
3001 2094021 2073712 2100590 2087637 2084871 1981988 1815916 1754815 1676377 1798950 1819786 1689425
2990 1689425 1690555 1714442 1713890 1571326 1696343 1840653 1916947 1996185 1934468 1949081 1899952
2979 1899952 1915492 1943968 1958497 1829962 1704508 1729865 1625974 1489045 1458333 1491846 1485058
2968 1485058 1433921 1383463 1358805 1241531 1262860 1370502 1300558 1209093 1306360 1295943 1176096
2957 1176096 1094848 1117104 1250101 1313563 1217046 1201641 1218848 1131710 1010411 1023953 999910
2946 999910 976688 988300 1056570 1066536 994697 1021236 925886 892536 874592 916672 909431 864677
2934 864677 1014826 883609 902929 1022171 1072324 967019 863909 908047 848162 910218 903006
2923I03006n5919q249J55538m1402P1077p7118j942R2210j06019K04k2771q5707
2911H22908K9722q8136Q4697J21611K3104k02715j04847M1278R8088K9315M7917
2900I02942r144k25124K4102M7581q0825J6046J08435m520L5852L1618R1649k4369
2888I14243j36006O2327k5596j91135N7581j49642L6008J45054O2019q3858J627
2877F92622J04095L7012r5899q3727Q6827l4115l7610l7682k5306M6396l8510
2866F14103m607n4744P478J15499p779m2213l6481K0133j06474J9372O7143n1103
2854E40327j5250j0347J4584P3474j04270j29693O7629J20627N3033j12264j8045
2843D79805j2767O8676J23116o7252j31618K5796K9777m0180j08782Q6156P2684
$$ plain form
2923 903006 847087 838838 994376 952974 1024051 946933 944991 1037201 931182 931386 908615 822908
2911 822908 852630 764494 849191 970802 993906 791191 686344 727622 825710 855025 902942
2900 902942 893798 668674 692776 740357 659532 675578 784013 779493 815345 846963 938612 914243
2888 914243 778237 840564 814968 623833 681414 531772 567780 712834 774853 690995 692622
2877 692622 796717 833729 737830 654103 740930 706815 669205 631523 606217 652613 614103
2866 614103 609496 554752 562230 677729 669950 627737 591256 611389 504915 524287 591430 540327
2854 540327 525077 514730 529314 602788 498518 368825 436454 557081 610114 497850 479805
2843 479805 467038 535714 658830 591578 459960 485756 515533 475353 366571 452727 525411
2832E25411j36704J2735N7403M3625J01184j38993J9460K3760l4240j893O1602
2821E33350m1233P7968j9866j68728M3458p0645k3448k2138J57259j8143j06114
2810C41720k3815j14913J02841N6414Q9531R8116R774l3862j02436r6167j0839
2799C16364M8126o3372M7828O5023l5033p8783j394M4300N4618j5755L6642J4776
2787D33340J91414o3564k5784p4686j56019Q5496R7049J176J0090o6762j48053
2776B83697J5966l2484J01402k1940p6890J08492q5257j6855k626J16123n5711
2765C33917j00346J28049k9700l1683N3281J8451r176M3278L5814J3162n6976
2754C98071k42336l1090J57913j57671K9658O8817O0619j24451o1487O5253P4451
$$ plain form
2832 525411 388707 401442 458845 502470 603654 464661 484121 507881 473641 471748 533350
2821 533350 492117 570085 550219 381491 424949 354304 330856 308718 465977 447834 341720
2810 341720 317905 202992 305833 362247 451778 549894 559668 525806 423370 327203 316364
2799 316364 364490 301118 348946 413969 378936 300153 298759 343059 397677 381922 418564 433340
2787 433340 624754 561190 535406 460720 304701 390197 487246 488422 498512 431750 283697
2776 283697 299663 267179 368581 346641 269751 378243 292986 276131 273505 389628 333917
2765 333917 233571 361620 331920 300237 353518 371969 362793 406071 441885 455047 398071
2754 398071 155735 124645 282558 124887 154545 223362 283981 159530 98043 163296 237747
2743B37747P4937j05351r798J5011L0518L1014j05127J15321Q250m4131o8599
2732A79792Q8757O3348l1116Q1085o9531o8427Q88M0929p7903J47641m7500j76510
2720A31453R052M327K3190l967m415P3462P1335k4126n0222J04512J21502j00253
2708C55850j20530j2166L4176Q4699j03665K8492P3194L126m8148n6593j22574
2697A15861k6736J17231q6571l5295K8344k3121J61184L0003p2873J097L3216
2686B42340n9335J70521m1868J4743R514r1414L155p895N9176j02164J9771o6969
2674A49575P8807N279k3288j76128m1147J94786K8771q6161L1189Q8278M3360
2663B93321l2287o4728M0243q3565j17935J0250J77223j5049l453j6072M7471
$$ plain form
2743 237747 312684 207333 197535 212546 243064 274078 168951 284272 292522 248391 179792
2732 179792 268549 331897 300781 381866 312335 243908 244796 285725 207822 355463 307963 131453
2720 131453 140505 144832 168022 164055 159640 233102 304437 280311 230089 334601 456103 355850
2708 355850 235320 223154 257330 342029 238364 266856 340050 343176 295028 238435 115861
2697 115861 89125 206356 119785 84490 112834 89713 250897 280900 208027 209124 242340
2686 242340 183005 353526 311658 326401 335915 244501 247656 239761 298937 196773 216544 149575
2674 149575 228382 233661 210373 34245 -6902 187884 216655 130494 161683 249961 293321
2663 293321 261034 196306 236549 152984 35049 45299 222522 207473 204020 187948 235419
2652B35419o0488O202j2573K4863j21617n3125J50889J5906j9942p1045j2112
2641H2377N7313p088o7696P67M4318K119j00098j1302R6268L5325n4562J56806
2629B34547j09441R3892r2583j46539k4006J28864P4274k9449O2232j7423r0511
2618H3857o4585K2448M4303J03783j2514k32155k3629J24252Q6808l3398j4465
2607H4705k506M239N4784j19621N0408j53529N0945P8199k8453J94530L0831r569
2595B34963m4015J39760q0690J4088m2204m9737N261J03732j38465j11664K9122
2584F0151K3910j2144N3506R0542Q8992Q7900j03137j88783m3069n0708R7378
2573A04538J1581o7627J85575l6579o8013j61723j09801J1108N7734j0559R4150
$$ plain form
2652 235419 174931 181133 168560 193423 71806 18681 169570 185476 165534 94489 82377
2641 82377 139690 132602 64906 65673 109991 112110 12012 710 96978 132303 77741 234547
2629 234547 125106 218998 126415 -20124 -44130 84734 159008 129559 191791 174368 83857
2618 83857 19272 41720 86023 189806 177292 -54863 -78492 45760 132568 99170 84705
2607 84705 82199 86438 141222 21601 72009 -81520 -30575 47624 19171 213701 244532 234963
2595 234963 190948 330708 250018 264106 221902 172165 177426 281158 142693 31029 60151
2584 60151 84061 71917 125423 215965 304957 392857 289720 100937 57868 7160 104538
2573 104538 116119 48492 234067 197488 129475 -32248 -142049 -130941 -73207 -83766 10384
2562A0384P1778p6984K1417P853J2636P1945j07462j7300R058K2286J12921O6577
2550B05109j32998j6465M7318M7968L149K522j01932m7942o7532J98169l787j7810
2538A15769l0030L6022Q8746k6226M4485j17409N2438J10240q1403j10073o1591
2527B0968L4928M243j5720m6829o6851R8336P8809M8269N6179l5558j4821O7532
2515B29485o3735j35446R8096J2235n6141J31983m3593j02718m1356m1327M3189
2504C0672O5522o4513r5137o8332M5725J86091l8462N0593j34772n6944L606J6253
2492e9698m8238Q1183J62003o1067l8793n1356r380L9173J63586r7742N8989L5853
2480A74513K1999N4076J7080P7965p1608N0567r0710j06576j6218J67564n5012
$$ plain form
2562 10384 82162 5178 26595 34448 47084 119029 11567 -5733 3325 25611 138532 205109
2550 205109 72111 55646 102964 150932 154081 156603 54671 6729 -60803 137366 133579 115769
2538 115769 85739 121761 210507 184281 228766 111357 163795 274035 192632 82559 20968
2527 20968 55896 60139 44419 -2410 -69261 29075 107884 156153 212332 176774 161953 229485
2515 229485 165750 30304 128400 140635 84494 216477 172884 70166 28810 -12517 30672
2504 30672 96194 31681 -63456 -131788 -86063 100028 61566 112159 -22613 -79557 -75951 -59698
2492 -59698 -107936 -26753 135250 74183 35390 -15966 -25346 13827 177413 79671 138660 174513
2480 174513 196512 250588 267668 345633 274025 324592 233882 127306 111088 278652 223640
2469B23640j1661R2442r5462J8606p6186n2353O6838J08820O1927M5554r9470
2458B82695o4235q823m79k4655Q6772P313j00192q1532l0926r2043J00526O2878
2446A37299j9696Q3785r8879P882K5798N2182N7307o7155Q0377m1349j43931P3975
2434A47595J06605p2572k36498O2999M8057J18714p3821j35985J32319N3456j448
2423A49421R768N679o4601J76931L2254l7186J4652O0288P1679o949o0871j58514
2411A92551P967K6914N4281J34234j6916J7953K2289k4769M5079N4340O7924M7513
2399F29360o538L2023j98194J6964J76240K2368j33839J86960J05599k8584J9676
2388H22035J54557J8331J74571J49882N6830J57928J66832l0413J28877K68393
$$ plain form
2469 223640 211979 304421 208959 227565 151379 99026 165864 274684 336611 382165 282695
2458 282695 218460 209637 209158 184503 271275 278588 178396 96864 65938 -26105 74421 137299
2446 137299 117603 201388 102509 110391 136189 188371 245678 178523 258900 217551 73620 147595
2434 147595 254200 181628 -54870 8129 56186 174900 101079 -34906 97413 150869 149421
2423 149421 159189 164868 100267 277198 309452 272266 286918 347206 418885 411936 351065 192551
2411 192551 200518 227432 281713 415947 399031 416984 439273 414504 459583 513923 581847 629360
2399 629360 622822 654845 456651 473615 649855 672223 538384 725344 830943 802359 822035
2388 822035 976592 994923 1169494 1319376 1376206 1534134 1700966 1670553 1799430 2067823
2378B067823R4791R2932R3367J21620R9528L1500M5467M7546j4282n7458M3242
2367B666076J96336O6799l4500P8861Q2722K04372J87923K31038K46220J73266
2357D099113K48234J78599J84045L79726L08109K54152M23845N44913M69769O41973
2347G732478P09744P11705Q21486P24233P05046P24434P81034R99209J129787
2338A5039156J232373J311683J389768J782398K278040L002891M016770M917865
2330C4970944N530357N085467R66026n4987o91733j995123l706133n578027m577160
2321B9949631l470103k721415k075042k176629k429259j888898j409402j216422
2313A2562461j312655j127301r64175q43991n69752o96021o56505n64759n68653
$$ plain form
2378 2067823 2162614 2255546 2348913 2470533 2570061 2601561 2647028 2694574 2680292 2622834 2666076
2367 2666076 2862412 2929211 2894711 2973572 3056294 3260666 3448589 3679627 3925847 4099113
2357 4099113 4347347 4525946 4709991 5089717 5397826 5651978 6075823 6620736 7090505 7732478
2347 7732478 8442222 9153927 9975413 10699646 11404692 12129126 12910160 13909369 15039156
2338 15039156 16271529 17583212 18972980 20755378 23033418 26036309 30053079 34970944
2330 34970944 40501301 45586768 46552794 46497807 45806074 43810951 40104818 34526791 29949631
2321 29949631 26479528 23758113 21683071 19506442 17077183 15188285 13778883 12562461
2313 12562461 11249806 10122505 9158330 8314339 7744587 7048566 6392061 5827302 5258649
2304E258649m05050k32491k43646l11148k66378k79259k27380k74889k93843R22
2294B725487j14679k31214j00743l6474j26780L043j39389j97056L6123J6344
2284A834662j48673j30923p4546j593n2716k0061M3028j52364j68625q6664k6749
2273A014776j04447K338N0452O3975j31873p4581K7051j76456L1378n182p5729
2262F21702q8683n2334M6547J93390J00580l0267r0297j17681l0798K023K613
2251E56795r0031N8109j12394l8709O280J28354N8741q0113j34848K4141K3922
2240D00247l499j42642L1944J14273k0660O1967K9449l5982j83362n6043j34999
2229F0693P0340K33619P8202j25330p8922k371q9857j8450r6354J30576J30698
$$ plain form
2304 5258649 4853599 4621108 4377462 4066314 3799936 3520677 3293297 3018408 2724565 2725487
2294 2725487 2610808 2379594 2278851 2242377 2115597 2118640 1979251 1782195 1818318 1834662
2284 1834662 1685989 1555066 1480520 1478927 1426211 1406150 1449178 1296814 1128189 1041525 1014776
2273 1014776 910329 912667 963119 1027094 895221 820640 847691 671235 702613 697431 621702
2262 621702 533019 480685 527232 720622 821202 790935 700638 582957 552159 554182 556795
2251 556795 466764 524873 412479 373770 380050 508404 567145 487032 352184 376325 400247
2240 400247 396748 254106 286050 400323 379663 441630 471079 435097 251735 195692 60693
2229 60693 131033 364652 442854 317524 238602 236231 146374 127924 31570 162146 292844
2218B92844j3265j40980m0080j24250J10222J57034k8800l1938q0977n8629J05104
2207A46285n3121m6160j24983o6673Q4275O4137p2550L0847K4440j6454O5549
2196C5592L1418K3908k3015J7729l5564j146j06313J8595k8944n6109M0983p2187
2184a55053R5607P9859n7754j7062J262p8913q4920N6261k7722N1599P1353L1107
2172c4376N0862j76938J29999J696R6703K7280r6541l1506K9998J80190j21237
2161E6130o8534k8122Q1396l219o3068n9661j7022r5305O9485J64340M2237J41180
2149B19837q7604k49961K6795J9709K2608n1899L0053k8382l6547R1361N8558
2138A4528n2082k0632q1230N8846K209K1868k4520J1307J89921j37014L8892M5179
$$ plain form
2218 292844 279579 138599 98519 -25731 84491 241525 212725 180787 99810 41181 146285
2207 146285 93164 47004 -77979 -144652 -60377 3760 -68790 -37943 -13503 -29957 35592
2196 35592 67010 90918 67903 85632 50068 48922 -57391 -38796 -67740 -123849 -82866 -155053
2184 -155053 -59446 20413 -37341 -54403 -53141 -132054 -216974 -160713 -188435 -136836 -65483 -34376
2172 -34376 16486 -160452 -30453 -28757 67946 95226 -1315 -32821 -2823 177367 56130
2161 56130 -12404 -40526 40870 37651 -25417 -85078 -102100 -197405 -127920 36420 78657 219837
2149 219837 132233 -117728 -90933 -71224 -48616 -100515 -70462 -98844 -135391 -44030 14528
2138 14528 -37554 -58186 -139416 -80570 -78361 -56493 -81013 -69706 120215 -16799 22093 67272
2126F7272j241p292m310m8365O1656N3333j058m6388n6503p5670P996J53157q5894
2113A6693p7931l9445k9683n5753Q7377r7487j2348J18030P9637l681M3100j02380
2101g3871j7968j8277N8577k2285j00368P7151N6780R146J13320l5663r3943q079
2089e5480k3776P477j31245J42401O3227j18880L9376J18777j02722n0481k4622
2078a35948L2834N0429l0069J22317m2895q4242K3378R3398j8629l7023K5508
2067i42j02248M7623n790J34330M3751r1597j06784N6462J52479P7108M3721j47714
2055A00399q943O5588O884j93273J326J77384o868j46205n0467L7365R095j5069
2043b2784j2244l5297r4893J9032n9132j652J59770N0498N0594o5765j15038q7675
$$ plain form
2126 67272 66031 58739 54429 6064 67720 121053 119995 73607 17104 -58566 -50570 102587 16693
2113 16693 -61238 -100683 -130366 -186119 -98742 -196229 -208577 -90547 -10910 -14591 28509 -73871
2101 -73871 -91839 -110116 -51539 -73824 -174192 -97041 -40261 -31115 82205 46542 -47401 -55480
2089 -55480 -79256 -71779 -203024 -60623 2604 -116276 -76900 41877 -60845 -111326 -135948
2078 -135948 -103114 -52685 -82754 39563 -3332 -87574 -64196 29202 10573 -26450 -942
2067 -942 -103190 -55567 -61357 72973 116724 25127 -81657 -25195 127284 204392 248113 100399
2055 100399 91456 157044 163928 -29345 -28019 149365 142497 -3708 -54175 -16810 -7715 -22784
2043 -22784 -35028 -70325 -165218 -146186 -205318 -206970 -47200 3298 53892 -11873 -126911 -214586
2031b14586o2207K07248p6655j52209J30559J0372P4000L2202m7568J0615J1598
2020g6631O6137L6956n4052n5120r7846J00201L4585j11636j06905J11325N2075
2009a00911L7015M141r2903r2976l9965J10748j8587M2619K3068k583o649Q5945
1997e1038J6432j5819p2741k11243L4812K63291m7815N0613l4691j42213Q2320
1986a28092J06632j881p2725j01472J2484P3350J792L8346P3092l6629j17900
1975a53003j17904M5350p1194R7081k1867J09533O1687n0976n7514J1939m0653
1964a87521P0675K0718o2512N4991j55619J50274J0847j15871q08M028J33287
1953g7511J9989k10740J3348O7580k5134k2405j24552Q3720J26210K9201L0255
$$ plain form
2031 -214586 -276793 -69545 -146200 -298409 -167850 -157478 -83478 -51276 -98844 -88229 -76631
2020 -76631 -10494 26462 -27590 -82710 -180556 -80355 -45770 -157406 -264311 -152986 -100911
2009 -100911 -63896 -59755 -152658 -245634 -285599 -174851 -193438 -150819 -127751 -130334 -136983 -51038
1997 -51038 -34606 -50425 -123166 -334409 -299597 -36306 -84121 -33508 -68199 -210412 -128092
1986 -128092 -21460 -23341 -96066 -197538 -185054 -111704 -109912 -71566 1526 -35103 -153003
1975 -153003 -270907 -225557 -296751 -199670 -221537 -112004 -50317 -101293 -158807 -146868 -187521
1964 -187521 -116846 -96128 -158640 -103649 -259268 -108994 -98147 -214018 -214826 -210798 -77511
1953 -77511 -57522 -268262 -254914 -187334 -212468 -234873 -359425 -275705 -149495 -120294 -90039
1942i0039Q459K2094M7829O7346q9919l9962j6395j81966r266M9625j6185K3685
1930b24694J336Q1867J0807J14231P4148r8373j42382K240J674L7189j8176q1759
1918b41892L5970P1112J35487o820J4244l8038o8638k23j27154q8686K1903l7834
1906c30569Q7347J87699j26344O5990P3157k7456j24266r7772J19943O9733j28367
1895b30905K594q8164M1010J03615L3195L0952q970p1802k956M0447n3152M7324
1883a56812R9075l8755k1542k0198j14620J15136j032p2971L3366J52493q6841
1872a12701r2277P4596Q778m5388Q0677o551r6962L3295K846O8762j52847j00981
1860c38753K38034J37968l0336j15552P6266K3151o3845j34943k3636O4695L829
$$ plain form
1942 -90039 -81580 -59486 -11657 55689 -34230 -74192 -90587 -272553 -281819 -232194 -248379 -224694
1930 -224694 -223358 -141491 -130684 -16453 57695 -40678 -183060 -180820 -179146 -141957 -160133 -241892
1918 -241892 -205922 -134810 677 -6143 8101 -29937 -98575 -98798 -225952 -314638 -292735 -330569
1906 -330569 -243222 -55523 -181867 -115877 -42720 -70176 -194442 -292214 -172271 -102538 -230905
1895 -230905 -228311 -316475 -275465 -171850 -138655 -107703 -116673 -188475 -191431 -150984 -204136 -156812
1883 -156812 -57737 -96492 -118034 -138232 -252852 -137716 -138748 -211719 -178353 -25860 -112701
1872 -112701 -204978 -130382 -121604 -166992 -86315 -92866 -189828 -156533 -153687 -84925 -237772 -338753
1860 -338753 -100719 37249 6913 -108639 -32373 -9222 -73067 -208010 -231646 -166951 -163122
1849a63122J25729r7702n4733j0980j2315l8199P9278O7683j36138L2508R0046
1838a17945Q933J41587j8214o798O3650q3717p9434m1270q2014n554Q1477m2883
1826a82182L5121K4990L4144m1990N263P934Q71K8265j11661l3031N3935N2199
1814a26142l6205K4901j56470P3499K1796j2162N70J29142p83l4551n7741j40256
1802c14402J09843M7746L0778K158L3634j64928j08488P7765M0935O7533J34361
1791d3065n7144m705L8604N4589L8910j17949r6053J08871K905j92356N6131J3419
1779a97843j624j250N5837o2804j8272o3641M7537O0683j15532O2277p4244O308
1767c02568M7421J01790j50638R6033O1779n91L3281m8913J7975J12535m1068
$$ plain form
1849 -163122 -37393 -135095 -189828 -200808 -213123 -251322 -172044 -104361 -240499 -207991 -117945
1838 -117945 -109012 32575 14361 7563 71213 -12504 -91938 -133208 -215222 -220776 -139299 -182182
1826 -182182 -147061 -122071 -87927 -129917 -124654 -116720 -115849 -87584 -199245 -232276 -178341 -126142
1814 -126142 -162347 -137446 -293916 -220417 -198621 -210783 -210213 -81071 -81854 -116405 -174146 -314402
1802 -314402 -204559 -156813 -126035 -123877 -90243 -255171 -363659 -285894 -244959 -177426 -43065
1791 -43065 -100209 -104914 -66310 -11721 27189 -90760 -186813 -77942 -75037 -267393 -211262 -197843
1779 -197843 -199467 -200717 -144880 -207684 -225956 -289597 -242060 -181377 -296909 -234632 -308876 -302568
1767 -302568 -255147 -153357 -303995 -207962 -146183 -146774 -113493 -162406 -144431 -31896 -72964
1756g2964N3258l9430r0530R8719n467j00862j12871R923m8346L8665J36420l4265
1744a67750J41948j2071N3596k9446p0340M5213o9574n2132j04837p8547R4042
1733b49898J71643O2716n472m0088j3783p0420m0559j8071p9675j20209J43190
1722b60626Q5431q3200p1297J0088K27794m4718j0975N181m9167P7203L7705p5629
1710a52210n2542J56655M6944j65070K4980o8293m859j3730k2285J8547J2302
1699b19561K8902J0441Q886r8820N6298m2199j02193O728O6152j16770J54817
1688b47319O2935Q3198J27367l2607j53773j56830k057L059L2347J31055J39566
1677a3059j3574O426q5512q4369J8492J08388P8816j12079K9677L8907k6595J3142
$$ plain form
1756 -72964 -19706 -59136 -149666 -50947 -56414 -157276 -270147 -260224 -308570 -269905 -133485 -167750
1744 -167750 -25802 -37873 15723 -13723 -84063 -38850 -108424 -160556 -265393 -343940 -249898
1733 -249898 -78255 -15539 -21011 -61099 -74882 -145302 -185861 -203932 -283607 -403816 -260626
1722 -260626 -175195 -258395 -329692 -319604 -91810 -136528 -147503 -142322 -191489 -114286 -76581 -152210
1710 -152210 -204752 -48097 -1153 -166223 -141243 -209536 -214395 -228125 -250410 -231863 -219561
1699 -219561 -190659 -180218 -171332 -270152 -213854 -256053 -358246 -351518 -285366 -402136 -247319
1688 -247319 -184384 -101186 26181 -6426 -160199 -317029 -319086 -316027 -283680 -152625 -13059
1677 -13059 -26633 -20207 -105719 -190088 -171596 -63208 15608 -96471 -66794 -27887 -54482 -41340
1665d1340n6083m0000m4494O8839M2711o3027p5942m9548m5349R4901J3033k2013
1653b18312J15500k5302m0486j02864L5344L5109L5752N152J50428K945k23917
1642b30651m4102R8793j89648O5124J72620J7611p3355K7361n2844J5579P543
1631a85969o6023k4018Q6233J51515k1460j23347j8697Q547r573R8453N0704j3039
1619f6674j09915L8505Q501J1236J76711j33419r7798R0822j5177K8844L0829
1608c7535j1892j39206j26601K6162M8892P1455j09928M3085J24254n1501k462
1597a65277p771M0889j9188k7097j13743p315O4586J12714j6373k26170J6371
1586c48374J33104N3075j9037p355o4771m7320J59745O7017j11081k4361J33568
$$ plain form
1665 -41340 -97423 -137423 -181917 -113078 -70367 -133394 -209336 -258884 -304233 -209332 -196299 -218312
1653 -218312 -102812 -128114 -168600 -271464 -236120 -201011 -165259 -160107 -9679 -6734 -230651
1642 -230651 -274753 -175960 -365608 -300484 -127864 -110253 -183608 -156247 -209091 -193512 -185969
1631 -185969 -251992 -276010 -189777 -38262 -59722 -183069 -201766 -193219 -202792 -104339 -53635 -66674
1619 -66674 -176589 -138084 -129583 -118347 58364 -75055 -172853 -82031 -97208 -68364 -37535
1608 -37535 -49427 -188633 -315234 -289072 -240180 -168725 -278653 -235568 -111314 -162815 -165277
1597 -165277 -173048 -132159 -151347 -178444 -292187 -299502 -234916 -122202 -138575 -364745 -348374
1586 -348374 -215270 -162195 -181232 -188587 -253358 -300678 -140933 -73916 -184997 -209358 -75790
1575g5790R8204j44901q5772J11659l7709Q9095j12856j45227R1048N8102m3987
1564a98134J86987J2775j18782O5148k247L7610P9046r2369k7739l2009J9456
1553g0258j12249J3615k0678J24680j3757K069J8644R096L8047n5681J0143L6189
1541b0140N7131Q2182n2592o6097q1553k0596J01519o5304o9801M4503J48455
1530E7707R241l4839k5440L7797M3146p6511M462j27673M560K5479L8645R115
1518c4311j35458K2925n0812R229R3966K0485j30277J61088M9465j3123L322j28507
1506a32008K5525M3148l5799n814k6864j82242P109Q1807J02188M5835j05806
1495a82921L3026m7325J27452l1174k1540O3535m821p2931N8658m2812r3476Q2511
$$ plain form
1575 -75790 22414 -122487 -208259 -96600 -134309 -45214 -158070 -303297 -212249 -154147 -198134
1564 -198134 -11147 1628 -117154 -52006 -54253 -16643 62403 -29966 -57705 -89714 -70258
1553 -70258 -182507 -168892 -189570 -64890 -78647 -76578 -57934 -48838 -10791 -66472 -56329 -20140
1541 -20140 36991 119173 66581 484 -81069 -101665 -146 -65450 -135251 -90748 57707
1530 57707 66948 32109 6669 44466 87612 11101 15563 -112110 -107550 -82071 -43426 -34311
1518 -34311 -169769 -146844 -197656 -188427 -94461 -73976 -204253 -43165 6300 -6823 -3501 -132008
1506 -132008 -106483 -63335 -99134 -104948 -131812 -314054 -306945 -225138 -122950 -77115 -182921
1495 -182921 -149895 -197220 -69768 -100942 -122482 -58947 -63768 -136699 -78041 -120853 -214329 -131818
1483a31818r583P0945k624r473J1777o5171O0888O114P6348j73438L352K5186
1471a37497m7971L6151O7717l8597N1383P1038Q4883J8335j52817M2479o983o0530
1459g2409k8617n7773n887L8952j0758O7765M2462j68875p7137L2576J06003O9902
1447f3796q8156K588m5639J23236j02953J8183K896J5571M4757n4707L6845N0632
1435f0543L6582R8839m9674q2742m2558l6005L0166N7634J54216r1124j25440
1424a10649q91P3947P6600L237j23098n7998N4358l5406K8780N3836r654K0557
1412b6381J17538j77409j40309Q0071j9273L5477J6757R6656n8542j32833M5199
1401a63049J19055K651J603R9425j0973r5967K5663k9608n5386q726k6946M9411
$$ plain form
1483 -131818 -141401 -70456 -73080 -82553 -70776 -135947 -75059 -68945 7403 -166035 -162683 -137497
1471 -137497 -185468 -149317 -81600 -120197 -68814 2224 87107 105442 -47375 -4896 -11879 -72409
1459 -72409 -101026 -158799 -164686 -125734 -136492 -68727 -26265 -195140 -272277 -239701 -133698 -63796
1447 -63796 -151952 -149364 -195003 -71767 -174720 -156537 -153641 -138070 -93313 -148020 -111175 -60543
1435 -60543 -23961 74878 25204 -57538 -100096 -136101 -105935 -48301 105915 14791 -110649
1424 -110649 -111540 -37593 39007 42244 -80854 -138852 -84494 -119900 -91120 -37284 -46938 -26381
1412 -26381 91157 -86252 -226561 -146490 -165763 -130286 -113529 -16873 -75415 -208248 -163049
1401 -163049 -43994 -41343 -39740 59685 48712 -47255 -21592 -51200 -106586 -115312 -142258 -92847
1389i2847r9635P7041R7812R843j1101r1119k2171J5433K006p3009J25565n7826
1377a20008l2063N6069J5666j31480p60J07175o1236P0837m2651K9097O8190N972
1365c5192j4017L2462J4151m108k1335m7519o692N3800J226j64350n9133P1370
1353a79337j7470J5850O4943K371j6765P2539j54032m6512J35857r3352L1303
1342a84605O1629P5837Q6326j30938o1771Q9620J32793r5994j76329J42388m94
1331f1538j6343N1485P6921k9927j09965P0670R9754n8395L5082p5002j4575L3305
1319A472j00070R1677j4093j8286q7793r1062J12577R2824L1788M7915n488o6721
1307e260p589l7578p0375o7052P5765n682N3851M2810j29317K0744l4492M5099
$$ plain form
1389 -92847 -192482 -115441 -17629 -7786 -18887 -110006 -132177 -116744 -114738 -187747 -62182 -120008
1377 -120008 -152071 -96002 -80336 -211816 -212576 -105401 -166637 -95800 -138451 -109354 -41164 -35192
1365 -35192 -49209 -16747 -2596 -6704 -28039 -75558 -82250 -28450 -27224 -191574 -250707 -179337
1353 -179337 -196807 -180957 -116014 -113643 -130408 -57869 -211901 -258413 -122556 -215908 -184605
1342 -184605 -122976 -47139 39187 -91751 -153522 -63902 68891 -27103 -203432 -61044 -61538
1331 -61538 -77881 -26396 50525 20598 -89367 -18697 81057 22662 57744 -17258 -31833 1472
1319 1472 -98598 -6921 -21014 -39300 -127093 -218155 -105578 -12754 19034 66949 61461 -5260
1307 -5260 -12849 -50427 -120802 -187854 -112089 -117771 -63920 -21110 -150427 -129683 -164175 -119076
1295a19076J59560L1393m9993K4533K6710n8318m5297p7147l3610L9605J05073
1284C433J40384r5514j23266j08842N5455Q6951J27736n0238k07631R6437o667
1273h1762j5438k7368P2724J35439j03151O5615j44644K9799J07674k0733j89153
1262a70998l5033O1218M8244k0534J06142j28350R528J48966q9481k3720O7675
1251b6343J16031n8322j0416R2131q6203L2836k6847N4232L8167j8091P3246k73915
1239i3494K1067L870j16043R6013L2286J2081N9004r6543J8701l8938l082q3034
1227a88112k0036J29431J1052j4851M0934j33462j3201J66972P3831j21605N0151
1216a8896n8747n1626O5433P8584j11n0482q6352O3921Q6311P7069m4931j56949
$$ plain form
1295 -119076 40484 71877 21884 46417 73127 14809 -30488 -107635 -141245 -101640 3433
1284 3433 143817 48303 -74963 -183805 -128350 -41399 86337 36099 -171532 -75095 -81762
1273 -81762 -97200 -124568 -51844 83595 -19556 46059 -98585 -68786 38888 18155 -170998
1262 -170998 -206031 -144813 -96569 -117103 -10961 -139311 -129783 19183 -70298 -94018 -26343
1251 -26343 89688 31366 20950 113081 26878 59714 32867 87099 125266 107175 180421 -93494
1239 -93494 -72427 -68557 -184600 -88587 -56301 -44220 14784 -81759 -63058 -101996 -105078 -188112
1227 -188112 -208148 -78717 -67665 -82516 -41582 -175044 -188245 -21273 52558 -69047 -18896
1216 -18896 -77643 -129269 -63836 14748 14637 -35845 -122197 -58276 28035 105104 60173 -96776
1204i6776j14238N0465l9440P0264J9559L3799N2959j7634J09977k3983q4436
1193c9484K4609l975K0539j3128n3061M8916P0935j1580o8580o0462j14805M7709
1181a52367L5817J03030j0517k6845L837K4780n2711j19866O7062K01919j56380
1170h2241J3192J3754P1456j296j28867L7435O701J2907O3512K360j03043K2467
1158g1663N7054o1077j05974L8042r2533j0962k620O0571J62932r6923M1166K5426
1146e6561q9260R0383o7926P5497J4861J1918P0260j9403r678k5669j40585j1086
1134a57249J4150l0521j8994j06885J62381P1951J60285M2165j1169K9392n9944
1123I5562M2418L3946j22080j16717P0213j1476k8459N4317j1140P8758r7227
$$ plain form
1204 -96776 -211014 -160549 -199989 -129725 -110166 -76367 -23408 -41042 68935 44952 -39484
1193 -39484 -14875 -18850 1689 -11439 -64500 -15584 55351 43771 -24809 -85271 -200076 -152367
1181 -152367 -116550 -13520 -24037 -50882 -47045 -22265 -74976 -194842 -127780 74139 -82241
1170 -82241 -69049 -55295 16161 14865 -114002 -76567 -69866 -56959 6553 8913 -94130 -71663
1158 -71663 -14609 -75686 -181660 -143618 -236151 -247113 -249733 -189162 -26230 -123153 -81987 -56561
1146 -56561 -145821 -55438 -123364 -47867 -33006 -21088 49172 29769 20091 -5578 -146163 -157249
1134 -157249 -143099 -173620 -192614 -299499 -137118 -65167 95118 137283 126114 155506 95562
1123 95562 137980 171926 49846 -66871 3342 -8134 -36593 17724 6584 85342 -11885
1112a1885m4562n7801k6414O6418l2077L4893Q1791O8973m8861l4922P8853l2806
1100D1600j3591J8546p7149O3990j23173j5902J24489J9013R444q067O5132j36005
1088c1673k4345Q2609N1897p0447j27423O704N1362L7978L7814m5104j5376K1768
1076b4236n6961O974r6718J21026J10940m3890q1437O5766r542j19084k5465J8994
1064a33633p4071M1372K2238O0684Q3769r9763L4485Q6010L027l9081M1149j84060
1052a57874r168L7295P9911o6257m4049J3084k5706O3814K8232n7139N4867R4745
1040A1755n9206L0140R5433n2274n5888O9438k7007j0207K453Q6995R0445P8422
1028B60499j79977k9598l8905o1977k1427q1935L6801m6246M9709N8049J36964
$$ plain form
1112 -11885 -56447 -114248 -140662 -74244 -106321 -71428 10363 79336 30475 -4447 74406 41600
1100 41600 28009 46555 -30594 33396 -89777 -105679 18810 37823 47267 39200 104332 -31673
1088 -31673 -56018 26591 78488 8041 -119382 -112678 -61316 -23338 14476 -30628 -46004 -24236
1076 -24236 -81197 -74223 -170941 -49915 61025 17135 -64302 1464 -8078 -127162 -152627 -133633
1064 -133633 -207704 -166332 -144094 -83410 359 -99404 -64919 21091 24118 -14963 26186 -157874
1052 -157874 -167042 -129747 -49836 -116093 -160142 -147058 -172764 -108950 -80718 -137857 -82990 11755
1040 11755 -47451 -17311 78122 25848 -30040 39398 12391 2184 4637 91632 182077 260499
1028 260499 80522 50924 12019 -49958 -71385 -153320 -116519 -162765 -113056 -55007 81957
1017H1957R689j40805J9376m8648M1186M6588M7242L34R822N8540j88539J8381
1005d4877j78251J41622P0597p9052O3139J8724M7828m2948Q8627N971j14924
994b3544Q0520n458k2623J84737p8184o4284k4824Q0756J5787L4286j13878j31154
982f7863j15093J31643J21972O1247j25486o3033J45837l249P0027K8354j36167
971D8189Q1705M8218j28510N7942j5645n4723K0705r0307J33639Q6107k18440
960c1120J8583M1719K0585j65259K2912N2900k0153P0260Q9932M3981q8707j21575
948f5942P2545j2005j11510o364J67376L3228p3784J3874p4305L2283k796M11
936b6989l469j8857J02250l563j9704j3488j4547N0972O644l0003o5563J44203
$$ plain form
1017 81957 91646 -49159 -29783 -78431 -37245 9343 56585 56919 66741 125281 -63258 -44877
1005 -44877 -223128 -81506 -10909 -89961 -26822 -8098 39730 -3218 85409 91380 -23544
994 -23544 56976 51518 28895 213632 135448 71164 46340 127096 142883 177169 63291 -67863
982 -67863 -182956 -51313 70659 131906 6420 -56613 89224 85975 156002 184356 48189
971 48189 129894 178112 49602 107544 91899 37176 57881 -32426 101213 187320 -31120
960 -31120 -12537 29182 49767 -115492 -92580 -39680 -59833 10427 100359 144340 55633 -65942
948 -65942 6603 -5402 -116912 -123276 44100 77328 3544 17418 -56887 -24604 -27400 -26989
936 -26989 -30458 -49315 52935 49372 29668 16180 1633 52605 59249 29246 -36317 107886
924A07886O8626j75247L4743N5814K973n2772L6231l2102l0039r783j17211J37318
912B6437o8464m5975K02800L8756q2522j53044J3498Q2880l4827N7977m1626N9319
900E5209R988n33P4252j34747j31519O1905J05568J0730j2312R0837K3128n9106
888I3400j2107l2177o8797R7698n1464L8773j5086J09298j92723L3496P4757K3438
876I8506J18035j01024j07197j46381O7642k6933Q4504l1079O7729M5256m5340
865B3718P8844k2323q0161K1631j22018J25449J07279j14286p3990Q0595J4121
854C8859q469P6262l1040o0510o4859J2764J5877M0140k5941N9991J6491K7852
842I7417j5027M5767p5804j40019P8932J9409J8885Q9703N1427j56312m1368k6630
$$ plain form
924 107886 176512 1265 36008 91822 94795 42023 78254 46152 16113 6330 -110881 26437
912 26437 -42027 -88002 114798 153554 71032 -82012 -68514 14366 -20461 37516 -4110 55209
900 55209 65197 64664 138916 4169 -127350 -65445 40123 50853 38541 129378 152506 93400
888 93400 81293 49116 -19681 78017 26553 65326 50240 159538 -33185 311 75068 98506
876 98506 216541 115517 8320 -138061 -70419 -97352 -12848 -43927 23802 69058 23718
865 23718 102562 80239 78 21709 -100309 25140 132419 18133 -55857 24738 38859
854 38859 30390 106652 75612 15102 -49757 -36993 -21116 19024 -6917 53074 69565 97417
842 97417 82390 128157 52353 -87666 -8734 10675 29560 119263 170690 14378 -26990 -53620
830e3620K0295N2257k1319k1611J2489p4455J40259M3668l2408m5720K4193l445
818D0583l5220k0926K8576J4809m5594K15P5669P5135L9898j27891k3847Q6560
806A07967m1672n3967M5845l2874M2775j8666Q6252n2351o7559N9059m5065n9860
794c0116J00820k4892j78721L1395J15210j9877l0364l4290K3264l467N6392K9676
782C5030K9863J5030L2679l220k8301N2973o6040J17368p0823l5535j9422o080
770E3522l014Q2178K2502L5308k13225P7981j27505N3935J528J05639R8061l3389
758A53521j2115l4446q022R3928p9648l7813o4208L537M6960k9620Q9162j17244
746C992J05978r6628p6228J26832n9261o2055q3750k1070K00539J07959K471p8496
$$ plain form
830 -53620 -33325 18932 -2387 -23998 -11509 -85964 54295 97963 65555 19835 44028 40583
818 40583 5363 -15563 13013 27822 -17772 -17557 58112 133247 173145 45254 21407 107967
806 107967 66295 12328 58173 25299 68074 49408 135660 83309 15750 74809 29744 -30116
794 -30116 70704 45812 -132909 -101514 13696 -6181 -36545 -70835 -47571 -51038 5354 35030
782 35030 64893 79923 112602 109382 81081 134054 68014 185382 114559 79024 59602 53522
770 53522 50508 132686 155188 190496 -22729 55252 -72253 -18318 -16790 88849 186910 153521
758 153521 141406 106960 98938 192866 113218 75405 11197 14734 61694 32074 121236 3992
746 3992 109970 13342 -62886 63946 4685 -57370 -141120 -162190 38349 146308 148779 70283
734G0283o621l8668j892q3548j9714J06896O9327K4470K5347j12882J7378k86
722E0090j09129J0636J04499K2992K4765L2831p1599K9229J1647j14676J3940
711E225J14380o5402n2255J20148Q8097L4580j80880j60382J06346N4203n3165
700A0895J21517l3631j17917p4899M2002J14360j01308K02875l8078q7965k6495
689A1356M3083J23895n6947j14184k5680J37660R0898j25152o4701N2319R648
678H2195l4153j3290j7187k299N5643O3473J0036j06164j5181J61927M3208j32599
666I5609Q5998K9798o1652N7993k5596j24291O2704q0883l4746K3279j21470R6222
654B965R5819k3604o1923j31255J10321Q4306l5766K0833N9555n8401M9953o526
$$ plain form
734 70283 63662 24994 23102 -60446 -80160 26736 96063 120533 145880 32998 50376 50090
722 50090 -59039 -48403 56096 79088 103853 136684 65085 94314 105961 -8715 5225
711 5225 119605 54203 1948 122096 210193 244773 63893 -96489 9857 64060 10895
700 10895 132412 98781 -19136 -94035 -52033 62327 -38981 163894 125816 37851 11356
689 11356 54439 178334 121387 7203 -18477 119183 210081 84929 20228 72547 82195
678 82195 48042 34752 17565 15266 70909 134382 144418 38254 23073 185000 228208 95609
666 95609 181607 211405 149753 207746 182150 57859 120563 39680 4934 28213 -93257 2965
654 2965 98784 75180 13257 -117998 -7677 76629 40863 61696 121251 62850 112803 106277
642A06277R859l5822L6257k7537J01718Q6087j38365p4723q279J80243j10749
631A24966L7755N3710j06920j4479j6807n4924j8930N658j20779J20929K17038
$$ plain form
642 106277 116136 80314 116571 89034 190752 276839 138474 63751 55472 235715 124966
631 124966 162721 216431 109511 95032 78225 23301 4371 10029 -110750 10179 227217
$$ [...]
##END NTUPLES=NMR SPECTRUM
##END=
