##TITLE=1H_CG-1227-D1
 200.13MHz, CDCl3,
 8 sc
 
 2.10.2025
##JCAMPDX= 6.0         $$ Bruker NMR JCAMP-DX V2.0
##DATA TYPE= NMR SPECTRUM
##DATA CLASS= NTUPLES
##ORIGIN= UXNMR, Bruker Analytische Messtechnik GmbH
##OWNER= pz
$$ XWIN-NMR		Version 3.5
$$ Thu Oct  2 14:09:23 2025 Russian Standard Time (UT+4h)  she@DPX200
##.OBSERVE FREQUENCY= 200.1313
##.OBSERVE NUCLEUS= ^1H
##.ACQUISITION MODE= SIMULTANEOUS
##.ACQUISITION SCHEME= undefined
##.AVERAGES= 8
##.DIGITISER RES= 18
##SPECTROMETER/DATA SYSTEM= spect
##.PULSE SEQUENCE= zg30
##.SOLVENT NAME= CDCl3
##.SHIFT REFERENCE= (INTERNAL, CDCl3, 0, 15.3613)
##AUDIT TRAIL= $$ (NUMBER, WHEN, WHO, WHERE, WHAT)
$$ ##TITLE= Audit trail, XWIN-NMR		Version 3.5
$$ ##JCAMPDX= 5.01
$$ ##ORIGIN= Bruker BioSpin GmbH
$$ ##OWNER= she
$$ F:/spectra/data/she/nmr/H-C/1/pdata/1/auditp.txt
$$ ##AUDIT TRAIL=  $$ (NUMBER, WHEN, WHO, WHERE, WHAT)
(   1,<2025-10-02 14:07:48.14 +0400>,<she>,<DPX200>,
      <created by zg, POWCHK disabled, PULCHK disabled
       configuration hash MD5:
       00 E9 B6 7A A2 85 ED C7 34 08 36 98 17 FE 4E 26
       data hash MD5: 16K
       5B 7D FC E2 F1 C6 74 00 60 B6 D5 0D 28 E2 F3 F2>)
(   2,<2025-10-02 14:07:57.18 +0400>,<she>,<DPX200>,
      <Start of raw data processing
       efp BC_mod = 2 LB = 0.25 FT_mod = 6 PKNL = 1 PHC0 = -1915.65 PHC1 = 13.39225 SI = 16K 
       data hash MD5: 16K
       BB 3B A9 13 13 E3 AB 90 2B 47 1D 48 10 6B 1F 90>)
(   3,<2025-10-02 14:08:11.10 +0400>,<she>,<DPX200>,
      <pk PHC0 = 1.535923 PHC1 = -3.2 
       data hash MD5: 16K
       2F 2F 3D A4 21 2B 38 7C 00 8B 20 B3 DB E4 65 1B>)
(   4,<2025-10-02 14:08:15.10 +0400>,<she>,<DPX200>,
      <abs ABSG = 5 
       data hash MD5: 16K
       8E 27 C5 4A B7 64 07 17 E8 A3 6F DB 40 D5 CA E5>)
$$ ##END=
$$ 
$$ hash MD5
$$ 3C A2 CD 5A 67 69 76 3F 38 AA 55 1E 1B 6A 69 79
##$RELAX= 
##$RELAX= 
##$RELAX= 
##$RELAX= 
##$RELAX= 
##$RELAX= 
$$ Bruker specific parameters
$$ --------------------------
##$DU= <F:/spectra>
##$EXPNO= 1
##$NAME= <H-C>
##$PROCNO= 1
##$TYPE= <nmr>
##$USER= <she>
##$AMP= (0..31)
100 100 100 100 100 100 100 100 100 100 100 100 100 100 100 100 100 100 
100 100 100 100 100 100 100 100 100 100 100 100 100 100 
##$AQSEQ= 0
##$AQ_mod= 1
##$AUNM= <au_zg>
##$AUTOPOS= <>
##$BF1= 200.13
##$BF2= 200.13
##$BF3= 200.13
##$BF4= 200.13
##$BF5= 200.13
##$BF6= 200.13
##$BF7= 200.13
##$BF8= 200.13
##$BYTORDA= 1
##$CFDGTYP= 0
##$CFRGTYP= 5
##$CHEMSTR= <none>
##$CNST= (0..31)
1 1 145 1 1 1 1 1 1 1 1 1 1 1 1 1 1 1 1 1 1 1 1 1 1 1 1 1 1 1 1 1 
##$CPDPRG= <>
##$CPDPRG1= <>
##$CPDPRG2= <>
##$CPDPRG3= <>
##$CPDPRG4= <mlev>
##$CPDPRG5= <mlev>
##$CPDPRG6= <mlev>
##$CPDPRG7= <mlev>
##$CPDPRG8= <mlev>
##$CPDPRGB= <>
##$CPDPRGT= <>
##$D= (0..31)
0 0.7 0 0 0 0 0 0 0 0 0 0.03 0 0 0 0 0 0 0 0 0 0 0 0 0 0 0 0 0 0 0 0 
##$DATE= 1759399667
##$DBL= (0..7)
120 120 120 120 120 120 120 120 
##$DBP= (0..7)
150 150 150 150 150 150 150 150 
##$DBP07= 0
##$DBPNAM0= <>
##$DBPNAM1= <>
##$DBPNAM2= <>
##$DBPNAM3= <>
##$DBPNAM4= <>
$$ [...]
##$SUBNAM3= <"">
##$SUBNAM4= <"">
##$SUBNAM5= <"">
##$SUBNAM6= <"">
##$SUBNAM7= <"">
##$SUBNAM8= <"">
##$SUBNAM9= <"">
##$SW= 18.0517328524113
##$SWIBOX= (0..15)
0 0 2 0 0 0 0 0 0 0 0 0 0 0 0 0 
##$SW_h= 3612.71676300578
##$TD= 16384
##$TD0= 1
##$TE= 0
##$TE2= 300
##$TE3= 300
##$TEG= 300
##$TL= (0..7)
0 120 120 120 120 120 120 120 
##$TP= (0..7)
150 150 150 150 150 150 150 150 
##$TP07= 0
##$TPNAME0= <>
##$TPNAME1= <>
##$TPNAME2= <>
##$TPNAME3= <>
##$TPNAME4= <>
##$TPNAME5= <>
##$TPNAME6= <>
##$TPNAME7= <>
##$TPOAL= (0..7)
0.5 0.5 0.5 0.5 0.5 0.5 0.5 0.5 
##$TPOFFS= (0..7)
0 0 0 0 0 0 0 0 
##$TUNHIN= 0
##$TUNHOUT= 0
##$TUNXOUT= 0
##$USERA1= <user>
##$USERA2= <user>
##$USERA3= <user>
##$USERA4= <user>
##$USERA5= <user>
##$V9= 5
##$VALIST= <valist>
##$VCLIST= <CCCCCCCCCCCCCCC>
##$VD= 0
##$VDLIST= <DDDDDDDDDDDDDDD>
##$VPLIST= <PPPPPPPPPPPPPPP>
##$VTLIST= <TTTTTTTTTTTTTTT>
##$WBST= 1024
##$WBSW= 4
##$XGAIN= (0..3)
0 0 0 0 
##$XL= 0
##$YL= 0
##$YMAX_a= 266914
##$YMIN_a= -422212
##$ZGOPTNS= <>
##$ZL1= 120
##$ZL2= 120
##$ZL3= 120
##$ZL4= 120
##$ABSF1= 15.49568
##$ABSF2= -2.55617
##$ABSG= 5
##$ABSL= 3
##$ALPHA= 0
##$AQORDER= 0
##$ASSFAC= 0
##$ASSFACI= 0
##$ASSFACX= 0
##$ASSWID= 0
##$AUNMP= <proc_1d>
##$AZFE= 0.1
##$AZFW= 0.1
##$BCFW= 0
##$BC_mod= 2
##$BYTORDP= 0
##$COROFFS= 0
##$CY= -3
##$DATMOD= 1
##$DC= 0
##$DFILT= <>
##$DTYPP= 0
##$F1P= 0
##$F2P= 0
##$FCOR= 1
##$FTSIZE= 16384
##$FT_mod= 6
##$GAMMA= 0
##$GB= 0
##$INTBC= 1
##$INTSCL= 3.241238e-09
##$ISEN= 128
##$LB= 0.25
##$LEV0= 0
##$LPBIN= 0
##$MAXI= 10000
##$MC2= 0
##$MEAN= 0
##$ME_mod= 0
##$MI= 1.114404
##$NCOEF= 0
##$NC_proc= -8
##$NLEV= 6
##$NOISF1= 3.799351
##$NOISF2= 2.8
##$NSP= 0
##$NTH_PI= 0
##$NZP= 0
##$OFFSET= 15.36126
##$PC= 1
##$PHC0= -1914.114
##$PHC1= 10.19225
##$PH_mod= 1
##$PKNL= yes
##$PPARMOD= 0
##$PSCAL= 0
##$PSIGN= 0
##$REVERSE= no
##$SF= 200.130032110116
##$SI= 16384
##$SIGF1= 3
##$SIGF2= 2
##$SINO= 0.751879
##$SIOLD= 32768
##$SREGLST= <19F.Aceton>
##$SSB= 0
##$STSI= 16384
##$STSR= 0
##$SW_p= 3612.71676300578
##$SYMM= 0
##$S_DEV= 0
##$TDeff= 16384
##$TDoff= 0
##$TI= <>
##$TILT= no
##$TM1= 0
##$TM2= 0
##$TOPLEV= 0
##$USERP1= <user>
##$USERP2= <user>
##$USERP3= <user>
##$USERP4= <user>
##$USERP5= <user>
##$WDW= 1
##$XDIM= 16384
##$YMAX_p= 416154921
##$YMIN_p= -2145478
$$ End of Bruker specific parameters
$$ ---------------------------------
##NTUPLES= NMR SPECTRUM
##VAR_NAME=  FREQUENCY,     SPECTRUM/REAL,   SPECTRUM/IMAG
##SYMBOL=    X,             R,               I
##VAR_TYPE=  INDEPENDENT,   DEPENDENT,       DEPENDENT
##VAR_FORM=  AFFN,          ASDF,            ASDF
##VAR_DIM=   16384,         16384,           16384
##UNITS=     HZ,            ARBITRARY UNITS, ARBITRARY UNITS
##FACTOR=    0.220516191357247, 1,           1
##FIRST=     3074.2495399304, 0,             0
##LAST=      -538.467223075384, 0,           0
##MIN=       -538.467223075384, -2145478,    0
##MAX=       3074.2495399304, 416154921,     0
$$ Real data points
##PAGE= N=1
##DATA TABLE= (X++(R..R)), XYDATA
$$ [...]
7404A570094j03405j6026J44187q837J05482j20855J69045n7712q3506j21491
7394A476976L90058L74475M8336l9712J88258N8056J24348k5102l8617k88052
7384B269024k86906N4350n8026Q98861l66179l55229O47027l90434m81494J82138
7374B113132J00732m82210K62550P97506k3088n87846L37678R4204m49916N10351
7364B673093J59843j26749n61392k3031J71909J30176O92545j64717J32983j92866
7354B891794k25671K41173K49628M8919m16262j59340J31601l83897j7580R0475
7344B450840J08513K2191L25030O20030k47109j28435k99744J43772N850q9653
7334B911285l76664l55129O5717R3125K47020p3823l02093l97867K76759N56977
$$ plain form
7404 1570094 1466689 1450663 1594850 1586013 1691495 1570640 1739685 1681973 1598467 1476976
7394 1476976 1867034 2241509 2289845 2250133 2438391 2496447 2620795 2595693 2557076 2269024
7384 2269024 1982118 2036468 1978442 2877303 2511124 2155895 2802922 2412488 1930994 2113132
7374 2113132 2213864 1731654 1994204 2791710 2768622 2180776 2518454 2612658 2162742 2673093
7364 2673093 2832936 2706187 2144795 2121764 2293673 2423849 3116394 2951677 3084660 2891794
7354 2891794 2666123 2907296 3156924 3205843 2789581 2630241 2761842 2377945 2360365 2450840
7344 2450840 2559353 2581544 2906574 3526604 3279495 3151060 2851316 2995088 3000938 2911285
7334 2911285 2534621 2179492 2245209 2338334 2585354 2511531 2209438 1811571 2088330 2645307
7324B645307K23494l83069L67557l67803l28934l11843L30501K26278L58906n23850
7314B236544J22541k85414l28806J88001l02649P20202N7539j09123J99104Q7311
7304B585250k33004j12620k77870M80650k66868m58391K4043K15900O2023j25392
7294A893721N9742L49909k65991l07069q3532m5737K38091N61871M74188m45222
7284B429971J31371k28074k61835K85186k86245K18289j1075j01894n1541j57750
7274A966403l0571L66268j9956j62397o67739L95302K07147O9155R9577K74694
7264B497883K74418K71647l82692k28504P2879m3668q9665R3772J97915L79704
7254C043689M69907p2001r8056m78930l92587L80777K02035Q7556J96051L62770
$$ plain form
7324 2645307 2868801 2485732 2853289 2485486 2156552 1844709 2175210 2401488 2760394 2236544
7314 2236544 2359085 2073671 1744865 1932866 1630217 2350419 2407958 2298835 2497939 2585250
7304 2585250 2352246 2239626 1961756 2442406 2175538 1717147 1741190 1957090 2019113 1893721
7294 1893721 1953463 2303372 2037381 1730312 1646780 1601043 1839134 2401005 2875193 2429971
7284 2429971 2561342 2333268 2071433 2356619 2070374 2288663 2277588 2175694 2124153 1966403
7274 1966403 1935832 2302100 2282144 2119747 1452008 1847310 2054457 2123612 2223189 2497883
7264 2497883 2772301 3043948 2661256 2432752 2505631 2461963 2372298 2466070 2663985 3043689
7254 3043689 3513596 3441595 3343539 2864609 2472022 2852799 3054834 3142390 3338441 3701211
7244C701211L28071l0841p0244P9675K05160J28448J67375Q7955o69825J08147
7234D035132j83436J37465k35782R9986K72319j26534N90734l78110l84438L40987
7224D168323K40526r8587Q9394M1279j76649J97815j07627J32649n29045M52462
7214D410540k83584l45708O98788m9606m48233J60768L85865l04411j41586N33223
7204D616056J93148n72419Q3838J0176R5082k78673l10829J2408M60622J5086
7194D324495o3580m01326J28927j75378o8431m67552J7020L67491J4966j07776
7184C568856N30359j39728k93508N3585O0313K91583k21761j57721L00588O3335
7174D055901K00104n60090k0979o9848r382O92665K03834q3299m30250j78191
$$ plain form
7244 3701211 4029282 3998441 3928197 4007872 4213032 4341480 4508855 4596810 3926985 4035132
7234 4035132 3851696 3989161 3753379 3853365 4125684 3999150 4589884 4211774 3827336 4168323
7224 4168323 4408849 4310262 4399656 4440935 4264286 4462101 4354474 4487123 3958078 4410540
7214 4410540 4126956 3781248 4480036 4430430 3982197 4142965 4528830 4224419 4082833 4616056
7204 4616056 4809204 4236785 4320623 4330799 4425881 4147208 3836379 3848787 4309409 4324495
7194 4324495 4260915 3859589 3988516 3813138 3744707 3277155 3294175 3661666 3676632 3568856
7184 3568856 4099215 3959487 3665979 3719564 3779877 4071460 3849699 3691978 3992566 4055901
7174 4055901 4256005 3695915 3674936 3605088 3595706 4288371 4492205 4408906 3978656 3800465
7164C800465L28497J08510J70522j81661K19060n03707J03240k08307K53082K2591
7154D112292J31826l25207L81054J05978j42428l00327J11819K25329j62898M04794
7144D542232k1133m4545r1314K37634q3343L23281M75474k85250p23628L5328
7134D364736K56427K73506k04801J09308l34374O9279O00302P96064N7843k11139
7124E777151o00542K9591P0282L5964L59436M39511q3331q3319J22228l41713
7114E725258K37785o2413M2812J72209o65512j42001Q3566k14727K905k59652
7104D920230L00584M24661o89038J60233K67407k09572K25382j34121k15492O44981
7094E695255L8624m83729q0118J67512L02140j52724o36770M70187q1062L891
$$ plain form
7164 3800465 4128962 4237472 4407994 4226333 4445393 3941686 4044926 3836619 4089701 4112292
7154 4112292 4244118 3918911 4299965 4405943 4263515 3963188 4075007 4300336 4137438 4542232
7144 4542232 4521099 4476554 4385240 4622874 4539531 4862812 5338286 5053036 4329408 4364736
7134 4364736 4621163 4894669 4689868 4799176 4464802 4534081 5134383 5930447 5988290 5777151
7124 5777151 5176609 5206200 5276482 5312446 5671882 6111393 6028062 5944743 6066971 5725258
7114 5725258 5963043 5900630 5943442 6115651 5450139 5308138 5391704 5176977 5179882 4920230
7104 4920230 5220814 5645475 4956437 5116670 5384077 5174505 5399887 5265766 5050274 5695255
7094 5695255 5733879 5250150 5170032 5337544 5639684 5486960 4850190 5320377 5239315 5243206
7084E243206J1175R6569n20614o07064L62001L38797J37288q7074r1933J90828
7074E073179J78977l12316L81302M24620j15910j93201l6545p9278j00788N38150
7064E758190j90315m73975R0279K85277k32371K12548J02474J86854k31987j61744
7054E345230J53554q496J74937K0728K66549k70239j75282K41955n3639l77776
7044E317521J70658K96746J09335j22857l43658L44852J32349k16353J53494n84508
7034E257579K59237J85941K23448k38866r4447m29763m38338J02424J94374L7780
7024E059369L2153Q9951l15143J91877k31322L72626o92191k90105K8604L40614
7014D586433O08659L29003j11738j70038J9252j71721q1497j45621J45316K20256
$$ plain form
7084 5243206 5254381 5350950 4830336 4223272 4585273 4924070 5061358 4974284 4882351 5073179
7074 5073179 5252156 4939840 5321142 5745762 5629852 5436651 5400106 5320828 5220040 5758190
7064 5758190 5567875 5093900 5184179 5469456 5237085 5449633 5552107 5738961 5506974 5345230
7054 5345230 5498784 5490288 5665225 5685953 5952502 5682263 5506981 5748936 5695297 5317521
7044 5317521 5488179 5784925 5894260 5771403 5427745 5772597 5904946 5688593 5842087 5257579
7034 5257579 5516816 5702757 5926205 5687339 5592892 5163129 4724791 4827215 5021589 5059369
7024 5059369 5091522 5181473 4866330 5058207 4826885 5199511 4507320 4217215 4245819 4586433
7014 4586433 5195092 5524095 5412357 5242319 5261571 5089850 5008353 4862732 5008048 5228304
7004E228304K28568l12081o6826J7947l85247m62783N32778j84745m62975K60185
6994D393125J9696k32711R1111J27584j34436J90729m35141L5364J1200J4467
6984D080988m05915j40725K6372j50777N75453L03887m56077p59616J68454L00748
6974C542792k39699k25578R5871m6495N0000K21670L30419l01671j6186K87626
6964C698749J36219P6405J84560p67926J71222q3378L70615O9954n97283K75445
6954C534582l78061l17362L11707K29212M00340k69467M27274l47636l22946Q8291
6944C355934m9349N15526L86491K5509j64651J32368L7798M67171J99888J1051
6934D917736j70877J06444L29019K22014k02285l14048K52784R1025n32066j93631
$$ plain form
7004 5228304 5456872 5144791 5077965 5095912 4710665 4247882 4780660 4595915 4132940 4393125
6994 4393125 4412821 4180110 4271221 4398805 4264369 4455098 4019957 4055321 4066521 4080988
6984 4080988 3675073 3534348 3560720 3409943 3985396 4289283 3833206 3073590 3242044 3542792
6974 3542792 3303093 3077515 3173386 3126891 3176891 3398561 3728980 3427309 3411123 3698749
6964 3698749 3834968 3911373 4095933 3328007 3499229 3415851 3786466 3856420 3259137 3534582
6954 3534582 3156521 2839159 3150866 3380078 3780418 3510951 3938225 3590589 3267643 3355934
6944 3355934 3306585 3822111 4208602 4234111 4069460 4201828 4239626 4706797 4906685 4917736
6934 4917736 4746859 4853303 5182322 5404336 5202051 4888003 5140787 5231812 4699746 4506115
6924D506115j8177J20256M01579k97294L54677J97033k67907j90355m52511n8153
6914D295263l68600k33597J10683N13295L18135p7813m84742J65461M6661l47077
6904C937669L55881M70892R1522L70864J11811k48606n2073K11598M54631l4779
6894E669410m74377l38555r5180M34019j35246K40621k0491J14212N36243m54729
6884E475927L12363K03432n28386K80656L33119J4728K48235l14656J16677K11324
6874F353419j22987k54656J88956O11287K99448J61389l34955J10141J94418P1660
6864G278120q84375J44697M86299M74189J38720o0495L38522m74219l39012K57568
6854G360014Q9125n4802k32926J37117N94249l06226K63397K85592K10583j59089
$$ plain form
6924 4506115 4487938 4608194 5009773 4712479 5067156 5264189 4996282 4805927 4353416 4295263
6914 4295263 3926663 3693066 3803749 4317044 4635179 4557366 4072624 4238085 4284746 3937669
6904 3937669 4293550 4764442 4855964 5226828 5338639 5090033 5037960 5249558 5704189 5669410
6894 5669410 5195033 4856478 4761298 5195317 5060071 5300692 5280201 5394413 5930656 5475927
6884 5475927 5788290 5991722 5463336 5743992 6077111 6091839 6340074 6025418 6142095 6353419
6874 6353419 6230432 5975776 6164732 6776019 7075467 7236856 6901901 7012042 7206460 7278120
6864 7278120 6393745 6538442 7024741 7498930 7637650 7577155 7915677 7441458 7102446 7360014
6854 7360014 7449139 7394337 7161411 7298528 7892777 7586551 7849948 8135540 8346123 8187034
6844H187034j24233m39988l4624K36427j45936o6792l4302R5783p7955K17210
6834G812624J30077L55141m19325N41486k42455m70206P83611j99439m81648j64889
6824G644977K36411r1486J67805k85272p1311K13824j26311j15309p2281j09730
6814G391317l70912O70125K32306k23061j04087J23286M29383j57699j39181k43873
6804G607604Q1148j14688j50317J90339K81026K04225q11545m54630j23829M8386
6794F757719K44183o6952J3442L12496q3001o49318K00879J95422k63838j06851
6784F554181k11194M1983J2913N84571K94013o5425n31678J68027M36734n01721
6774F782404n02614N57262J95834p7753L50850j35073j75617J41368p7337m11999
$$ plain form
6844 8187034 8062801 7622813 7588189 7824616 7678680 7611888 7577586 7673369 7595414 7812624
6834 7812624 7942701 8297842 7878517 8420003 8177548 7707342 8490953 8291514 7809866 7644977
6824 7644977 7881388 7789902 7957707 7672435 7601124 7814948 7688637 7573328 7501047 7391317
6814 7391317 7020405 7690530 7922836 7699775 7595688 7718974 8148357 7990658 7851477 7607604
6804 7607604 7688752 7574064 7423747 7614086 7895112 8099337 7287792 6833162 6709333 6757719
6794 6757719 7001902 6934950 6948392 7260888 7177887 6528569 6729448 6924870 6661032 6554181
6784 6554181 6342987 6384970 6397883 6982454 7276467 7211042 6679364 6847391 7284125 6782404
6774 6782404 6279790 6837052 7032886 6955133 7305983 7170910 6995293 7136661 7059324 6647325
6764F647325j26640L16762M28824n3711l35748J0521J09683j64159J31944J57798
6754G122599J79456l93303M00702k28508M43334L4888m13013K06851K23082m3232
6744G532856M66298J8428r1238N05776j4512o94045k66626M23352P8641l81112
6734G577818K59092k80270J68738K78924n31619k25680J4252Q1978L96834J13371
6724G853438j93133K57664n6678j21686L6597m23386j96969J98626L20148J82537
6714G857158k40405l72961k35192J78557J92566N49637j3114K91872j86192j97744
6704G824182j76927J57101j00570k798N3684M23568J49336K86153l2514k58291
6694H322924p2717l68201M36552P12715K67460l67831K16232J81152L80194K79534
$$ plain form
6764 6647325 6520685 6837447 7266271 7212560 6876812 6887333 6997016 6832857 6964801 7122599
6754 7122599 7302055 6908752 7309454 7080946 7524280 7559168 7146155 7353006 7576088 7532856
6744 7532856 7999154 8017582 7926344 8432120 8417608 7723563 7456937 7880289 7958930 7577818
6734 7577818 7836910 7556640 7725378 8004302 7472683 7247003 7261255 7343233 7740067 7853438
6724 7853438 7660305 7917969 7861291 7739605 7776202 7352816 7155847 7354473 7674621 7857158
6714 7857158 7616753 7243792 7008600 7187157 7379723 7929360 7916246 8208118 8021926 7824182
6704 7824182 7647255 7804356 7703786 7700988 7754672 8178240 8327576 8613729 8581215 8322924
6694 8322924 8250207 7882006 8318558 9031273 9298733 8930902 9147134 9328286 9708480 9988014
6684I988014j4225k56036o0794J33358j16990q3459m62479l92976J50283N13640
6674I398336M7438k71364L87515k2805K10735J66762M1956L2679L79135M2716
6664A0413103p965k11934n54189J0332k8595L53856J06272m6641l58803l4178
6654I641258j44623k30957k13435M90896M17307l68667r9837m0025k16395J10261
6644I345783r9631J28430P9107j23129K2141n14990l02623m72455L81259M53275
6634H897167k6878R7280L54894k30574j16880K01173q0554m55580n89004N8248
6624H109292J72502K74744J14522K01189K9705j44716j1677J93543m78619l16705
6614H143780l9209L11762O22178l18245m18389n2340M9890L12891k3079N21155
$$ plain form
6684 9988014 9973789 9717753 9656959 9790317 9673327 9589868 9127389 8734413 8884696 9398336
6674 9398336 9445774 9174410 9561925 9539120 9749855 9916617 9958573 9991252 10370387 10413103
6664 10413103 10405138 10193204 9639015 9649347 9620752 9974608 10080880 10034239 9675436 9641258
6654 9641258 9496635 9265678 9052243 9543139 9960446 9591779 9491942 9451917 9235522 9345783
6644 9345783 9246152 9374582 9453689 9330560 9352701 8837711 8535088 8062633 8443892 8897167
6634 8897167 8870289 8967569 9322463 9091889 8975009 9176182 9095628 8640048 8051044 8109292
6624 8109292 8281794 8556538 8671060 8872249 8901954 8757238 8745561 8939104 8460485 8143780
6614 8143780 8104571 8416333 9038511 8720266 8301877 8249537 8299427 8612318 8589239 9110394
6604I110394p66972L14354J6471j39851Q1394m9917L39132K96738R8504m59990
6594H840257K65181R1304k00964k07689K31460P49004K03436l81680j93341k86766
6584I110202k71992L87888J68621N26941m1311l22267L45114m8787M70455j330
6574A0323534J8825l90486J76114l83493N60206N23819p1101j07729j9958Q2451
6564A0712182R4141j64249J25976J18349o17605L1447o3035l8978R6131L48782
6554A0643141Q523J28617N59868l35404k41080M81080J88730K75819j28309n75266
6544A1005719N66667M5441K8465N94278K67944l84051J96448J69088J11658m57125
6534A2144532l08290P8237O30490K64293j07594M19622n223j36793N13725L93789
$$ plain form
6604 9110394 8343422 8657776 8674247 8534396 8615790 8565873 8905005 9201743 9300247 8840257
6594 8840257 9105438 9196742 8995778 8788089 9019549 9768553 9971989 9590309 9396968 9110202
6584 9110202 8838210 9226098 9394719 9921660 9880349 9558082 9903196 9854409 10324864 10323534
6574 10323534 10342359 9951873 10127987 9744494 10304700 10828519 10757418 10649689 10629731 10712182
6564 10712182 10806323 10642074 10768050 10886399 10268794 10300241 10237206 10198228 10294359 10643141
6554 10643141 10651664 10780281 11340149 11004745 10763665 11244745 11433475 11709294 11580985 11005719
6544 11005719 11572386 11617827 11646292 12240570 12508514 12124463 12320911 12489999 12601657 12144532
6534 12144532 11836242 11914479 12544969 12809262 12701668 13121290 13116067 12979274 13492999 13886788
6524A3886788J76127R0488P77572P24898o8277L17877R0176N04355J82882J85958
6514A6868844R46224N50230J07906Q25014M50185R72552P48975K01229J047053
6505B2718212J146873K69465O86317J695288J206282J166906J168594Q17140J093343
6496C1968420R48337J568749J806395J665725J211332J245504J378432K408067
6488D4200961J139313J135589J212294J976030J956945J490016J736216K305454
6480E7152818J954563J645475K547563K447465K403438K471202L160285L412459
6472G7195268L207766K770195K701919L136821L539310L058499K759117L290936
6464A01659831L154659L146946K560997K133532K425771K449281J833931J172447
$$ plain form
6524 13886788 14062915 14153403 14930975 15655873 15587596 15905473 15995649 16500004 16682886 16868844
6514 16868844 17815068 18365298 18473204 19298218 19748403 20720955 21469930 21671159 22718212
6505 22718212 23865085 24134550 24820867 26516155 27722437 28889343 30057937 30875077 31968420
6496 31968420 32916757 34485506 36291901 37957626 39168958 40414462 41792894 44200961
6488 44200961 45340274 46475863 47688157 49664187 51621132 53111148 54847364 57152818
6480 57152818 59107381 60752856 63300419 65747884 68151322 70622524 73782809 77195268
6472 77195268 80403034 83173229 85875148 89011969 92551279 95609778 98368895 101659831
6464 101659831 104814490 107961436 110522433 112655965 115081736 117531017 119364948 120537395
6456A20537395J559140J601441K216654K152317K755046K668468L253964L133495
6448A39877920L231321L236949L282034L746482L436765L044515L230793K642704
6440A65729483K424894K258141J313014R44939N14353p92631j615222j431349
6432A69345622j242292p47539n9901k44755R83791J646472J845634K764527L105424
6423A77396983L846159M367955M221789L813422L199150K585381K258258J704514
6415B03393611P89217J39555L57465j269106j098768j723342j304086p63121n86742
6406A97934683p40171k31636Q76189R25040J079373O93481J638838J481050J628273
6397B05285120J442884J900474K524922K002208J729255J888933J191057M5045
$$ plain form
6456 120537395 122096535 123697976 125914630 128066947 130821993 133490461 136744425 139877920
6448 139877920 143109241 146346190 149628224 153374706 156811471 159855986 163086779 165729483
6440 165729483 168154377 170412518 171725532 172670471 173184824 172392193 170776971 169345622
6432 169345622 168103330 167355791 167295890 167051135 168034926 169681398 171527032 174291559 177396983
6423 177396983 181243142 185611097 189832886 193646308 196845458 199430839 201689097 203393611
6415 203393611 204182828 204322383 204679848 203410742 202311974 200588632 199284546 198521425 197934683
6406 197934683 197194512 196962876 197839065 198764105 199843478 200536959 202175797 203656847 205285120
6397 205285120 206728004 208628478 211153400 213155608 214884863 216773796 217964853 218009898
6389B18009898j7961n60931j215934j442087j902238k260890k086078j870148
6381B06653631j334239j637968j307499j79005m75804M44884N83054Q15172N80218
6372B04142444J061962Q62294N07624m03200o78668j145201j923814j588790j885143
6363A98949508k353544k527547j742985j493084k232830j385798j018944j319494
6355A84875282m55515p49747n96269o45959o51882j224943r81267r63385p94156
6346A77812159j738508j298856r79222j801161r92489r84078r69747j519386j439264
6337A66089448j567157j839706j151123j378000p76044j181487j797674j085732
6329A55312525j392726q25369j257611j077355j088788r45937j554773j239494
$$ plain form
6389 218009898 217991937 217431006 216215072 214772985 212870747 210609857 208523779 206653631
6381 206653631 205319392 203681424 202373925 202194920 201719116 202164000 202747054 203562226 204142444
6372 204142444 205204406 206066700 206574324 206171124 205492456 204347255 202423441 200834651 198949508
6363 198949508 196595964 194068417 192325432 190832348 188599518 187213720 186194776 184875282
6355 184875282 184419767 183670020 183073751 182427792 181775910 180550967 179569700 178606315 177812159
6346 177812159 176073651 174774795 173795573 171994412 171001923 170017845 169048098 167528712 166089448
6337 166089448 164522291 162682585 161531462 160153462 159377418 158195931 156398257 155312525
6329 155312525 153919799 153094430 151836819 150759464 149670676 148724739 147169966 145930472
6321A45930472n84667p26724q54655j153407o58155j588281q77479j170286p93689
6312A37523129m83260r10433j351282n69461q78980r40445o34933o259o61706
6303A31086370q50139n40484L4589p84994j514048l33943j37666l64545o66033
6294A25929107r40565j369967m59781m17737l47973j524081r08117q59761r72603
6285A18128522j074312j098733p22840j506761r60662q01258j367114j363950
6277A09232892q96717j487782j071944o35238j507830j999843j083553j596281
6269I8953704j330241q95312j680501j096263j457950k003285k034258j493731
6261H6962163j205051r58410j454399j230403j606447j137351q88556k017437
$$ plain form
6321 145930472 145345805 144619081 143764426 142611019 141952864 140364583 139487104 138316818 137523129
6312 137523129 137039869 136129436 134778154 134208693 133329713 132389268 131754335 131748076 131086370
6303 131086370 130236231 129695747 129730336 128945342 127431294 127097351 126959685 126595140 125929107
6294 125929107 124988542 123618575 123158794 122741057 122393084 120869003 119960886 119101125 118128522
6285 118128522 117054210 115955477 115232637 113725876 112765214 111963956 110596842 109232892
6277 109232892 108336175 106848393 105776449 105141211 103633381 101633538 100549985 98953704
6269 98953704 97623463 96728151 95047650 93951387 92493437 90490152 88455894 86962163
6261 86962163 85757112 84798702 83344303 82113900 80507453 79370102 78481546 76464109
6253G6464109j234898j164774j053615j729427j414970j136546j687579j190984
6245F5851316j220248j370657j234376n55154j350546j241613j688268j221680
6237E5968774p92220j051497j119553j006043r91452j241545j275698j047039
6229D7443727j035443j153507p81378j314673j092009p37308l21777j326398j612273
6220C8068961q67749r88717j193344m36872j95604r76139j165449p24051N2226
6211C1573262n02747o98599m67077o97225p58461j438021k25716p88057r55057
6202B5042302N2684l66873l07777k88342n74837o01338l99546o40220l66971j79134
6192B1369948n54402o45133o98130k84177p21947p93715L92614k30603n66654
$$ plain form
6253 76464109 75229211 74064437 73010822 71281395 69866425 68729879 67042300 65851316
6245 65851316 64631068 63260411 62026035 61470881 60120335 58878722 57190454 55968774
6237 55968774 55176554 54125057 53005504 51999461 51008009 49766464 48490766 47443727
6229 47443727 46408284 45254777 44473399 43158726 42066717 41329409 41007632 39681234 38068961
6220 38068961 37201212 36212495 35019151 34582279 34386675 33410536 32245087 31521036 31573262
6211 31573262 31070515 30371916 29904839 29207614 28449153 27011132 26785416 25997359 25042302
6202 25042302 25094986 24728113 24420336 24131994 23557157 22955819 22556273 21916053 21549082 21369948
6192 21369948 20815546 20170413 19472283 19188106 18466159 17672444 18065058 17834455 17267801
6183A7267801k95600M10033l83992m97284J88592L23954j28218l20853p78292
6174A5786141k77416j84923K14004j53817n73076j83406m4769k81981m3110n04510
6164A3753137o12098k22735R1061N26047j66635J07181m58459m01969m44739l64403
6154A1806388M09377P5269M88012l07532j60139J06947j45954L3406J27332p11465
6144A1721641j91414K63768k94495j79056J96999q29n74362K69909j55351L66262
6134A1423072k81396j65169j25868P41120L14L1906j25122k63957k20508n33797
6124A0480595q4684K57106J04183L64780p5274k68433q5311K72985J28501l46883
6114A0747565R8520R3684J77414M2971M44964l6403J88264N20355l22188k03417
$$ plain form
6183 17267801 16972201 17382234 16998242 16500958 16689550 17013504 16885286 16564433 15786141
6174 15786141 15508725 15323802 15537806 15383989 14810913 14627507 14582738 14300757 14257647 13753137
6164 13753137 13141039 12918304 13009365 13535412 13368777 13475958 13017499 12615530 12170791 11806388
6154 11806388 12215765 12291034 12779046 12471514 12311375 12418322 12272368 12305774 12433106 11721641
6144 11721641 11530227 11793995 11499500 11320444 11517443 11516614 10942252 11212161 11056810 11423072
6134 11423072 11141676 10976507 10850639 11591759 11592073 11623979 11498857 11234900 11014392 10480595
6124 10480595 10395911 10653017 10757200 11121980 11046706 10778273 10692962 10965947 11094448 10747565
6114 10747565 10846085 10939769 11117183 11160154 11605118 11568715 11756979 12277334 11955146 11751729
6104A1751729K83185k32163j43350j84187P60625L31023o04775K9764k15585J72880
6094A1949146J81006r23497m15125J18531N24949K21479l77803k23860k86654
6085A0768172L81857L3606J10153M07488j7132j68721K72932J68729l38371K77292
6075A1896005K02373k45850L53497m03413r37608j25123P3642J44592j9938k42504
6065A0695673M16639M86861j75286m41605j22795L73636j30439j74410l22194
6056A0606080j90754M27871P2K71630k9396J75748n35162n21299M11907j87045
6046A0429652l8022M80796K4353L1869j1784K62201l81538p7377j8925k94601
6036A0406624M11075n2455M02250k50591n73689J14807R62667m1646m75536j64716
$$ plain form
6104 11751729 12034914 11802751 11659401 11475214 12235839 12566862 11962087 11991851 11776266 11949146
6094 11949146 12130152 11206655 10791530 10910061 11435010 11656489 11278686 11054826 10768172
6085 10768172 11150029 11183635 11293788 11701276 11684144 11515423 11788355 11957084 11618713 11896005
6075 11896005 12098378 11852528 12206025 11802612 10865004 10739881 10813523 10958115 10938177 10695673
6065 10695673 11112312 11599173 11423887 10982282 10859487 11233123 11102684 10928274 10606080
6056 10606080 10415326 10843197 10843269 11114899 11085503 11261251 10726089 10204790 10616697 10429652
6046 10429652 10391630 10872426 10896779 10928648 10916864 11179065 10797527 10720150 10701225 10406624
6036 10406624 10817699 10765244 11167494 10916903 10343214 10458021 11420688 11379042 10903506 10738790
6026A0738790K04385k82176K24399k42416J5563K35226K65619L09654l37321k77832
6016A0853891j88013K34902L6355K88167O55629J1044n80983j85971j4988q9361
6006A1020672J81873k64708o34949O18681K3303M75893j4373R1545j21261p46686
5996A0629990N250L03680J87563J79597j04759J5095k07739l16544k87330k20111
5986A0184692K2067J94545K61565L36133N3821k57057N7750m08820N29391m75071
5976A0499016m5334J03867J89877J59290l11571m43136Q1204J3190K20250m80584
5966I986069N8229O2973n2228l1135j24918L3241j67245l58495j6389K99001L87525
5955A0076628O63373k4960l54167p44243J97663M43499q2979J17464m69385l65662
$$ plain form
6026 10738790 10943175 10660999 10885398 10642982 10658545 10893771 11159390 11469044 11131723 10853891
6016 10853891 10665878 10900780 10937135 11225302 11880931 11891975 11310992 11125021 11110033 11020672
6006 11020672 11202545 10937837 10302888 10921569 10944872 11420765 11406392 11497937 11376676 10629990
5996 10629990 10635240 10938920 11126483 11306080 11201321 11216416 11008677 10692133 10404803 10184692
5986 10184692 10206759 10401304 10662869 10999002 11052823 10795766 10853516 10444696 10974087 10499016
5976 10499016 10453682 10557549 10747426 10906716 10595145 10152009 10233213 10246403 10466653 9986069
5966 9986069 10044298 10107271 10055043 10023908 9898990 9932231 9764986 9406491 9390102 9689103 10076628
5955 10076628 10740001 10715041 10360874 9616631 9814294 10257793 10174814 10292278 9822893 9457231
5945I457231m6744O07673J21215K86241j49132l83596r84362K18768N63068J67823
5935I858185M96634j03457M977l11686N39399N0749J10239K20000j98724m38502
5925A0227814j97182p9326M57882n29824M9929J33402L31751p0065k5219j73326
5915A0125836J86078K01764m48480n17206Q7443K34348O7006k34136K88249n6184
5905I934718j39502O41384O7022R7158L0253k92298l50470j58145m09978J04459
5895I524601L48731j28103l98982j73806M16194K683m73102k70573o3399l66630
5885H417614O39269J62089j02424J5769L15605n7562n23950Q8254R025o5546M37318
5874I335461l56293k56741P1323K37255k78682j89254l60506M38157J33956L32199
$$ plain form
5945 9457231 9410487 10018160 10139375 10425616 10276484 9892888 8908526 9127294 9690362 9858185
5935 9858185 10354819 10251362 10256339 9944653 10484052 10534801 10645040 10865040 10666316 10227814
5925 10227814 10030632 9951306 10409188 9879364 9929293 10062695 10394446 10324381 10299162 10125836
5915 10125836 10311914 10513678 10065198 9547992 9635435 9869783 9936789 9702653 9990902 9934718
5905 9934718 9795216 10436600 10503622 10600780 10631033 10338735 9988265 9830120 9420142 9524601
5895 9524601 9873332 9745229 9346247 9172441 9588635 9591318 9118216 8847643 8784244 8417614
5885 8417614 9056883 9218972 9116548 9132317 9447922 9390360 8866410 8954664 8963689 8898143 9335461
5874 9335461 8979168 8722427 8793750 9031005 8752323 8563069 8202563 8640720 8774676 9106875
5864I106875L39150m94425J50337j09952M51932K41749k01000j24513k61266m51950
5854H646937Q50771j76457m5243K55733k89486P3170k19152J21143N36857j36232
5844I618041K33875J0473m69332l08246R3362L66007M23733j6197j01986M50068
5834A0299798J50723j19682L70438j55740j60760N92507J94015k50748j83692
5825A0736859K9657L64900M45193j26530J49439L86683J53239R1583O614N81580
5815A2819217L0986l77146j76352L69268O90432O29726j66624K9458l97540K41860
5805A3693285K72483j50888L00774O40435K26629L8701Q7189J53312L04678J78336
5795A5744934K17064P001k48435Q17252K11298j63843L6322M86539P66731N03627
$$ plain form
5864 9106875 9446025 8951600 9101937 8991985 9443917 9685666 9484666 9360153 9098887 8646937
5854 8646937 9497708 9321251 9276008 9531741 9242255 9315425 9096273 9217416 9754273 9618041
5844 9618041 9851916 9862389 9393057 9084811 9178173 9544180 9967913 9951716 9849730 10299798
5834 10299798 10450521 10330839 10701277 10545537 10384777 10977284 11171299 10920551 10736859
5825 10736859 10766516 11131416 11576609 11450079 11599518 11986201 12139440 12231023 12237637 12819217
5815 12819217 12850203 12473057 12296705 12665973 13356405 13986131 13819507 13848965 13451425 13693285
5805 13693285 13965768 13814880 14115654 14756089 14982718 15021419 15108608 15261920 15566598 15744934
5795 15744934 15961998 15968999 15720564 16537816 16749114 16585271 16621593 17108132 17874863 18378490
5785A8378490K15530N94722K92643r4911N22809N06547M90941P96250L71410K29563
5775B2303994O24498M76636N92377P2727M90219J172682P43754J162810J161042
5766B8800739Q61459J260786J149528J340582R47619J405567J419562J310505
5758C8496347J811896J703420J632908K117528K685021K378043K542295L044857
5750E6412315K998095L197567M478663M001422L825770L997991M967040M958807
5742H8837670N141253N928217N926357N908504N704201O167277N919248N816341
5734A35349068N014241N714077N126770M458860L371913L456497K457445K355993
5726A67304864J715347J346664Q93063M25696N15832o6146k96501L36925M71444
$$ plain form
5785 18378490 18594020 19188742 19481385 19386474 19909283 20415830 20906771 21703021 22074431 22303994
5775 22303994 22928492 23405128 23997505 24070232 24560451 25733133 26476887 27639697 28800739
5766 28800739 29662198 30922984 32072512 33413094 34360713 35766280 37185842 38496347
5758 38496347 40308243 42011663 43644571 45762099 48447120 50825163 53367458 56412315
5750 56412315 59410410 62607977 67086640 71088062 74913832 78911823 83878863 88837670
5742 88837670 93978923 99907140 105833497 111742001 117446202 123613479 129532727 135349068
5734 135349068 140363309 146077386 151204156 155663016 159034929 162491426 164948871 167304864
5726 167304864 169020211 170366875 171259938 171685634 172201466 172135320 171838819 172175744 172647188
5717A72647188P96748Q59323J254528J480867J375943J955391J667554J669358
5709A83706900J895326J564789J118864J000476K65724k67896r39192j426847
5701A86918144k366269k610618k287063l227438l275951l291990k624164l050722
5693A64183929l556242k689577k415241k499925k155645k651530k204150k091921
5685A43919698k378713k256680k606402k985405k397931k531621k978935k401027
5677A23382984k066088j758638k848854k926345k079776j744428j973886k123082
5669A05861887k014831j520016j871890j750473j752781j704350j043511j325552
5661I2878483r94822j567502j565358n25472j562195j361916j469896j244851
$$ plain form
5717 172647188 173443936 174303259 175557787 177038654 178414597 180369988 182037542 183706900
5709 183706900 185602226 187167015 188285879 189286355 189552079 189284183 188344991 186918144
5701 186918144 184551875 181941257 179654194 176426756 173150805 169858815 167234651 164183929
5693 164183929 160627687 157938110 155522869 153022944 150867299 148215769 146011619 143919698
5685 143919698 141540985 139284305 136677903 133692498 131294567 128762946 125784011 123382984
5677 123382984 121316896 119558258 116709404 113783059 111703283 109958855 107984969 105861887
5669 105861887 103847056 102327040 100455150 98704677 96951896 95247546 94204035 92878483
5661 92878483 91883661 90316159 88750801 88225329 86663134 85301218 83831322 82586471
5653H2586471n65917j020310p62809r3081n50576p90709l20752J09605j61459
5644G8430463j4042J76740j032N59535J162446Q66449J93300M56696O70692Q96466
5634H3397713J429030J274935J052262P01515J311172J048921J324962J682700
5626I3223210J484956J295549J668183J127501P74405N04783J257557J039191
5618A02375335J089225J304726R02020M76112L47457L27052O40452P50480l04337
5609A07908522K0638L60205q6663p59410q02671l45410j002973j207551o92075
5600A03392612j040926q84081j144006j197209j721049j721723j734742j567995
5592I2380881r32850j355761j644694j699990j166045j369926j303820r74052
$$ plain form
5653 82586471 82020554 81000244 80237435 80144354 79593778 78803069 78482317 78591922 78430463
5644 78430463 78416421 78593161 78592129 79151664 80314110 81180559 81373859 81830555 82501247 83397713
5634 83397713 84826743 86101678 87153940 87855455 89166627 90215548 91540510 93223210
5626 93223210 94708166 96003715 97671898 98799399 99573804 100078587 101336144 102375335
5618 102375335 103464560 104769286 105671306 106147418 106494875 106821927 107462379 108212859 107908522
5609 107908522 107929160 108289365 108202702 107443292 106640621 106295211 105292238 104084687 103392612
5600 103392612 102351686 101467605 100323599 99126390 97405341 95683618 93948876 92380881
5592 92380881 91448031 90092270 88447576 86747586 85581541 84211615 82907795 81933743
5584H1933743j358791j214423j584188j312090j416870p13522j144919j067728
5576G2121212p91083j723167j411056n60933j406966p53986p25610j460069j299385
5567F1988957j507868n24110m80811o97508j560197j677621j614309j125810r72504
5558E1828219j284283j301217q56191j157927j211606j011109j597971q88487
5550D2519428j304661p62289q61511j337654r72412j143937j103218l10556j107252
5541C3615938r56784l90739n56064j520309j245048n87449o73377N6361k13549
5532B7528980n27860l14100o07927j049744n61628l32099o127q18442n95164k92478
5522B2423411n02156n19418K92888n01257j071074j06690j52126m63911k22724
$$ plain form
5584 81933743 80574952 79360529 77776341 76464251 75047381 74333859 73188940 72121212
5576 72121212 71330129 69606962 68195906 67634973 66228007 65474021 64748411 63288342 61988957
5567 61988957 60481089 59956979 59476168 58778660 57218463 55540842 53926533 52800723 51828219
5558 51828219 50543936 49242719 48386528 47228601 46016995 45005886 43407915 42519428
5550 42519428 41214767 40452478 39590967 38253313 37280901 36136964 35033746 34723190 33615938
5541 33615938 32659154 32268415 31712351 30192042 28946994 28359545 27686168 27742529 27528980
5532 27528980 27001120 26687020 26079093 25029349 24467721 24135622 24129495 23311053 22715889 22423411
5522 22423411 21921255 21401837 21694725 21193468 20122394 20015704 19863578 19399667 19176943
5513A9176943j21295p36164r1252J23996j79338m22397l29917j88676K3383j6353
5503A7238930j61441j86560R9991n562l91734l24716j72428l84184j053598k1633
5493A4637065J85222J64226m62740Q0753K46844l19238l74416j40424r1172p1067
5483A3855053R5454p71405j12486K83505n17620k89219M10201l55571k79484j18718
5473A2199710k8459r4852L57337K19808r4755l23265k12862Q7889K96528j3708
5463A2393371l16489m47781m10087R9521M80238J25691j95466j24783k12031q60076
5453A0532108Q0149L01193L81235j46450J73420K36433n74080J98749J81942o8477
5443A1296222J23239K29228n57077J50927p7340J10218m87587L1376r3717m5652
$$ plain form
5513 19176943 19055648 18319484 18228232 18352228 18172890 17750493 17420576 17231900 17255283 17238930
5503 17238930 17077489 16890929 16990920 16985358 16593624 16268908 16096480 15712296 14658698 14637065
5493 14637065 14822287 14986513 14523773 14604526 14851370 14532132 14157716 14017292 13926120 13855053
5483 13855053 13950507 13179102 13066616 13350121 12832501 12543282 12953483 12597912 12318428 12199710
5473 12199710 12171251 12076399 12433736 12653544 12558789 12235524 12022662 12110551 12407079 12393371
5463 12393371 12076882 11629101 11219014 11318535 11798773 11924464 11728998 11604215 11392184 10532108
5453 10532108 10612257 10913450 11294685 11148235 11321655 11558088 10984008 11182757 11364699 11296222
5443 11296222 11419461 11648689 11091612 11242539 11165199 11275417 10787830 10819206 10725489 10679837
5433A0679837J89497J85423J66021m9146j15325L383q1539q7899P1378l37248
5423A0624382J06392j18019N21651K27674o28412K16597M13631r6436l08221J74418
5413A1133657j35083k50109l99467r2205L40884J76268K20484k70378M1206l33865
5403A0431392J76703O34128q5172O6196o863m59204k32012j19481m89991M64059
5393A0379755N7270K98158J24942k63967K65713m9454l11105J42684Q3615j01243
5383A0626368K95283k7903k010l2890k33950l01443N50124M39894l24204n42948
5373A0446321N78839m3739l6840j2102l52866j20384l10062N36484M00116r5717
5363A0990050J03239j49303j65851M5127L65475p6406l98298L73933Q88507n4141
$$ plain form
5433 10679837 10869334 11054757 11220778 11171632 11056307 11059690 10978151 10890252 10961630 10624382
5423 10624382 10730774 10612755 11134406 11362080 10733668 10950265 11363896 11267460 10959239 11133657
5413 11133657 10998574 10748465 10348998 10256793 10597677 10773945 10994429 10724051 10765257 10431392
5403 10431392 10608095 11242223 11157051 11223247 11216384 10757180 10525168 10405687 9915696 10379755
5393 10379755 10437025 10735183 10860125 10596158 10861871 10812417 10501312 10643996 10727611 10626368
5383 10626368 10921651 10893748 10891738 10858848 10624898 10323455 10873579 11313473 10989269 10446321
5373 10446321 11025160 10981421 10944581 10932479 10579613 10459229 10149167 10685651 11085767 10990050
5363 10990050 11093289 10943986 10778135 10823262 11188737 11112331 10714033 11087966 11976473 11922332
5353A1922332k37486L0632K53762m4528l7233J00261J00631N19503J64222q47156
5343A1924940k16311L56335K84453j60040j45156O50688n3013j75030K21415j79300
5333A2508981k46462K47468J12573L3748n8787J90395L43353O40348k51539o3187
5323A3456891J93970L2566p33470n7236O49388K29575l0648J40447L88339k99002
5313A3970820j39017N65310J53195J12350l13569J26638K99823m5163j06059p5702
5303A4548626R7588l16440L43288r3390J64911K42967o7268J61287N8995L47170
5293A5487734m1858L01618M73304M10595j22782K55274L48613N9064K75951l7501
5283A7410012Q5495N44911j26587L20805L00085J05218P86344M50458L64821L25899
$$ plain form
5353 11922332 11684846 11715478 11969240 11924712 11887479 11987740 12088371 12607874 12772096 11924940
5343 11924940 11708629 12064964 12349417 12189377 12044221 12694909 12641896 12466866 12688281 12508981
5333 12508981 12262519 12509987 12622560 12656308 12597521 12787916 13131269 13771617 13520078 13456891
5323 13456891 13650861 13683427 12949957 12892721 13542109 13771684 13741036 13881483 14269822 13970820
5313 13970820 13831803 14397113 14550308 14662658 14349089 14475727 14775550 14730387 14624328 14548626
5303 14548626 14646214 14329774 14673062 14579672 14744583 14987550 14920282 15081569 15140564 15487734
5293 15487734 15445876 15747494 16220798 16631393 16508611 16763885 17112498 17171562 17447513 17410012
5283 17410012 17495507 18040418 17913831 18234636 18534721 18639939 19426283 19876741 20241562 20567461
5273B0567461N43637p8475Q9205M67517N01734O22660L22464K43045N15529Q58466
5263B4653243P27644N36585Q29190P0243J170985O96258R00730O87511J036800
5254C1309189R27366J037464J054238N00543O38408P16971N07329J32087K29735
5245C7053330l10919m69116l35320l08660l73165K55785n22436j21339Q20885
5236C5689045J68909J98019L57l75073M19844K80394J36909O51249P92420P72528
5226C8734601J49209N95266J50403n34165j04051k41778n56529p54763j359541
5217C6078652j264220p94899k29812n37645n32854J25810J17999j94774L79354
5208C3147611P75732l60916m84675p19375p35498j71309j64446p20582M25088
$$ plain form
5273 20567461 21111098 21032623 21121828 21589345 22091079 22713739 23036203 23279248 23794777 24653243
5263 24653243 25380887 25917472 26746662 26816905 27987890 28684148 29584878 30272389 31309189
5254 31309189 32236555 33274019 34328257 34828800 35467208 36184179 36691508 36823595 37053330
5245 37053330 36742411 36273295 35937975 35629315 35256150 35511935 34989499 34868160 35689045
5236 35689045 35857954 36055973 36056330 35681257 36101101 36381495 36518404 37169653 37962073 38734601
5226 38734601 38883810 39479076 39629479 39095314 38991263 38749485 38192956 37438193 36078652
5217 36078652 34814432 34019533 33789721 33252076 32719222 32845032 32963031 32768257 33147611
5208 33147611 33923343 33562427 33077752 32358377 31622879 31451570 31287124 30566542 30991630
5199C0991630K13861r31757r78037k53538Q1783k35032l62367r5906k18365r4715
5189B8117557Q4436J17869p68717M4274n2240M02442m59083k21240Q7178j55188
5179B7197288J8143j27605p3915M64250K86716l38736K38226J96427J05055p54357
5169B7211492J38428N06533M03290j77983M04725O08322L9975J53125O78252J184158
5159C1150317J3929p06503Q93860O07112J21648O76953M43362J68078P9670M88992
5149C3937418P75678O08317L02763O61910J82769O23818M17336L64136K57513
5140C8131658M70660L17992O92355Q10770N5485O97051R25363O60103J77721R05467
5130D3844625j61742P3797L27377O38068M75957L02582q9536K64530N15127N19689
$$ plain form
5199 30991630 31205491 30273734 29295697 29042159 29123942 28888910 28526543 28430637 28212272 28117557
5189 28117557 28201993 28319862 27551145 27595419 27543179 27945621 27486538 27265298 27352476 27197288
5179 27197288 27215431 27087826 27013911 27478161 27764877 27426141 27664367 27860794 27965849 27211492
5169 27211492 27349920 27856453 28259743 28081760 28486485 29094807 29134782 29287907 29966159 31150317
5159 31150317 31164246 30457743 31351603 31958715 32080363 32757316 33200678 33368756 33448426 33937418
5149 33937418 34713096 35321413 35624176 36286086 36468855 37092673 37510009 37874145 38131658
5140 38131658 38602318 38920310 39612665 40423435 40478920 41175971 42101334 42761437 42939158 43844625
5130 43844625 43682883 43756680 44084057 44722125 45198082 45500664 45411128 45675658 46190785 46710474
5120D6710474J21326L28981O47617M8376K820M50073M94841O67083K65563J309687
5110E1046841L39987M67865Q69331M59925R04688K45539Q54915N50215P71423
5101E6510729J298034J113287R95214J184767J273880J506040J092736J308886
5093F6283573J755297K163582J440263J597174K546867K752358J705113K416610
5085H2660837K523739K733648K910977K636016L940355L684589L684927M097964
5077A08873052M322405M554787N090972N629192N779741O088360O544808P117771
5069A54001088P092649Q325605R271414R249397R037127R274871R445586J0207785
5061B25905522R913725R789554R732004Q774159Q448575P794236P243058O281340
$$ plain form
5120 46710474 46831800 47160781 47808398 47856774 47859594 48309667 48804508 49471591 49737154 51046841
5110 51046841 51386828 51854693 52724024 53183949 54088637 54334176 55189091 55739306 56510729
5101 56510729 57808763 58922050 59917264 61102031 62375911 63881951 64974687 66283573
5093 66283573 68038870 70202452 71642715 73239889 75786756 78539114 80244227 82660837
5085 82660837 85184576 87918224 90829201 93465217 97405572 101090161 104775088 108873052
5077 108873052 113195457 117750244 122841216 128470408 134250149 140338509 146883317 154001088
5069 154001088 161093737 169419342 178690756 187940153 196977280 206252151 215697737 225905522
5061 225905522 235819247 245608801 255340805 264114964 272563539 280357775 287600833 293882173
5053B93882173N261323L717857K824902K529582J461852P14030Q97491Q61299
5045C12150509p2909J37717J083987N08179P66919J634209J647703K403232K269877
5036C22529423K456386L057916L046686K510151K428011K625499Q91509q9510
5028C39456071n85428j430693k335608l558792m005508m462225n189296n002680
5020C12885841m925007n121526m640643m289639m297889l958294l368024k852205
5012B79432614l187806l431098k957933k979895k961033k952903k332849k731589
5004B55897508l075147k497179k258539k362362k262095k521187k493083j411666
4996B37016250k445346k073272j662523k488808k115907j720622k392474k411858
$$ plain form
5053 293882173 299143496 302861353 305686255 308215837 309677689 310391719 311289210 312150509
5045 312150509 312077600 312215317 313299304 313807483 314574402 316208611 317856314 320259546 322529423
5036 322529423 324985809 328043725 331090411 333600562 336028573 338654072 339545581 339456071
5028 339456071 338870643 337439950 335104342 331545550 327540042 323077817 317888521 312885841
5020 312885841 307960834 302839308 298198665 293909026 289611137 285652843 282284819 279432614
5012 279432614 276244808 272813710 269855777 266875882 263914849 260961946 258629097 255897508
5004 255897508 252822361 250325182 248066643 245704281 243442186 240920999 238427916 237016250
4996 237016250 234570904 232497632 230835109 228346301 226230394 224509772 222117298 219705440
4988B19705440k180477k011427k015603k007653k191221j621733j068412j869671
4980B04739243j830996k098683j757650j271738q15020n18129o36216j97809n31682
4971A95081320l21161o3448l57955K05361M98688L33351J29925r2413N8720O81238
4961A96153626M44599N57733J153615J353166R49155R18598J244983J376763J592812
4952B05745050J556580J056635J404661J627597K64262J363207J572891J474911
4944B16065794J185558R40981L35903M97154N02217L88338Q65327n3994J94064
4935B20921342m28649n22700o66493r67031j336438n85526j223411j360776j770154
4926B12060164k053692j523090j741686j772614k261511k005143k253027k301887
$$ plain form
4988 219705440 217524963 215513536 213497933 211490280 209299059 207677326 206608914 204739243
4980 204739243 202908247 200809564 199051914 197780176 196965156 196447027 195810811 195613002 195081320
4971 195081320 194760159 194696711 194338756 194544117 195042805 195376156 195506081 195413668 195472388 196153626
4961 196153626 196598225 197155958 198309573 199662739 200611894 201530492 202775475 204152238 205745050
4952 205745050 207301630 208358265 209762926 211390523 211654785 213017992 214590883 216065794
4944 216065794 217251352 218192333 218528236 219025390 219527607 219915945 220781272 220727278 220921342
4935 220921342 220492693 219969993 219303500 218336469 217000031 216414505 215191094 213830318 212060164
4926 212060164 210006472 208483382 206741696 204969082 202707571 200702428 198449401 196147514
4918A96147514k310061k909772k397374j945526k046598j981846j981245j828333
4910A78746759k456186j913529j831185k036716j423583j862865j197824j803430
4902A64221441k451363j131759r98995j415247j056958q49053j074649r50490
4894A54292927j126937q85248r30620j190727j936566m90317j042499j423370
4886A45266643r96091j789468j196243j598449r87905j131579j049711m20883
4878A36096314q27760p95429q71270o16300r22106L18518j73693K01909K881K73274
4868A32686338R24699j39875L10029Q24554J597800J856478K060349K135496K724896
4859A44980764L516031M142253M405734N588125O202266P402225P118024P857137
$$ plain form
4918 196147514 193837453 190927681 188530307 186584781 184538183 182556337 180575092 178746759
4910 178746759 176290573 174377044 172545859 170509143 169085560 167222695 166024871 164221441
4902 164221441 161770078 160638319 159639324 158224077 157167119 156318066 155243417 154292927
4894 154292927 153165990 152280742 151350122 150159395 148222829 147732512 146690013 145266643
4886 145266643 144270552 142481084 141284841 139686392 138698487 137566908 136517197 136096314
4878 136096314 135268554 134473125 133601855 132985555 132063449 132381967 132208274 132410183 132413064 132686338
4868 132686338 133611037 133471162 133781191 134605745 136203545 138060023 140120372 142255868 144980764
4859 144980764 148496795 152639048 157044782 162632907 168835173 176237398 183355422 191212559
4851A91212559Q898982J0278095J0741823J0291484J0598053J0763763J0646142
4844B63430901R060443P421925O377657M768697L288224O14704k187203l601589
4836B89173759m061005m551259m164163l201998k553202j045352J4600R22866
4828B70534246J283097J593553K151834K737724M125107N359938O787057Q305587
4820C02878143Q557886R176679P973999N743479K028287j850301n503721q259431
4812C20745020r078861j0025798r330590p248834m853827l433853j367145J103327
4804B76509439K250891L619045M115946M537166L667731L137327K454557J704037
4796C01996139J826828J605049L200940L745349N246720O466632P152815Q017853
$$ plain form
4851 191212559 200111541 210389636 221131459 231422943 242020996 252784759 263430901
4844 263430901 272491344 279913269 286290926 291059623 294347847 294962551 292775348 289173759
4836 289173759 285112754 280561495 276397332 273195334 270642132 269596780 269611380 270534246
4828 270534246 271817343 273410896 275562730 278300454 282425561 287785499 294572556 302878143
4820 302878143 311436029 320612708 328586707 334330186 336358473 334508172 329004451 320745020
4812 320745020 311666159 301640361 292309771 285060937 280207110 276773257 275406112 276509439
4804 276509439 278760330 282379375 286495321 291032487 294700218 297837545 300292102 301996139
4796 301996139 303822967 305428016 308628956 312374305 317621025 324087657 331240472 339258325
4788C39258325P816130P921328P578330O582518O422666O397260N548918M268476
4780C91793951K837762J111863k90009j661877k763307l108354l431413k705568
4772C81783048k857611j802402j561312n67245L32172J72333N29509J062880K293296
4763C79384668K619990L627415M540122O148369O020469N403458M751362L221977
4755D15717830M37091j549171m032200o764199o917641p392944o496562n744847
4747C77257357m456736k529473k40418M51670J075807Q29566N25956M36264J28900
4738C73478893j823388l037205l747651m182518m134509m006218l090819k816820
4730C46639765j789154j233430p50049j078219k137397l552916l116059l508987
$$ plain form
4788 339258325 347074455 354995783 362574113 369156631 375579297 381976557 387525475 391793951
4780 391793951 394631713 395743576 395453567 393791690 391028383 387920029 384488616 381783048
4772 381783048 378925437 377123035 375561723 374994478 375326650 375498983 376028492 377091372 379384668
4763 379384668 382004658 385632073 390172195 396320564 402341033 407744491 412495853 415717830
4755 415717830 416154921 414605750 410573550 403809351 396891710 389498766 383002204 377257357
4747 377257357 372800621 370271148 370030730 370482400 371558207 372387773 372913729 373349993 373478893
4738 373478893 371655505 368618300 364870649 360688131 356553622 352547404 349456585 346639765
4730 346639765 344850611 343617181 342867132 341788913 339651516 336098600 332982541 329473554
4722C29473554m066495m252089l929747l769005l419276l706862l129852l123940
4714C00076288l589972m213202m493038m260643m732910m316206n085850m678568
4706B64705899m302010m251585l973402k938381k388580j850335j905428j972881
4698B41123297k077825k729120k343105k385759j739609j994982j993325j373579
4690B24485993l44133l81296n73560L96195J070485J816160J551059J054138J232497
4681B30307538P74089R56994O00759j18093m24997O30569r1942o34672j45489
4672B31854756l205Q41182P9261O27710O51480R10500N01725l40588l79747n43897
4662B34199177j364252j282090j359977k181405j789365j728816j625537j462093
$$ plain form
4722 329473554 325407059 321154970 317225223 313456218 310036942 306330080 303200228 300076288
4714 300076288 296486316 292273114 287780076 283519433 278786523 274470317 269384467 264705899
4706 264705899 260403889 256152304 252178902 249240521 246851941 245001606 243096178 241123297
4698 241123297 239045472 236316352 233973247 231587488 229847879 227852897 225859572 224485993
4690 224485993 224141860 223760564 223187004 223583199 224653684 226469844 228020903 229075041 230307538
4681 230307538 231081627 232038621 232639380 232521287 232096290 232726859 232634917 232000245 231854756
4672 231854756 231851551 232692733 232771994 233399704 234051184 234961684 235463409 235122821 234743074 234199177
4662 234199177 232834925 231552835 230192858 228011453 226222088 224493272 222867735 221405642
4654B21405642j609786j264733j658752k161784j889614k700008l497573k613763
4646B04009629k605098k616403k533592k385286k190125k667075k431959j809509
4638A84770582k385451k313067k206031l034106k706195k700531k676710l175598
4630A63572893k642081l296876k514936j699897k107547k076998j412650j163551
4622A46658357j287299j135938j949429j373861k314093k417126k011975j780855
4614A32387781k493969k757081k500964k309794k228235k078186k284080k281402
4606A13454070l232107k307661k181274k410465j588129k633346k190669k077839
4598I4832580k266881k126492k036309j831131j837610k083584j367781j511835
$$ plain form
4654 221405642 219795856 218531123 216872371 214710587 212820973 210120965 206623392 204009629
4646 204009629 201404531 198788128 196254536 193869250 191679125 189012050 186580091 184770582
4638 184770582 182385131 180072064 177866033 174831927 172125732 169425201 166748491 163572893
4630 163572893 160930812 157633936 155119000 153419103 151311556 149234558 147821908 146658357
4622 146658357 145371058 144235120 142285691 140911830 138597737 136180611 134168636 132387781
4614 132387781 129893812 127136731 124635767 122325973 120097738 118019552 115735472 113454070
4606 113454070 110221963 107914302 105733028 103322563 101734434 99101088 96910419 94832580
4598 94832580 92565699 90439207 88402898 86571767 84734157 82650573 81282792 79770957
4590G9770957j687349j752969j098797j459791j321173j036394r90108r45557
4582F9478819r44092j372971j237239j513739q06422p99920q23240j036947p75725
4573F0168524o67083r54187n97851n05656m76095p30657n01763j122223l45869
4564E4267140m56757p38918n21989k07630q77346l21173l36608k2235l06141l46025
4554E0132318l42933k33963p2671l65922m44034N1230m40402l64930m9454o8590
4544D7800649K03022m03532m7209K3766m58151M49738J01844p04728k45684m73807
4534D6245908m64374k19294l65985n02254k0660O5789o01345J31433O15282k08650
4524D4675850n45659n09402J91994l39036o84511m52222n48504l97666o3944K1776
$$ plain form
4590 79770957 78083608 76330639 75231842 73772051 72450878 71414484 70424376 69478819
4582 69478819 68534727 67161756 65924517 64410778 63604356 62804436 61981196 60944249 60168524
4573 60168524 59501441 58547254 57949403 57443747 56967652 56236995 55735232 54613009 54267140
4564 54267140 53810383 53071465 52549476 52341846 51464500 51143327 50806719 50784484 50478343 50132318
4554 50132318 49789385 49555422 49482751 49116829 48672795 48724025 48283623 47918693 47869239 47800649
4544 47800649 48003671 47600139 47552930 47576696 47118545 47568283 47670127 46965399 46719715 46245908
4534 46245908 45781534 45562240 45196255 44694001 44673341 44739130 44137785 44269218 44884500 44675850
4524 44675850 44130191 43620789 43812783 43473747 42789236 42337014 41788510 41390844 41326900 41348676
4514D1348676j80327o05172o70741k95512l58201o29390l9028L374k36182o21291
4504C7716206L46898n5861m54479n84145m73140p41047o47332j08259p1540n5263
4494C4872038m46290m51064o8105q28597l74270J06734m27788k62335l60408q1814
4484C1678101j22143Q1353O9387j180635j27642j60670L22311m32913l68728l17001
4474B9441420q25068k8756m81149n5910m08528o31494n72076O9148P7963n91147
4464B5994403n4492l59578j09131K26290k38892k82450l82215r7796j13179k10234
4454B4372726m82328l94618l59232l12509J79518K50069K89856k33850r24268
4445B2385364k9408l59559J08501R863J15880r9126m74467m31652L06093J09799
$$ plain form
4514 41348676 41168349 40563177 39892436 39596924 39238723 38609333 38570305 38573679 38337497 37716206
4504 37716206 38063104 38007243 37552764 36968619 36495479 35754432 35107100 34998841 34927301 34872038
4494 34872038 34425748 33974684 33906579 33077982 32703712 32810446 32382658 32120323 31759915 31678101
4484 31678101 31555958 31637311 31706698 30526063 30398421 30237751 30560062 30127149 29758421 29441420
4474 29441420 28616352 28587596 28106447 28050537 27642009 27010515 26438439 26507587 26585550 25994403
4464 25994403 25939911 25580333 25471202 25697492 25458600 25176150 24793935 24696139 24582960 24372726
4454 24372726 23890398 23495780 23136548 22824039 23003557 23253626 23543482 23309632 22385364
4445 22385364 22355956 21996397 22104898 22114761 22230641 22131515 21657048 21225396 21531489 21641288
4435B1641288m09446m64816m88402N10706K84991M5914m31665m17511L5173l62850
4425A9943382J34258o53732k42111j95583N32043k02669n74955m44589m46944
4416A7849100J71238J46243n9492l86299M06852N45475n68980K31166l5154n51909
4406A7748240n39106j76760n53286q2183l29756k74202L1106l94185l4856L65344
4396A5760356J60243o91146m84393J62083j85859l29818j97776m67129J66438
4387A3892999J94667K99275p14034l40032r4628J1047P8759j78510n01888m79686
4377A2167969P9251m2399p77950n422M04816L46588l82632n30157L27174o18758
4367A0968480K0951l7948n86987P43827P2224m55536M65632k09704o76274J4103
$$ plain form
4435 21641288 21231842 20767026 20278624 20789330 21074321 21120235 20688570 20271059 20306232 19943382
4425 19943382 20077640 19423908 19181797 18986214 19518257 19315588 18740633 18296044 17849100
4416 17849100 18020338 18166581 18107089 17720790 18127642 18673117 18104137 18335303 18300149 17748240
4406 17748240 17209134 17032374 16479088 16396905 16067149 15792947 15824053 15429868 15395012 15760356
4396 15760356 15920599 15229453 14745060 14907143 14721284 14391466 14193690 13726561 13892999
4387 13892999 14087666 14386941 13672907 13332875 13238247 13249294 13328053 13149543 12647655 12167969
4377 12167969 12247220 12204821 11426871 11421449 11826265 12172853 11790221 11260064 11587238 10968480
4367 10968480 10989431 10951483 10364496 11108323 11180547 10725011 11190643 10980939 10304665 10318768
4357A0318768l34446L06509o968r9964k57843L59475l51187K46945l13911P9188
4347I946566J03359k71328j51265j49137J80957J578K9884k88343j34764M8495
4337I316002J58459j56517J33868n8739j61047K25711o9991k59435j01517L05829
4327I332623L18882n3806m92485l73242N26264o37001k18399O21069j533k63709
4317H758663j59103J3542J17461L88260j08570l77577Q763k9557K31000O5120
4307H908002o89930j55269K82031j89396J50594K21865l10144j17489k71155j80685
4297G648424N97222P6118o04524L87183R36K7381m29542l49426K61125K15858
4287G830755l86458J51475K59593o3313J52219k77911M0601l49167o0616J94339
$$ plain form
4357 10318768 9984322 10290831 10283863 10183899 9926056 10285531 9934344 10181289 9867378 9946566
4347 9946566 10049925 9778597 9627332 9478195 9659152 9660730 9690614 9402271 9267507 9316002
4337 9316002 9474461 9317944 9451812 9393073 9232026 9457737 9387746 9128311 9026794 9332623
4327 9332623 9651505 9597699 9105214 8731972 9258236 8621235 8402836 9023905 9022372 8758663
4317 8758663 8599560 8613102 8730563 9118823 9010253 8632676 8641439 8611882 8842882 8908002
4307 8908002 8218072 8062803 8344834 8155438 8306032 8527897 8217753 8100264 7829109 7648424
4297 7648424 8245646 8321764 7717240 8104423 8105359 8132740 7703198 7353772 7614897 7830755
4287 7830755 7444297 7595772 7855365 7792052 7944271 7666360 7706961 7357794 7297178 7491517
4277G491517M2685j77665k91534k68506N73540k66721l177K41721l63011m1387
4267F937462k53658q0523J92344o9293J79563j0364k03252O8176M9202q4553q1708
4256F643396j19657l30830m11182L90344N4892K2275k42729j83269L56109K7922
4246F207271n29212J99755M14846m5202k93481m5495k29698L17009P1545k60210
4236E807128n92990j53728k46135K99692O01039j56703j07397R6725L23946K60713
4226F132290k03700O5565k22820j79847l99756l22206L73377N71425P9750l17578
4216E576500L12384r22230J20163J448J32247k40639j59107J92402J28436K70515
4206E412119J53126k3738k02220m11035q3872K52039m44380k984K09685J27032
$$ plain form
4277 7491517 7534202 7356537 7065003 6796497 7370037 7103316 7100139 7341860 6978849 6937462
4267 6937462 6683804 6603281 6795625 6726332 6905895 6895531 6692279 6760455 6809657 6725104 6643396
4256 6643396 6523739 6192909 5781727 6172071 6226963 6249238 6006509 5823240 6179349 6207271
4246 6207271 5678059 5877814 6292660 6247458 5953977 5908482 5678784 5995793 6067338 5807128
4236 5807128 5214138 5060410 4814275 5113967 5715006 5558303 5450906 5547631 5871577 6132290
4226 6132290 5928590 5994155 5771335 5591488 5191732 4869526 5242903 5814328 5894078 5576500
4216 5576500 5888884 4966654 5086817 5088265 5220512 4979873 4820766 5013168 5141604 5412119
4206 5412119 5565245 5541507 5339287 4928252 4844380 5096419 4652039 4649055 4858740 4985772
4196D985772k44919j24296N03670m2533j26335K04720L69409j55155l46543K92205
4186E315995J76695j38505k39579j23703L9319Q6528l6845l1394m6073N2354p7626
4175D977166n1525j41733J81300r7579r3457k47790p78777J8234K85708O25715
4165D677262L77410l65951m42177M9467K99685k53750m8660N55076k31293j33418
4155D483651j06906M42084j28717J43943k30418j10362k56502J01403M97282k29357
4145D606101m39597J53281L85707k01931K69754l08754R6949j99945k05618J4301
4135D170248o2488m591l58263j93530K54694K53320O35083L02467n66433m97014
4125C933493K19517K03911r8525K51036j1434j57419J61759j52855m7156j673
$$ plain form
4196 4985772 4740853 4616557 5120227 5077694 4951359 5156079 5525488 5370333 5023790 5315995
4186 5315995 5492690 5354185 5114606 4990903 5030222 5116750 5079905 5048511 5002438 5054792 4977166
4175 4977166 4925641 4783908 4965208 4867629 4774172 4526382 3747605 3765839 4051547 4677262
4165 4677262 5054672 4688721 4246544 4296011 4595696 4341946 4293286 4848362 4617069 4483651
4155 4483651 4376745 4818829 4690112 4834055 4603637 4493275 4236773 4338176 4835458 4606101
4145 4606101 4166504 4319785 4705492 4503561 4773315 4464561 4561510 4361565 4155947 4170248
4135 4170248 4107760 4103169 3744906 3551376 3806070 4059390 4694473 4996940 4430507 3933493
4125 3933493 4153010 4356921 4258396 4509432 4497998 4340579 4502338 4349483 4302327 4300654
4115D300654j20109J97824O1143k65937K51092j29965N5403j88019L0128M14856
4105D607070k59332l75429m6670N30347J82924J03704k38593m44727m20043N6718
4095C695969M8656J52302L39681K29963o01893l46739j14945L79560r6247J81588
4085C867895k4200K06674J79997J38220K11012j81375n87233k96028J35476N69194
4075D219632J6012l96799M01009M8597j51342m91026o273J20091L89298k35761
4065C913438M12332k57194J4814m0825l78688L912K10670k54571K52697N3642
4055C930227m32675K32772p842J23241k50924L21764K31819l87151M36369k48318
4045C949282l11679k19519K61295q1746j59761K25848l39461K31746K61294j173
$$ plain form
4115 4300654 4180545 4378369 4439512 4173575 4424667 4294702 4350105 4162086 4192214 4607070
4105 4607070 4347738 3972309 3925639 4455986 4638910 4742614 4504021 4059294 3639251 3695969
4095 3695969 3744625 3896927 4236608 4466571 3864678 3517939 3402994 3782554 3686307 3867895
4085 3867895 3843695 4050369 4230366 4368586 4579598 4398223 3810990 3514962 3650438 4219632
4075 4219632 4235644 3838845 4239854 4288451 4137109 3646083 3639810 3759901 4149199 3913438
4065 3913438 4325770 4068576 4083390 4042565 3663877 3667789 3878459 3623888 3876585 3930227
4055 3930227 3497552 3730324 3722482 3845723 3594799 3916563 4148382 3761231 4197600 3949282
4045 3949282 3637603 3418084 3679379 3597633 3437872 3663720 3324259 3556005 3817299 3816126
4035C816126k95006J70934J57624K00215R680K8981M78363K12358l60172j61390
4025D257713J07719Q2087j16091j74699K331M22824J01833O0495k69691l41111
4015D133410J23193k52653o4813p8632L5317K13027J26630q927K55803r6284R0497
4004D476568k67234M03589l5048n24662r298J56004M678K2004O1479L00891j19160
3993D469811k50086J70763j4501n5124J86083p6526m07511N09571k67398K18041
3983D483123m5801K33011L76040m64224J11189M52906m36057n29268k17303K40236
3973D203852R881j305K96286J76787l25746m3495N21607m99521R1385k89135J4822
3962D155418k37122J56197O10762j46403o3213j73985M97586L64174m06344L47859
$$ plain form
4035 3816126 3521120 3692054 3849678 4049893 4059573 4088554 4566917 4779275 4419103 4257713
4025 4257713 4365432 4447519 4331428 4156729 4159060 4581884 4683717 4744212 4474521 4133410
4015 4133410 4256603 4003950 3939137 3860505 3895822 4108849 4235479 4226552 4482355 4386071 4476568
4004 4476568 4209334 4612923 4577875 4053213 4043915 4199919 4204597 4226601 4288080 4588971 4469811
3993 4469811 4219725 4390488 4375987 4320863 4506946 4430420 4022909 4532480 4265082 4483123
3983 4483123 4437322 4670333 5046373 4582149 4693338 5146244 4710187 4180919 3963616 4203852
3973 4203852 4213733 4212428 4508714 4685501 4359755 4316260 4837867 4338346 4429731 4140596 4155418
3962 4155418 3918296 4074493 4685255 4538852 4475639 4301654 4799240 5163414 4757070 5104929
3952E104929K49413m95402J9240m9959l32515K13081L9873J6089r1545m1700o1169
3941D570335K88058J65339K86307o7660k98162o55086J64735J95121r8671R9815
3931D650131K29106J24957l69564j33731M23925J53576j64113K36607j66261j71511
3921D813122k06465L02100l19624L5640k3904M17398l15017P8864L60281O0134
3911E202529n81086J00148M98687k66431k56714J01707K25893L89050L70598j72797
3901E611584m49834K34244K03885k00460J91234R0440m32520K99765N2413K19853
3891E820604r81114l20109P21637K66732L72297k14916k21868P3651M73469K3094
3881F013477l85348k77191N4232M9553k50468J07998n8255K22831K48353j47651
$$ plain form
3952 5104929 5354342 4858940 4878180 4828221 4495706 4708787 4748660 4764749 4673204 4631504 4570335
3941 4570335 4858393 5023732 5310039 5242379 4944217 4289131 4453866 4648987 4550316 4650131
3931 4650131 4879237 5004194 4634630 4500899 4924824 5078400 4914287 5150894 4984633 4813122
3921 4813122 4606657 4908757 4589133 4624773 4600869 5018267 4703250 4782114 5142395 5202529
3911 5202529 4621443 4721591 5220278 4953847 4697133 4798840 5024733 5413783 5784381 5611584
3901 5611584 5161750 5395994 5599879 5399419 5590653 5681093 5248573 5548338 5600751 5820604
3891 5820604 4839490 4519381 5241018 5507750 5880047 5665131 5443263 5516914 5990383 6013477
3881 6013477 5628129 5350938 5405170 5454723 5204255 5312253 5253998 5476829 5725182 5577531
3871E577531L53402N45733K79402n5468P4053k20549Q0951j00665k40770r6051
3861F197569k17369j32685L66937l98427J77478r2106M03890J68562K03643J97624
3851F875116p92958J26378L10243o68O106o1047L01006j81576k85719k78829L06185
3840F324237l60044N800K57623j18006O74861l78991n62613L42035K85435J03308
3830F573645j6214m31461L69290l43365j06757k59809l36018M57365J65453P3438
3820F145567J67584r7904L64825J7017j70202n52278j92838L03731p2569J57006
3810F069939j1231l63191k77077O36984l83096m05158r373K54221J69660J93035
3800E874713M7422j19000L19273n1948k01657O8047K62902l74154l99531K16742
$$ plain form
3871 5577531 5930933 6476666 6756068 6700600 6774653 6554104 6635055 6534390 6293620 6197569
3861 6197569 5980200 5847515 6214452 5816025 5993503 5901397 6305287 6473849 6677492 6875116
3851 6875116 6082158 6208536 6518779 6518111 6524217 6463170 6764176 6582600 6296881 6018052 6324237
3840 6324237 5964193 5969993 6227616 6109610 6784471 6405480 5842867 6184902 6470337 6573645
3830 6573645 6557431 6125970 6495260 6151895 6045138 5785329 5449311 5906676 6072129 6145567
3820 6145567 6313151 6215247 6580072 6597089 6426887 5874609 5681771 5985502 5912933 6069939
3810 6069939 6058708 5695517 5418440 6055424 5672328 5267170 5257797 5512018 5681678 5874713
3800 5874713 5922135 5803135 6122408 6070460 5868803 5936850 6199752 5825598 5426067 5642809
3790E642809K60820M79562j05991N1030m7009o15376k11076J57992O34225M5862
3780F292848n18793m4683l74590L33008m92966K96352j26346K2326L97706M6090
3770E830952m7411l21078J68192q3768O9057j14288O87818r8949n65764l888R9056
3759E619929J34904r9455k21374k41767j41978n53109M34143M27181J03549K86679
3749E748702J94459m722k90177o92436L49554M58139p01419J16039j40342O0403
3739E098200M65315J42408j84541L04250L42388k56606l50722r6341M61132R2172
3729F017655J14135k7343j15698l3454j56004O91581K21296J20413l91636M9852
3719F490797k82345J9695N45244n3916l18838K00835L57580J41661m66042J71474
$$ plain form
3790 5642809 5903629 6383191 6277200 6328230 6281221 5665845 5454769 5612761 6246986 6292848
3780 6292848 5774055 5729372 5354782 5687790 5194824 5491176 5364830 5387156 5784862 5830952
3770 5830952 5783541 5462463 5630655 5546887 5615944 5501656 6189474 6090525 5524761 5520873 5619929
3759 5619929 5754833 5655378 5434004 5192237 5050259 4497150 4931293 5358474 5462023 5748702
3749 5748702 5943161 5938439 5648262 4955826 5305380 5763519 5062100 5178139 5037797 5098200
3739 5098200 5563515 5705923 5521382 5825632 6168020 5911414 5560692 5464351 5925483 6017655
3729 6017655 6131790 6104447 5988749 5955295 5799291 6490872 6712168 6832581 6440945 6490797
3719 6490797 6208452 6228147 6773391 6719475 6400637 6601472 6959052 7100713 6634671 6806145
3709F806145K16159J07425j88991J05940L22155J58789l34159K4263K90919N78106
3699H086751K32486m40513J23781J41738J46434r7164k86580L45775N50860L84990
3689I188558k72476m41315k0067L56486k09550l44383O00388K75121L6506K75122
3679I444390K69593j40136K75401k95588l5078J69305N03288J65542O63071m5359
3669A0974429j28604J20851J87393M85738o5906M75467j90903J56127n5959q0446
3659A1878187M49661J00700O60158O88625M75902J41393l69183l8032O7897P41838
3649A4797146M9375L92532K70345K08377N60015L12917O29292M34727J57936M50223
3639A8262885L48371J69988M03637P71149j22871J240387N90512k0386J294441
$$ plain form
3709 6806145 7022304 7129729 6940738 7046678 7368833 7527622 7193463 7217726 7508645 8086751
3699 8086751 8319237 7878724 8002505 8144243 8290677 8193513 7906933 8252708 8803568 9188558
3689 9188558 8916082 8474767 8454700 8811186 8601636 8257253 8857641 9132762 9169268 9444390
3679 9444390 9713983 9573847 9849248 9553660 9518582 9687887 10191175 10356717 11019788 10974429
3669 10974429 10845825 10966676 11154069 11639807 11573901 12049368 11858465 12014592 11958633 11878187
3659 11878187 12327848 12428548 13088706 13777331 14253233 14394626 14025443 13987411 14055308 14797146
3649 14797146 14846521 15239053 15509398 15717775 16277790 16590707 17219999 17654726 17812662 18262885
3639 18262885 18611256 18781244 19184881 19956030 19833159 21073546 21664058 21643672 22938113
3630B2938113N93457N4699J30635J027783Q65690Q95934M64654R02868L85471
3621B8259304Q18403R61152Q88324N12576N48492N3740O70413O36329M59885K52918
3611C4061536R33586O45683l24723n69028L76551K84645Q43941L16841j96056
3602C6372976M81179K21440J27913k681J80311M76563k8278k95991M71816J77209
3592C8182457J51750K68929L3451o7801J70258p2976l50033J02590N52294q89076
3582C8081843j34193q8189m451j02042m60980k62137k26040p41286l31832K2769
3572C5753462j010928K42462j57422j98924n76139n46665k47060o03638j68658
3563C2486490O0524O8960k03406m37317m93469m62619m72506Q242r8266M55393
$$ plain form
3630 22938113 23531570 23586269 23716904 24744687 25610377 26506311 26970965 27873833 28259304
3621 28259304 29077707 30038859 30927183 31439759 31988251 32041991 32712404 33348733 33808618 34061536
3611 34061536 34995122 35640805 35316082 34747054 35123605 35408250 36252191 36569032 36372976
3602 36372976 36854155 37075595 37203508 37200827 37381138 37857701 37829423 37533432 38005248 38182457
3592 38182457 38334207 38603136 38636587 38568786 38739044 38666068 38316035 38418625 38970919 38081843
3582 38081843 37947650 37859461 37855010 37752968 37291988 37029851 36803811 36062525 35730693 35753462
3572 35753462 34742534 34984996 34827574 34628650 34052511 33505846 33258786 32655148 32486490
3563 32486490 32547014 32615974 32412568 31975251 31481782 31019163 30546657 30554899 30456633 30912026
3553C0912026o85167p2921n2098p2602m94957p45978l7853k39550R2926k82236
3543B8321590n09090l09880j66720j04955k96234P8707k8676L0456k92377j67006
3533B6555815l80118J74809r8199l06488K99670q7365n3089k88921M81370J5506
3523B6312990k11754o1956k49340J89727O69925o74591O9730J42318R37692j96353
3513B6928388L0834M18082l60581L09076l53653j49017r917L28585m65517j42524
3503B6533756J67919J71969k75301K81143K42618m56438K53667M41715j66694
3494B7194354M00043l65516J9850n64496j77250M37536l35116j49542J22471R6822
3484B6679156m98151N3470l00326j18619j3553o18383k60167K78300m11219l18684
$$ plain form
3553 30912026 30226859 30153938 30101840 30029238 29534281 28788303 28750450 28510900 28603826 28321590
3543 28321590 27812500 27502620 27335900 27230945 26934711 27013418 26984742 27015198 26722821 26555815
3533 26555815 26175697 26350506 26252307 25945819 26245489 26158124 26105035 25816114 26297484 26312990
3523 26312990 26101236 26039280 25789940 25979667 26649592 25975001 26044731 26187049 27124741 26928388
3513 26928388 26959222 27377304 27016723 27325799 26972146 26823129 26813212 27141797 26676280 26533756
3503 26533756 26701675 26873644 26598343 26879486 27122104 26665666 26919333 27361048 27194354
3494 27194354 27594397 27228881 27248731 26684235 26506985 26944521 26609405 26459863 26582334 26679156
3484 26679156 26181005 26234475 25934149 25815530 25801977 25183594 24923427 25201727 24790508 24471824
3474B4471824j01421J25284n83847k18670l03449m50304n8945L03919k6578l50393
3464B2807420j04396m89635j34575m57697k05794n12674l77965O3311k33440J56841
3454B0511396m49480k53279k69966j94605K7271o22230l58034l30631k79611L61269
3444A8142100k21866q1960o18993o88983L64181l96861L86k09610K56156j51404
3434A6393146m79702j78945L18445p32014j01969j76490p76253l39467N5763m71916
3424A3510598j84256M53249p74883j01767K55790k97408l04194o25987n9214M74721
3414A2346649O8590n92182l34317L23715k13560n1481q86675l6480K30972o6713
3404A0788518K9394k30597K10238l27906o5870k81755l03479L68927j47869p38824
$$ plain form
3474 24471824 24370403 24495687 23911840 23693170 23389721 22939417 22880472 23184391 23157813 22807420
3464 22807420 22703024 22213389 22078814 21621117 21415323 20902649 20524684 20587995 20354555 20511396
3454 20511396 20061916 19808637 19538671 19344066 19371337 18749107 18391073 18060442 17780831 18142100
3444 18142100 17920234 17838274 17219281 16530298 16894479 16497618 16498004 16288394 16544550 16393146
3434 16393146 15913444 15734499 16052944 15320930 15218961 15042471 14266218 13926751 13982514 13510598
3424 13510598 13326342 13779591 13004708 12902941 13158731 12861323 12557129 11931142 11871928 12346649
3414 12346649 12415239 11823057 11488740 11812455 11598895 11547414 10660739 10624259 10855231 10788518
3404 10788518 10817912 10587315 10797553 10469647 10403777 10122022 9818543 10187470 10039601 9300777
3394I300777k71175M26046l18394J28114m21241q6642r2417J1232n6126k75204
3384H344970O68863j91078k59556J28588o15499K84067r763K95878l19774j78899
3374H147797K02148m20942J12649O9727k72727K34341l62158j73248K49000J56476
3364G943063K3904k04468k88356j63760K79012l11763j8825J10131q4786m09898
3354F874254Q1302P0526j45144P9502J259P1341k15799M70440L20321l66027J39724
3343G381699k19784J92510k33453j07158n24221k06583J042732L2318k10660K2735
3333G170135m14136K48331j43874J57024L64558l36861r611N75155Q5985Q5696
3323G782402J29297j24088o2879j00016J52595L24702j44566L62120L94467k71028
$$ plain form
3394 9300777 9029602 9455648 9137254 9265368 8844127 8757485 8665068 8676300 8620174 8344970
3384 8344970 9013833 8822755 8563199 8691787 8076288 8360355 8350592 8646470 8326696 8147797
3374 8147797 8349945 7929003 8041652 8111379 7838652 8072993 7710835 7537587 7786587 7943063
3364 7943063 7966967 7762499 7474143 7310383 7589395 7277632 7258807 7368938 7284152 6874254
3354 6874254 6955556 7026082 6880938 6960440 6961699 7033040 6817241 7287681 7608002 7241975 7381699
3343 7381699 7161915 7354425 7120972 7013814 6489593 6283010 7325742 7358060 7147400 7170135
3333 7170135 6755999 7004330 6860456 7017480 7382038 7045177 7035566 7610721 7696706 7782402
3323 7782402 7911699 7787611 7724732 7624716 7777311 8102013 7957447 8319567 8714034 8443006
3313H443006k02957o3225l38021O62169L48799L17034M28633L53050k5886L34072
3303A0256674J82280l16674K92070M67549N9521m1829J205209M08599l09148j15435
3293A2088816L05945K9389K79588J04770N11116L84170P04278P01533M72835k42846
3283A5339594o4674N21224Q74569L71994K13095N51116N30767M45335L77380J12908
3273A9273308R5309M96823N27928P78852K52385q5372L39456N99326J87976m06117
3263B2059874r3860r6323r4930J56518K79769n0794l94165K49316P34709L67769
3253B3117883k34236L28983J03072L44668P8066N807N04482P25518K37253k15018
3243B4996478J62857J53581l15280j54075J15632m4645p68674q147J5026j25970
$$ plain form
3313 8443006 8240049 8176824 7838803 8500972 8849771 9166805 9595438 9948488 9922602 10256674
3303 10256674 10438954 10122280 10414350 10881899 10941420 10899591 12104800 12513399 12204251 12088816
3293 12088816 12394761 12424150 12703738 12808508 13319624 13703794 14408072 15109605 15582440 15339594
3283 15339594 15274920 15796144 16670713 17042707 17255802 17806918 18337685 18783020 19160400 19273308
3273 19273308 19368617 19865440 20393368 21172220 21424605 21339233 21678689 22278015 22465991 22059874
3263 22059874 21966014 21869691 21774761 21931279 22211048 22160254 21766089 22015405 22750114 23117883
3253 23117883 22883647 23212630 23315702 23660370 23738436 23744243 24248725 24974243 25211496 24996478
3243 24996478 25159335 25312916 24997636 24843561 24959193 24914548 24145874 24137727 24152753 24026783
3233B4026783K66998n92355m31474j50538m21604j7720j66173K6445M07295J77939
3223B3125596r9265l11038l89561l92858K24401j32598k48865L7761k24861n44197
3213B1044515l31500L09632R0878k14298l9780n10747l40807k01775m75608q7750
3203A9242760l43088j71125K81833k68047n97695L267J38254K10163L7751l57254
3193A8176819l8842M2851l86286m88655j48121K72976m16155l55368P0104j89806
3183A6539517n1269P9701j69249l66850K81497L387l27104K02978j50019n8318
3173A5984271j02666J63538P6390o55337k1555J76109K74562k71366j25866J40163
3163A5638243j83815l19827M40700k91231j56796Q04525K71015k21995k89411
$$ plain form
3233 24026783 24293781 23701426 23269952 23119414 22697810 22680090 22513917 22540362 22947657 23125596
3223 23125596 23026331 22715293 22325732 21932874 22157275 22024677 21775812 21813573 21588712 21044515
3213 21044515 20713015 21022647 21113525 20899227 20859447 20348700 20007893 19806118 19330510 19242760
3203 19242760 18899672 18728547 19010380 18742333 18144638 18147905 18286159 18496322 18534073 18176819
3193 18176819 18137977 18180828 17794542 17305887 17157766 17430742 17014587 16659219 16729323 16539517
3183 16539517 16488248 16567949 16398700 16031850 16313347 16316734 15989630 16192608 16042589 15984271
3173 15984271 15881605 16045143 16121533 15466196 15444641 15620750 15895312 15623946 15498080 15638243
3163 15638243 15454428 15134601 15575301 15284070 15127274 15931799 16202814 15980819 15691408
3154A5691408k04507l96870m0942k22815N2828M66103N59589j53723m17259m6664
3144A5287148k22134j98410O0321k49215J91949P83557j88125P4550r2929l79853
3134A5066859j72025j64225n94382k76759l204R20902l48802m70715J57096P4967
3124A4189712m50684n14411j38550J82362K22558n52211J07163J13910J08237
3115A3268086l87331J90408k2472m39337k55953o13079J40684O06530j68308o41859
3105A1677369l76075j7661p30961L54770J94143o40502l12727j11520r0162n12420
3095I434254R9532O6890k99852l85484l63492K8814k47073m7306J95163j65442
3085H316004R198L4482p94910n83269j68273j11817O62054k3375o32990m89687
$$ plain form
3154 15691408 15486901 15090031 15049089 14826274 14879102 15345205 15904794 15751071 15333812 15287148
3144 15287148 15065014 14866604 14926925 14677710 14869659 15653216 15465091 15539641 15446712 15066859
3134 15066859 14894834 14730609 14136227 13859468 13856264 14777166 14428364 13957649 14114745 14189712
3124 14189712 13739028 13224617 13086067 13268429 13490987 12938776 13045939 13159849 13268086
3115 13268086 12880755 13071163 13048691 12609354 12353401 11740322 11881006 12487536 12319228 11677369
3105 11677369 11301294 11283633 10552672 10907442 11101585 10461083 10148356 10036836 9946674 9434254
3095 9434254 9533786 9600676 9300824 8915340 8551848 8580662 8333589 8286283 8481446 8316004
3085 8316004 8325202 8359684 7564774 6981505 6813232 6701415 7363469 7340094 6707104 6217417
3075F217417K93351K5613q05843J61523K32256j26444n05447j92709L68543l12735
3065E355525l7964N15301o18901l70172k30259k29180M0188J24342l65436M783
3055D188227K3655l85009M9781J22767j50094k83002P7543j3105n77997K38079
3045C290845J50336k70885p08584O1733m8310K2728K17914R7030L83623q27454
3035B368976J02265N9215l08112L15362J263j44292J96947L0651k01456m38252
3025A982567L04731L32957k70341K12850j11091p40198K7013L74103O534J38895
3015B258020n6210J17734j22997o42529o650J64184J08119j13951J94783l60183
3005A540320M5569r1949J54638j31929Q8087k75421k50321K55557P9752K10303
$$ plain form
3075 6217417 6510768 6536381 5730538 5892061 6124317 5997873 5492426 5299717 5668260 5355525
3065 5355525 5317561 5832862 5213961 4843789 4613530 4384350 4424538 4548880 4183444 4188227
3055 4188227 4211882 3826873 3876654 3999421 3849327 3566325 3643868 3630763 3052766 3290845
3045 3290845 3441181 3170296 2461712 2523445 2475135 2497863 2715777 2812807 3196430 2368976
3035 2368976 2471241 2530456 2222344 2537706 2538969 2394677 2591624 2622275 2420819 1982567
3025 1982567 2287298 2620255 2349914 2562764 2451673 1711475 1738488 2112591 2119125 2258020
3015 2258020 2201810 2319544 2196547 1554018 1547368 1711552 1819671 1705720 1900503 1540320
3005 1540320 1585889 1493940 1648578 1516649 1604736 1329315 1078994 1334551 1414303 1624606
2995A624606J10669N043q9763J60829n7432k86160k61961M39712J61901r08873
2985H98571K39983O10906j12680l73307J26685M40575m63345J55454r9221j01862
2975A321759m04423N56851k1093j95391J05962l61870j43488L11401N04438p15146
2965I59000R18751l38600p39752L04814j6951L27879n72310P824p2753K30033
2955A007935m67778l18813M04352O58269j86562l08357P58388k53445k96327j90748
2945H06914j10187m15576J50362L92263j64010J49234k12333n36066J32940Q9755
2935B83296K10328k85227n1817M48016l04106m44688N93410M47380n9138m25493
2925D11961l21849N96242J51959j66021l17756J88097K42271m31433N57281q1421
$$ plain form
2995 1624606 1735275 1740318 1650555 1811384 1753952 1467792 1205831 1645543 1807444 898571
2985 898571 1138554 1749460 1636780 1263473 1390158 1830733 1367388 1522842 1423621 1321759
2975 1321759 917336 1474187 1453094 1257703 1363665 1001795 858307 1169708 1674146 959000
2965 959000 1877751 1539151 799399 1104213 1087262 1415141 842831 850655 777902 1007935
2955 1007935 540157 221344 625696 1283965 1097403 789046 1547434 1293989 997662 806914
2945 806914 696727 281151 431513 823776 659766 809000 596667 60601 193541 283296
2935 283296 493624 208397 156580 604596 300490 -144198 449212 896592 837454 411961
2925 411961 90112 686354 838313 672292 354536 542633 784904 353471 910752 829331
2915H29331l09587K55414o1374j79383K18341k06796k1773m24807j74209L74992
2905C00149j03663N16742P2048j75365l21002N87031k81296n72299J8762n0626
2895i519N81908R9537l01538K00040M07466l36408m58901j86579l73138O23589
2885B46457K69400k23955j52456J08474L96078L1708j9773K90448j41614k76094
2875E28673j49827L13456J04916J86817J15372k61478k26891J79833q2234n70781
2865A37856J57096j29594N16144j06182l28561p0110m38257l64920L92935Q84461
2855F50868m6091R7679k12147k72802j79636L73611m46427N48749r9880p2908
2845C41016O39707j71766o07981L89803O3934q632J17793k79889L45400j45789
$$ plain form
2915 829331 519744 775158 713784 534401 752742 545946 524173 99366 -74843 300149
2905 300149 196486 713228 785276 609911 288909 875940 594644 22345 41107 -9519
2895 -9519 572389 671926 370388 570428 977894 641486 182585 -3994 -377132 246457
2885 246457 515857 291902 139446 247920 643998 675706 655933 946381 804767 528673
2875 528673 378846 692302 797218 984035 1099407 837929 611038 790871 708637 137856
2865 137856 294952 165358 681502 575320 246759 176649 -261608 -626528 -233593 650868
2855 650868 604777 702456 490309 217507 37871 411482 -34945 513804 413924 341016
2845 341016 980723 808957 200976 590779 654713 646081 763874 483985 829385 683596
2835F83596L09483k19456m44030K28824l52194L74857L96355j90816k39371o3905
2825D83343K01823m29699L482M35209m1855m87253k84050K15231N5094J30712
2815B82037J17713j61714L13308j19731Q8662l42145j78532l19725k35678N00967
2805e4838Q91428j37244q8739l70825j19560k25024N75108L21759J40029n38614
2795C93480K37597j53624j46807n84469J73120Q80986L3825m69960o45192J92040
2785h9004Q4384k62585K17001K21538K44526j14310l24024J66660O6084q9280
2775A20990J97057p0893o7259m49331Q9287J93693n0462J87380J19460k9254J33627
2764C74295N14349j70446j74358j52108k27454Q0542L17404k53429j48824L50060
$$ plain form
2835 683596 993079 773623 329593 558417 206223 581080 977435 786619 547248 483343
2825 483343 685166 255467 258949 694158 652303 165050 -119000 96231 151325 282037
2815 282037 399750 238036 551344 431613 520275 178130 -402 -320127 -555805 -54838
2805 -54838 836590 699346 610607 239782 120222 -104802 470306 792065 932094 393480
2795 393480 631077 477453 330646 -253823 -80703 800283 834108 364148 -281044 -89004
2785 -89004 -4620 -267205 -50204 171334 415860 301550 -22474 144186 210270 120990
2775 120990 318047 247154 179895 -269436 -180149 13544 -36918 150462 269922 240668 374295
2764 374295 888644 718198 543840 391732 164278 244820 562224 308795 159971 510031
2754E10031J83066k91401J33475k33660l31288K34333K73571j17341Q969N7825
2744D27580K40899k57020M4899Q0571N24057o27474N1862J52363l22477J99491
2734E14751N83808r7752k67560j31863L8482j20263Q5893J6739r9376L04095J88219
2723A015173m92375N50688R6993o51715m73641L44318l382R0863k91384n6627
2713A28911P0138L12228o5494l19150K02706Q7994m28926j56671L37652P3468
2703B42856K64827l07512o7180O9420N7764p0770j57313J76420Q247K95670k3687
2692D88742l03898L02015L40480j57470l08178o57127j56336N99512j79669k12956
2682b44885O12734m6369J41985Q5555n19002L38899r1996k73378j87176N97164
$$ plain form
2754 510031 693097 401696 535171 301511 -29777 204556 478127 360786 369755 427580
2744 427580 668479 411459 456358 536929 1060986 433512 485374 637737 315260 514751
2734 514751 1098559 1000807 733247 601384 639866 519603 605496 622235 522859 826954 1015173
2723 1015173 522798 1073486 1170479 518764 45123 389441 386059 476922 185538 128911
2713 128911 199049 511277 445783 126633 329339 417333 -11593 -168264 169388 242856
2703 242856 507683 200171 132991 202411 260175 189405 32092 208512 216759 512429 488742
2692 488742 184844 486859 827339 669869 361691 -295436 -451772 147740 -31929 -244885
2682 -244885 367849 321480 463465 549020 30018 368917 276921 3543 -183633 413531
2672D13531K18076J83752k65119J00986Q6111k7805n50682m2307N75435L64427
2662A056405j01320j81349o84392J13530L98909K58148k85433k46804k67024P8097
2652A38767R7583J42265n05740J83587J161893j2519q53058L96242r4171J0646
2642F65495k50556j04342Q9120j23391K50390p4343k17477l18203J80510O7707
2632A64910J6528o848M34097l57052R4841l6715L63135O7303k08171j64258K59208
2621F26978j22602n9231l2288L40989l84683j96682K77771j95270P5923M54940
2611G85845k55343l32052N64985J16475K02762k14115m78916J65603L22600j241694
2601c63850N4286Q70360j00100j93114J58895j08820P4909J7469J38732K81227
$$ plain form
2672 413531 631607 815359 550240 651226 737337 709532 158850 116543 691978 1056405
2662 1056405 955085 773736 89344 202874 601783 859931 574498 327694 60670 138767
2652 138767 236350 378615 -127125 56462 1218355 1205836 352778 749020 654849 665495
2642 665495 414939 310597 399717 276326 526716 452373 234896 -83307 97203 164910
2632 164910 181438 174590 608687 251635 346476 309761 672896 740199 532028 367770 626978
2621 626978 504376 445145 412857 753846 369163 172481 450252 254982 330905 785845
2611 785845 530502 198450 763435 879910 1082672 868557 389641 555244 877844 -363850
2601 -363850 -309564 560796 460696 267582 426477 317657 392566 410035 548767 829994
2591H29994j57537K40540j22283n28680M4350l17196j10152j51800M27017M33404
2581E87657J02062j90295k37122L3749K80476J84054j38535J20708R5500l9248
2571G99006m81191O5875O64223O5148j98892J747m02907L83840q775J1091N8438
2560I57603l47815P86626j04444n9755M82858l30989o54750p87319M32452l6992
2550C37475p3415L47417P36584j36190o4336k52764l5643J18068K30093l13805
2540H93484K38302k36153o64950L98496P0686L88607l45187K46877k45744l35933
2530D08485L38163M68585J71929j53803k56082J40346O36735J52160K62585l52076
2520A817027j40399Q5175j85085K666K5261n3519M96537L06234r4443q7619j40487
$$ plain form
2591 829994 672457 912997 790714 262034 306384 -10812 -120964 -272764 154253 587657
2581 587657 689719 499424 262302 296051 576527 760581 622046 742754 838254 799006
2571 799006 317815 383690 1047913 1113061 914169 915916 513009 896849 888074 899165 957603
2560 957603 609788 1396414 1291970 1232215 1715073 1384084 729334 -57985 374467 337475
2550 337475 264060 611477 1348061 1211871 1147535 894771 859128 977196 1207289 893484
2540 893484 1131786 895633 230683 629179 699865 1088472 743285 990162 744418 408485
2530 408485 746648 1215233 1387162 1233359 977277 1117623 1754358 1906518 2169103 1817027
2520 1817027 1676628 1761803 1576718 1579384 1604645 1551126 2047663 2353897 2259454 2171835 2031348
2509B031348K44232M17505K82520k1265j73476M33033K67016K68431L21709N64963
2499D636016K80165L04193K52532K85037J73013K27883K45399O89361J54079P90811
2489H038489P62945M04247J306500L79477P33398R55174J396388R20246J261083
2480A6157947J265539J856504R31571J553807J847080K051285J714142J464846
2472B8842721J417266P32405J308074J482228P28125N76283j81815p31174l93721
2463C3780392m27694l84899j549201n99532J75676N3900l1621k6735M55123K01815
2453C1647224p0134L27646L23053P45400N93062J216277J349781J264006J502308
2444C8898623J166437Q67144J18168q38211j303084j294745j418199j702971j639627
$$ plain form
2509 2031348 2275580 2693085 2975605 2954340 2780864 3213897 3480913 3749344 4071053 4636016
2499 4636016 4916181 5220374 5472906 5757943 5930956 6158839 6404238 7093599 7247678 8038489
2489 8038489 8801434 9205681 10512181 10891658 11625056 12580230 13976618 14896864 16157947
2480 16157947 17423486 19279990 20211561 21765368 23612448 25663733 27377875 28842721
2472 28842721 30259987 30992392 32300466 33782694 34510819 35087102 34905287 34174113 33780392
2463 33780392 33352698 32967799 31418598 30819066 30994742 31048642 31017021 30990286 31445409 31647224
2453 31647224 31577090 31904736 32227789 32973189 33566251 34782528 36132309 37396315 38898623
2444 38898623 40065060 40932204 41050372 40212161 38909077 37614332 36196133 34493162 32853535
2435C2853535j617064j500904j034793n96222m91805k87815Q50671J71672J20486
2426B8467761P2640K09407o94694l16529n55259j123642j382419q97407k01354
2417B3578504o31689m70950j109911N7511q3209l75396o28123o37407n62296j7864
2407A9119170k82356n33817n97114o72427J21920M61770R788q33081j22134n11491
2397A6160228q13306Q8029J23224m31842m62261R61k50659n16895j5678m5727
2387A3836074m0036l8746k04620L8126K24884M6962j05347M3580L96844J46449
2377A4344170R0977K55910k39919L47980Q54427N97934K30347L38708N1667M08269
2367A7280470P84303J49534K07519M17104O70302k64362O78415L07531o9226M55333
$$ plain form
2435 32853535 31236471 29735567 28700774 28104552 27612747 27324932 28175603 28347275 28467761
2426 28467761 28540401 28749808 28055114 27738585 27183326 26059684 24677265 23779858 23578504
2417 23578504 22946815 22475865 21365954 21423465 21340256 20964860 20336737 19699330 19137034 19119170
2407 19119170 18836814 18302997 17705883 17033456 17155376 17617146 17626934 16793853 16671719 16160228
2397 16160228 15346922 15434951 15558175 15126333 14664072 14665033 14414374 13897479 13881801 13836074
2387 13836074 13796038 13757292 13552672 13590798 13815682 13862644 13757297 13800877 14197721 14344170
2377 14344170 14435147 14691057 14451138 14799118 15653545 16251479 16481826 16820534 16872201 17280470
2367 17280470 18064773 18214307 18421826 18838930 19509232 19244870 19923285 20230816 20161590 20616923
2357B0616923L98373N33077J88296J92644O99175K83105M87315Q06669J49819
2348B4355396L0879n45793p596K16843K39108q7819o01625j84670N1253l42467
2338B3123509R7185j0681K73004n64422r58723k74760m61786m78936n20781k19307
2328B0004302o06435m63497Q4090k65855m33079k43150l49650m6295l48729m88321
2318A6843381l66937j12795n63267o07727j20301j50095l92013o51235J64164
2309A4043175L34669j67143n02256k80011K12166J13737n18645M00034k92907
2300A3342819m11822j038141n88043o1823o39494K2059j19930j14224k92676m54429
2290I644296p5038o57708l92618j39912o95584m59406J18535m80659k86004m28341
$$ plain form
2357 20616923 21015296 21548373 21736669 21929313 22628488 22911593 23398908 24205577 24355396
2348 24355396 24386275 23840482 23832886 24049729 24288837 24201018 23599393 23414723 23465976 23123509
2338 23123509 23220694 23210013 23483017 22918595 21959872 21685112 21223326 20744390 20223609 20004302
2328 20004302 19397867 18934370 19018460 18752605 18319526 18076376 17726726 17680431 17331702 16843381
2318 16843381 16476444 16363649 15800382 15192655 15072354 14922259 14530246 13879011 14043175
2309 14043175 14377844 14210701 13708445 13428434 13640600 13754337 13235692 13635726 13342819
2300 13342819 12930997 11892856 11304813 11242990 10603496 10625555 10505625 10391401 10098725 9644296
2290 9644296 9569258 8911550 8518932 8379020 7683436 7224030 7342565 6861906 6575902 6147561
2280F147561p39115K08266k36920K37808l5099k56668K56981m79791n11941l1024
2270D560058m78479l81378k7224L59164l42285O2178l74416o89720L14339j59599
2260B842638k84948k07861m8820p8967O51538m33938K41613P26456p87230j88249
2250B432232L6859o04271J57473N56677j32687r41813q1106L06128L4782j98917
2240A565357j18707M02001k8854M12247l35236o29346R8348K52162J47804J06583
2230A872359l20779J52938k75403k98853r4268K34964k86239j53906j65834M54488
2220A119467K26207n5636m68556J59783j81966k69339J12659l64249l84099N20359
2210D14630M58497k42640K05177Q3791k5776j32583J11561J34551N6151k75613
$$ plain form
2280 6147561 5408446 5616712 5379792 5617600 5582501 5325833 5582814 5103023 4591082 4560058
2270 4560058 4081579 3700201 3672977 4032141 3689856 3752034 3377618 2687898 3002237 2842638
2260 2842638 2557690 2349829 2301009 2222042 2873580 2439642 2681255 3407711 2620481 2432232
2250 2432232 2469091 1864820 2022293 2578970 2446283 1504470 1423364 1729492 1764274 1565357
2240 1565357 1446650 1848651 1819797 2232044 1896808 1267462 1365810 1617972 1765776 1872359
2230 1872359 1551580 1704518 1429115 1130262 1035994 1270958 984719 830813 664979 1119467
2220 1119467 1345674 1290038 821482 981265 799299 529960 642619 278370 -105729 414630
2210 414630 873127 630487 835664 919455 893679 761096 872657 1007208 1063359 787746
2200G87746j8296j55962K70847l12611J9902q6727k54825R8688K97677q7863J78185
2189G36761Q0511l316L79889K58888l80502j72849J00794j67511k92463r8083
2179D42119k01240K30491j3058j50100J67199M259O0489P939n5851L51613m03946
2168D39914l33710l0770k49314L55431k82464p7930J88778P24551p11439q7085
2158f4038J73356j0218m8804J11368M87425l25546k93210k82463M96339j94550
2148D9659j09751q8169K5405O29504L36933j2554m05998j27930l48892j13148
2138a64941J12812K10199l22586m22247K58590K73412m6023M25936k91638l84698
2128c51184M36500K23621j52722k3802K54929N5081k29998m50088J98887k7708
$$ plain form
2200 787746 769450 613488 884335 571724 591626 504899 250074 348762 646439 558576 736761
2189 736761 817272 813956 1193845 1452733 1072231 899382 1000176 832665 540202 442119
2179 442119 240879 471370 458312 308212 475411 479670 540159 548098 492247 843860 439914
2168 439914 106204 75434 -173880 181551 -100913 -178843 9935 734486 23047 -64038
2158 -64038 109318 99100 50296 161664 649089 323543 30333 -252130 244209 49659
2148 49659 -60092 -148261 -122856 506648 843581 831027 425029 297099 -51793 -164941
2138 -164941 -52129 158070 -164516 -586763 -328173 -54761 -100784 325152 33514 -351184
2128 -351184 85316 308937 156215 132413 387342 442423 212425 -237663 -38776 -66484
2118f6484J26960k268L07138j85540n9889J25985p0450K587k13912K00852J44546
2107C09525K23215l21742j77419K14272Q8453r8752J67227j23042j46886k397
2097A32454M7618K70396k49574q5834j32005q7027J48243J29895L73880P5531
2087F23577p17492j97996o9524Q36980l9695r5161m17895K5037J011154n90236
2077C68749l80343P327J45361l64298j57810L48302j51078j97844J44593J04184
2067a32857K15923l70780K86505j96425M2168J20346n2963k1478M71455r4619
2057B67275r6711K67113J18706p9840m68358L84015l4048m71727k95832K76150
2047a33257L39463j84437j46552L18783Q1140k16633m90864K83397K0596J10706
$$ plain form
2118 -66484 60476 58208 365346 179806 119917 245902 175452 178039 -35873 164979 309525
2107 309525 532740 210998 33579 247851 336304 237552 404779 281737 134851 132454
2097 132454 180072 450468 200894 115060 -16945 -103972 44271 174166 548046 623577
2087 623577 -93915 -291911 -361435 475545 435850 340689 -77206 -52169 958985 368749
2077 368749 -11594 -4267 141094 -223204 -381014 -32712 -183790 -381634 -237041 -132857
2067 -132857 83066 -287714 -1209 -197634 -155466 -35120 -88083 -109561 361894 267275
2057 267275 170564 437677 556383 476543 8185 392200 358152 -113575 -409407 -133257
2047 -133257 206206 21769 -124783 194000 275140 58507 -432357 -148960 -128364 -17658
2037a7658J86835j25718N036n5730q0701J79350m01151j49139L19601J92757j41471
2026h7989L05929l75653o6330j3971k00449J94859l35673K46799M42775k37920
2016a27623l21978L94934l0676L22420l78651k36481J69173J36198K54046k21096
2006c9734L45041M82474l85480j43776k24935l55636j18958Q7002J93637n2009
1996b12374N9273m35776K64757J50943J03994J12843l22931R554N45094j06900
1986A68477m50868K16889L41287j44545J94091L83680o22441r6697J92950n84852
1976d02029K61913J17235j97066j51701R4230l32546j93238O41058J27195J70522
1966A35573k48295m353k34206Q915k011K48392k82593L8247M14747L97721k70767
$$ plain form
2037 -17658 169177 43459 48495 -7235 -87936 91414 -309737 -458876 -139275 53482 -87989
2026 -87989 217940 -157713 -224043 -238014 -438463 -243604 -579277 -332478 110297 -127623
2016 -127623 -449601 -54667 -85343 237077 -141574 -378055 -208882 -72684 181362 -39734
2006 -39734 305307 787781 402301 258525 33590 -322046 -441004 -354002 -160365 -212374
1996 -212374 -153101 -588877 -324120 -173177 -69183 43660 -279271 -269717 275377 168477
1986 168477 -282391 -65502 275785 131240 325331 709011 86570 -10127 182823 -402029
1976 -402029 -140116 -22881 -219947 -371648 -277418 -609964 -803202 -162144 -34949 135573
1966 135573 -112722 -117075 -351281 -342366 -344377 -95985 -378578 -340331 74416 472137 201370
1955B01370p769q8452m61721K3148m5527k24031J72280o12J93685O71882l1054
1944D03199k74984M0183k18241l33982K5125N93407J64723k56428M4182n52423
$$ plain form
1955 201370 193601 105149 -356572 -333424 -378951 -602982 -430702 -431314 -237629 434253 403199
1944 403199 128215 168398 -49843 -383825 -358700 234707 399430 143002 187184 -365239
$$ [...]
##END NTUPLES=NMR SPECTRUM
##END=
