##TITLE=1H_CG-1226-y3
 200.13MHz, CDCl3,
 8 sc
 
 7.8.2025
##JCAMPDX= 6.0         $$ Bruker NMR JCAMP-DX V2.0
##DATA TYPE= NMR SPECTRUM
##DATA CLASS= NTUPLES
##ORIGIN= UXNMR, Bruker Analytische Messtechnik GmbH
##OWNER= pz
$$ XWIN-NMR		Version 3.5
$$ Thu Aug  7 14:45:20 2025 Russian Standard Time (UT+4h)  she@DPX200
##.OBSERVE FREQUENCY= 200.1313
##.OBSERVE NUCLEUS= ^1H
##.ACQUISITION MODE= SIMULTANEOUS
##.ACQUISITION SCHEME= undefined
##.AVERAGES= 8
##.DIGITISER RES= 18
##SPECTROMETER/DATA SYSTEM= spect
##.PULSE SEQUENCE= zg30
##.SOLVENT NAME= CDCl3
##.SHIFT REFERENCE= (INTERNAL, CDCl3, 0, 15.4946)
##AUDIT TRAIL= $$ (NUMBER, WHEN, WHO, WHERE, WHAT)
$$ ##TITLE= Audit trail, XWIN-NMR		Version 3.5
$$ ##JCAMPDX= 5.01
$$ ##ORIGIN= Bruker BioSpin GmbH
$$ ##OWNER= she
$$ F:/spectra/data/she/nmr/H-C/1/pdata/1/auditp.txt
$$ ##AUDIT TRAIL=  $$ (NUMBER, WHEN, WHO, WHERE, WHAT)
(   1,<2025-08-07 14:43:52.56 +0400>,<she>,<DPX200>,
      <created by zg, POWCHK disabled, PULCHK disabled
       configuration hash MD5:
       00 E9 B6 7A A2 85 ED C7 34 08 36 98 17 FE 4E 26
       data hash MD5: 16K
       12 E2 07 1D EA 4C 1C D6 57 1D A1 D5 1D 07 F2 75>)
(   2,<2025-08-07 14:43:59.18 +0400>,<she>,<DPX200>,
      <Start of raw data processing
       efp BC_mod = 2 LB = 0.25 FT_mod = 6 PKNL = 1 PHC0 = -1201.604 PHC1 = 13.1923 SI = 16K 
       data hash MD5: 16K
       D1 54 89 0F 36 71 98 2A 95 C5 56 F1 6E 3C B4 2F>)
(   3,<2025-08-07 14:44:17.12 +0400>,<she>,<DPX200>,
      <pk PHC0 = 1.201359 PHC1 = 0 
       data hash MD5: 16K
       8B E3 75 40 2B 84 F2 70 BB B3 0A 39 38 29 D3 F3>)
(   4,<2025-08-07 14:44:21.20 +0400>,<she>,<DPX200>,
      <abs ABSG = 5 
       data hash MD5: 16K
       EB EF 89 A9 89 44 0A D7 D0 16 29 81 67 8A 7E 7A>)
(   5,<2025-08-07 14:44:45.59 +0400>,<she>,<DPX200>,
      <abs ABSG = 5 
       data hash MD5: 16K
       8B 19 B6 81 18 B8 68 7A 54 B5 1C 4D FD 92 9E 65>)
$$ ##END=
$$ 
$$ hash MD5
$$ 9E 91 C7 36 FA 9E 44 53 90 9B 69 9E A3 4C FB B9
##$RELAX= 
##$RELAX= 
##$RELAX= 
##$RELAX= 
##$RELAX= 
##$RELAX= 
$$ Bruker specific parameters
$$ --------------------------
##$DU= <F:/spectra>
##$EXPNO= 1
##$NAME= <H-C>
##$PROCNO= 1
##$TYPE= <nmr>
##$USER= <she>
##$AMP= (0..31)
100 100 100 100 100 100 100 100 100 100 100 100 100 100 100 100 100 100 
100 100 100 100 100 100 100 100 100 100 100 100 100 100 
##$AQSEQ= 0
##$AQ_mod= 1
##$AUNM= <au_zg>
##$AUTOPOS= <>
##$BF1= 200.13
##$BF2= 200.13
##$BF3= 200.13
##$BF4= 200.13
##$BF5= 200.13
##$BF6= 200.13
##$BF7= 200.13
##$BF8= 200.13
##$BYTORDA= 1
##$CFDGTYP= 0
##$CFRGTYP= 5
##$CHEMSTR= <none>
##$CNST= (0..31)
1 1 145 1 1 1 1 1 1 1 1 1 1 1 1 1 1 1 1 1 1 1 1 1 1 1 1 1 1 1 1 1 
##$CPDPRG= <>
##$CPDPRG1= <>
##$CPDPRG2= <>
##$CPDPRG3= <>
##$CPDPRG4= <mlev>
##$CPDPRG5= <mlev>
##$CPDPRG6= <mlev>
##$CPDPRG7= <mlev>
##$CPDPRG8= <mlev>
##$CPDPRGB= <>
##$CPDPRGT= <>
##$D= (0..31)
0 0.7 0 0 0 0 0 0 0 0 0 0.03 0 0 0 0 0 0 0 0 0 0 0 0 0 0 0 0 0 0 0 0 
##$DATE= 1754563431
##$DBL= (0..7)
$$ [...]
##$SUBNAM3= <"">
##$SUBNAM4= <"">
##$SUBNAM5= <"">
##$SUBNAM6= <"">
##$SUBNAM7= <"">
##$SUBNAM8= <"">
##$SUBNAM9= <"">
##$SW= 18.0517328524113
##$SWIBOX= (0..15)
0 0 2 0 0 0 0 0 0 0 0 0 0 0 0 0 
##$SW_h= 3612.71676300578
##$TD= 16384
##$TD0= 1
##$TE= 0
##$TE2= 300
##$TE3= 300
##$TEG= 300
##$TL= (0..7)
0 120 120 120 120 120 120 120 
##$TP= (0..7)
150 150 150 150 150 150 150 150 
##$TP07= 0
##$TPNAME0= <>
##$TPNAME1= <>
##$TPNAME2= <>
##$TPNAME3= <>
##$TPNAME4= <>
##$TPNAME5= <>
##$TPNAME6= <>
##$TPNAME7= <>
##$TPOAL= (0..7)
0.5 0.5 0.5 0.5 0.5 0.5 0.5 0.5 
##$TPOFFS= (0..7)
0 0 0 0 0 0 0 0 
##$TUNHIN= 0
##$TUNHOUT= 0
##$TUNXOUT= 0
##$USERA1= <user>
##$USERA2= <user>
##$USERA3= <user>
##$USERA4= <user>
##$USERA5= <user>
##$V9= 5
##$VALIST= <valist>
##$VCLIST= <CCCCCCCCCCCCCCC>
##$VD= 0
##$VDLIST= <DDDDDDDDDDDDDDD>
##$VPLIST= <PPPPPPPPPPPPPPP>
##$VTLIST= <TTTTTTTTTTTTTTT>
##$WBST= 1024
##$WBSW= 4
##$XGAIN= (0..3)
0 0 0 0 
##$XL= 0
##$YL= 0
##$YMAX_a= 178172
##$YMIN_a= -255829
##$ZGOPTNS= <>
##$ZL1= 120
##$ZL2= 120
##$ZL3= 120
##$ZL4= 120
##$ABSF1= 15.49458
##$ABSF2= -2.557269
##$ABSG= 5
##$ABSL= 3
##$ALPHA= 0
##$AQORDER= 0
##$ASSFAC= 0
##$ASSFACI= 0
##$ASSFACX= 0
##$ASSWID= 0
##$AUNMP= <proc_1d>
##$AZFE= 0.1
##$AZFW= 0.1
##$BCFW= 0
##$BC_mod= 2
##$BYTORDP= 0
##$COROFFS= 0
##$CY= -3
##$DATMOD= 1
##$DC= 0
##$DFILT= <>
##$DTYPP= 0
##$F1P= 0
##$F2P= 0
##$FCOR= 1
##$FTSIZE= 16384
##$FT_mod= 6
##$GAMMA= 0
##$GB= 0
##$INTBC= 1
##$INTSCL= 3.241238e-09
##$ISEN= 128
##$LB= 0.25
##$LEV0= 0
##$LPBIN= 0
##$MAXI= 10000
##$MC2= 0
##$MEAN= 0
##$ME_mod= 0
##$MI= 1.114404
##$NCOEF= 0
##$NC_proc= -7
##$NLEV= 6
##$NOISF1= 3.799351
##$NOISF2= 2.8
##$NSP= 0
##$NTH_PI= 0
##$NZP= 0
##$OFFSET= 15.49458
##$PC= 1
##$PHC0= -1200.403
##$PHC1= 13.1923
##$PH_mod= 1
##$PKNL= yes
##$PPARMOD= 0
##$PSCAL= 0
##$PSIGN= 0
##$REVERSE= no
##$SF= 200.130005428205
##$SI= 16384
##$SIGF1= 3
##$SIGF2= 2
##$SINO= 0.751879
##$SIOLD= 32768
##$SREGLST= <19F.Aceton>
##$SSB= 0
##$STSI= 16384
##$STSR= 0
##$SW_p= 3612.71676300578
##$SYMM= 0
##$S_DEV= 0
##$TDeff= 16384
##$TDoff= 0
##$TI= <>
##$TILT= no
##$TM1= 0
##$TM2= 0
##$TOPLEV= 0
##$USERP1= <user>
##$USERP2= <user>
##$USERP3= <user>
##$USERP4= <user>
##$USERP5= <user>
##$WDW= 1
##$XDIM= 16384
##$YMAX_p= 271257491
##$YMIN_p= -768684
$$ End of Bruker specific parameters
$$ ---------------------------------
##NTUPLES= NMR SPECTRUM
##VAR_NAME=  FREQUENCY,     SPECTRUM/REAL,   SPECTRUM/IMAG
##SYMBOL=    X,             R,               I
##VAR_TYPE=  INDEPENDENT,   DEPENDENT,       DEPENDENT
##VAR_FORM=  AFFN,          ASDF,            ASDF
##VAR_DIM=   16384,         16384,           16384
##UNITS=     HZ,            ARBITRARY UNITS, ARBITRARY UNITS
##FACTOR=    0.220516191357247, 1,           1
##FIRST=     3100.93043331468, 0,            0
##LAST=      -511.786329691097, 0,           0
##MIN=       -511.786329691097, -768684,     0
##MAX=       3100.93043331468, 271257491,    0
$$ Real data points
##PAGE= N=1
##DATA TABLE= (X++(R..R)), XYDATA
$$ [...]
8263 8265551 8534856 8578431 8379697 8475514 8562745 8763703 9191104 9039177 9037001 8937375 8782693
8252 8782693 8387694 8364758 8367129 8278508 8478169 8591768 8372578 8377358 8609510 8712277 8694954
8241 8694954 8621295 8478469 8186367 8434388 8174048 8208892 8116321 8023594 8130804 8302728
8231 8302728 8519448 8592063 8475134 8673671 8486455 8503748 8374540 8298043 8613977 8328685
8221 8328685 8100853 8003739 8466863 8320430 8036183 8020540 8326197 8430722 8450162 8126982
8211 8126982 8237601 8567987 8433499 8386569 8515302 8333800 8238480 8400625 8478145 8583453
8201 8583453 8622310 8582909 8496984 8591316 8530824 8247621 8352802 8777740 8388367 7754036
8191 7754036 8405287 8521679 8922783 8916083 8308506 7895776 8239717 8715608 8492299 8520823
8181 8520823 8550418 8613431 8167622 8621309 8772912 8710323 8585649 8608833 8556686 8519291 8630298
8170 8630298 8766508 8868762 8754058 8545228 8280352 8272494 8637039 8654663 8591495 8839834
8160 8839834 8743266 8800478 8847541 8881503 8601710 8599499 8559024 8799571 8889208 8647512 8562480
8149 8562480 8474730 8818534 9013532 8773824 9123259 9167028 8908174 8907242 9019483 8927907 8808617
8138 8808617 8679774 8697610 8875421 8493405 8625534 8563023 8373870 8935729 9312900 9060433
8128 9060433 8518340 8374901 8417058 8534290 8911216 9022586 8944418 8772870 8537692 8498079
8118 8498079 8747735 8867650 8774717 8498411 8419499 8693247 8955027 8752545 8636648 8483296
8108 8483296 8654826 8699010 8571909 8628516 8660548 9020690 9033522 8901368 9019940 8900715
8098 8900715 8802021 8505875 8488204 8795011 9049783 9116900 9185289 9443295 9256213 9011627
8088 9011627 8967351 8782308 8793805 8805431 8617255 8568068 8356405 8404492 8706241 8799426 8904008
8077 8904008 8929746 8993356 8898777 8818970 9031061 8799783 8705323 9073876 8752282 8581708
8067 8581708 8850752 8937009 8839574 8841262 8929865 8881975 9047120 9090342 9020083 8909934 8926945
8056 8926945 8867336 9025583 9113427 8855759 8989248 8679466 8678752 8945976 9182013 9250373 9045429
8045 9045429 8713602 9031806 8815817 8702783 8890075 8948140 9116417 9307122 9251096 9252907
8035 9252907 9377814 8961362 8929842 9357973 9341151 8888211 9081273 9122159 9057290 8897869
8025 8897869 9078908 9125258 8890353 8801531 9029717 9132487 9174728 9189795 9065216 8815990
8015 8815990 8921707 9097305 9305158 9146065 9153620 9086567 9140567 9231779 9400044 9431823 9623760
8004 9623760 9725886 9697476 9681395 9708337 9658210 9572748 9304937 9255044 9437480 9501429 9333678
7993 9333678 9566678 9857190 9727405 9689058 9667820 9629443 9297825 9193924 9314743 9428537
7983 9428537 9451696 9610787 9601567 9645244 9396256 9323757 9699671 9791278 9829564 9659315 9495944
7972 9495944 9900769 10024679 10028927 10182428 10310920 10060374 10176201 10300344 9967671 9635730
7962 9635730 9603697 10141377 10434468 10424407 9953441 9782114 10018342 10068226 9989934 9977028
7952 9977028 9883822 9919699 10147709 10603881 10439466 10344971 10509943 9935290 10233235 10522437
7942 10522437 10350556 10204698 10410590 10227432 10264301 10327394 10301767 10203777 10215364 10364203
7932 10364203 10554280 10465804 10569806 10728851 10697178 10542870 10474955 10534895 10524508 10368631
7922 10368631 10553344 10528712 10188307 10725679 10672570 10823703 10814169 10277031 10444793 10683222
7912 10683222 10802078 10466856 10458130 10591951 10579813 10815581 10805085 10774479 10687714 10671126 10572420
7901 10572420 10560529 10757448 10839684 10948959 10853902 10636384 10710458 10759470 10460976 10006241
7891 10006241 9998517 10332201 10117230 10428628 10695005 10761002 10506974 10363954 10642655 10692462
7881 10692462 10445931 10521086 10668776 10213543 10130184 10318079 10508377 10716410 10799254 10687176
7871 10687176 10393409 10266890 10484072 10577911 10517828 10650078 10647544 10636132 10626290 10443774 10349836
7860 10349836 10685555 10817211 10627035 10759712 10482626 10971211 10879529 10571031 10487054 10480230
7850 10480230 10379397 10325415 10391357 10497897 10603985 10869905 10868951 10924970 11003909 10853039 10890815
7839 10890815 10657791 10369250 10679097 10360109 10226555 10699385 10726360 10782925 10615921 10788718
7829 10788718 11048081 10873105 11028467 11005582 11083314 10809468 10491385 10521249 10501820 10429978
7819 10429978 10763165 11030576 10751029 10652081 10437816 10792502 11169864 10862503 10889882 10987069
7809 10987069 11169308 11085789 11068851 11163688 11079649 11269346 11209897 11088655 11218838 11061080
7799 11061080 11142894 11592576 11336399 11160592 11252914 11670934 11315776 11285699 11069935 11123604
7789 11123604 11158255 11050149 10968837 10990488 11021589 10888722 11289077 11491954 11189357 11314383
7779 11314383 11426297 11634094 11711416 11703617 11332199 11328217 11471886 11585675 11613269 11416260
7769 11416260 11461178 11469849 11640119 11569793 11610653 11314987 11781083 11897687 11756075 11665503
7759 11665503 11273463 10910886 11012644 11302966 11146233 11181741 11191087 11292671 11363862 11395975
7749 11395975 11635067 11372878 10931323 10938105 11051585 11234571 11406530 11334890 11115386 11271512
7739 11271512 11443168 11170048 11143548 10946468 11150137 11517086 11545037 11436197 11189232 11356935
7729 11356935 11510310 11493664 11482220 11204920 11176825 11239471 11294350 11281605 11313383 11420280 11308922
7718 11308922 11061353 11085410 11354093 11402441 11048966 11149314 11416736 10852009 10791701 10843940
7708 10843940 11182420 11168773 10947613 10892708 11035455 10825680 10718995 10858359 10768694 10879157
7698 10879157 10920719 10892281 10755784 10932528 11197169 10781742 10593396 10692767 10397282 10535851
7688 10535851 10546654 10441532 10430131 10128225 10384563 10654187 10317568 10458899 10374962 10154622
7678 10154622 9963944 10026736 10108535 9925077 10122032 10169918 10057206 10293936 10196809 10006081
7668 10006081 10096204 10082313 9746032 9616197 9739430 9765180 9739824 9862937 9974818 10031034
7658 10031034 9492759 9509948 9506323 9152081 8984552 8949764 8917636 8970139 8799024 8562885
7648 8562885 8815289 8940872 8787517 8965111 9047880 9078795 8937883 8954441 8830810 8546974
7638 8546974 8386513 8543071 8348501 8071834 8084007 8061177 8000831 7984251 7743867 7760839
7628 7760839 7836100 7705675 7727804 7588810 7887037 7763354 7624145 7419792 7445886 7303762
7618 7303762 7262275 7075116 7191733 7114038 7375918 7090040 7039822 7238570 7069790 6940427
7608 6940427 7049905 7131866 7149296 6876597 6716747 6484762 6474811 6918477 6825546 6798914 6988625
7597 6988625 6731524 6074816 5746505 6002242 6126384 5828164 6157892 6369653 6081721 6242544
7587 6242544 6011397 5767039 5598688 5578807 5652180 5705244 5788578 5949600 5784187 5071586
7577 5071586 4727009 5194926 5281643 5216031 5252644 5088038 5076937 5094179 4965738 4577791
7567 4577791 4661225 4796768 4762506 4611830 4425252 4669185 4760977 4429786 4279048 4299760
7557 4299760 4515849 4439464 4505726 4400348 4657519 4660011 4519216 4325030 4498274 4514372
7547 4514372 4325932 4367104 4225462 4135953 4001567 3531411 3683112 3892632 3855185 3721868
7537 3721868 3475852 3432301 3712992 3709005 3423832 3497702 3483112 3395624 3470376 3263800 3297873
7526 3297873 3147800 3234430 3259693 3224453 3196136 3259316 3336868 3204002 2852914 2711844 2919024
7515 2919024 3051901 3286334 3275355 3205749 2816474 2816402 2615621 2439843 2671346 2969514 3040132
7504 3040132 3146327 3017458 2610425 2461263 2446014 2921444 3173719 3279683 3004378 2731037
7494 2731037 2561794 2540794 2657022 2909569 2855755 2573888 2422957 2399128 2629529 2330088
7484 2330088 2407904 2365916 2168227 2232222 2500491 2098047 1774178 1820227 2071624 1981013
7474 1981013 2010089 2183144 2078733 2139502 1908777 2071911 2106872 1937247 1963946 1960788 2004358
7463 2004358 1835915 1839742 1836308 1555667 1635545 1971279 1775637 2050555 2321948 1916566
7453 1916566 1820813 1660859 1846578 1912384 1920436 1746839 1638711 1594240 1730985 1773668 1721147
7442 1721147 1569023 1187239 1352617 1498487 1541549 1415232 1475939 1498275 1461392 1652580
7432 1652580 1613709 1335234 1486123 1405760 1213286 683167 1013632 1095066 1276907 1232272
7422 1232272 1396501 1494515 1280927 999785 1170250 1416404 845982 1035708 1389019 1396267
7412 1396267 1344532 1407641 1397880 1305277 1069698 1035718 1112285 1172387 1185229 1219620 1301451
7401 1301451 931705 585319 780917 819523 729351 645650 1160710 1590469 1444267 1030769
7391 1030769 694905 651260 1039341 827874 781301 1033425 995256 935076 903224 904772 1024572
7380 1024572 911618 813749 916612 1128599 1064487 1026525 1109890 1093757 1157531 1107801 1333132
7369 1333132 1050663 892012 912109 530473 562850 741462 558294 489983 630482 842394
7359 842394 788955 748553 660470 552327 610593 758748 820030 645467 779252 915554 968094
7348 968094 869217 887007 855048 958472 874956 1036371 1077686 1159072 1102896 1150046 1097654
7337 1097654 985106 893382 592015 691656 745694 590555 862331 920580 1179238 870993
7327 870993 836558 882623 762691 853093 772223 738400 555834 818197 751871 436791 600943
7316 600943 793568 223075 448045 640618 709383 675541 473403 406751 557368 666749
7306 666749 790995 632241 526135 525220 430279 512735 265466 503511 837143 956891 689604
7295 689604 354425 442048 402411 481364 714192 546165 510275 546421 554972 572646 632334
7284 632334 625333 346336 183077 287021 675538 777754 515008 516666 745747 603341
7274 603341 465496 438735 175941 74163 221879 231841 200965 483957 495954 736425 371724
7263 371724 314025 202474 229111 551972 97028 318785 289528 255748 277967 644554 530971
7252 530971 532686 381213 410395 467363 481854 412919 455174 434536 500730 346388 379915
7241 379915 317813 372270 312489 211302 171075 162013 139045 234519 196020 215730 146511 144597
7229 144597 98111 105109 68765 -30760 164711 194238 297822 390593 498549 376217 487631
7218 487631 245934 185158 -1497 384236 545298 237930 49405 277332 309044 307886
7208 307886 266808 279945 92206 232829 367853 92409 452384 338035 209478 253749
7198 253749 254676 471669 175933 320050 123080 -278594 -47657 245490 365273 359354 129940
7187 129940 154636 24258 -14665 165964 124969 30237 -160063 315710 242894 319731 410525
7176 410525 270199 268321 49800 199543 -110545 -170135 54689 263091 303715 378118 148963
7165 148963 177517 46682 410576 319633 77786 115828 45947 96187 -21177 -207067 7468
7154 7468 -90445 -118226 12808 -78065 -118852 386794 578259 362576 390549 37545 290231
7143 290231 203376 249755 133237 324910 282727 263108 420733 85612 110814 104952 122994
7132 122994 315859 188508 48520 314589 183450 -51843 -194789 -353745 -126946 133708
7122 133708 295018 399479 642046 408075 344659 475183 413867 -11764 379780 242515
7112 242515 259661 365429 341958 331235 240627 172910 211123 204370 194077 319223 109604
7101 109604 62426 125757 -42121 -294572 -39041 92270 123421 59400 -93294 -54002 47225
7090 47225 148478 369364 84867 58377 -69426 -447674 -102162 145138 127489 267050
7080 267050 341173 116277 187721 387542 486171 784767 709408 368328 -7067 158158
7070 158158 326901 -48585 -57773 46082 121148 -267327 21562 -43893 -105053 -16047 -341195
7059 -341195 -118635 -46884 66101 57532 -180513 -247997 181317 101348 97678 203220 -54350
7048 -54350 -64664 319500 84657 19606 -71135 119029 167683 162574 -25744 64797 397214
7037 397214 304366 -82938 -187652 -121811 -274050 -109779 123066 104212 137193 140557 158951
7026 158951 290247 213625 329578 53580 -225684 -191655 -123149 253607 310206 51
7016 51 132625 149299 177809 290169 439778 71606 -136901 246557 159277 393186 534093
7005 534093 141151 -166 -130256 204552 331964 184811 10490 199781 198292 -133930
6995 -133930 -254754 -27825 -183159 -52140 48772 388711 288741 357075 161662 68473
6985 68473 32929 -109318 -77310 -207951 -59818 -365265 -182469 84440 165693 -19890
6975 -19890 169401 89974 262946 370256 55276 -152413 -144669 -11209 17057 180485 392321
6964 392321 265633 14625 134102 240099 119043 -41174 128304 178365 -83319 9703
6954 9703 -225718 -208400 68859 363779 90481 -93556 -84646 -121663 -263739 -69749 -42974
6943 -42974 -38571 -11372 67716 214032 390591 257957 -1130 11070 54066 101702 59731
6932 59731 292337 67051 -48002 -26208 -155706 -392933 -418506 -563576 -484706 -171806
6922 -171806 -175361 -7931 89258 -152446 -53387 -223382 -292199 -177301 -402253 -167523 6017
6911 6017 -134211 -218680 -331210 -182529 -157745 -328321 -160086 -156045 -98764 -220147 -85297
6900 -85297 -157768 -184920 -117529 -210037 -118784 -303495 -13165 -35915 -453822 -446358 -347504
6889 -347504 -143282 -191527 -266733 -86184 -41664 6336 8192 118990 74835 -400336 -150022
6878 -150022 -105294 -60392 -57416 -239880 48951 93300 -199949 -277004 -337522 -180585 226463
6867 226463 87158 14113 -144249 179756 94501 -335233 -285319 16595 215693 281650
6857 281650 14941 -145267 -92235 54484 -28066 -104480 -204986 -386075 -322107 6330
6847 6330 -206329 -81642 76309 203068 289770 257479 87768 -106768 91907 -68348
6837 -68348 -142377 -113566 -478150 -96864 307401 359691 -39331 32137 200822 -19212 -15443
6826 -15443 -200005 2476 183420 37784 65073 142003 -148384 -519844 -713661 739
6816 739 -159053 -509471 -180443 -170872 -239874 -136423 136076 117173 228940 -120760 -37274
6805 -37274 46072 -36712 20491 336637 519195 197599 27674 72400 133370 -268195 -22378
6794 -22378 -101598 -367745 -368477 -60202 9833 137698 500315 352864 108211 -139739 -47081
6783 -47081 62915 -5108 -36560 -168789 99806 17020 72061 -58191 52514 120592 -20510
6772 -20510 -257173 -226128 -137157 -308339 -174474 -63882 -173712 190034 92966 -119308
6762 -119308 -143396 -73060 2135 -49205 123089 295151 331601 122483 -214871 -47426 116658
6751 116658 222153 -79195 -244391 -201040 -13650 123537 313252 67547 -8587 412775
6741 412775 215983 139084 -226449 -345680 -128603 -70816 -299971 -214127 -130382 -168638 -253796
6730 -253796 -282041 -229963 -22596 -1438 199307 123012 -154054 -87059 11553 189186 448630
6719 448630 422526 134314 -119698 -120401 -230467 -14099 -108500 8580 343954 349705 316234
6708 316234 194 92313 141032 8660 -245806 -198511 -144913 -169686 230437 151494 -222305
6697 -222305 -604398 -328029 117989 -215007 -325312 -413177 -532337 -210299 -233378 -250409
6687 -250409 30556 -76532 -109821 -14487 -6608 -203283 -247414 -120754 37626 270719 -119138
6676 -119138 -155714 139481 14513 23150 -108993 -364607 -418575 -180315 -190006 -130580 217297
6665 217297 43558 -116331 -130846 -210127 -371920 -412703 -382550 -43746 5003 45686 10325
6654 10325 -314534 -768684 -483329 -411142 -387613 -272184 -140067 -164955 -245606 -117364 -66988
6643 -66988 -328104 -282980 -332020 -364338 -308721 -263285 -316666 24709 375335 134450 274057
6632 274057 303591 100324 -35407 -66084 -256984 -143149 -34938 133826 -128125 -218452
6622 -218452 101151 -330679 -518524 -443032 -253907 67148 100155 -155903 -82903 -93390
6612 -93390 -345006 -511740 -756221 -347183 -462656 -317784 -201565 -465665 -73835 -162715
6602 -162715 -431462 -285323 -563337 -237601 -540545 -474198 -642304 -520803 -64323 -98077
6592 -98077 -239955 -222118 -309187 -406746 -216617 -229211 -73173 -87564 -216495 -87278 120213
6581 120213 -186851 -301129 -395827 -250949 -105446 -399313 -456677 -579439 -232865 -178115
6571 -178115 -260239 -193006 27775 224131 5098 -136484 -261738 -200573 -212287 -8027
6561 -8027 266469 235255 -80359 -239561 -142462 -373896 -178626 -123940 -94451 -100525 119884
6550 119884 -17261 -141397 -198332 -459207 -345372 -436214 -307991 -222355 -353010 -581535
6540 -581535 -609670 -560333 -385568 -132545 17353 -187641 -436158 -479414 -370030 -399284
6530 -399284 -402105 -269102 -162492 -135651 -3906 -151348 -101050 -209136 -454434 -343929
6520 -343929 -130794 -414267 -280953 -212478 -310770 -170127 -117547 -121970 -127968 -134372 111841
6509 111841 395353 295559 452732 78891 -156065 -5203 121675 249195 347504 -20841
6499 -20841 -47998 -49403 -167918 189955 192078 96919 128916 156279 73527 -346619 -514888
6488 -514888 -146444 -173670 -186417 172717 54414 -13723 -60801 -275312 -330617 -295037 -202728
6477 -202728 -546939 -53379 11004 -479502 -450382 -300206 -31774 -52384 -158015 -82854
6467 -82854 -93201 -119337 -35645 -18042 -69671 63585 309191 276287 127868 65108 -77026
6456 -77026 122485 -11542 -23536 35237 69708 -124508 221909 120316 -121112 -132731 229133
6445 229133 289965 -132369 -371149 -193844 -186385 -115118 -46895 -54336 -108699 -89773 -165994
6434 -165994 -196023 200850 106088 142308 -260094 -393672 -476993 -539395 -286218 -317885 -391129
6423 -391129 -388135 -539537 -100335 169380 400051 -197368 -138421 -212532 -203903 126597 -211519
6412 -211519 -474488 -489640 -194218 132644 149889 143216 -134054 -207214 -137952 -167075 -247734
6401 -247734 -94012 -152161 -194418 -566178 -227863 85166 127233 -191108 -365401 -2172
6391 -2172 -375922 -251039 -178037 -60246 16279 -38684 -239210 -66925 25028 -46047 -159163
6380 -159163 -264313 -131255 -21939 -204460 -364237 -338687 -101162 -215284 -431459 -23075
6370 -23075 109451 -156719 -348695 -134548 -15391 -162330 -71166 -303463 -48869 265265
6360 265265 380034 290767 152947 261323 -165701 -209250 -23927 85403 -50681 -159404
6350 -159404 -243176 -263416 -308992 -380995 68352 -18041 -295712 -309385 -206199 -511642 -421993
6339 -421993 -284871 -351481 -123682 -119865 -168401 -31154 -69345 46033 -400798 -672891 -336600
6328 -336600 -208173 -188108 -650954 -563596 -17148 136055 -153507 -500693 -255926 -97137
6318 -97137 -611384 -632831 -454884 -281978 -160724 -235493 -307099 -275097 -166877 -355164 -118408
6307 -118408 79681 -148142 -7203 -152309 -191272 250347 18457 34345 343401 56654
6297 56654 186543 290883 116628 -215333 -281882 39844 144033 117739 -213626 -347242
6287 -347242 -162938 -179742 -334366 -242884 -134204 14451 -33597 -56239 167485 -283375
6277 -283375 -261358 -299222 7262 302208 -92298 -300009 -305733 -127762 -157260 -262526 -181464
6266 -181464 -421796 -473018 -336397 -574587 -192456 -322224 -616760 -388204 -303255 -367967
6256 -367967 -217862 -93081 43792 8761 51426 377585 147342 55449 -120621 193344
6246 193344 403591 236552 -94912 -147517 -257978 -326681 -256187 -621324 -576303 -443783
6236 -443783 -10889 107242 -132708 -23015 -115418 -239788 -75481 -384761 -66513 49953
6226 49953 126030 64979 51643 -287477 -341298 -49206 -98872 -226807 -115464 27659 64607
6215 64607 79057 -23144 -252203 92373 -291 -198172 -28021 -256166 -13512 116616
6205 116616 270191 425765 409980 80898 -83808 92870 -14836 -141024 -182396 31540
6195 31540 -98849 -24435 172839 -199088 -113608 -198507 -127882 93287 -209006 -223292 45668
6184 45668 -93847 -68264 -42439 66739 286765 230386 347633 376499 219467 212788 145648
6173 145648 122429 -192163 -37645 -203163 -18432 295852 174115 -7765 -15714 172758
6163 172758 160657 -113063 -205702 34904 48318 45842 71158 -31189 -62135 46762 219336
6152 219336 320786 340740 270492 117408 92221 153333 226130 382967 384272 248145 261250
6141 261250 143856 56086 196033 82202 -274382 -61943 -40885 -58183 66163 344
6131 344 -175240 -130471 96258 29268 -205165 -397471 -2430 -137389 -75978 -59512 121092
6120 121092 -87164 -34849 320497 223507 98863 -301111 -339153 -256361 -111754 65271
6110 65271 4671 38547 -18774 -196765 -507192 -247910 -124035 165844 492116 225087
6100 225087 557396 669337 360346 170790 362728 400855 284198 -944 -70110 86665
6090 86665 132525 54581 200293 395040 805706 263113 17011 402358 535276 480417
6080 480417 553477 735133 675235 378501 351082 345935 409436 437121 386166 448314 744518
6069 744518 591229 274056 313333 421591 563787 387899 296637 111062 308061 421945
6059 421945 339663 390806 310554 15928 -138645 -63415 204061 228681 21985 242411 189104
6048 189104 302118 623935 480537 288255 739402 732062 557537 290905 238319 384261
6038 384261 -185267 57006 287611 106516 91394 237837 522866 523953 605234 460444
6028 460444 108734 61440 -67836 -147403 -104538 -301881 -293183 202453 189372 -26729 -184929
6017 -184929 -102185 39946 235881 24655 -155302 98875 337391 438748 260637 297119
6007 297119 245305 183065 -95627 103189 256784 -39360 -19671 175283 -151 -186524
5997 -186524 -91455 215151 -23963 76066 345446 267227 359063 216619 -55687 20480
5987 20480 52376 -108696 -48699 25708 125601 -224422 -121569 -68326 212551 67337 -176879
5976 -176879 283372 87585 49001 393308 591749 618619 376510 275509 187149 220438
5966 220438 26700 12659 -79236 6930 316969 300255 359042 281606 458924 573693 119428
5955 119428 107715 190841 -2507 -167962 -143461 -99430 47685 -272817 -135226 -10241
5945 -10241 -211832 88730 500173 131430 -292145 -48084 159375 107952 -124903 -79939
5935 -79939 -364139 -169745 97522 9855 -54692 143501 277366 116646 11837 219300
5925 219300 230577 381747 278533 157325 241747 -11366 -227225 -86279 -245295 152939
5915 152939 404040 522310 572350 373591 395073 373914 12576 -191111 120241 63959
5905 63959 -47247 -407185 -277945 89277 134597 -46870 -116578 -26341 308934 484959
5895 484959 308345 850 62788 105433 -107218 -127244 160297 -7395 -59112 37954 -65091
5884 -65091 -107094 62713 103382 246656 551952 488210 166139 -11816 -76344 -138843 217911
5873 217911 -103406 -215448 -10364 -1107 -31937 -51781 201306 73955 -13883 -34004 35517
5862 35517 -103490 -173762 47857 -162420 132801 42459 -9970 61883 -127338 -13975 78612
5851 78612 -16713 -24390 52147 -118203 -167740 -3845 100766 147711 238508 219605 63120
5840 63120 -61222 115901 112971 118447 36566 -199340 -151076 21201 -206042 -65655 -167939
5829 -167939 -179430 -114220 -183840 69421 -87394 -9019 -33424 90265 206380 304164 334459
5818 334459 170938 -23391 -139474 -106446 42089 -33404 4732 -200556 -34809 -158501
5808 -158501 -177597 86222 352066 211830 -14839 -11618 -208903 -133903 -231068 -124708 28847
5797 28847 102423 77247 133816 140608 336409 267820 -11764 98692 -143657 -454273 91153
5786 91153 246688 54642 -37712 105426 613101 346248 609015 520076 503772 402774
5776 402774 202457 581039 379262 403965 368214 227568 274037 216991 210161 207124 392866
5765 392866 371850 62348 123183 216065 307694 146485 355993 493419 487988 134047 -178119
5754 -178119 -368552 11367 414325 326226 268381 322885 282755 347842 471770 773707 741215
5743 741215 346887 -125300 14605 160382 151665 30596 -32967 266418 184165 172867 211131
5732 211131 98653 100443 302733 305019 504612 740518 548355 670358 948581 855028 546665
5721 546665 180228 -72408 88320 54608 402401 570335 235462 228000 341063 279570
5711 279570 11363 51164 -214820 -121485 282299 423249 342429 61323 -5339 194972
5701 194972 392618 430386 508847 363373 180735 305649 225213 543052 772378 1027761
5691 1027761 636352 408199 328824 276008 425717 476876 487730 374768 414402 459840 330463
5680 330463 562915 909475 551448 357618 719909 655929 392521 533337 762460 595624
5670 595624 604530 583172 612160 479501 489598 728379 610714 653547 834045 846402 901325
5659 901325 735292 473213 323146 432378 864144 482939 491310 941604 757939 485287
5649 485287 647439 907953 847216 993560 887241 736257 795254 879964 836749 875870 728941
5638 728941 529702 743837 483695 405858 431438 814508 861859 636903 642448 389089 330997
5627 330997 550626 775594 877417 752779 581769 668540 652303 570863 646373 585587 636780
5616 636780 676130 642963 512061 662158 606365 437881 681508 603702 767344 955885
5606 955885 787489 759773 550405 684063 980786 838761 808660 603387 480924 747837
5596 747837 792568 728531 884053 1103990 738115 826484 818031 728124 1034451 1037066 994860
5585 994860 1179295 1415370 1073123 727570 701158 723887 961148 748873 723607 873694
5575 873694 1030864 913422 1066007 1039213 719401 485115 628173 807892 646978 699311
5565 699311 1180075 1308400 1190329 1253555 764301 875439 1037109 829982 884701 888771
5555 888771 580913 695601 708951 989953 1316871 975023 992930 940734 1171589 1088430
5545 1088430 991086 854297 656526 1139690 1086043 1129429 743605 774819 1060511 786804
5535 786804 782959 970467 1007078 991775 919253 805370 779934 764867 719016 965876 654090
5524 654090 761351 504598 571131 838891 916378 826672 1023832 1557748 1318687 1132034
5514 1132034 1177300 1249687 861796 922295 1155684 988707 936006 1077946 1022230 799284
5504 799284 910995 1094327 1235112 1042908 1050226 1168546 991548 927052 754986 536204
5494 536204 531854 909197 631106 343182 367038 399727 735787 892303 1113898 755940
5484 755940 806007 933300 734672 867115 731768 722051 973024 1067521 833383 923238 1104480
5473 1104480 914023 1049531 1116074 1066588 939628 905994 1411638 1561499 1704038 1380065
5463 1380065 1154638 903800 930141 976168 874560 873652 1006920 829096 1309874 1537609
5453 1537609 1362338 1439248 1415471 1063049 1103405 1292394 1363162 1638935 1311572 1318548 1563948
5442 1563948 1352604 1204723 1516389 1355917 1220893 1579903 1668161 1286463 1382796 1669586
5432 1669586 1539736 1534419 1703032 1687515 1564426 1362688 1570513 1495509 1517360 1404195
5422 1404195 1260210 1311052 1324111 1241256 1166290 1567948 1541102 1383754 1337711 1457149 1738105
5411 1738105 1630018 1574452 1585756 1755177 1798713 1731572 1807423 1906284 1875780 1565292 1530814
5400 1530814 1153105 1327537 1466218 1171839 1495345 1867486 1272329 1255901 1414595 1392854
5390 1392854 1405345 1344105 1287857 1257264 1372506 1325552 1259134 1156655 1170318 966744 1030684
5379 1030684 1516954 1703851 1619268 1721572 1635743 1589089 1679099 1487633 1513662 1618613
5369 1618613 1609983 1767081 1594435 1766852 1552180 1354694 1520261 1472259 1384930 1337913
5359 1337913 1233892 1346413 1523458 1570407 1577619 1795760 1626117 1615410 1691045 1795377
5349 1795377 1919779 1840073 1912789 1994311 2040043 1880273 1564636 1736116 1802948 1847399 1855750
5338 1855750 1680651 2090098 2077560 1861730 1809352 1721608 1770279 1954493 1656814 1519394
5328 1519394 1960746 2096227 2279007 2327028 2232163 2332411 2136380 2215534 2573842 2810090
5318 2810090 2737461 2261143 2245839 2178220 2337003 2567089 2549017 2461606 2380908 2753136 2958063
5307 2958063 2889221 2661100 2706225 2886743 2971624 2820518 2732599 2994411 3179730 3279141
5297 3279141 3378466 3315823 3605074 3839449 3599854 3563486 3976103 4082562 4149317 3868810
5287 3868810 4067291 4567555 4802123 4762306 4622096 4614240 4813946 4889170 5088744 5339647
5277 5339647 5407277 5725237 5743984 5949890 6362005 6571609 6711237 6799975 7098578 7132726
5267 7132726 7304026 7743762 8230910 8491064 8655369 8725166 8956993 9410045 9568354 9688373
5257 9688373 9701844 10062746 10327304 10793603 10756789 10747518 10990117 11056648 11124878 11504976 11353225
5246 11353225 11443903 11979947 11840373 11787020 11933984 12483231 13213044 13464813 13454464 13545806
5236 13545806 13745041 14153133 14316366 14602163 15167005 15202593 15345683 15565961 15553856 15774079
5226 15774079 15743235 15408906 15340620 15136972 14995172 14805364 14531347 14282825 13856453 13179188
5216 13179188 12952442 12538189 12419563 12396964 11918810 11746627 11428899 10976508 10749890 10472240
5206 10472240 10269615 10232287 9935856 9676647 9729279 9624951 9393483 8991830 9089077 9306131
5196 9306131 8922160 8657366 8429804 8132898 7846517 7465283 7328237 7164818 6707977 6340648
5186 6340648 6159873 5821560 5360125 5292040 5061733 5098349 4932223 4737967 4397163 4449776
5176 4449776 4290270 4050108 3957414 3766358 3722347 3102371 2789318 2889894 2849200 2797196
5166 2797196 2670967 2427675 2379389 2687649 2539476 2687460 2372464 2070731 2129071 2366331
5156 2366331 2347428 2337024 2149380 1731491 1700676 1820988 1799109 1452867 1591359 1597203 1474547
5145 1474547 1732146 1830284 1921037 2039065 1689834 1287195 1079704 1168518 1107537 1487482
5135 1487482 1463553 909880 1040902 996042 1231142 1291688 1231566 1444484 1351477 1207746
5125 1207746 1160194 1201542 1091921 1159215 1140549 1382459 1224764 1264065 1376684 1097501
5115 1097501 1214067 1416301 1269771 1176574 1397232 1213597 932960 891951 639433 480978
5105 480978 628250 868608 859758 915078 990789 933742 919499 706631 750525 859586 570511
5094 570511 503947 530222 475785 824233 910793 680126 628098 798131 1029399 929239 717277
5083 717277 648112 597860 546206 412382 246467 465105 817036 849714 733231 811906 781093
5072 781093 300729 668952 913858 1114872 1186564 875569 769223 856130 715108 721374
5062 721374 692480 790305 886497 572726 589273 489687 910197 850544 971565 742462 804252
5051 804252 652912 340922 628440 842645 438132 741836 708177 679577 829512 642200
5041 642200 404603 834445 806312 438115 431878 475655 684488 832843 674548 724236 901526
5030 901526 892535 961667 784770 770463 571178 780093 644470 679421 668010 780790 583291
5019 583291 594660 541998 506149 611780 1123226 1140336 878683 553519 482074 348833 357825
5008 357825 578505 693798 803387 670081 389932 550103 856878 713962 666022 583830
4998 583830 703495 926198 973463 884454 735049 558067 182620 -24302 182455 237616
4988 237616 246023 300361 812924 952883 903217 890156 951671 848143 731646 860246 975557
4977 975557 838238 738305 718708 696727 883461 932033 934291 814069 1022661 802469 741401
4966 741401 739131 864106 1200373 1011541 798324 726822 685100 616702 789422 822016 1051960
4955 1051960 1317048 1150543 952986 1010704 1037444 958800 1182937 1069724 975454 1170831
4945 1170831 1230419 1274546 1055795 915141 865380 1039345 1076048 866002 1273158 1171313
4935 1171313 935867 848117 1190069 1196708 996007 1068828 1149609 1017600 975140 999825 930536
4924 930536 568719 732404 1044458 1114673 1109125 980178 1274361 1465022 1637207 1642189 1220343
4913 1220343 1060167 1541175 1346709 1147397 1293981 1553283 1495300 1252566 1153330 1209507
4903 1209507 1236489 1210657 1307209 1346834 1276453 1390870 1457118 1550226 1406339 1335859 1856308
4892 1856308 1947142 1715851 1934579 1844008 1843973 2122395 2105398 1873659 1633917 1616889 2134877
4881 2134877 2477683 2342985 2033212 2240063 2075674 2134622 2350229 2040802 1799485 1770299
4871 1770299 2011507 2276001 2425789 2667401 2823169 2821196 3209472 3483172 3644587 3593729
4861 3593729 3642329 3984266 4249850 4109139 4328344 4056881 4282875 4333508 3727031 3809637
4851 3809637 3779030 3967650 3599275 3305758 3074693 3229322 2832507 2259678 2062945 2243895
4841 2243895 2037420 1881074 1961608 1887883 1937360 1981046 1831927 1621082 1653526 1655740 1631764
4830 1631764 1423878 1645143 1548665 1606648 1611323 1680426 2041325 2009540 2073325 2116213 2002761
4819 2002761 1899885 2227237 1916623 1744432 1760379 1721002 1777764 1663677 1933652 1674040
4809 1674040 1272827 1289463 1345362 1374720 1566773 1388305 1568904 1672657 1605629 1288115
4799 1288115 1123432 982440 1046619 1158308 1549992 1678519 1573944 1619887 1513628 1060541
4789 1060541 1112679 979070 662266 1156628 1490461 1607162 1532235 1239862 1155488 1071501
4779 1071501 1014990 1153053 1104475 1145464 1124734 1201212 1173709 1140552 1187070 1348899 1449956
4768 1449956 1115451 1049824 1074912 1113312 1280273 1387662 1063865 1246753 1452863 1378482
4758 1378482 1585794 1588051 1659041 1528014 1521892 1450308 1665919 1539410 1486030 1540683 1340814
4747 1340814 1392212 1444478 1195865 1382524 1530625 1607258 1335512 1200950 948800 1050148
4737 1050148 1153944 1130320 1087800 929973 1111143 797483 858934 956129 1058537 912692
4727 912692 938223 1203485 1412242 1661709 1607603 1520136 1632368 1649697 1887668 1727256
4717 1727256 1779248 1514755 1229524 1186356 1091090 1410120 1325423 1246255 1224668 1496470 1334658
4706 1334658 1095044 1365196 1456345 1374450 1173219 1383801 1386398 1507539 1497710 1543505 1374301
4695 1374301 1383293 1372130 1485064 1250259 1356920 1431732 1756759 1625655 1483662 1336668
4685 1336668 1326301 1541401 1275871 1629094 1313018 1623669 1860440 1923821 1975238 1546692
4675 1546692 1495566 1792594 1475966 1345822 1667997 1809239 1598766 1668686 1795565 1527881
4665 1527881 1411743 1621758 1682825 1862245 1879193 1656868 1501683 1377933 1535464 1940033
4655 1940033 1870240 1963046 1948812 1743096 1763583 2046582 1909921 1652032 1721303 1824370
4645 1824370 1624584 1919042 2315658 2286768 2131889 2011841 2007092 1796678 1733431 1791343
4635 1791343 2152073 2295359 2294606 2274311 2142989 2101661 1962488 1910029 2107219 2320897 2398319
4624 2398319 2143561 2074757 2468980 2569428 2361034 2332301 2120239 1909881 2043268 1920872
4614 1920872 2016488 2038068 2193190 2087516 2113325 2026462 2083525 2336332 2560485 2236701
4604 2236701 2163387 2310174 2143236 2206252 2173593 2422199 2638774 2516676 2512479 2483495 2197611
4593 2197611 2262472 2479346 2613836 2540083 2445177 2753332 2474360 2227769 2357365 2453143
4583 2453143 2388494 2296437 2654321 2365296 2102316 2307274 2366528 2433153 2471547 2562464 2575459
4572 2575459 2558384 2273726 2367213 2347167 2502812 2739905 2574571 2695293 2680876 2531153
4562 2531153 2539133 2545498 2568021 2684994 2415490 2706018 2738838 2759614 2828823 2970206 2934707
4551 2934707 3063414 2741378 2599526 2910189 3205020 2890670 2718811 2744384 2975658 2697145
4541 2697145 2751223 2832971 2861508 2864916 2679576 2554586 2702954 2876119 3133534 3102567 3266718
4530 3266718 3484674 3236698 3009071 3176277 3404658 3208279 2953785 2639428 2963786 3209035
4520 3209035 3103372 2779427 2835778 3208686 3299198 3323469 3187925 3377856 3307526 3360553
4510 3360553 3577559 3474955 3367088 3234719 3178632 3312056 3220657 3408245 3496919 3355566
4500 3355566 3530650 3275479 3431625 3473909 3580800 3715166 3558707 3573387 3933225 3706215
4490 3706215 3504410 3223320 3235828 3481907 3590828 3482702 3559109 3613210 3617040 3394366
4480 3394366 3579818 3727869 3730200 3895325 3733045 3679434 4045547 4132252 4028398 4324380
4470 4324380 3964303 3936076 4124314 4294669 4226432 4101392 3756007 4105517 4204294 3755314
4460 3755314 4126159 4162846 4319200 4366994 4544833 4610051 4723141 4588350 4610217 4630558
4450 4630558 4584281 4542841 4967754 5070123 5179283 4961571 5054529 5216340 5105065 5093387
4440 5093387 5169698 5374416 5582063 5564500 5474360 5324028 5179107 5019242 5252733 5320549
4430 5320549 5292988 5466421 5675706 5748955 5810387 5979599 5971183 5858634 5759037 6087369 6220183
4419 6220183 6423201 6673932 6553988 6323487 6471175 6574578 6943067 6971743 6932256 7089484
4409 7089484 7011899 7181487 7880152 7890099 7958719 7808896 7871815 8106956 8228085 8189192 8646179
4398 8646179 8693617 8462870 8615594 8961020 9191930 9069272 9302052 9547148 9532652 9560370
4388 9560370 9884617 9845199 9778351 10005282 10393298 10398418 10327918 10555546 10435521 10637955
4378 10637955 10943152 11137193 11361629 11643861 11937046 12020519 12238231 12357127 12801943 13014918
4368 13014918 12932942 12809758 13068982 13366599 13815286 14066653 14079912 13922327 14564111 15041622
4358 15041622 14976583 14910253 15034245 15559729 16198346 16375413 16025973 16381121 16564450 16957290
4348 16957290 17060235 17127582 17577280 18049045 18349759 18648167 18566812 19166534 19626572 19763379
4338 19763379 19952516 20100556 20478349 20900038 21092288 21449370 22085938 22321817 22647223
4329 22647223 23026514 23450113 24098046 24495017 25110758 25603737 25931627 26183916 26660158
4320 26660158 26826524 27637955 28013818 28698987 29499356 29588832 29760558 30192304 30611955 30738735
4310 30738735 31081407 31324234 31682203 31870530 31951758 32055207 32232543 32413843 32462921 32162924
4300 32162924 32088017 32099021 31962011 31890088 31697838 31091570 30913377 30276798 29977318 30044479
4290 30044479 29483028 29122860 28811068 28153948 27826457 27534815 26796841 25996901 25226515
4281 25226515 24761740 24208920 23682716 23075953 22271505 21882807 21145034 20538448 20245589
4272 20245589 19692627 19021864 18682410 18032631 17664226 17212730 17046516 16770494 16227361
4263 16227361 15651627 15408891 15115279 15060091 14522409 14023960 13892034 13532950 13184153 13259408
4253 13259408 13229862 13018817 12786524 12523121 12724247 12572363 12515317 12348644 12424624 12037333
4243 12037333 11875295 11396029 11751395 12046509 11690830 11703441 11805966 12083495 11894233 11952457
4233 11952457 12076466 12076001 12109196 12099609 11978165 12044466 12020918 12152907 11952627 12126060 12358125
4222 12358125 12485182 12412382 12391381 12173837 12029406 12608987 12720553 12878642 12724249 12721679
4212 12721679 13056283 13080380 13141320 13460040 13838909 14213118 14608424 14802954 14746958 14580363
4202 14580363 14967502 15059881 15189396 15537950 15882731 16181205 16132553 16313797 16576569 16934781
4192 16934781 17244799 17491863 18056513 18634429 18852970 18983222 18806765 18875949 19126063 19403567
4182 19403567 19338798 19819280 20481404 20493957 20743798 20773321 20826191 21085802 21346181 22011052
4172 22011052 22536880 23208649 23408237 23377112 23953495 24490673 25039612 25567695 25939266 26473178
4162 26473178 27204502 28237679 28924077 29436861 29891696 30960977 32003787 32757170 33562524
4153 33562524 34378653 35627701 36968314 37957272 38954855 40103105 41414192 42342217 43139414
4144 43139414 44218218 45420365 46885324 48416389 49879831 51043523 52357287 53928670
4136 53928670 55659347 57413093 58965841 60864931 63214535 65697539 68368804 71365849
4128 71365849 74702907 79026825 84000715 88990415 94713316 100927354 107834736 114645406
4120 114645406 121838172 129586409 137508686 145709566 154361579 162836824 169494179 174000725
4112 174000725 175601409 173502145 168562280 162218496 155053880 147112520 138536999 129714337
4104 129714337 120846623 112569010 104997622 98334487 91902541 85965487 80701607 76216540
4096 76216540 72403672 68423348 65244974 62358477 59416392 56982222 54868790 53048846
4088 53048846 51466187 50012940 48963924 48022318 46819399 45686659 45083265 44389843 43357731
4079 43357731 42580922 42180770 41443634 40334087 38685023 37671306 36857124 36004560 34992456
4070 34992456 34072845 33620554 32731634 31762031 30913175 30179928 29511772 28896301 28462671
4061 28462671 27963859 27299568 26525863 25933717 25319539 24766029 24619930 24228518 23993240
4052 23993240 23617001 23158826 22934506 22538192 22059919 22078247 21698759 20952731 20564761 19882270
4042 19882270 19573489 19226359 18745442 18575466 17961733 17691269 17355817 16601707 16117963
4033 16117963 16067013 15896873 15750375 15503818 15360892 15175576 15172086 15083392 15092085 14878190
4023 14878190 14834268 14792262 14525446 14480493 14329792 14247740 14074951 13978094 13851197 14039465
4013 14039465 13769070 13729907 13770301 13968377 13661631 13893738 14211778 13976347 13937118 13735583
4003 13735583 13519115 13339610 13403345 13704526 13675243 13229864 13028872 13482311 13695769 13789127
3993 13789127 13725466 13629016 13643569 13733672 13973465 13960054 13949034 14174892 14168307 14491152 14426169
3982 14426169 14800331 15296682 15199274 15300607 15500346 15837190 15739493 15918954 15709710 16280744
3972 16280744 16510307 16352177 16747875 16891437 17122603 17232562 17481304 17663154 17735086 18226728
3962 18226728 18747615 19137607 19468600 19487867 19817781 20556593 20869478 21183304 21867740 22450718
3952 22450718 22707155 23459314 23848853 24621503 24970195 25358878 25552682 26164533 26765503
3943 26765503 26998097 27277569 27467088 27544675 27598105 27953550 28220015 28210179 28105923 28496040
3933 28496040 28473757 28512604 28704981 28830583 28915698 28990122 28934901 28934996 28839079 28817120 28498624
3922 28498624 28499328 28424893 28146682 28216833 28113732 27873901 27894990 28088181 28157251 28118292 28094612
3911 28094612 28464892 28505937 28799241 29176182 29188897 29667158 29897215 30146835 30538382 31196598
3901 31196598 31415980 31844566 32555272 32949465 33400700 34173324 34880499 35111841 36070194
3892 36070194 37161005 37768955 38499958 39460494 40620706 42108457 43043900 44372909 46037737
3883 46037737 47584708 49116042 50471312 52188797 53869357 55814218 58220201 60629513
3875 60629513 62205275 63986408 65925014 67794780 69428859 70561812 71556136 72318010
3867 72318010 72992457 73746434 74091561 74118434 73887297 73881323 73730365 73058035 72220859 71253467
3857 71253467 70331881 69245489 67806092 66301412 64965376 63222363 61458510 59139074
3849 59139074 56586004 54514297 52535666 50604475 48657206 46767911 44694316 43144311
3841 43144311 41423272 39861616 38687274 37502641 36337726 35062036 34182245 33048130
3833 33048130 32175016 31309406 30808744 30375067 29657470 29095895 28712540 28255971 27876707
3824 27876707 27578908 27023431 26955865 26695823 26521909 26152201 25985721 25819270 25600721 25347828
3814 25347828 24961587 24852536 24486905 24481618 24471893 24113309 23938471 23575158 23729313 23721314
3804 23721314 23891722 24065315 24210829 24437373 24235117 24437767 24548797 24610543 24780197 25005631
3794 25005631 24922430 25169874 25067897 25202682 25452947 25869965 26256206 26621420 26545148 26856698
3784 26856698 27036330 27321697 27665298 27630561 28225058 28715881 28706362 28789932 28951336 29257873
3774 29257873 29306384 29773319 30118451 30045228 30140080 30740386 30876570 31080880 31767213 32204361
3764 32204361 32644569 32904652 33333426 33711715 34666045 35550432 36389796 37012667 37717737
3755 37717737 38204471 38934823 39708171 40872381 42031542 42791503 43376187 44378815 45071635
3746 45071635 45821043 46899401 47578443 48113362 48806346 49985081 50798230 51372280 52396712
3737 52396712 52985217 53798128 54747188 55530526 56016150 56907911 57854093 58606264 59203885
3728 59203885 59555413 60354352 61119235 61479276 61983339 62510808 62965327 63704487 64291704
3719 64291704 64967109 66032723 67297230 68184866 69506245 70647217 72053411 73656939
3711 73656939 75352478 77091383 79181981 81613792 83667333 86214860 88864999 91443231
3703 91443231 94199787 96909899 100060827 103204043 106216798 109034917 112115663 115346544
3695 115346544 117804329 120178538 122183960 124061882 125649211 126500657 127257771 127492248
3687 127492248 127848637 127589119 126736007 125928259 124874661 123293577 121769293 120467406 118478961
3678 118478961 115932720 113652127 111105436 108062623 105253277 102543517 99447318 96341187
3670 96341187 92862137 89444837 86398851 83176647 79697159 76594006 73452339 70588747
3662 70588747 68141082 65205985 62859510 60534619 58145328 56106640 54768706 53362027
3654 53362027 51948085 50600273 49119208 47781850 46639087 45759149 44907137 43763465
3646 43763465 43145067 42457910 41735932 41381178 40913187 40149210 39989672 39768250 39653823
3637 39653823 39158585 38819345 39145261 39310504 39588585 39693634 39569985 39692221 40064313
3628 40064313 40348687 40572742 40711164 41142580 41449393 41631323 41822938 42024070 41646474
3619 41646474 41452793 41856011 42020848 41807290 41450441 41602717 42134219 41898089 41810575 41853810
3609 41853810 41890393 42049304 42192012 42170977 42543750 42685385 42700906 43029783 42948091 43347956
3599 43347956 43611251 43880009 43868093 43923210 44321776 44635091 44685118 44898083 45258993 45720613
3589 45720613 45908833 46300433 46639001 46918327 47262516 47344213 47697789 48276484 48768134 49270640
3579 49270640 50120335 50871233 51658765 52554162 53202481 53835878 54983253 56037857 57186368
3570 57186368 58512963 59908029 61726759 63377944 64620400 66861851 69067484 71067154
3562 71067154 73240250 75814400 78021595 80992013 83561882 86032894 88940380 91829358
3554 91829358 94833426 97798066 100552442 103902121 106941391 109452403 112026461 114790626
3546 114790626 117348657 119245239 121250046 122527360 124184357 125412782 126724779 127773284
3538 127773284 128555250 129588621 130104246 130435310 130386660 129922089 129475801 128760914 127553961
3529 127553961 126111864 124595718 122650797 120293174 117977762 115579303 113087032 110560116
3521 110560116 108002105 105269330 102516929 99775762 96804397 94035279 91485181 88845258
3513 88845258 85604353 82323809 79081024 76258919 73438485 70384525 67501353 64888476
3505 64888476 62324582 60010573 57612744 55351003 53078830 51053950 49389234 47773178
3497 47773178 46078242 44613255 43432286 42468255 41800457 40839240 39819943 39110865 38609869
3488 38609869 38473936 38054489 37107261 36587923 36359587 36002596 35911857 35515642 35047881 34622424
3478 34622424 34266355 34446898 34002072 33677372 33833831 33836829 33725493 33681806 33519143 33574187
3468 33574187 33441905 33189346 33160692 32881658 32736729 32702291 32556007 32239092 31899866 31713475
3458 31713475 31704124 31420220 30890743 30631383 30455869 29993287 29970863 29421249 28813847 28554651
3448 28554651 28061344 27668020 27695036 27528569 27428236 27434371 27026155 27072354 26928622 26622393
3438 26622393 26489239 26592541 26417195 26517167 26512238 26816563 26926203 26869111 27049151 26918059
3428 26918059 27419490 27808349 28081538 28095733 28449831 29047158 29596512 30226628 30330535 30972475
3418 30972475 31452133 31715966 32100309 32823107 33526628 33930204 34240271 35223542 36224315
3409 36224315 36998869 37648957 38620032 39570419 40709415 41826167 42830615 44185627 45754822
3400 45754822 47162794 48219475 49685417 51400777 53302033 55048685 56844430 58613926
3392 58613926 60649488 62437926 64648010 66913430 68779597 70798414 72776558 75280876
3384 75280876 77613188 79771209 82087043 84151150 86394495 88422022 89948479 91185921
3376 91185921 92058395 92644169 92838760 92190872 90783571 89492589 87607042 84814543 82052057
3367 82052057 78716586 75321281 71608235 68141843 64534321 61211698 58240240 55103922
3359 55103922 52377800 49658650 47163526 44998241 42440058 40346292 38408681 36694752
3351 36694752 35224597 33486657 32273655 30856402 29693751 28957508 27598968 26637015
3343 26637015 26030838 25063480 24210596 23298264 22909863 22396671 21753037 21565755 21238327
3334 21238327 20313009 19931342 19539339 19315226 18548833 18280752 18170544 17858047 17319939
3325 17319939 17000363 17304822 17011171 17021063 16796444 16252699 15923402 15733329 15474941 15571541
3315 15571541 15411160 15230851 14900211 14807976 14875604 14520609 14534748 14007905 13962008 14047086
3305 14047086 13941391 14079115 14080559 14323272 14051156 13699430 13273378 13181448 13190328 13400390
3295 13400390 13202270 13129168 13306915 13225496 13532964 13471657 13347738 13309654 13250539 13282170
3285 13282170 13018903 13086221 13254480 13341636 13328654 13306472 13354745 13396466 13558382 13281833
3275 13281833 13428143 13734967 13838971 13822735 13413958 13551109 13870803 13953557 13722861 13863629
3265 13863629 14009834 13990444 14176231 14280760 14285136 13971424 13817978 14140443 14469396 14607850
3255 14607850 14620534 14723139 14750328 14962667 15077306 15039908 15251167 15375439 15249081 15252848
3245 15252848 15348652 15614116 15677859 15727179 16137722 16338329 16262851 16527888 16711013 16662480
3235 16662480 16988630 17091662 17219975 17433962 17640270 17520038 17913612 17942740 18292757 18597870
3225 18597870 18654101 18897542 19174288 19243499 19479400 19934987 20176725 20288976 20551447 20952233
3215 20952233 21076989 20955103 21200317 21291943 21780147 22161488 22347595 22787630 23413035 23819728
3205 23819728 24078853 24456474 24780041 25231127 25709264 26090890 26349309 27098187 27675091
3196 27675091 28187544 28690643 28989800 29825147 30603294 30933854 31593773 32222998 32736770
3187 32736770 33188407 34039566 34564060 35312606 35795399 36306864 36945279 37869313 38614606
3178 38614606 39474668 40327314 41422786 42203047 43000614 43729927 45116030 46376926 47068413
3169 47068413 48343479 49641439 50709511 51720030 53147123 54335215 55898628 57304235
3161 57304235 58552282 60238246 61910622 63614000 65982626 68200300 70296547 72943435
3153 72943435 75423720 78366891 81693019 85150637 88556698 92106673 95798474 99597453
3145 99597453 103903359 108112807 111994859 116080947 120104590 123762116 126456096 128323391
3137 128323391 129611032 130038380 130501338 131502700 132113656 132915156 134286227 136301609 138734173
3128 138734173 141993209 146075039 150817043 156645122 163416969 170677465 178653299 187891782
3120 187891782 197184778 207183548 217131455 227894454 238369857 248301321 257445117 264619108
3112 264619108 269235639 271257491 269613912 264839023 257052488 247285493 235494894 222304107
3104 222304107 208755642 195302380 182394502 169978979 157923732 146710290 136698625
3097 136698625 127248364 118341463 110658746 103710631 97361127 91263211 85695999 80633837
3089 80633837 76044613 72296417 68816234 65620258 62097129 58998287 56358429 53991231
3081 53991231 51465506 49025261 46997125 45083694 43189092 41709599 39881293 38262181
3073 38262181 36784514 35123366 33897624 32577556 31463401 30325380 29501048 28428876
3065 28428876 27167754 26486683 26349514 25428872 24147042 23345403 22362040 21882963 21251296
3056 21251296 20530616 20103106 19763200 18786379 18289919 17946248 17497814 17037654 16899607
3047 16899607 16348984 15859512 15884344 15300026 15139926 14703969 14050986 13963549 13549384 13042657
3037 13042657 12296384 12036553 12078939 12225817 11776619 11324821 11040918 11016993 10832050 10509071
3027 10509071 10101982 9641150 9524387 9051993 9167973 9296447 9123497 8929602 8670354
3018 8670354 8597546 8588621 8528350 8199953 8214987 8033256 7827579 7417385 6907828 7006623 7017637
3007 7017637 6921775 6804416 6778856 6384693 6232843 6354847 6298124 6212254 6440604 6314267
2997 6314267 5924948 5597472 5494240 5643558 5709768 5606474 5286052 5147146 4988948 4730930
2987 4730930 5064696 5229396 5191112 4993081 4477054 4419192 4357081 4329458 4614226 4811692
2977 4811692 4704869 4311344 4106983 4125773 4058496 3983516 3994773 3861242 3704926 3871182
2967 3871182 3837086 3814757 3569458 3825135 3797883 3675344 3882537 3772044 3517925 3433202
2957 3433202 3487996 3453025 3075211 2807390 3097281 3347383 3199037 3269807 3348668 3050975
2947 3050975 3059374 2988559 2889648 2781803 2606876 2671811 2896069 2812815 2793485 2881843 2952213
2936 2952213 2745277 2581414 2417863 2410937 2381885 2367267 2353237 2424337 2633527 2505215 2267346
2925 2267346 2415924 2390913 2395288 2085330 2193792 2156214 2249569 2228638 2222576 2453104 2672990
2914 2672990 2510690 2256616 2497016 2255109 1958072 1931986 2070069 2077411 2271450 2304988
2904 2304988 2074616 2126057 2304762 2075706 2272428 2234991 2115063 2027102 1996394 2022052
2894 2022052 2088954 2273917 1868239 1780110 1932121 2157102 1913689 1988840 2230681 2325344
2884 2325344 2128446 1872690 2008589 2140607 2166319 2184369 2310178 2311955 2089106 1912700
2874 1912700 1880221 2036996 2154453 2139166 2065465 1986197 1999046 1869971 1595609 1976798
2864 1976798 2112475 2303735 2148673 2044599 2115201 1778800 1864665 2052931 2009813 1945690
2854 1945690 1996151 2103024 2142514 2048666 2579522 2440492 2268797 1937201 1990281 2134139
2844 2134139 2128780 1942675 2368097 2327519 2207763 2214466 2296620 2359379 2372880 2743098 2865441
2833 2865441 2672115 2399219 2465543 2511725 2654048 2446360 2364429 2483913 2743136 2464001
2823 2464001 2302206 2490810 2447894 2147255 1951311 1981039 1631683 1909909 2108839 2133004
2813 2133004 1898652 1830745 1904991 1766484 1659462 1614774 1790185 1879951 1466013 1183522
2803 1183522 1462466 1395659 1432068 1617825 1451168 1589862 1462278 1386142 1356210 1539627
2793 1539627 1687900 1663129 1717877 1442211 1347073 1323548 1372872 1214247 1367865 1577440
2783 1577440 1261028 947144 1093557 1004952 924642 1255684 1288236 1499719 1338935 978867
2773 978867 1025929 836332 1065960 1373946 1102806 1100805 835920 685730 935129 844410
2763 844410 804150 860087 976140 1213831 1240604 977493 1070496 1067688 1108280 1076142 839759
2752 839759 898844 1037129 935730 1062714 773733 650816 749959 816082 1051164 1313253
2742 1313253 1228146 958784 972544 605131 647155 756347 894441 1006658 798941 759299
2732 759299 792093 978707 881085 559495 602134 905550 1049338 1386869 1284266 1339148
2722 1339148 1167818 1205846 1043414 1169761 1151983 1220702 895569 669971 833050 729932
2712 729932 608692 816309 828141 857340 1034670 910595 891752 1172711 1268904 1188522 1191466
2701 1191466 991330 1116306 979497 1016052 807958 827700 554185 703383 804690 864795
2691 864795 630454 550720 746875 636997 761081 572064 530724 966373 853174 745316
2681 745316 709111 718955 688408 899053 802351 602923 425040 853660 990388 759505 595435
2670 595435 657341 885582 831155 626943 916666 1042458 730457 919990 575950 584781
2660 584781 643229 613953 667878 778363 726561 994183 912586 862848 648928 590925 1034818
2649 1034818 928763 764559 845857 655937 508835 692545 743211 844201 945424 883996
2639 883996 826740 308147 309355 659778 803663 673153 543163 560155 746391 713410 456451
2628 456451 420930 594992 944539 652629 422371 206346 109516 482279 693490 573507
2618 573507 333033 591483 642682 691945 1186378 1098978 596905 524753 818008 967690
2608 967690 985675 1138758 1227419 1005690 1187465 1125590 1118186 1015451 872680 999953 1344154
2597 1344154 1289829 1125705 902430 1062671 1383464 1177987 940724 1078261 970670 754198
2587 754198 1053074 969212 1037226 822923 743710 1259534 1237341 881058 1014598 1003102 837623
2576 837623 948056 710315 679221 781723 805874 1122710 1097554 951325 1026439 1187730
2566 1187730 1163174 817131 881492 863645 897070 900254 1037186 1121057 1275265 968725 789997
2555 789997 1141239 1083088 1049449 879686 959676 843533 1004605 938976 829438 762996 726929
2544 726929 525895 234509 550495 761575 868231 1033177 1089574 1154362 1165267 1326697
2534 1326697 1632849 1407457 1151300 1166637 762825 548661 771668 876345 1177631 1077411
2524 1077411 944513 659623 452980 812420 805836 941752 1180988 759345 953424 1121631
2514 1121631 824011 816547 1038124 1369894 1298085 1277488 1176067 1011462 923964 936575 863835
2503 863835 1008176 1078869 872592 973284 1079186 881083 1157680 847918 907046 1199132
2493 1199132 977573 940528 840525 949018 843785 854569 584039 694680 896085 1044453
2483 1044453 1187545 1179887 959510 1288612 1346330 1096840 1367213 1301813 1473354 1359399
2473 1359399 1301481 1168343 1367095 1474739 1674091 1770560 1568737 1378535 1430796 1193492
2463 1193492 920234 1098717 1370152 1561644 1325293 1400733 1154317 1004120 1248275 1323780
2453 1323780 1374105 1207697 1098487 963636 1120924 1009901 1065371 1058815 1106282 1118766 1009036
2442 1009036 1294381 1517287 1462982 1355227 1770104 1894972 1983543 1874640 1829959 1833122
2432 1833122 1826011 1697591 1548076 1703573 1809976 1975282 1970070 1762861 1811416 1805536 1913006
2421 1913006 1885897 1892807 2296278 1996711 1915193 1932784 2058049 2177562 2210039 2287038 2504127
2410 2504127 2626397 2536592 2517558 2474441 2420329 2297183 2357173 2432954 2807028 2789926 2785598
2399 2785598 3005384 3321151 3031601 3045344 2911688 2730981 3049499 3400975 3329960 3381713
2389 3381713 3491521 3888359 3880567 3511167 3441790 3765166 3808438 3678462 3863534 3920096
2379 3920096 3914649 3958157 3867676 4140194 4357011 4287084 4419846 4302396 4526026 4624749 4901569
2368 4901569 5360401 5812937 5834310 5819236 6277348 6595968 7023926 7165702 7224147 7993435
2358 7993435 8085012 8291419 8518797 9022479 9045995 9121485 9678590 9987918 10032526 10791604
2348 10791604 11548144 12179553 12484695 12752497 13201756 13818701 14816804 15152242 16117978
2339 16117978 17216873 18171181 19503996 20687499 22371079 24607945 26429067 28671365
2331 28671365 30631751 33213682 36142370 38897393 41494098 44832441 48448851 51457734
2323 51457734 53380478 54165116 53436305 51179780 48476736 45537379 41613450 38368082
2315 38368082 35263576 31890896 29018293 26303468 23768920 21498805 19877034 18064988
2307 18064988 16778993 15986772 15021276 13593172 12737639 11850697 11326841 10364264 9559848
2298 9559848 9165256 8516278 8147717 7365562 6870453 6644738 6174040 5915981 5753321 5526530
2288 5526530 5666084 5561574 5166281 5095961 5136541 4754387 4413540 4210682 3718533 3646803
2278 3646803 3464158 3197478 3283113 3150335 3043178 2818943 2866832 2871802 2411565 2194048
2268 2194048 2353491 2411545 2603385 2403386 2259212 2429399 2354223 2333745 1923629 1604148
2258 1604148 1594144 1832364 1692170 1618261 1706442 1904808 1967557 2094423 1948430 1808097
2248 1808097 1915723 1765113 1555022 1594312 1400197 1608830 1536383 1493168 1486966 1283242
2238 1283242 1176896 1385766 1494505 1189299 1010967 1095841 1271265 1409545 1286355 1283022
2228 1283022 1204397 963573 751852 704907 670310 584786 776900 612622 569377 537158 652704
2217 652704 694926 860120 824020 673560 601005 811371 913735 976253 775371 492597
2207 492597 702110 584464 527665 690280 668823 426305 475577 686972 761622 723370 561059
2196 561059 811571 667044 602733 748389 655262 488627 591714 677392 758419 796254 738481
2185 738481 509702 552456 251519 254044 366984 466685 309713 591862 388081 28554
2175 28554 117074 124545 369755 325172 483417 641223 316085 184721 303018 633557 694400
2164 694400 461531 541324 448574 538297 505131 573830 753738 416961 426526 228801 451518
2153 451518 559507 316076 395937 179535 221105 301217 419903 424537 376185 83829 318532
2142 318532 271265 419482 86269 195033 425880 345458 244642 123837 400885 340623
2132 340623 385979 547563 446841 375315 269770 105333 -74009 -1810 57493 114641 109779
2121 109779 -72294 32705 220499 28265 61390 118414 93651 329564 393777 358826 335329
2110 335329 493407 332289 103415 197110 81185 -139152 -229438 -152785 -19396 -60452
2100 -60452 41146 141729 255653 80282 -82495 27517 -87115 168878 417317 396674
2090 396674 480868 397408 -3707 15257 334377 406230 367598 25509 120430 266022 528019
2079 528019 427658 379472 230571 65097 361884 482253 404925 416384 376804 289000 193018
2068 193018 312610 786964 687410 255178 531403 888450 657746 109476 60508 490949
2058 490949 575311 36379 17363 -50194 286422 464319 419351 618709 358267 472023
2048 472023 490488 297567 188478 380234 506954 550479 305215 462722 681643 449375
2038 449375 517343 515091 323848 383593 196507 58146 -164629 -327227 -16762 345741
2028 345741 125044 368936 343900 253725 -3317 395883 466460 418187 528010 258991
2018 258991 136886 167463 127704 281011 477121 443370 352371 424702 509801 263483 116562
2007 116562 161353 353135 154738 -75503 -50857 180333 400375 649016 324154 251052
1997 251052 60915 -3875 54183 173343 83937 -187702 133835 115468 122480 -24163 106625
1986 106625 380909 206807 311103 170305 6074 -119732 -46435 226532 267698 412115
1976 412115 491266 275358 70458 191697 202050 209300 -57779 -277291 192217 -77845
1966 -77845 -294216 -87168 -100163 -45696 259291 9048 58646 107081 100757 182267 24799
1955 24799 -194875 -89370 -110768 -210335 -17966 85859 -101681 26841 105840 246751
1945 246751 38735 -129721 -226876 80700 -102652 35559 -68641 -482545 -99536 25188
1935 25188 242320 121510 199488 208527 384600 338326 426594 166330 -65023 31353 270155
1924 270155 154282 -147223 195839 573536 263487 -99003 -95817 -106447 135103 -94362
1914 -94362 128107 288608 239697 432441 273776 398644 402719 220820 96673 -81158
1904 -81158 -418886 -393821 -153124 201778 345831 52686 -85076 -83013 239233 217075 68700
1893 68700 136568 -3975 239066 178643 -55948 -216117 -32393 199732 222713 90603
1883 90603 369546 349746 199823 117184 -321869 -229112 100017 -25471 -2270 -312208 -371817
1872 -371817 28660 219591 115315 910 -88528 144382 -86902 -301700 -41047 227350
1862 227350 329861 490968 9483 133834 277321 213870 163470 -194756 -480438 -252561
1852 -252561 138813 -221393 -35561 113121 190191 -22406 -1190 92453 173094 -41918
1842 -41918 52271 96606 -48864 -153610 -136321 -63193 23232 -303016 -279279 -21447 298374
1831 298374 351306 235023 34274 -228458 -197098 -53161 -69009 272809 342081 208775
1821 208775 180897 35289 156465 147065 66313 268915 428976 151080 294697 600987
1811 600987 552901 342910 176470 -45206 155084 57610 51288 192413 33110 249583
1801 249583 380431 -39857 -192775 -331934 -386168 -467608 -287991 193968 197497 217983 284691
1790 284691 -257243 -370977 -425208 -355036 -303713 -207681 42465 35340 47284 14405 -60865
1779 -60865 -174943 -55703 100899 71383 -103250 195811 362581 209299 -75709 -97667
1769 -97667 4128 90930 -15460 -186834 -314936 -212649 -11994 319865 313330 516380
1759 516380 35383 -43655 70787 4256 -201143 -237408 -51173 -28766 12856 -77404 -50976
1748 -50976 -57533 -254525 -504351 -116462 171961 317251 -177638 -387803 -81191 -205806
1738 -205806 13227 215616 103361 319501 211673 200444 313984 -25103 -134332 173778
1728 173778 147093 358431 386347 -166210 -236902 109602 -2857 -115212 11727 -76987
1718 -76987 -302272 -44671 13233 -71419 -260653 -564865 -576687 -147896 49785 -73110
1708 -73110 -300587 -509330 -343711 -248082 -645599 -555118 -235921 -290629 -226707 125702 238128
1697 238128 -64296 91379 176896 81765 -21798 57012 -101844 -260419 108209 236641
1687 236641 98585 -144137 -276010 192528 109356 -60478 -46393 -172528 -104600 -375345
1677 -375345 -487595 -193892 -289717 -242948 -138644 -83367 -92999 -141555 -493946 -22327 100659
1666 100659 68642 160229 19091 102960 -11637 156279 187311 231076 236910 67943 237849
1655 237849 397587 151339 438172 292498 535920 308525 335618 56309 -3998 251378
1645 251378 -57713 91985 236693 -81188 -212862 -275162 -123282 -290784 -480668 -48828
1635 -48828 -144105 -442259 -375545 -195168 29292 -80208 56535 126042 -160394 -265672
1625 -265672 -132182 154286 148171 380421 226263 -84567 -91686 99584 85456 -35168 -100789
1614 -100789 -37338 185464 170845 -132641 -212561 -255006 -55469 -30756 -95494 4274 192356
1603 192356 231723 33709 -2169 -66969 23028 -29804 -82600 133137 163506 136942 59367
1592 59367 115124 49244 169264 -6541 328016 194072 -74818 -9593 -249282 -561390
1582 -561390 -197988 -101010 90475 14091 -105411 -79629 -199561 -354631 -253385 -137256
1572 -137256 -306939 -67638 -12194 40807 -197130 189735 45262 78699 162602 112022 197723
1561 197723 328219 187024 -183318 -242908 -50544 120524 115843 -174804 -486033 -370184
1551 -370184 -111201 -118903 -371418 -534635 -177778 309490 156044 -212268 66844 -8579
1541 -8579 94824 115242 -68281 64537 -116797 157696 114236 -66059 -189726 14439
1531 14439 163965 83875 -6049 -78712 -109382 -96439 112839 177685 2113 -183045 -334348
1520 -334348 -397733 -470045 -458558 -430950 -360470 -43712 -201127 -24123 20104 15284 -35929
1509 -35929 -133196 -188858 262029 359504 218540 -21171 -281341 109345 403507 273734
1499 273734 89410 366203 -97223 -304642 -53091 -120978 -323642 -285285 -424360 -361635
1489 -361635 -432629 -243406 -4217 219650 225367 -98545 -278894 -203019 -57517 -53108 -246419
1478 -246419 -245846 -449278 -338592 75934 208372 -25569 24566 99629 46981 157020 268869
1467 268869 383844 217057 366702 86854 166425 -97397 -206221 -170756 -319731 -344746
1457 -344746 177567 -41865 -90180 -49224 258536 128311 -87848 77395 151509 -251092
1447 -251092 -426099 44795 -83025 -238435 -198149 65854 150682 127319 -73459 -66549 4661
1436 4661 -10469 -119406 -178472 -305477 -426955 -366681 -140194 -164138 -53332 45180 -46728
1425 -46728 -300967 -189602 -13975 136001 -17245 -235691 -185700 -40136 -192036 -739695
1415 -739695 -588655 -227665 126432 1607 125901 151857 -66860 316532 475630 503118
1405 503118 353936 330094 72054 5470 256894 167492 135013 349649 16276 97892 215831
1394 215831 456298 478367 493823 128582 -238506 170710 150855 177454 44378 -133826
1384 -133826 202498 320633 506441 226201 -26031 66716 225462 296543 -322290 2553
1374 2553 427980 273384 36962 197749 -5569 186257 364441 324468 234328 22403
1364 22403 175884 -299351 -372857 -195825 -326874 -295277 -234268 74124 442437 73846
1354 73846 -134340 -43916 -12924 148329 72046 -178294 -166890 -168148 -222129 -19315 138050
1343 138050 101888 -13565 -192724 -137722 -19317 -126342 -359630 -152223 120602 149915
1333 149915 45874 -144593 -136116 -268576 -271988 -93577 96257 144579 29340 -268446 -566373
1322 -566373 -540642 -207173 -288735 -283553 -18201 245237 189419 195003 99115 -86517 95742
1311 95742 100174 164583 -183727 -184504 -58527 11362 -69362 -250680 8356 123890 85840
1300 85840 -77773 232111 444313 188982 -346773 -293907 -133535 -496664 -758017 -319892
1290 -319892 195133 78699 85793 -99058 -114449 77215 130377 437496 85962 -106444
1280 -106444 -117563 -16036 18119 196752 168365 -16920 55384 165151 30038 28520 -109592
1269 -109592 -330833 295860 204480 178977 43784 -306721 -241929 -235106 -9845 253241 407561
1258 407561 194130 73212 -31275 -136734 -30736 685 51105 54634 -123252 -261844
1248 -261844 22324 243310 252705 179520 107398 298532 177300 -5576 275083 121510
1238 121510 126111 464562 487716 220467 44243 -6825 2923 17001 152030 257388 320087
1227 320087 240713 437000 -38321 -195650 201993 94817 131186 31436 269816 241210
1217 241210 88301 242164 259484 364526 138818 37875 22259 50437 -76663 239558
1207 239558 294926 216619 124697 325223 264919 230633 202815 185550 347144 1971 -184598
1196 -184598 -28566 44619 82219 150166 161299 184855 256461 -76834 103836 284136 -77133
1185 -77133 -89264 -125869 52420 336636 313115 125168 347040 -152570 -1827 -12882 -201131
1174 -201131 -245510 -48335 118707 -101921 -42245 -3726 -179749 -122768 15996 48812 -287808
1163 -287808 -180458 -243655 -212453 -203941 -268470 -341853 59078 -25135 -45109 34522 67111
1152 67111 254654 -18545 -304904 -289940 -332785 -365213 -82985 151493 271058 -27260
1142 -27260 -48913 15819 -113354 -102488 -87729 -308506 -43241 152812 282670 325053 199629
1131 199629 -64731 -374701 32045 186852 -73166 264929 114855 36129 64165 22991
1121 22991 232536 -50321 -482696 -389397 -219059 -309157 -743546 -515497 -456974 -420051 -197576
1110 -197576 -76637 -325161 -415105 -564152 -551447 -403342 -119915 -71490 -269447 -203893
1100 -203893 -81236 154793 -105382 -265723 -239589 -202780 -47103 161662 -202108 -102906
1090 -102906 -3372 -160984 -196778 -491148 -446841 16450 49801 -74346 91247 -8494 151817
1079 151817 42419 72622 90438 103826 960 -175620 -1272 -1724 -245066 -230688 -36593
1068 -36593 -28560 -63246 -334904 -242567 72366 -107570 95708 55698 -137706 -201613 -192279
1057 -192279 181949 -106694 -307082 -93970 -10310 72885 209800 160884 -161110 -13478
1047 -13478 -76307 -250593 -73110 -72529 -125276 30608 -77073 -183846 2805 -87438 -105898
1036 -105898 -57215 96866 56228 -45406 -302132 -76024 465470 537985 289064 202680
1026 202680 -157591 -226674 -165054 88886 67496 42169 38266 -299944 -277445 -133833 -30971
1015 -30971 72567 25468 159968 -42792 -279046 -82395 11233 49475 106867 187272 78410
1004 78410 -353022 -426473 -110439 75145 320991 197280 -56425 50213 103271 382041
994 382041 238379 18478 127453 244774 -129688 -613076 -146861 -234 181273 404303
984 404303 108939 -25191 167554 299267 137316 146564 93407 180118 232558 445171 417092
973 417092 308750 404946 277890 302952 199725 -31673 -137529 101719 -1935 -230451
963 -230451 -468865 -478478 182660 220300 -34016 -35703 -209677 -322223 -76346 118440 -277693
952 -277693 -485911 -701040 -283417 -290279 -226290 -120770 -59584 -184101 -352210 -298051 -137529
941 -137529 -22574 -125181 112167 300649 132847 -120567 -427752 -493842 -271787 -142556
931 -142556 -67842 218279 430120 471250 304031 69425 155537 54095 274905 353267 1173
920 1173 135546 350485 39567 141841 -30384 -136902 -39567 -98540 -13094 94969 254196
909 254196 138148 13746 -117419 187481 259560 -89828 -286720 -77742 100363 -111450
899 -111450 106874 87289 32204 -23799 -273465 -296822 -67019 120326 401845 301802 205536
888 205536 217325 240624 409172 158151 -188032 -178578 -290073 -310929 45454 157937 138911
877 138911 -23666 8196 151930 154275 -8703 -62935 -30286 131974 50686 120444 132811
866 132811 13451 -24543 -7380 -56367 -213488 -160048 -170072 2242 -33387 -1429 64865
855 64865 -150952 -311713 -474342 -269326 -7063 -31179 -100650 -127760 -56741 -82505 152149
844 152149 277684 168503 -133489 -256708 -20067 203570 133076 10464 59335 -361589
834 -361589 -507441 -355766 -82175 -42962 -100645 -5872 -26291 -226498 -416611 -104996 187236
823 187236 210999 36084 161991 41219 -297752 -279870 -181474 -101854 -94547 106343 -123758
812 -123758 -483429 -405886 -425712 -146725 126852 -91668 98068 38295 -195175 153204
802 153204 -7879 17564 43494 -27312 191571 237591 243274 79870 158464 44260 -405253
791 -405253 -380962 -34194 228106 307674 1082 -180162 -237005 -583211 -543126 -300037 -296638
780 -296638 -454589 -126320 -120411 -263010 -101342 219132 456966 391251 162694 286108
770 286108 99856 84387 339858 84412 -198915 -474989 -318487 -311354 -182277 170550
760 170550 204669 235727 229611 335306 286363 -76489 -198131 -71319 -118391 -282202 -384037
749 -384037 -546759 -525309 -409782 -513719 -281297 -297262 -244484 250605 368073 -66487
739 -66487 -111491 61734 263638 321931 360687 343787 216586 181496 113526 18689 -35215
728 -35215 83572 -17865 -429447 -383118 -297991 -226216 205615 57682 189154 -54792 -26950
717 -26950 -67759 -69984 -175458 -351248 -269106 11499 450 149406 -106765 165428 417659
706 417659 482127 413572 -6392 -127368 -313276 -420990 -445633 -397337 -288470 -195958 -580003
695 -580003 -374720 -82209 195765 177901 133253 271471 73571 -213280 -332729 7504
685 7504 199891 -55137 12597 59438 -303946 -258225 -162887 162248 115911 -2091 77694
674 77694 -95495 281906 437595 390118 275577 292981 166877 -71188 -164483 -45569 173856
663 173856 182741 115251 90373 -54512 -242969 -691 31445 48056 21267 -44361 106509
652 106509 177737 242442 4733 -42803 -59841 -328491 -459452 -184312 141204 -428 -76580
641 -76580 145511 163944 -17455 70670 239018 180231 35656 -219284 -147635 -177124 -17690
630 -17690 -299571 -311747 99932 -154911 79907 234805 55956 165507 60414 -143072
620 -143072 71948 442017 159602 266904 615098 74617 -78722 304956 53844 205337
610 205337 176194 236628 228926 60158 31283 21677 -169177 -242377 -376906 -379127 -263136 -301753
598 -301753 268736 106867 -143346 -142907 -78164 104308 338660 387136 714827 50538 -170446
587 -170446 132060 136994 27798 -6196 -10417 -116303 -157565 -150581 -98132 -302200 -67394
576 -67394 60732 -90703 -553570 -628532 -470584 -285018 -300997 4916 -4888 28867 24167
565 24167 -114856 -30976 299805 17670 -107881 -81991 121363 531789 368767 374218 448502
554 448502 313269 15130 -227484 -288696 -152954 221629 568049 167477 172754 167846 342838
543 342838 55346 10756 -13059 -69488 -9774 -259910 -117170 -4560 102160 -38863 -121401
532 -121401 -58783 -212021 -127146 -292805 -287447 -268150 -235573 -92949 95972 92723 112166
521 112166 -173420 211919 17483 -124013 -171551 -16555 -39495 -229635 -296819 -160959
511 -160959 41415 -127985 24882 66368 136695 -215545 -69784 -243952 -44027 39503
501 39503 175181 -84122 -345684 -426336 -315064 -283765 -166333 -57247 -55600 -229530 -280196
490 -280196 -305904 -461580 -449360 -468336 -150122 63783 100761 -3028 -58830 -31922 -285678
479 -285678 66790 47936 219757 169632 484896 732070 210882 315079 89610 -140357
469 -140357 -47968 191508 156671 95036 7588 -119414 204284 292100 55764 51607 -36766
458 -36766 -349269 -226180 -265381 -327029 -86224 -63264 -140806 -243907 -60898 56968 -186326
447 -186326 -425432 -361397 -328102 -6369 57528 -96886 144232 581060 230334 304620 127788
436 127788 71417 -104632 -23641 229162 -135244 -127713 191896 171133 50913 -177331 35984
425 35984 -73455 132658 195244 -57531 22411 40918 38074 -263926 -72790 3608 242599
414 242599 94469 335866 315600 175539 112552 -79055 76672 390255 517720 115998
404 115998 -66414 180092 157938 79435 31093 278219 -42240 -224419 152138 -20726
394 -20726 -432423 -126902 -47342 -65576 -17680 193161 431524 281218 439587 257661 64771
383 64771 117439 677794 412010 -206390 -17493 37571 139544 222423 200791 10766 -120869
372 -120869 144578 305081 203637 314636 346094 319228 91267 -142297 59571 -62138
362 -62138 315070 232957 -117940 118675 288557 -225852 12216 358439 -15538 -39310
352 -39310 -53645 -35086 98145 -21951 5834 50413 244368 271860 238874 12305 87874
341 87874 25784 76348 527986 190809 -43563 249240 264321 -139373 -3602 13542 241293
330 241293 406944 253243 397534 416297 38827 175831 177180 64928 62525 199049 98979
319 98979 262355 84551 -14650 194344 248556 -47361 -283197 -305142 -22790 127727 161419
308 161419 46072 -65773 19164 130544 174288 -148445 321189 389072 -175828 -247945 41401
297 41401 464856 438173 250812 92306 310419 544222 530601 565898 486663 131372 -99841
286 -99841 90763 321673 62802 80613 -32621 -345446 -29792 206822 118028 -202004
276 -202004 -69373 87436 194616 159365 -103240 -3468 -156942 -93158 -3869 -171417 -142624
265 -142624 -149038 -75777 157113 399728 356831 521036 320748 168179 -637 -47397 -202430
254 -202430 -226115 -139962 136230 269344 310102 88259 227817 55048 122329 386747 665210
243 665210 714295 378609 375271 138741 224188 247667 241390 401753 299414 284348 362486
232 362486 157029 42329 -56705 62657 -58169 303623 479295 381585 196681 -84278
222 -84278 173787 -250259 -552401 -21153 -10849 -51382 117866 -118342 200024 48514
212 48514 -209900 98908 -63596 -53217 84047 193333 101616 -60060 111948 114505 38920
201 38920 36531 22995 160326 18663 -82611 79140 -54370 282912 391363 469333 506828
190 506828 474812 354742 -24803 -300054 -167412 92454 321128 306772 233486 121369
180 121369 21801 18725 -28572 68149 -15348 60605 263951 408766 469125 285468 79198
169 79198 -66444 -244283 -39897 46419 302482 201864 266486 80848 86930 243198 188638
158 188638 266536 440140 237991 214543 492470 468693 486446 48052 75521 147545 347374
147 347374 715610 485411 14950 -41961 145550 -67048 -260415 -349063 -387086 -79804
137 -79804 244843 301474 256716 56664 134669 276936 127569 48802 42824 125630 158180
126 158180 172278 583144 559183 51338 -142476 97247 191859 158825 252941 285654 227079
115 227079 175287 239421 250422 191420 168263 -37265 189823 -4305 127740 85782 -124031
104 -124031 -102818 202483 147776 10009 -12791 152151 233417 95988 -14453 -152012 55200
93 55200 -7264 -7977 33136 -65960 -69472 -133943 -108994 -7323 -5855 166128 388454 435078
81 435078 442562 118824 -19088 162596 287529 288884 49673 171915 145321 167111 5025
70 5025 143696 83465 27883 142823 166518 2269 -71458 11042 199282 182752 98737 152463
58 152463 184483 125344 164515 262977 241987 126381 2188 -112210 120885 121426 343112
47 343112 374869 179536 131659 194627 280261 251291 187771 216283 314899 278717 271724 425109
35 425109 321298 158232 362394 394850 155063 101707 85272 172557 179733 161357 -6520
24 -6520 29084 204719 269183 269323 -234342 -182874 114299 243314 210629 -21355 69337 95407
12 95407 143238 113874 53184 44175 221358 195520 -53717 -138875 24278 378770 368471 165028
0 165028
$$ Imaginary data points
##PAGE= N=2
##DATA TABLE= (X++(I..I)), XYDATA
16383 -2116526 -2198133 -2252813 -2270929 -1952798 -1842374 -1523467 -1316994 -1460350 -1799842 -1752024
16373 -1752024 -1481982 -1385438 -1542556 -1572490 -1482382 -1539288 -1438550 -1374318 -1491348 -1535800
16363 -1535800 -1354669 -1324451 -1454958 -1210228 -1415734 -1426343 -1378591 -1175372 -1026515 -991717
16353 -991717 -1221379 -1001725 -993525 -1077464 -1021914 -885018 -919049 -1065290 -805856 -936888
16343 -936888 -994376 -991621 -988844 -1198277 -1036124 -817048 -514247 -367949 -634613 -559843 -613226
16332 -613226 -719500 -820344 -810643 -755298 -788174 -617621 -290512 -359458 -395581 -533042 -669017
16321 -669017 -436190 -394994 -389907 -397865 -432001 -343112 -167872 -205326 -228758 -202156 -116625
16310 -116625 -246191 -52018 199221 94714 10467 172631 295614 89300 177657 207406
16300 207406 77029 81403 172659 235082 156076 205650 315776 607470 381260 393816 524989
16289 524989 608146 351454 688393 638670 570095 319672 312573 392811 373227 729616 904466
16278 904466 871406 659789 831742 719354 701545 832205 821426 653463 713997 926531
16268 926531 769920 663494 914713 881098 1180423 1046046 1020960 1061964 1033473 1134241
16258 1134241 1020343 1184858 1188959 1202811 1308406 1326742 1219701 1384945 1379965 994394
16248 994394 1228498 1492343 1634956 1653665 1463937 1494442 1203133 1380807 1427725 1381955
16238 1381955 1249108 1359062 1568252 1618224 1593399 1736058 1699578 1635050 1600684 1486895
16228 1486895 1495869 1641837 1759849 1691967 1786991 1582319 1611265 1872484 1711555 1770241
16218 1770241 1695202 1771676 1931448 1817234 1854911 2030021 1880530 1736930 1652924 1808242
16208 1808242 1721567 1778412 1980074 1460618 1500426 1751498 1934829 1794260 1782628 1662344
16198 1662344 1857512 2030590 2196269 2459823 1989338 2170888 2166863 1757532 1783475 1970405
16188 1970405 1858748 1828716 2031418 1718630 1862546 1881591 2059862 1944303 2024275 2292329
16178 2292329 2317641 2293720 1946133 1729736 2178302 1915701 1871760 2218898 2410623 2089334
16168 2089334 1846522 1919279 2003492 2015852 2216004 2275224 2319797 2414471 2245277 2261176 2252180
16157 2252180 2040079 2237146 2230892 2239064 2155694 2189529 2085876 2177987 2497286 2463972 2466462
16146 2466462 2535202 2219719 2210277 2549367 2286714 2537010 2460252 2478511 2490810 2651641
16136 2651641 2505547 2435580 2642979 2523297 2400514 2109390 2357934 2568367 2440686 2303609
16126 2303609 2403425 2448409 2546597 2583044 2132205 2276708 2528333 2417905 2106394 2161379
16116 2161379 2441177 2542711 2476188 2365640 2320738 2223101 2110843 2272667 2042308 2379794
16106 2379794 2605555 2700154 2254974 2089248 2323812 2369247 2365565 2040738 2109980 2541060
16096 2541060 2962444 2720088 2439124 2505979 2602465 2467409 2334021 2343247 2278702 2174320
16086 2174320 2175027 2374728 2064440 2072971 2212754 2665238 2529072 2220104 2405413 2552497
16076 2552497 2448757 2507185 2570821 2259604 2294411 2291233 2245417 2191212 2435660 2460157 2539704
16065 2539704 2711081 2709883 2562298 2330370 2459991 2346319 1944169 2108408 2410138 2102224
16055 2102224 2203064 2211972 2091426 2117579 2255959 2390103 2322644 2244495 2241911 2259142 2254762
16044 2254762 2276403 2354270 2382212 2271562 2288827 2432794 2741322 2743053 2794325 2820020 2615581
16033 2615581 2342733 2489236 2654723 2800555 2552685 2676164 2853704 2726895 2769002 2774175
16023 2774175 2376381 2412057 2410501 2063951 2475725 2796463 2766155 2906189 2744007 2555637
16013 2555637 2334291 2249060 2473303 2363329 2436162 2588101 2259968 1924096 2192678 2481834
16003 2481834 2399259 2350321 2260662 2276128 2345395 2316761 2037307 2410026 2471329 2467927 2609570
15992 2609570 2846804 2537930 2453814 2674808 2300872 2318547 2351281 2536693 2630850 2870681
15982 2870681 2662687 2789698 2849788 2598359 2595786 2459135 2633864 2536113 2574913 2287409
15972 2287409 1947326 2366022 2692556 2665093 2677834 2500209 2181143 2214349 2235516 2431789
15962 2431789 2378676 2683903 2645019 2362995 2429980 2279443 2568408 2705955 2501603 2423916
15952 2423916 2642336 2770153 2386989 2267055 2523594 2479325 2510384 2521510 2268600 2171399
15942 2171399 2249019 2626305 2467398 2326211 2611095 2549085 2175580 2251936 2531654 2503517
15932 2503517 2141024 2396862 2435463 2440200 2669817 2455727 2554602 2582556 2544919 2367331
15922 2367331 2373944 2380064 2407062 2165522 2334756 2338318 2229269 2620010 2641831 2621765 2978141
15911 2978141 2905612 2655591 2582792 2381105 2655570 2804791 2672365 2707750 2800317 2777214
15901 2777214 2632798 2586258 2608083 2311957 2456137 2574460 2649893 2361174 2277993 2630769
15891 2630769 2934909 2878669 2515090 2549383 2700486 2634053 2760891 2582829 2627374 2808740
15881 2808740 2580745 2600121 2332501 2324046 2429220 2341540 2340832 2552391 2625073 2728999 2776561
15870 2776561 2600663 2655307 2677256 2755768 2482244 2268483 2497528 2662585 2511621 2419739
15860 2419739 2789480 2493343 2312105 2101650 2140806 2177322 2840895 2726302 2371979 2705676
15850 2705676 2886515 2861808 2549511 2591484 2351844 2427771 2480486 2928883 2873759 2708928
15840 2708928 2600987 2528398 2548370 2440193 2331508 2514709 2532955 2583128 2719115 2620068
15830 2620068 2569133 2656108 2528495 2552241 2408191 2380097 2337994 2509558 2936802 2788852
15820 2788852 2708769 2882808 2805046 2575968 2720238 2690580 2541305 2620968 2553124 2456970
15810 2456970 2621685 2529383 2636677 2729931 2784205 2524289 2553645 2386050 2597206 2792357
15800 2792357 2685507 2487986 2652415 2962264 2789497 2510200 2405770 2880339 2888729 2832982
15790 2832982 2923986 2519263 2269166 2206380 2259456 2531632 2571340 2408492 2505242 2493039
15780 2493039 2620255 2712060 2788550 2486044 2420261 2548219 2589110 2526648 2350967 2227756
15770 2227756 2649361 2977414 3019604 2884922 2674274 2587226 2571378 2366558 2511982 2629783
15760 2629783 2471449 2738095 2656260 2688058 2534179 2671371 2770829 2622975 2499410 2801590
15750 2801590 2724910 2723147 2882196 2611863 2649130 2679201 2698998 2391294 2186572 2687337
15740 2687337 2753631 2667356 2336888 2429124 2227282 2166202 2359719 2450375 2569388 2615618
15730 2615618 2522387 2681735 2558160 2634961 2559824 2794187 2730650 2366476 2534608 2342805
15720 2342805 2679598 2762834 2571784 2508227 2480889 2421173 2579541 2308689 2220596 2545440
15710 2545440 2629724 2568482 2439727 2469387 2241569 2303055 2390702 2083559 2162945 2045211
15700 2045211 2172434 2533366 2739621 2706274 2858209 2861611 2814553 2693876 2395525 2425659
15690 2425659 2356595 2724907 2806612 2624722 2736490 2578360 2661712 2635981 2667858 2886284
15680 2886284 2699623 2194842 2275490 2177909 1962012 2040791 2046302 2253214 2579119 2638635
15670 2638635 2800931 2476792 2405897 2562329 2545472 2487298 2577541 2482107 2259083 2369402
15660 2369402 2364020 2510927 2283553 2645195 3001496 2987208 2888249 2851231 2539664 2260238
15650 2260238 2444962 2575840 2463483 2532115 2641203 2698208 2522500 2524057 2540781 2542283 2091942
15639 2091942 2183843 2368887 2572153 2748880 2631949 2589163 2625911 2757748 2762650 2856001
15629 2856001 2687769 2653616 2783350 3003026 2759149 2608520 2588222 2665143 2925920 2790021
15619 2790021 2638240 2731968 2681027 2499043 2470447 2687272 2891204 2807056 2592360 2535408
15609 2535408 2116119 2427954 2583878 2757674 2525256 2378616 2706464 2874717 2774129
15600 2774129 2664392 2746303 2672636 2870696 2919987 2530980 2529011 2437234 2705973 3148357
15590 3148357 3007562 2601442 2422469 2817622 2794735 2665541 2565631 2808916 2836014 2822479
15580 2822479 2691851 2437601 2686918 2959651 3081145 2495546 2181475 2247834 2292203 2562373
15570 2562373 2526803 2425846 2481514 2367809 2742205 2740583 2550225 2660528 2763142 2852021
15560 2852021 2629093 2573529 2468456 2333088 2426521 2350453 2129228 2517719 2368935 2474642
15550 2474642 2309942 2442538 2776581 2771191 2385858 2395718 2894778 2842256 2448439 2478419
15540 2478419 2600929 2560481 2601484 2550917 2676575 2425881 2459904 2517017 2624213 2546954
15530 2546954 2678881 2697940 2448990 2471775 2403207 2438172 2403858 2320401 2420081 2645548 2807909
15519 2807909 2870732 2575513 2421894 2577406 2780195 2577431 2204483 2407607 2695889 2786952
15509 2786952 3082889 2854597 2575642 2540463 2316794 2423655 2716881 2836401 2523705 2549245
15499 2549245 2547442 2448963 2821810 2572426 2252542 2618098 3135578 3185906 3129051 2739240
15489 2739240 2604261 2636858 2555792 2601701 2466054 2595529 2467336 2429141 2388400 2623530
15479 2623530 2587083 2672905 2760521 2505285 2797803 2933814 2465203 2102423 2375239 2352837
15469 2352837 2080988 2174615 2622723 2788719 2751318 2520071 2337479 2708063 2894757 2833035
15459 2833035 2824828 2811772 2616942 2682616 2880896 2806151 2845303 2714390 2109335 2557197
15449 2557197 2977616 2862550 2523200 2636127 2750310 3056038 2803472 2980599 3380921
15440 3380921 3004229 2873322 2408154 2593368 2563839 2520626 2311022 2142395 2241604 2514020
15430 2514020 2520680 2677731 2791237 2633142 2502391 2663800 2922745 2719018 2584445 2558601
15420 2558601 2427781 2346596 2400552 2483333 2591317 2765826 2774877 2541155 2504351 2611704
15410 2611704 2670555 2708500 2726981 2837334 2914135 2993394 3008719 2833629 2717278 2864821
15400 2864821 2611190 2410085 2604427 2528073 2664928 2494890 2553158 2607381 2627614 2698156
15390 2698156 2452612 2644525 2756242 2673879 2597046 2519325 2604049 2424904 2388142 2549718
15380 2549718 2494465 2467783 2588337 2712603 2526513 2541794 2651800 2758466 2882074 2592965
15370 2592965 2416358 2193216 2673067 2534327 2274432 2910416 2926077 2782824 2690775 2571975
15360 2571975 2438405 2278791 2333788 2746382 2731717 2564637 2752660 2796483 2695173 2724954
15350 2724954 2630523 2994207 2521150 2392261 2390934 2667128 2504047 2492418 2730368 2915070
15340 2915070 2781692 2479668 2506845 2702850 3002055 2918110 2829123 2895959 2776315 2577096
15330 2577096 2566278 2253484 2334075 2821825 3068457 2728151 2677052 2501626 2606505 2660332
15320 2660332 2762667 2897610 2753490 2582031 2711334 2757467 2779333 2588728 2489195 2410853
15310 2410853 2557762 2552790 2672161 2489948 2663591 2850926 2762885 2978862 2959359 2747053
15300 2747053 2698430 2722177 2782619 2571647 2525004 2156332 2403410 2895770 2776246 2627574
15290 2627574 2601064 2543706 2680426 2422722 2420057 2538068 2345637 2085842 1954324 2205984
15280 2205984 2708017 2662117 2411217 2597486 2558587 2232946 2449826 2605098 2664240 2624109
15270 2624109 2416531 2644125 2698755 2710579 2535193 2538475 2447685 2607200 2680948 2411421
15260 2411421 2270000 2537218 2437183 2600110 2435209 2518711 2406749 2542172 2806568 3182449
15250 3182449 2907711 2997932 3321304 3323698 3052685 2829456 2603812 2878086 3101124 2734945
15240 2734945 2911601 2778693 2668727 2362700 2406362 2592462 2611772 2780234 2597970 2644889
15230 2644889 2325707 2632708 2883769 2921256 2775930 2900719 2787258 2765635 2793224 2731698
15220 2731698 2673773 2263868 2532011 2944463 2855321 2892499 2883972 2679464 2592480 2655149 2867660
15209 2867660 2537799 2432428 2486198 2595418 2739249 2908354 2678660 2467139 2464791 2449061
15199 2449061 2648009 2644589 2502203 2508807 2763794 3030684 2826927 2908470 2649206 2812479
15189 2812479 2666727 2436504 2623129 2597883 2891011 2752568 2537084 2664092 2737867 2665453
15179 2665453 2647489 2857768 2784310 2676648 2529358 2691465 2445354 2522394 2529584 2702165
15169 2702165 2562161 2780594 2697129 2489939 2588691 2448594 2304244 2272224 2639121 2583858
15159 2583858 2488419 2399598 2712060 2875053 3029978 2894490 2750463 2816475 2806257 2748404
15149 2748404 2910140 2788718 2633184 2895703 2288523 2484649 2605735 2431006 2594683
15140 2594683 2403039 2497351 2570726 2831662 3023945 2853834 2907318 2623886 2626088 2486220
15130 2486220 2500937 2419583 2525013 2839109 2699416 2682142 2301491 2674181 2771528 2825158
15120 2825158 2920426 2633661 2338346 2412452 2626510 2615181 2381920 2543415 2577871 2330680
15110 2330680 2676047 2738231 2612067 2446185 2628266 2581760 2545132 2606136 2802829 2903653
15100 2903653 2882730 3172710 2694004 2494516 2847697 2877972 2463453 2690850 2991351 2866969
15090 2866969 2857884 2674186 2702840 2603143 2713895 2927384 2839061 2714722 2560652 2571531
15080 2571531 2437676 2759903 3096224 2880374 2683131 2699944 2845809 2874842 3020426 2716004
15070 2716004 2599110 2702958 2555694 2656784 2621630 2882636 2886552 2905714 2917781 2856238
15060 2856238 2611312 2569262 2594386 2717964 2718509 2957322 2659686 2794908 2808547 2670475
15050 2670475 2370262 2302877 3011328 2972478 2589914 2420799 2531304 2717111 2800982 3094206
15040 3094206 2904371 2805331 2878388 2835665 2878709 2475608 2489272 2273481 2553637 2686453
15030 2686453 2837682 2835070 2758274 2961374 2920228 3117375 2970323 2714274 2864369 2810698
15020 2810698 2782458 2548177 2765768 3019769 2816797 2470677 2366908 2473383 2611237 2979706
15010 2979706 3117196 2648319 2355860 2555809 2738334 2988849 3113224 3265703 3326344 3265277
15000 3265277 3277487 3153906 2719084 2591235 2834078 2831752 2989691 2794441 2437791 2658208
14990 2658208 2757454 2592804 2582044 2674921 2873099 3014267 2905639 2756998 2925805 3169073
14980 3169073 2719239 2818901 2935387 3176222 3326248 3087806 2912825 2949906 2849441 2901412
14970 2901412 2829638 2583319 2691835 2835324 2706710 2670907 2645438 2741504 2886816 2925758
14960 2925758 3056765 2772753 2624627 2523717 2711424 2419148 2430714 2536890 2598463 2564820
14950 2564820 2623740 2751256 2898578 2714565 2756334 2612291 2761578 2488339 2895393 3255739
14940 3255739 3336236 3325978 2794871 2627346 2709494 2932499 2762838 2713287 2921617 2785767
14930 2785767 2690600 2963902 2890050 2971942 2660097 2798886 3305221 3008007 2712462 2720216
14920 2720216 2367103 2137423 2496562 2635604 2822364 2749858 2668887 2717633 2724066 2702335
14910 2702335 2445346 2645185 3006681 3115218 2629204 2609547 2735375 2560200 2561499 2704195
14900 2704195 2725654 3018413 3035035 2831509 2472323 2703928 3059120 3020201 3180814 3016294
14890 3016294 2874223 2827250 2806063 2939081 2736151 3112516 3087755 2746872 2918422 2967543
14880 2967543 2778695 2605890 2562407 2510871 2757373 3178193 3013773 2722633 2843357 2753111
14870 2753111 2496839 2907459 2933656 2782692 2612499 2671147 2556506 2586189 2929737 3041474
14860 3041474 3144113 3070261 3063025 3050459 2841262 2555994 2699856 2592573 2612862 2620873 2777033
14849 2777033 2657287 2576949 2731976 2722200 3048831 3228697 3040666 2955798 3071680 2837737
14839 2837737 2746960 2879654 2789524 2922646 3056830 3091850 3051490 2899684 2795720 2788380
14829 2788380 3059085 2874766 2501860 2650410 2747358 2989060 3155826 2710450 2521837 2763494
14819 2763494 2780497 2884659 3056576 3072259 2915228 2861713 2921264 3064184 2704020 2462194
14809 2462194 2610632 2733449 2979912 3241020 2815987 2625449 2872376 3030899 3178305
14800 3178305 2876272 2885085 2918987 2853353 2648253 2424561 2482283 2578496 2683163 2911862
14790 2911862 2969195 2855497 2783385 3068964 3084847 3022035 3130184 2686460 2865819 2897042
14780 2897042 2803238 2932675 2957139 3052828 2800657 2684206 2766180 2988170 2910760 3119224
14770 3119224 3187625 2890635 2718845 2362716 2451431 2485890 2703609 2611348 2623586 2950269
14760 2950269 2975936 3033858 2895909 3064328 2708484 2549519 2706571 2541678 2839083 2866059
14750 2866059 3006820 2942474 3085362 2829402 2842313 2928492 3231283 3290302 3017403 3199724
14740 3199724 3008517 2985009 3007848 2822465 2505119 2711141 2515899 2512921 2708895 2800176
14730 2800176 2593554 2427698 2604981 2957477 2919966 2682207 2744402 2655722 2879001 2925487
14720 2925487 2652864 2557010 2408497 2686788 3154594 2888011 2320976 2596213 2513196 2633907
14710 2633907 3009486 2952578 3025677 2971110 3028232 3025131 2811814 2801069 2564239 2555974 2766267
14699 2766267 2567628 2689097 2761769 2461010 2334246 2517279 2650103 2624472 2719078 2367628
14689 2367628 2596905 2719436 2569382 3021407 2836219 2623731 2937085 2932600 2667900 2710987
14679 2710987 2781299 3148633 2838749 2669160 2422836 2675912 2997888 3222179 3046478 2938956
14669 2938956 3014674 2930998 2954310 3110944 2983391 2662713 2860976 2741244 2965306 2636882
14659 2636882 2426981 2377957 2529404 2741508 2873839 2668957 3017692 2943102 2669811 2736091
14649 2736091 2889142 2871032 2682257 2798941 2908168 2982742 3005845 2767773 2605705 2913867
14639 2913867 3011448 2969606 2680123 2754296 2640684 2960254 2969895 2629771 2761790 2885689
14629 2885689 2968407 3076684 2848183 2780828 2951679 2885635 2905331 2851094 3061912 3181734
14619 3181734 2990168 2690215 2453042 2804623 2935832 2972709 3072138 3275124 2927415 2878609
14609 2878609 2674145 2390910 2494333 2845027 2869231 3055209 3019486 2630624 2745548 3061293
14599 3061293 3026505 2977215 3021695 2617228 2506144 2708944 2463309 2465470 2492559 2537211 2561942
14588 2561942 2823564 3079828 2698977 2947192 3131549 2930934 2911075 2925931 2902765 3292116
14578 3292116 3033747 2972238 2607255 2585841 2786012 2918191 3382385 3611257 3246616 2966872
14568 2966872 2917680 3131676 2651220 2863998 2918461 2785554 2407666 2400639 2305053 2358701
14558 2358701 2454886 2263517 2488238 2768255 2779466 3040939 2910292 2730011 3036241 2950864
14548 2950864 3318329 3065353 2854750 3055655 3277930 3092740 3226488 3311934 3142817 2928844
14538 2928844 2712351 2659161 2704561 2649865 2709128 2880086 2754012 2844004 2915344 3145578
14528 3145578 2934455 2886459 2998549 2551488 2611960 2692859 3031161 3090210 2642221 2659076
14518 2659076 2902418 2980426 2917809 2551106 2828302 2510728 2596742 2629933 2795536 2758688
14508 2758688 2809088 2868017 2937891 3015487 3373621 3186850 3120628 2966521 2816447 3297932
14498 3297932 3008115 2911902 2924726 2877717 2915282 2817248 2700764 2895698 2906053 2694787
14488 2694787 2693262 2911622 2802895 2873016 2994902 2744662 2670390 2676435 2837729 2878934 3032951
14477 3032951 3161334 3197490 3041447 2904034 2842424 2955577 3175333 2922532 2891313 2921492
14467 2921492 2791281 2933113 3006328 2706796 2929212 2811172 3037159 2973241 3094865 2831594
14457 2831594 2447539 2819907 2850082 2906156 2897894 2675965 2936900 2942979 3279370 3180059 2962708
14446 2962708 3097788 3232447 3241138 3320521 3256651 3000677 3018093 3310961 3258194 3267379 3312160
14435 3312160 3195404 3060158 3081542 2979433 3063469 3191292 2938339 2855241 3083206 2917035
14425 2917035 2639112 2788989 2623437 2705447 2622387 2868918 2780639 2876442 3121490 2930378
14415 2930378 2588671 2901132 2882172 2775458 2667025 2480089 2933406 2891667 2880987 2976695
14405 2976695 2879995 2803400 2614837 2875911 2825566 3106948 3100906 2907973 2928209 2886953 2953225
14394 2953225 2852697 2635151 2375471 2593079 2994744 3137804 3006811 2865558 2766953 2860362
14384 2860362 2732778 2568330 2513690 2303686 2662541 2786444 2751730 2566283 2445885 2803916
14374 2803916 2721242 2826719 2927752 3006126 3101450 2845166 2716060 2845962 3079625 3079322
14364 3079322 2979882 3019125 3006913 3087216 3115170 3118942 3127802 2841757 2745028 2716891 3044693
14353 3044693 3058505 3014361 2661813 2770199 2900212 2670659 2769819 2825084 2877304 2820372
14343 2820372 2892989 2731913 2887682 2962946 3114338 3329714 3269271 2894447 2692336 3143991
14333 3143991 3158644 3124688 2882347 2963919 2975737 2745796 2929140 2769466 2844940 2865519
14323 2865519 3070239 3087518 2864290 2621633 2846185 2902027 3020379 3077335 3112523 2933353
14313 2933353 2970726 3089293 2906338 2507875 2712779 2818663 2948303 2726908 2886968 3109783
14303 3109783 3093769 3367857 3280301 3175017 3055092 2981146 2912336 2909774 2603417 2712198
14293 2712198 3164772 3285979 3258190 3030476 2752165 2885004 3199584 2986823 2812980 2986489
14283 2986489 2941837 2996412 3139567 3094631 3266081 3233906 3070365 2818361 2991927 3172939
14273 3172939 3072783 2909439 2796166 2935634 3007060 3098568 2809113 2996667 3026934 2939983
$$ [...]
##END NTUPLES=NMR SPECTRUM
##END=
