##TITLE=1H_CG-1225-A
 200.13MHz, CDCl3,
 8 sc
 
 9.6.2025
##JCAMPDX= 6.0         $$ Bruker NMR JCAMP-DX V2.0
##DATA TYPE= NMR SPECTRUM
##DATA CLASS= NTUPLES
##ORIGIN= UXNMR, Bruker Analytische Messtechnik GmbH
##OWNER= pz
$$ XWIN-NMR		Version 3.5
$$ Mon Jun  9 14:00:21 2025 Russian Standard Time (UT+4h)  she@DPX200
##.OBSERVE FREQUENCY= 200.1313
##.OBSERVE NUCLEUS= ^1H
##.ACQUISITION MODE= SIMULTANEOUS
##.ACQUISITION SCHEME= undefined
##.AVERAGES= 8
##.DIGITISER RES= 18
##SPECTROMETER/DATA SYSTEM= spect
##.PULSE SEQUENCE= zg30
##.SOLVENT NAME= CDCl3
##.SHIFT REFERENCE= (INTERNAL, CDCl3, 0, 15.4913)
##AUDIT TRAIL= $$ (NUMBER, WHEN, WHO, WHERE, WHAT)
$$ ##TITLE= Audit trail, XWIN-NMR		Version 3.5
$$ ##JCAMPDX= 5.01
$$ ##ORIGIN= Bruker BioSpin GmbH
$$ ##OWNER= she
$$ F:/spectra/data/she/nmr/H-C/1/pdata/1/auditp.txt
$$ ##AUDIT TRAIL=  $$ (NUMBER, WHEN, WHO, WHERE, WHAT)
(   1,<2025-06-09 13:58:55.78 +0400>,<she>,<DPX200>,
      <created by zg, POWCHK disabled, PULCHK disabled
       configuration hash MD5:
       00 E9 B6 7A A2 85 ED C7 34 08 36 98 17 FE 4E 26
       data hash MD5: 16K
       81 D7 9C 51 87 2E 1B 3B B6 E7 E2 C3 6F 02 AF A3>)
(   2,<2025-06-09 13:58:59.26 +0400>,<she>,<DPX200>,
      <Start of raw data processing
       efp BC_mod = 2 LB = 0.25 FT_mod = 6 PKNL = 1 PHC0 = -1553.123 PHC1 = 9.992201 SI = 16K 
       data hash MD5: 16K
       2F 9A 59 24 0B 19 06 E2 00 EF 66 0B 5A B9 DB C0>)
(   3,<2025-06-09 13:59:17.62 +0400>,<she>,<DPX200>,
      <pk PHC0 = 0.05577199 PHC1 = 0 
       data hash MD5: 16K
       56 89 FB 2B B0 5B CC C5 E7 C3 06 F7 9E 31 C9 01>)
(   4,<2025-06-09 13:59:23.45 +0400>,<she>,<DPX200>,
      <abs ABSG = 5 
       data hash MD5: 16K
       A5 D7 C5 0A 35 65 94 A3 35 27 AD 3D A4 51 A5 DF>)
$$ ##END=
$$ 
$$ hash MD5
$$ E0 EA 80 32 69 C1 DB CB 4F FA 40 36 3F 16 81 2C
##$RELAX= 
##$RELAX= 
##$RELAX= 
##$RELAX= 
##$RELAX= 
##$RELAX= 
$$ Bruker specific parameters
$$ --------------------------
##$DU= <F:/spectra>
##$EXPNO= 1
##$NAME= <H-C>
##$PROCNO= 1
##$TYPE= <nmr>
##$USER= <she>
##$AMP= (0..31)
100 100 100 100 100 100 100 100 100 100 100 100 100 100 100 100 100 100 
100 100 100 100 100 100 100 100 100 100 100 100 100 100 
##$AQSEQ= 0
##$AQ_mod= 1
##$AUNM= <au_zg>
##$AUTOPOS= <>
##$BF1= 200.13
##$BF2= 200.13
##$BF3= 200.13
##$BF4= 200.13
##$BF5= 200.13
##$BF6= 200.13
##$BF7= 200.13
##$BF8= 200.13
##$BYTORDA= 1
##$CFDGTYP= 0
##$CFRGTYP= 5
##$CHEMSTR= <none>
##$CNST= (0..31)
1 1 145 1 1 1 1 1 1 1 1 1 1 1 1 1 1 1 1 1 1 1 1 1 1 1 1 1 1 1 1 1 
##$CPDPRG= <>
##$CPDPRG1= <>
##$CPDPRG2= <>
##$CPDPRG3= <>
##$CPDPRG4= <mlev>
##$CPDPRG5= <mlev>
##$CPDPRG6= <mlev>
##$CPDPRG7= <mlev>
##$CPDPRG8= <mlev>
##$CPDPRGB= <>
##$CPDPRGT= <>
##$D= (0..31)
0 0.7 0 0 0 0 0 0 0 0 0 0.03 0 0 0 0 0 0 0 0 0 0 0 0 0 0 0 0 0 0 0 0 
##$DATE= 1749463135
##$DBL= (0..7)
120 120 120 120 120 120 120 120 
##$DBP= (0..7)
150 150 150 150 150 150 150 150 
##$DBP07= 0
##$DBPNAM0= <>
##$DBPNAM1= <>
##$DBPNAM2= <>
##$DBPNAM3= <>
##$DBPNAM4= <>
$$ [...]
##$SUBNAM3= <"">
##$SUBNAM4= <"">
##$SUBNAM5= <"">
##$SUBNAM6= <"">
##$SUBNAM7= <"">
##$SUBNAM8= <"">
##$SUBNAM9= <"">
##$SW= 18.0517328524113
##$SWIBOX= (0..15)
0 0 2 0 0 0 0 0 0 0 0 0 0 0 0 0 
##$SW_h= 3612.71676300578
##$TD= 16384
##$TD0= 1
##$TE= 0
##$TE2= 300
##$TE3= 300
##$TEG= 300
##$TL= (0..7)
0 120 120 120 120 120 120 120 
##$TP= (0..7)
150 150 150 150 150 150 150 150 
##$TP07= 0
##$TPNAME0= <>
##$TPNAME1= <>
##$TPNAME2= <>
##$TPNAME3= <>
##$TPNAME4= <>
##$TPNAME5= <>
##$TPNAME6= <>
##$TPNAME7= <>
##$TPOAL= (0..7)
0.5 0.5 0.5 0.5 0.5 0.5 0.5 0.5 
##$TPOFFS= (0..7)
0 0 0 0 0 0 0 0 
##$TUNHIN= 0
##$TUNHOUT= 0
##$TUNXOUT= 0
##$USERA1= <user>
##$USERA2= <user>
##$USERA3= <user>
##$USERA4= <user>
##$USERA5= <user>
##$V9= 5
##$VALIST= <valist>
##$VCLIST= <CCCCCCCCCCCCCCC>
##$VD= 0
##$VDLIST= <DDDDDDDDDDDDDDD>
##$VPLIST= <PPPPPPPPPPPPPPP>
##$VTLIST= <TTTTTTTTTTTTTTT>
##$WBST= 1024
##$WBSW= 4
##$XGAIN= (0..3)
0 0 0 0 
##$XL= 0
##$YL= 0
##$YMAX_a= 247164
##$YMIN_a= -414079
##$ZGOPTNS= <>
##$ZL1= 120
##$ZL2= 120
##$ZL3= 120
##$ZL4= 120
##$ABSF1= 15.5651
##$ABSF2= -2.486752
##$ABSG= 5
##$ABSL= 3
##$ALPHA= 0
##$AQORDER= 0
##$ASSFAC= 0
##$ASSFACI= 0
##$ASSFACX= 0
##$ASSWID= 0
##$AUNMP= <proc_1d>
##$AZFE= 0.1
##$AZFW= 0.1
##$BCFW= 0
##$BC_mod= 2
##$BYTORDP= 0
##$COROFFS= 0
##$CY= -3
##$DATMOD= 1
##$DC= 0
##$DFILT= <>
##$DTYPP= 0
##$F1P= 0
##$F2P= 0
##$FCOR= 1
##$FTSIZE= 16384
##$FT_mod= 6
##$GAMMA= 0
##$GB= 0
##$INTBC= 1
##$INTSCL= 3.241238e-09
##$ISEN= 128
##$LB= 0.25
##$LEV0= 0
##$LPBIN= 0
##$MAXI= 10000
##$MC2= 0
##$MEAN= 0
##$ME_mod= 0
##$MI= 1.114404
##$NCOEF= 0
##$NC_proc= -6
##$NLEV= 6
##$NOISF1= 3.799351
##$NOISF2= 2.8
##$NSP= 0
##$NTH_PI= 0
##$NZP= 0
##$OFFSET= 15.49127
##$PC= 1
##$PHC0= -1553.067
##$PHC1= 9.992201
##$PH_mod= 1
##$PKNL= yes
##$PPARMOD= 0
##$PSCAL= 0
##$PSIGN= 0
##$REVERSE= no
##$SF= 200.130006090622
##$SI= 16384
##$SIGF1= 3
##$SIGF2= 2
##$SINO= 0.751879
##$SIOLD= 32768
##$SREGLST= <19F.Aceton>
##$SSB= 0
##$STSI= 16384
##$STSR= 0
##$SW_p= 3612.71676300578
##$SYMM= 0
##$S_DEV= 0
##$TDeff= 16384
##$TDoff= 0
##$TI= <>
##$TILT= no
##$TM1= 0
##$TM2= 0
##$TOPLEV= 0
##$USERP1= <user>
##$USERP2= <user>
##$USERP3= <user>
##$USERP4= <user>
##$USERP5= <user>
##$WDW= 1
##$XDIM= 16384
##$YMAX_p= 319116515
##$YMIN_p= -881365
$$ End of Bruker specific parameters
$$ ---------------------------------
##NTUPLES= NMR SPECTRUM
##VAR_NAME=  FREQUENCY,     SPECTRUM/REAL,   SPECTRUM/IMAG
##SYMBOL=    X,             R,               I
##VAR_TYPE=  INDEPENDENT,   DEPENDENT,       DEPENDENT
##VAR_FORM=  AFFN,          ASDF,            ASDF
##VAR_DIM=   16384,         16384,           16384
##UNITS=     HZ,            ARBITRARY UNITS, ARBITRARY UNITS
##FACTOR=    0.220516191357247, 1,           1
##FIRST=     3100.26797252148, 0,            0
##LAST=      -512.448790484296, 0,           0
##MIN=       -512.448790484296, -881365,     0
##MAX=       3100.26797252148, 319116515,    0
$$ Real data points
##PAGE= N=1
##DATA TABLE= (X++(R..R)), XYDATA
$$ [...]
8107H8366J32924P6054j3545J9299K6698j84242o3276K02647j6284k07427K7997
8096H9211J26997J32775m5959j26051J0895l9872m7818N8501L3341m5602K4692
8085A71110n9794K4636O0363N50K3730O0470j47391M8377Q6607n5926k6485k0925
8073A65322R17l7077m3635M0179J16058j1432K3726r0311O1404l4602o7168n2305
8061G1076M8588R5139O0060n242J13506j24989J144n1544m0566Q9360j21116K5545
8049A60961N8621R70o7415j82748L2444J36119K0688M5839r706q7096q6589R7488
8037A19576J10339J45767L7232j76543q2007R5221q34q8723k7301J28795r8246
8026A63276j23713Q4437M7959k5525L9129n5956L5845M6998n1120j57346L6508
$$ plain form
8107 88366 221290 297344 283799 303098 329796 145554 82278 284925 268641 61214 89211
8096 89211 216208 348983 303024 176973 187868 147996 100178 158679 192020 146418 171110
8085 171110 111316 135952 196315 196865 220595 281065 133674 182051 268658 212732 186247 165322
8073 165322 166239 129162 85527 125706 241764 230332 254058 163747 225151 190549 123381 71076
8061 71076 119664 214803 274863 269621 383127 258138 259282 207738 167172 256532 135416 160961
8049 160961 219582 220552 153137 -29611 2833 138952 159640 205479 195773 108677 22088 119576
8037 119576 229915 375682 412914 236371 154364 249585 248751 160028 132727 261522 163276
8026 163276 39563 124000 171959 146434 185563 129607 165452 212450 161330 3984 40492
8015D0492m0426L9777M6959j06034J04069P6218j9429k3464n5078M6439n9476
8004E0047Q914N3636L4283k5715n5115K2565P627J2074J02250m165j63215O3554
7992A06740J30404k4185j10038K1383Q4207P0934j6993j05553K0028k8030r1578
7981E7319O917Q5694k4068J6347O7627M3973l7480n5666K3180j05289p1625L3808
7969D0737J8360j39683R1560q987O528J64705R8702l2450r4042o4239j28018k8075
7957g4902k277J23134M3160j13638O8797P2921n4096j5305n9774l579M1059N0694
7945G6194l3340J7520M2944j08673m3551R6656J20337K7088j60308n0532k6739
7934d2404k2762L7088Q1614O6202P2224k1603p619O9354O97r7767j00800Q2150
$$ plain form
8015 40492 66 39843 86802 -19232 84837 161055 141626 118162 63084 109523 50047
8004 50047 58961 112597 146880 121165 66050 88615 96242 108316 210566 206401 43186 106740
7992 106740 237144 212959 102921 124304 208511 279445 262452 156899 176927 148897 57319
7981 57319 64236 149930 125862 142209 209836 253809 216329 160663 183843 78554 6929 40737
7969 40737 59097 -80586 10974 1987 8515 173220 271922 239472 145430 81191 -46827 -74902
7957 -74902 -77179 45955 89115 -24523 44274 117195 63099 47794 -11980 -15559 25500 76194
7945 76194 42854 60374 103318 -5355 -48906 47750 168087 195175 34867 -15665 -42404
7934 -42404 -65166 -28078 53536 119738 191962 170359 162740 232094 232791 135024 34224 116374
7922A16374k1467L5580K1275r321J9763J0423r7966J4489M2690O1590j07723n6828
7910B8879j4222J7868P202j7720P3915R5699p1460q5102j2107O084j5928N5995
7898F9103L1436m2859n0172l8084p1100Q2286K20246j20450J16729k7665J2598
7887A82068P0600q6641k3690P162M406o843j13389R1887o6430k2Q3814m5815j41880
7874d4773k9154j952m6796J65848J36744k2609m1566o9739n3826Q8368O2623r0572
7862E2596P8812N1151j00069R9083o397K3327l2732q0490P5403L197j93942o8014
7850i8075j3366J27705J35987P3007r5693k522P2541N4073o8246l6690P6542r2110
7838A33153j13056K6318J41947N8734q7761M3128r9507q0070J09507J11944N4031
$$ plain form
7922 116374 94907 130487 151762 142441 162204 172627 74661 89150 131840 193430 85707 28879
7910 28879 14657 32525 39727 22007 95922 191621 120161 35059 22952 29036 13108 69103
7898 69103 100539 57680 7508 -30576 -101676 -19390 200856 80406 197135 169470 182068
7887 182068 252668 166027 142337 149499 153905 147062 33673 125560 59130 59108 142922 97107 -44773
7874 -44773 -73927 -75879 -122675 43173 179917 157308 115742 46003 -7823 80545 143168 52596
7862 52596 131408 182559 82490 181573 175176 198503 165771 85281 160684 163881 -30061 -98075
7850 -98075 -111441 16264 152251 225258 129565 127043 199584 253657 185411 148721 225263 133153
7838 133153 20097 46415 188362 247096 159335 202463 102956 22886 132393 244337 298368
7827B98368L8800O4762j26851k18781q3074K8173n483l9485N5236R5040J4708
7816A21413l3783Q9209q6599p8688j68659P5271J20286l3829k4708N5835R3462
7805A29210r9222J36411k9155j58359M4768r963K0848L8143L4264j42722P9272
7794D3495R7361n8752k9778J7069N4244q9433j7504J07410J94510j04409j12500
7783A01713Q969p361r4325J1030K6809O4364N1784M340j47590K1042J83190p7281
7771A46684q5892o5195M8847j12051O9602J67513r3882k330K3845k8929J0380
7760G8592q681m7020J63083O4674j4654j13739K6896o8805m2552J9017p5379l1346
7748d9914J61610o5209j8870Q1810l1900r1263p5833R4316Q6808j17549k0596
$$ plain form
7827 298368 337168 401930 275079 56298 -26776 1397 -4086 -43571 11665 106705 121413
7816 121413 87630 176839 90240 11552 -157107 -81836 38450 4621 -20087 35748 129210
7805 129210 29988 166399 137244 -21115 23653 13690 34538 72681 106945 -35777 43495
7794 43495 140856 82104 52326 69395 123639 34206 16702 124112 318622 214213 101713
7783 101713 110682 103321 8996 20026 46835 111199 162983 167323 19733 40775 223965 146684
7771 146684 60792 -4403 44444 -67607 1995 169508 75626 73296 97141 68212 78592
7760 78592 69911 22891 185974 250648 235994 122255 149151 80346 37794 56811 -18568 -49914
7748 -49914 111696 46487 27617 109427 77527 -13736 -89569 4747 91555 -25994 -46590
7737d6590J02878o3129O1557Q565R1343J01078o7515j3022j8764j33053j58J67184
7725A90374q2541j8237O5123j72487J09025m320P0290M1492j04145J35425j22170
7714A07829M1956k7183J2893j00138K6919P702m0256q8760O406J28780N4113l1004
7702I9257Q5469r5331k7760P60j16169J8999R5692Q9966q9224J9674p196j10232
7690c6095P3697O3398k3674p2415n1158j550Q1659P2195M149r413k02469k6712
7678a28388J09789J30233m3842O9456p3846j5212L1959P292R2625M8986p2777
7667A56275p6246k3706n5615j19711J13410R9624J23k9402j8928O8355P0882j49886
7655C5175Q5276N7338N9294r7363K4903M6016K2773r3078k5843n0838q6362l7424
$$ plain form
7737 -46590 56288 -6841 54716 63281 154624 255702 188187 175165 156401 23348 23190 190374
7725 190374 107833 89596 154719 -17768 91257 86937 157227 198719 94574 229999 107829
7714 107829 149785 122602 135495 35357 62276 69978 29722 -59038 -52632 76148 130261 99257
7702 99257 184726 89395 61635 62395 -53774 -34775 60917 150883 61659 81333 74137 -36095
7690 -36095 37602 101000 77326 4911 -46247 -47797 33862 106057 110206 100793 -101676 -128388
7678 -128388 -18599 111634 67792 137248 63402 48190 80149 87441 180066 229052 156275
7667 156275 80029 56323 708 -119003 -5593 94031 94154 64752 45824 114179 185061 35175
7655 35175 120451 177789 237083 139720 164623 210639 233412 140334 114491 63653 -22709 -60133
7643f0133j850J31214K828n3937m5022Q0558O947j14022m7889J36957M9458p0736
7631A4373P4131j16267K6865L8931R703l6599L7714N1051o6879n464k1887J2372
7619A8044J5120R734M4835k8432L0021l572k2718j23090L433N6281P1716Q4818
7607A56190j55517M6154L0505k5468J49638L1307j54233p816m6081o2750L2896
7596e175L9683M622K5372m7669O9893R7402m2332o9416m7602p272O7988j51262
7584f5768J1013O1172M8937L489m5072r2326l3130L7558M0871R611J99213K45
7572A75813j8342L9297j10452n1050R1332L398j4575q0575N7971P3592L6967J14946
7560C18322p5869j18949Q3663q3908j12044R5171M544K5518M0559q3649O6148
$$ plain form
7643 -60133 -61983 69231 72059 18122 -26900 53658 60605 -53417 -101306 35651 85109 14373
7631 14373 88504 -27763 -898 38033 47736 11137 48851 99902 33023 27559 5672 18044
7619 18044 33164 42898 87733 59301 89322 85750 63032 -60058 -56625 -344 71372 156190
7607 156190 673 46827 77332 51864 201502 232809 78576 70760 24679 -38071 -5175
7596 -5175 34508 39130 64502 16833 86726 184128 141796 72380 24778 17506 85494 -65768
7584 -65768 -54755 6417 55354 58843 13771 -78555 -111685 -74127 -33256 -23645 175568 175813
7572 175813 157471 196768 86316 35266 126598 129996 115421 34846 92817 166409 203376 318322
7560 318322 242453 123504 207167 123259 11215 106386 110930 136448 177007 93358 159506
7549A59506K1968l7033q5646R9911r8739l7033J2327R6428Q586j8795m2723M7407
7537A26164R3289j01986K9504K6211n572m6305l835j08605Q843K7416O1548j766
7525A04906m6158j25925J01152R0484l5951j30276N7553J22297N8830o7964l4666
7514I4282m1214K5866k7279O3594J65906m3177q2713j10978k540R0253M7769n8000
7502A21769r233P1804p5532j4571O8273r5178L6110M9225K6852j8534N2689p828
7490B05846l5657L5162K7119j98934J07328J03292p3173J0532j06548O271Q8499
7479A69737N1502r0534r8040R4467J70903m6622m1046N3155L7078K9395o8093
7468B61902l0697J91874m6497o5761M394o3594P522j17819o3474J14541N2248
$$ plain form
7549 159506 181474 144441 58795 158706 59967 22934 35261 131689 140275 121480 78757 126164
7537 126164 219453 117467 146971 173182 167610 121305 117470 8865 17708 45124 106672 104906
7525 104906 58748 -67177 33975 124459 88508 -41768 15785 138082 196912 128948 94282
7514 94282 53068 78934 51655 115249 281155 237978 155265 44287 41747 132000 179769 121769
7502 121769 112536 184340 108808 94237 162510 67332 103442 152667 179519 160985 213674 205846
7490 205846 170189 205351 232470 33536 140864 244156 170983 181515 74967 81238 169737
7479 169737 221239 130705 32665 127132 298035 251413 210367 263522 300600 329995 261902
7468 261902 231205 423079 376582 310821 315215 251621 259143 141324 77850 192391 244639
7457B44639R9148J2380J0227o5663j47940N0736j19414k6383K33582R293O1469
7446C62074m8536M3386p059O54J5885j70383Q1826q8906q5504K12240m088r837
7434C01752j23036K4514Q9954L7740n4748P9611L2292N0218o1716n8657j38445
7423A79479P3506N0929O3515R9005K2068J9246j57435m5866l8655J77443Q7290
7412E30525q5619l4630n1399j79995O6020N8113j1928J38767n3072k1874P7292
7401D32200J4342R0474k00435j4715M2242n4580L4298j2904R9121o3438Q4763
7390D51368L6942P5373M827j20180K9745q1623L3273j2972l0486k5361N4480J13980
7378E29366P9586n0544K1770O6471m8135j4334P8367j16532P3283j4125K4919
$$ plain form
7457 244639 343787 356167 366394 300731 152791 203527 84113 57730 291312 300605 362074
7446 362074 313538 356924 349865 350519 366404 196021 277847 188941 103437 315677 311589 301752
7434 301752 178716 203230 293184 330924 276176 355787 388079 438297 376581 317924 179479
7423 179479 252985 303914 367429 466434 488502 507748 350313 304447 265792 443235 530525
7412 530525 444906 410276 358877 178882 244902 303015 291087 429854 376782 354908 432200
7401 432200 446542 537016 336581 321866 364108 309528 343826 330922 430043 366605 451368
7390 451368 488310 563683 568510 448330 478075 396452 429725 416753 386267 360906 415386 529366
7378 529366 608952 558408 580178 646649 598514 584180 662547 546015 619298 605173 630092
7367F30092J3380o5791n3926K8237o663q4745O184J26779L916j0347o7481m4691
7355D74944Q8261n752p2560m8661k0446K03511N583o3189o7021k8519J23788r6214
7343D93725K0312O8787J4477L3196k0689L7799M2462o0746O6766o0510J535n2437
7331E84677j8899M8318L0648p3656m1441p0604j9294k1865n4856R4652K3197R1846
7319E72723k0856j24911J03043M1723m4372P7706R8793n1201L153R3074J2318
7308G61193R210j6703q6606M8380O4792R437J21629l0018M1156n2585l8121j14876
7296G16888n2613k8942J04380Q5826K5436K31719o3994j68890k4903l693m3929
7285G77285p5481J19928R9881n0431p771K1704J43723J38Q7701R4194p3029M2128
$$ plain form
7367 630092 643472 577681 523755 551992 545329 460584 466768 593547 597463 587116 519635 474944
7355 474944 563205 557453 484893 436232 415786 619297 624880 561691 494670 466151 589939 493725
7343 493725 514037 582824 597301 630497 609808 647607 690069 629323 696089 635579 637114 584677
7331 584677 565778 614096 644744 571088 529647 459043 439749 417884 363028 457680 480877 572723
7319 572723 551867 426956 529999 571722 527350 605056 703849 652648 655801 748875 761193
7308 761193 770403 753700 667094 715474 780266 789703 911332 881314 922470 869885 831764 716888
7296 716888 664275 635333 739713 825539 850975 1082694 1018700 849810 824907 821214 777285
7285 777285 701804 821732 921613 871182 863411 885115 1028838 1028976 1116677 1210871 1137842 1179970
7273A179970R2771j25233n5556K9394O1798P1034Q2957j8074o7536j001J2433
7262A262957J06864K9979M6558n4921J96782R1731q3081j30398J77870O8838J48444
7251A861623M0118k09082o9129Q5619M2936m5553M1888q4016R9931m3909p3753
7240A646673j06301R1905M4490k13530j65871P59k2304L3596j10968M6543j3334
7229A231658n6795m5456o1968q6373m2377k8429m0091p6482l0225r5201l2250
7218F36011l1082p6328o5958O0719N8260l6266L1339O2126p9098l3336m4179j03075
7206C79133J21486J599M5073q1734j398k6126k8237P0365p1184n6253J57519J2697
7194E22940q8741J4515J1548o4616n9625O1802M5784O5176m1731n7104j01091
$$ plain form
7273 1179970 1272741 1147508 1091952 1121346 1183144 1254178 1337135 1319061 1251525 1250524 1262957
7262 1262957 1369821 1399800 1446358 1391437 1588219 1679950 1596869 1466471 1644341 1713179 1861623
7251 1861623 1901741 1692659 1623530 1709149 1752085 1706532 1748420 1664404 1764335 1720426 1646673
7240 1646673 1540372 1632277 1676767 1463237 1297366 1298125 1275821 1309417 1198449 1244992 1231658
7229 1231658 1174863 1129407 1067439 981066 938689 910260 870169 793687 763462 668261 636011
7218 636011 604929 528601 462643 523362 581622 545356 576695 638821 559723 526387 482208 379133
7206 379133 500619 502218 547291 465557 464159 438033 409796 480161 408977 352724 510243 522940
7194 522940 434199 448714 460262 395646 336021 397823 443607 508783 467052 409948 308857
7183C08857O320j12865P8681J36930J9231r6236J00384L7186O574K4041q0600
7172D28503k6531J2904M2212k4838J2631J00181J0292m9941o4753l9468O9280
7161D70472m0717o0845o0243Q5923l9929l8560q4673P5611J57518N4729m3436
7150D75850n3611p4383J03659j9015m0408L6977L8352k1687J21655m2929R1499
7139F15959j52259q1346K952N8871P4376j08271M5289o0002O797Q3498J1542j1017
7127D86389m0624j14009O5435l0405j12930M3446J13473p790R5382N415p2233
7116D31549j14205P443K28030J47897N390J8889k5146j77911j58730J06881n0863
7105D19224M1718j3410N417l620J49911P8042n8008j87962r3075O1046j3714N0697
$$ plain form
7183 308857 315177 202312 280993 417923 437154 340918 441302 478488 485062 509103 428503
7172 428503 401972 414876 457088 432250 444881 545062 555354 505413 440660 401192 470472
7161 470472 429755 368910 308667 394590 354661 316101 231428 307039 464557 519286 475850
7150 475850 422239 347856 451515 432500 392092 429069 467421 445734 567389 524460 615959
7139 615959 463700 382354 385306 444177 518553 410282 455571 395569 402366 485864 497406 486389
7127 486389 445765 331756 397191 366786 253856 297302 410775 402985 498367 503782 431549
7116 431549 317344 324787 552817 700714 706104 724993 699847 521936 363206 470087 419224
7105 419224 460942 447532 452949 449329 599240 677282 619274 431312 338237 399283 385569 436266
7093D36266p4763J6192R2787J49335j18609j0664K0086j32008n0674k8059m0799
7082B59090j0499r893O7206j8986j2416o2970j19874J56430P2844K3540J02257
7071D46729j09445L2627J40336M3623j71811N9945L1150j667p2933L9739L7846
7060D76139n7756m9704J7160l3644L1430k4430j17263J4228J11823L0178J02759
7049E00920N3869j17830o6702L7101j478p1762N4683M0451Q5609k3104k9212l6513
7037D26032K3876J09083J6217p5656j15205K7648L4574N792J33141j03220j55317
7026C26965R3042P0143k3311j07722n5213Q6160J9944P9577n2407L5567K058Q7605
7014E62408o372J34942L9068j43577j8780n1600l3576M5036N5934m0493K6422
$$ plain form
7093 436266 361503 377695 470482 619817 501208 490544 510630 378622 327948 299889 259090
7082 259090 248591 238698 305904 286918 274502 211532 91658 248088 320932 344472 446729
7071 446729 337284 369911 510247 553870 382059 442004 473154 471487 398554 438293 476139
7060 476139 418383 368679 385839 352195 383625 359195 241932 256160 367983 398161 500920
7049 500920 554789 436959 370257 407358 405880 334118 388801 429252 514861 491757 462545 426032
7037 426032 449908 558991 575208 499552 384347 411995 446569 452361 585502 482282 326965
7026 326965 420007 490150 466839 359117 303904 390064 410008 489585 437178 472745 474803 562408
7014 562408 556036 690978 730046 586469 567689 516089 482513 527549 583483 542990 569412
7003E69412j3010j22061N580P2470q897q7435J18990L6372J4878j26725q1708
6992C77866n8849O7441L6026r5123o6791R2961l2431N7422R5571j12777m6555
6981C14761R0647J88475j32723k6841J4068j19601k6984O1830J02729J36776m994
6970E98143j26190K2910l9994O2611P7521j20758M4179k9536l4901N5064J19652
6959F28701L063n8363J7439K9639Q9222L4874r9897L6770J50652p9022o3975j52032
6947E37071k6151J32787J16556R5819p9195m1143J44349m694J6343R0381P1655
6936A053778k588J3660P3700K9361L005L7042O5419R8167L3167M4133k0521o0662
6924A367661J2530k4063K2905j05916J6101m1314o9961j32262j4120p9419o9078
$$ plain form
7003 569412 556402 434341 439921 512391 503494 416059 535049 571421 586299 459574 377866
6992 377866 319017 386458 422484 327361 260570 353531 321100 378522 474093 361316 314761
6981 314761 405408 593883 461160 434319 448387 328786 301802 363632 466361 603137 598143
6970 598143 471953 494863 454869 517480 595001 474243 518422 488886 453985 509049 628701
6959 628701 631764 573401 590840 620479 709701 744575 644678 681448 832100 753078 689103 537071
6947 537071 510920 643707 760263 856082 776887 735744 880093 875399 891742 982123 1053778
6936 1053778 1051190 1064850 1138550 1167911 1170916 1207958 1273377 1371544 1404711 1448844 1428323 1367661
6924 1367661 1380191 1356128 1379033 1273117 1289218 1247904 1177943 1045681 1031561 952142 883064
6913H83064L1703m1518j16687k2883m4143P0575N6234q3967k879q496J8654j5890
6901G23767p9207j14608m1602Q6492j25822k6408R2216P7160J8034j4859l2451
6890E62712n7189j41365J9387J03775L0630L8115j33492p7557L4415P4896N5506
6879E09833J2672l4573r1419o0882K8222J69089j3922K1166l3230L1958l9291
6868D99623n973J8397j16179R1921Q8540j4322o9164R0718L0279j31711r4747
6857C87382k6857J20978N2589j2492m178L7321n3586p1167O3759J46071K7763
6846F67583m2043j79707J09161m1261m871j8979k3415K2104o5141L4705k3186
6835D34950L3638r845J9509n6672L0880Q8974q0944j01367L5065k1941J86934
$$ plain form
6913 883064 914767 873249 756562 733679 689536 760111 816345 732378 729499 721003 739657 723767
6901 723767 644560 529952 488350 574842 449020 422612 514828 591988 610022 595163 562712
6890 562712 505523 364158 383545 487320 517950 556065 422573 345016 379431 454327 509833
6879 509833 522505 487932 396513 335631 363853 532942 519020 540186 506956 538914 499623
6868 499623 493650 512047 395868 487789 576329 562007 492843 583561 613840 482129 387382
6857 387382 360525 481503 534092 521600 517422 554743 501157 429990 493749 639820 667583
6846 667583 625540 445833 554994 513733 508862 489883 466468 488572 423431 458136 434950
6835 434950 468588 458743 478252 421580 452460 541434 460490 359123 394188 372247 559181
6824E59181L2853q1259j17321j4932J58162j1062q818j12171j379L592j18609
6813B88237J06564P1950R583j18209J31700j7478P0549P7847M7836j13426K9666
6802E84819r9574j71324n1514L8816Q9594M9454N6150Q4524Q871j09543r101L533
6790D74705j2732J6108N755j7262l8354J88405J16059m9837j31166j7270J04881
6779F39292j65548j6173L9590j3279K9368Q8402l1697p3455K9703J04909j6610
6768F14502j09750N3836p710m3771J4120J39707K11335q1719p4284K8448p4995
6757F69719q111j2921N595J8913k8587l1943j01519Q0215J40266P6905j32821
6746F75711j85860J17505q440n6281J61769M2481r6197j5186j6808M0003N8570
$$ plain form
6824 559181 592034 510775 393454 378522 536684 525622 516804 404633 403254 406846 288237
6813 288237 394801 466751 476334 358125 489825 472347 542896 620743 668579 555153 584819
6802 584819 485245 313921 262407 301223 390817 440271 496421 580945 589816 480273 471172 474705
6790 474705 461973 478081 483836 466574 428220 616625 732684 682847 551681 534411 639292
6779 639292 473744 457571 497161 483882 513250 601652 569955 496500 526203 631112 614502
6768 614502 504752 558588 550878 507107 521227 660934 872269 790550 716266 744714 669719
6757 669719 661608 648687 654282 673195 644608 612665 511146 591361 731627 808532 675711
6746 675711 489851 607356 598916 542635 704404 746885 650688 635502 618694 658697 717267
6735G17267P9633j1923M2018M191P5915m5874j56751Q8648K4637n750n5847q9492
6723F66672N9478K089Q3712k4366r140m5620J9610R0758k0406N2329J25547k38
6711A000425l3480k3154m6291N4210R1078p7847n6518J18114m4037Q9029n4732
6700A016797o1325J6614J23518n176k4632Q7747P0833L5251N58o5998M1501m6410
6688A189278m9484O310P2078l4931P0065M3942o70M2094J912M1202J00366p4145
6676A408017N0751L6367L1404J8859K2260L8120N7350Q9860k1500r0416K15945
6665A857017n0819n9842N8877K396J07778P1291J24755P7583q8537n3876J47175
6654B193798P4165J38796R8916K8250l0560j28101j3800J0291J43567O1049Q0437
$$ plain form
6735 717267 796900 784977 826995 831186 907101 861227 704476 793124 817761 812011 756164 666672
6723 666672 726150 728239 811951 787585 778445 732825 752435 843193 822787 875116 1000663 1000425
6711 1000425 966945 943791 897500 951710 1042788 964941 908423 1026537 982500 1071529 1016797
6700 1016797 955472 972086 1095604 1090428 1065796 1153543 1224376 1259627 1260185 1194187 1235688 1189278
6688 1189278 1139794 1146104 1218182 1183251 1253316 1297258 1296588 1338682 1340594 1381796 1482162 1408017
6676 1408017 1458768 1495135 1526539 1545398 1567658 1605778 1663128 1752988 1731488 1641072 1857017
6665 1857017 1806198 1746356 1805233 1807629 1915407 1986698 2111453 2189036 2100499 2046623 2193798
6654 2193798 2267963 2406759 2505675 2533925 2503365 2375264 2361464 2371755 2515322 2576371 2656808
6643B656808J34669r4793L7147J53123Q8226N3963Q2742K4670Q6679J21227M7388
6632C391849O3156R8832M2041K5246Q8943J01917m7280R4432J63979K60092L9648
6621D322855M6569R1228R7510J32395K09411K99717Q5174L02042L39901J19785
6611F046587Q0610Q9349J81219K49024J72149J93379P0438R908Q8993P6205J29219
6600G387080J55617J98227K87220K66070K54515M07470L85997M32201O11102P05086
6590A1090585N98807O52118Q56716R43834P98576R39171R49247J142576Q76351
6581A8847981N48551l4198o48769j379260j763692j605450j636161j403811j151454
6572I773737j063974o51542p24626m09631l25108k13005j84961k20731P9173M931
$$ plain form
6643 2656808 2791477 2696684 2733831 2886954 2975180 3029143 3111885 3136555 3223234 3344461 3391849
6632 3391849 3455005 3553837 3595878 3621124 3710067 3811984 3764704 3859136 4023115 4283207 4322855
6621 4322855 4369424 4460652 4558162 4690557 4899968 5199685 5284859 5586901 5926802 6046587
6611 6046587 6127197 6216546 6397765 6646789 6818938 7012317 7082755 7092663 7181656 7257861 7387080
6600 7387080 7542697 7740924 8028144 8294214 8548729 8956199 9342196 9774397 10385499 11090585
6590 11090585 11689392 12341510 13198226 14142060 14940636 15879807 16829054 17971630 18847981
6581 18847981 19396532 19362334 18713565 17334305 15570613 13965163 12329002 10925191 9773737
6572 9773737 8709763 8058221 7333595 6923964 6598856 6385851 6200890 5980159 6059332 6064263
6562F064263j71503k34491l10245j99670j38307k65870k09250l12975j22803k07873
6552C891276j33037k50913j19066j22782j13013J28054j50209n0225Q274j46101
6542B942258K6973J3853j6052O9703k5926o957J1794j74273l2009J52892K8082
6531B990338r6632J01333J57r1386Q6518q8810p3832k9273m8164n3913j23963
6520B572373q6616Q373o662q7883M9733J41312M3025k79839k8130p9497j8124
6509B228065O0940J3897O4849n0698N8036R466p29l0980j3481R6871j24559q712
6497B302965N2527o6544n611K3475J16294j65092M6389N5551J11627j19152m0929
6486B311500J75781q781K3631q693N9060o4708L1488o3818L6741R9851P9703L8555
$$ plain form
6562 6064263 5892760 5658269 5348024 5148354 5010047 4744177 4534927 4221952 4099149 3891276
6552 3891276 3758239 3507326 3388260 3265478 3152465 3280519 3130310 3080085 3088359 2942258
6542 2942258 2969231 2983084 2967032 3036735 3010809 3003852 3015646 2841373 2809364 2962256 2990338
6531 2990338 2893706 2995039 2995196 2903810 2990328 2901518 2827686 2798413 2750249 2696336 2572373
6520 2572373 2485757 2494130 2487468 2399585 2449318 2590630 2633655 2353816 2325686 2246189 2228065
6509 2228065 2289005 2302902 2367751 2317053 2375089 2384555 2383826 2352846 2339365 2436236 2311677 2302965
6497 2302965 2355492 2288948 2283337 2306812 2423106 2258014 2304403 2359954 2471581 2352429 2311500
6486 2311500 2487281 2478500 2502131 2493438 2552498 2487790 2519278 2455460 2492201 2592052 2671755 2710310
6474B710310N9266r9915J34932q1963n3355J2058k0628J25417J08055P6414O6540
6463C037131j04482L9897J16290K6200j21668l5760O9859N4251K3689O6297m842
6452C166862m8352L7791P0174L9567m2648O2671j0641J92378N5697p6586J2738
6441C459651N8841K2916N6870Q1122J65331j3292K5471N2880n411N8692O1659
6430D024730l302K0850K6975Q8509m3049J3709J76714q1017O1008O9854j03391
6419D251590J01071P7469J89269J32042j4809K9393J40957p937J2233J39162R8902
6408E149342J55410J9524O5813J34587M9802J42730j5068J44739K51799Q6634
6398F185312N6569J56808J00034P3888L1767J43108K61964J09218J88716J59011
$$ plain form
6474 2710310 2769576 2669661 2804593 2722630 2669275 2681333 2660705 2786122 2894177 2970591 3037131
6463 3037131 2932649 2972546 3088836 3115036 2993368 2957608 3027467 3081718 3105407 3171704 3166862
6452 3166862 3118510 3156301 3226475 3266042 3223394 3286065 3275424 3467802 3523499 3446913 3459651
6441 3459651 3518492 3541408 3598278 3679400 3844731 3831439 3856910 3909790 3904379 3963071 4024730
6430 4024730 4021428 4042278 4069253 4157762 4114713 4128422 4305136 4224119 4285127 4354981 4251590
6419 4251590 4352661 4430130 4619399 4751441 4736632 4766025 4906982 4899045 4911278 5050440 5149342
6408 5149342 5304752 5324276 5390089 5524676 5574478 5717208 5702140 5846879 6098678 6185312
6398 6185312 6241881 6398689 6498723 6572611 6604378 6747486 7009450 7118668 7307384 7466395
6388G466395J04776R8656Q7222J69824J08881J72391J83325J53962K78667K50115
6378I074214L24136K37856J42517J75379K22638K12516M01198K91893L07480L38904
6368A1728731K72675L49923L85908L95247N17094M02095M92825M51646M30943
6359A5427087L48169L75485M28685L54761N75139N90072P26450O46409O27707
6350B0099964P42551R34071R98863P81149R78879R43266R42506R41192Q27810
6341B8190251P92461P79729Q37258Q55170J083457J070230J285881J285002J379107
6332C7558546J486257J425980J190972J212399J149856J428320J552653J874508
6324D8879491K205424K266717K658029K895615L196317L589016L972012M549174
$$ plain form
6388 7466395 7571171 7669827 7757049 7926873 8035754 8208145 8391470 8545432 8824099 9074214
6378 9074214 9398350 9636206 9778723 9954102 10176740 10389256 10790454 11082347 11389827 11728731
6368 11728731 12001406 12351329 12737237 13132484 13649578 14051673 14544498 14996144 15427087
6359 15427087 15775256 16150741 16579426 16934187 17509326 18099398 18825848 19472257 20099964
6350 20099964 20842515 21776586 22775449 23556598 24535477 25478743 26421249 27362441 28190251
6341 28190251 28982712 29762441 30599699 31454869 32538326 33608556 34894437 36179439 37558546
6332 37558546 39044803 40470783 41661755 42874154 44024010 45452330 47004983 48879491
6324 48879491 51084915 53351632 56009661 58905276 62101593 65690609 69662621 74211795
6316G4211795N267462N155924L663095Q76137j836523l118330l238151k665652
6308G8315757k117913j109304K62522J604170K632349L427682K579258J196724
6300H6791245r8102n71500M29471J188975K270156K005537P42148j339513l032851
6291H8385566l829430l934122l134579k054521q73714N6692l66991j370257k312432
6282G0566212k310167j863330j257769o51268K51285J589023K814447K859884
6274G1998317J037569k078708n160396o522850o658514o053668n365712m430445
6266C6765593l462790k815308k144768j674644j369798j071296j071371q67332
6258B2288286r93207r07788q52567q51923n89186l78407l95139l74949n17199
$$ plain form
6316 74211795 79479257 84635181 88298276 89174413 87337890 84219560 80981409 78315757
6308 78315757 76197844 75088540 75351062 76955232 79587581 83015263 85594521 86791245
6300 86791245 86693143 86121643 86551114 87740089 90010245 92015782 92757930 91418417 88385566
6291 88385566 84556136 80622014 77487435 75432914 74559200 74615892 74248901 72878644 70566212
6282 70566212 68256045 66392715 65134946 64483678 64734963 66323986 69138433 71998317
6274 71998317 73035886 70957178 65796782 59273932 52615418 46561750 41196038 36765593
6266 36765593 33302803 30487495 28342727 26668083 25298285 24226989 23155618 22288286
6258 22288286 21295079 20387291 19534724 18682801 18093615 17715208 17320069 16945120 16427921
6249A6427921n79915n27974m05261k40471k08195j29022j54202j3373k0697n4437
6239A4094374l29557n25551o57610p04959p75916m71008m17529m27470l46420
6230I438354l56577j82334j61859r6135j36444r5497m7810r4989r4368J3429J35031
6219H320801R3792Q110k9796j7263j57619K390M5816l9139L491K0896p3927k4885
6207H152667J42175P1110J01710J28961k578P042j7102J34301J52026R4580J28703
6196I093595R9788K86414J91878J46626K65695K82148K63997K99690K12741M64729
6186A1607301K90166J20150J71109J25982P5731P2139K62685L5704M7259N875
6176A2814101o1438j1222k63852j15115p9037k9703m086O6209K26823L22324L72581
$$ plain form
6249 16427921 15848006 15320032 14914771 14674300 14466105 14337083 14182881 14169508 14148811 14094374
6239 14094374 13764817 13239266 12581656 11876697 11100781 10629773 10212244 9784774 9438354
6230 9438354 9081777 8899443 8737584 8641449 8505005 8409508 8361698 8266709 8172341 8185770 8320801
6219 8320801 8414593 8422703 8392907 8375644 8218025 8220415 8266231 8227092 8230583 8251479 8177552 8152667
6207 8152667 8294842 8365952 8467662 8596623 8594045 8601087 8583985 8718286 8870312 8964892 9093595
6196 9093595 9193383 9479797 9671675 9818301 10083996 10366144 10630141 10929831 11142572 11607301
6186 11607301 11897467 12017617 12188726 12314708 12390439 12462578 12725263 12760967 12808226 12814101
6176 12814101 12752663 12741441 12477589 12362474 12283437 12253734 12249648 12315857 12542680 12865004 13237585
6165A3237585K52965K99764M24422J90242J89598K76732J86945K71984p7361m36123
6155A4816753m91044n76916o66165n41075l43548n25429l50954j02237j57884
6146A1061501k66720l22693q9195k9510p0972K803K00572J31217K22724K39849
6136A1079576K37504j70891k78385m43900k82816l09124n56025n28510m33215
6127H314214k33494k68715l43627k69857k54570j68463j4987r0149j80131j98455
6117F291766o4497j18338j22671p5620N6367M0079j59086m2203k9486J20548Q0302
6106E977161K1493j3380j750P429j9669J52784k2023J5999M622j30720n3560O4980
6094F003366r4782j59538J6162J78020j4792O9860l8688O7979Q3594k4006l0738
$$ plain form
6165 13237585 13490550 13790314 14214736 14404978 14594576 14871308 15058253 15330237 15252876 14816753
6155 14816753 14325709 13748793 13082628 12541553 12198005 11672576 11321622 11219385 11061501
6146 11061501 10794781 10472088 10382893 10353383 10282411 10285214 10485786 10617003 10839727 11079576
6136 11079576 11317080 11146189 10867804 10423904 10141088 9831964 9275939 8747429 8314214
6127 8314214 8080720 7812005 7468378 7198521 6943951 6775488 6760501 6670352 6490221 6291766
6117 6291766 6227269 6108931 5986260 5910640 5967007 6007086 5848000 5805797 5776311 5896859 5977161
6106 5977161 5998654 5985274 5983524 5990953 5971284 6124068 6102045 6118044 6122666 5991946 5938386 6003366
6094 6003366 5908584 5749046 5765208 5943228 5928436 5998296 5959608 6027587 6111181 6087175 6056437
6083F056437j0286n8610J44539j5556r1296J37624J44631q6743N2979L4737r2063
6072F216393k01321j1937J22604J03843r6944k3476M8160k8200O6177o0993o2131
6061F072175o7389k7536p9403r5877J43821j30646k02235J2464M5858n5896m4371
6050E570965j044l122j13870J0631m229k8709P720o7276j3492p7677j91336r9957
6038D988604O7768l1850q1879j80118J24370L865k8176j33466o1602k6863J47089
6027D787742j37124n642l3613o2861M1456N9581j38497Q9577L9718k2607l4122
6016D583608L5990N7780J3826M7825m4928J61132L2703k9436r4202q9151o4996
6005D610151n8500j76035M1677j08650k4147N3003p41j48062m4250m5915p5731
$$ plain form
6083 6056437 6046151 5987541 6132080 6116524 6025228 6162852 6307483 6220740 6273719 6308456 6216393
6072 6216393 6015072 6003135 6125739 6229582 6132638 6109162 6157322 6129122 6195299 6134306 6072175
6061 6072175 6004786 5977250 5897847 5801970 5945791 5815145 5612910 5625374 5671232 5615336 5570965
6050 5570965 5569921 5566799 5452929 5463560 5459331 5430622 5438342 5371066 5357574 5279897 5088561 4988604
6038 4988604 5056372 5024522 4942643 4762525 4886895 4890760 4862584 4729118 4667516 4640653 4787742
6027 4787742 4650618 4644976 4611363 4548502 4589958 4649539 4511042 4600619 4640337 4617730 4583608
6016 4583608 4619598 4677378 4691204 4739029 4694101 4855233 4887936 4858500 4764298 4675147 4610151
6005 4610151 4551651 4375616 4417293 4308643 4284496 4337499 4336758 4188696 4144446 4098531 4022800
5994D022800K7036n8119J41903Q707N528o4671j04609M0696R6708R5017J08019
5983D319015j37643J2826L5734P3005J7058O2224j11746k2542J38049n3962j2091
5972D319927Q3336R1467l2810k0496r1962m5407k156l0534m556M3512R850N5206
5960D375377J5588O5565n2448m7807K6946r8436j4435N3713Q5396O5734K0159
5949D495352P1912o2279n198J22888r0805j01808j7171O5891J62173M9193J545
5938D691693k8514o2656m8849R771J66761j1547k3699J19461m6493Q3213n9058
5927D790083j64343K7467M6812j7747L5866P6412J32144k4822j24265p434J11628
5916D881801r88M2514Q1767J5507J35238L3280j2372P0691P6185J12101K4707
$$ plain form
5994 4022800 4049836 3991717 4133620 4142327 4147855 4083184 3978575 4019271 4115979 4210996 4319015
5983 4319015 4181372 4194198 4229932 4302937 4319995 4382219 4270473 4247931 4385980 4332018 4319927
5972 4319927 4403263 4494730 4461920 4441424 4349462 4304055 4301899 4271365 4266809 4310321 4320171 4375377
5960 4375377 4390965 4456530 4404082 4356275 4383221 4284785 4270350 4324063 4409459 4475193 4495352
5949 4495352 4567264 4504985 4499787 4622675 4531870 4430062 4412891 4478782 4640955 4690148 4691693
5938 4691693 4663179 4600523 4551674 4561445 4728206 4716659 4692960 4812421 4765928 4849141 4790083
5927 4790083 4625740 4653207 4700019 4682272 4718138 4794550 4926694 4901872 4777607 4770173 4881801
5916 4881801 4880813 4923327 5005094 5020601 5155839 5189119 5176747 5247438 5323623 5435724 5460431
5905E460431J9861K3915J48425k6843j17171j27518Q4870J06151L5826L817P7453
5894E689217J11073J15717L0919o2410M65J56009J14564n7056k466N4953K48068
5883F399053j7207J16855M2068M7875J6006K1239N6427J61262J0867k5443K50025
5872G079027J45500P1843k0119K39472J23959m16J98169J21296J21597J96325
5862H276653J9953R3537K28030R4709N0684J06865J84479P2405J46047K59507
5852I532869J31764K22635J82821J22553J81214K58701J08989J41521L75358L32085
5842A1590510J37841K09490K32259J98342J61833L87110M15922K88987M95350
5833A4117644L70600J93950M65928L51225M42181N98062L73859M09646M17870
$$ plain form
5905 5460431 5480292 5504207 5652632 5625789 5508618 5381100 5465970 5572121 5607947 5611764 5689217
5894 5689217 5800290 5916007 5946926 5884516 5884981 6040990 6155554 6098498 6096032 6150985 6399053
5883 6399053 6381846 6498701 6540769 6588644 6604650 6625889 6682316 6843578 6854445 6829002 7079027
5872 7079027 7224527 7296370 7276251 7515723 7639682 7639266 7837435 7958731 8080328 8276653
5862 8276653 8296606 8390143 8618173 8712882 8763566 8870431 9054910 9127315 9273362 9532869
5852 9532869 9664633 9887268 10070089 10192642 10373856 10632557 10741546 10883067 11258425 11590510
5842 11590510 11728351 11937841 12170100 12368442 12530275 12917385 13333307 13622294 14117644
5833 14117644 14488244 14682194 15148122 15499347 15941528 16539590 16913449 17323095 17740965
5824A7740965N35623M72757M79948M44321M26383O56932O52404P76733O27339
5815B2813405Q02209R62185R62470J070359J091772J059613J167452J165678R96549
5806C2091692O89996Q65689R60501P62716Q91709R91018J144803J250151J106023
5797D0754298J090038J161356J250174J548746J695263J897641K137240K478209
5789E4012965K719553L009062L128348L438696L649602M004765M575816N199028
5781H3737835N919996O516666N284331K335643j365494l501537m293067m051452
5773I0582921l093934j965772l61093J178938K345704K926235J890262M78043
5765I3981304m56220m01841J39505J251092K528001L283675L106715J532981r48637
$$ plain form
5824 17740965 18276588 18749345 19229293 19673614 20099997 20756929 21409333 22186066 22813405
5815 22813405 23615614 24577799 25540269 26610628 27702400 28762013 29929465 31095143 32091692
5806 32091692 32781688 33647377 34607878 35370594 36262303 37253321 38398124 39648275 40754298
5797 40754298 41844336 43005692 44255866 45804612 47499875 49397516 51534756 54012965
5789 54012965 56732518 59741580 62869928 66308624 69958226 73962991 78538807 83737835
5781 83737835 89657831 96174497 101458828 103794471 102428977 98927440 94634373 90582921
5773 90582921 87488987 85523215 85162122 86341060 88686764 91612999 93503261 93981304
5765 93981304 93525084 93123243 93262748 94513840 97041841 100325516 103432231 104965212 104016575
5756A04016575l062310m208044m114189l190545k020050j512425j990591k939970
5748H0978451l800733l433633k698432j720235r71539l014J241600K368200L129783
5739G5090448K221199l24822k899131m839372n413371n174438m722866m204996
5731D9732651l430967k842856k213872j887629j807005j693211j371876j262494
5723C3222741j190871q03862o35407p47502p39943o26787m11747n38587l44300
5714B7183735k48221k64953P924O1180J85823L74012L00147M51113M65582K37356
5704B8753698L39879N17509M45598K85246L90215M08649M61218M75848K52417
5695C2330277j7716q0154j72458j78997k15740l26426k47932k14005l5196M8096
$$ plain form
5756 104016575 100954265 96746221 92632032 89441487 87421437 85909012 83918421 80978451
5748 80978451 77177718 73744085 71045653 69325418 68353879 68350865 69592465 71960665 75090448
5739 75090448 77311647 76986825 74087694 69248322 63834951 58660513 53937647 49732651
5731 49732651 46301684 43458828 41244956 39357327 37550322 35857111 34485235 33222741
5723 33222741 32031870 31228008 30592601 29845099 29105156 28478369 28066622 27528035 27183735
5714 27183735 26935514 26670561 26678485 26739665 26925488 27299500 27599647 28050760 28516342 28753698
5704 28753698 29093577 29611086 30056684 30341930 30732145 31140794 31602012 32077860 32330277
5695 32330277 32312561 32232407 32059949 31880952 31665212 31338786 31090854 30876849 30841653 30889749
5685C0889749M2722J24936K5103M5691Q8770J40965J72246J82945K24097K78701
5675C2215925J11292q3400j49242j3422J62542L94180M21416O12091N07337M64154
5665C4642873N59534O81543O82561Q54243J012246P60767M60172J84245O392l87196
5655C9457380p45652j041623j171945j254679j119245r25797q93609p59582n18736
5646C1026512m42669j09621k38816k31746o2277k06655l92944k81024l39342l47573
5636B8373845l02420k42961k73245j32960q1017j65197m07550j78230k95252o68428
5626B5626585p64443p51153q59916r74780p34769p06576n61652m00358k43606
5617A9629332j17100k2559l7913n0702j60822j63040m0900l00997k43015k72298
$$ plain form
5685 30889749 30932471 31057407 31082510 31128201 31216971 31357936 31530182 31713127 31937224 32215925
5675 32215925 32327217 32243817 32094575 32081153 32243695 32637875 33059291 33671382 34178719 34642873
5665 34642873 35202407 35883950 36566511 37420754 38433000 39193767 39653939 39838184 39844576 39457380
5655 39457380 38711728 37670105 36498160 35243481 34124236 33198439 32304830 31545248 31026512
5646 31026512 30583843 30474222 30235406 30003660 29941383 29734728 29341784 29060760 28721418 28373845
5636 28373845 28071425 27828464 27555219 27422259 27341242 27176045 26768495 26590265 26295013 25626585
5626 25626585 24862142 24110989 23251073 22276293 21541524 20834948 20273296 19872938 19629332
5617 19629332 19512232 19489673 19451760 19401058 19240236 19077196 19036296 18735299 18492284 18219986
5607A8219986l83148j48653l46524l56327l18409l90069j31287j22817j71121
5598A5851631j25276o8331L615q9963J95610J59863J20670N6847J66606K23923
5588A6495195J09882r8292J77805N6203k52016j11008k70833l67427j97447k05473
5578A5336589l59319l5161j6510L4339J40657Q0113k7251j00620j79643J023N1075
5567A4925292J79070M1712j48714k25125j51826l0660k47473l05556k02696j78310
5557A3655714k34283j13039k05618r1849j50674j86618j74746M1878N4774Q3328
5547A2678867J05413J2174j3732p9914j96007k95608n29914l08529k42022k87977
5537A0842751k18457k36412r3503m0947j29529M2909n5135o1529k02733j92687
$$ plain form
5607 18219986 17836838 17688185 17341661 16985334 16666925 16276856 16145569 16022752 15851631
5598 15851631 15726355 15658024 15661639 15571676 15767286 15927149 16047819 16104666 16271272 16495195
5588 16495195 16605077 16506785 16684590 16740793 16488777 16377769 16106936 15739509 15542062 15336589
5578 15336589 14977270 14942109 14925599 14959938 15100595 15180708 15153457 15052837 14873194 14874217 14925292
5567 14925292 15104362 15146074 14997360 14772235 14620409 14589749 14342276 14036720 13834024 13655714
5557 13655714 13421431 13308392 13102774 13010925 12860251 12673633 12498887 12540765 12595539 12678867
5547 12678867 12784280 12796454 12782722 12702808 12506801 12211193 11681279 11372750 11130728 10842751
5537 10842751 10624294 10387882 10294379 10253432 10123903 10166812 10111677 10050148 9847415 9654728
5527I654728j30390j31026m6925j57280m5541p8055j0213k02455j36127J02620
5517H819336p5129m3750o4580N3226L012j0091j73239j73632j24488j82532n3402
5506G974731L7807N62j40835q856Q1647n2934o927r501k07515n8219l8363Q473
5494G580070J4615P6123m3956j25327L8069J8339q1745p6150o4987j13434j38656
5483G082961o0754J695m9196k8656O5641n8808l580m774J418p0462M361q8768
5471F791078l0043j1823J15780n3971q0188q5307N8840J1148K6531R7486j37075
5460F702456L4059J08553L602k8798J02961o9530o8924N5270J29722o6081m3737
5449F859553N0646j24648O398M0072j6933O9971k11812q4680J30231J28550P2623
$$ plain form
5527 9654728 9524338 9393312 9346387 9189107 9143566 9065511 9055298 8852843 8716716 8819336
5517 8819336 8744207 8700457 8635877 8689103 8692115 8682024 8508785 8335153 8210665 8028133 7974731
5506 7974731 8012538 8013100 7872265 7863409 7945056 7892122 7885195 7875694 7668179 7609960 7571597 7580070
5494 7580070 7594685 7670808 7626852 7501525 7539594 7557933 7476188 7400038 7335051 7221617 7082961
5483 7082961 7022207 7023902 6974706 6946050 7011691 6952883 6949303 6944529 6945947 6875485 6879846 6791078
5471 6791078 6761035 6749212 6864992 6811021 6730833 6645526 6704366 6715514 6742045 6839531 6702456
5460 6702456 6736515 6845068 6848670 6819872 6922833 6853303 6784379 6839649 6969371 6903290 6859553
5449 6859553 6910199 6785551 6791949 6832021 6815088 6885059 6673247 6588567 6718798 6847348 6919971
5438F919971j0054Q9679p3653q4808Q3177J25703J17628l4456J13435N2716P1681
5427G371019J62558q8216J06569J16704K19006J32829M3917J35989q2260k04463
5417G913652k72392l06089j26706l4559j69354k60516N3012k2547j26536M3852
5407F691817j01859n3465n9567o5502p4603k926l3578n3655K6909K8692M04O7984
5395F370651O6422r0771r0856p4766o3259Q1899k6454Q7634J2829j04436R2112
5384F261005j09192J08063m772k4986J91400O7309j61761R8738J29368J54686
5374F709858J15103P8635O2104N7354j10433M0438n7378K4765k0564j11552J17215
5363F905545J93767Q327K1435K6013N7325J12863Q4578J24341K8321J71917R7036
$$ plain form
5438 6919971 6909917 6999596 6925943 6841135 6924312 7050015 7167643 7133187 7246622 7299338 7371019
5427 7371019 7533577 7445361 7551930 7668634 7887640 8020469 8064386 8200375 8118115 7913652
5417 7913652 7641260 7335171 7208465 7173906 7004552 6744036 6797048 6774501 6647965 6691817
5407 6691817 6589958 6536493 6476926 6411424 6336821 6333895 6300317 6246662 6273571 6302263 6302667 6370651
5395 6370651 6437073 6346302 6255446 6180680 6117421 6199320 6172866 6260500 6273329 6168893 6261005
5384 6261005 6151813 6259876 6255104 6230118 6421518 6488827 6327066 6425804 6555172 6709858
5374 6709858 6824961 6903596 6965700 7023054 6912621 6953059 6895681 6920446 6899882 6788330 6905545
5363 6905545 7099312 7107639 7129074 7155087 7212412 7325275 7409853 7534194 7562515 7734432 7831468
5352G831468R8599L1346J18249J03504J02077r3384M5409m3112r7054j22371j21135
5341G853596k7935o3498l449R6911j29634L4686M5728O6812l118P7787Q0021k6634
5329H001273j5263L9550K14874J03366J55975L16934J20099P946J10439K98227
5319I353420K12930L29195L69332M02000J75138j22847j22628l07827l14561l85915
5309I588237j63510j58456l45595k05485j30781K8725j05369o4012n5805k3920
5299H364029o027p3915M1186K9322J2292M0298J11796K17961J48496J92210P7077
5288I154725K82945K88515K12752K24473L36279K95526J11891j36456k68257l67608
5278A0134785m68067l21501j70258k32152k14141k01571k4626J02426j9498j11697
$$ plain form
5352 7831468 7930067 7961413 8079662 8183166 8285243 8191859 8237268 8194156 8097102 7974731 7853596
5341 7853596 7825661 7762163 7758714 7855625 7725991 7760677 7806405 7873217 7870099 7947886 8027907 8001273
5329 8001273 7986010 8025560 8240434 8343800 8499775 8816709 8936808 8944754 9055193 9353420
5319 9353420 9566350 9895545 10264877 10666877 10842015 10719168 10596540 10288713 9974152 9588237
5309 9588237 9424727 9266271 8920676 8715191 8584410 8613135 8507766 8443754 8387949 8364029
5299 8364029 8358002 8284087 8325273 8354595 8366887 8407185 8518981 8736942 8885438 9077648 9154725
5288 9154725 9437670 9726185 9938937 10163410 10499689 10795215 10907106 10770650 10502393 10134785
5278 10134785 9666718 9345217 9174959 8942807 8728666 8527095 8502469 8604895 8585397 8473700
5268H473700l0715P3581o8377l037L4238J77376L34257O6976p0400M7914K11404
5257I246917K15327N1585J74985P6030O3765J51860J35754P661K9332m7458J2636
5246A0118394q2210L2382r3749j08814K0109K11612j75738j03346P705N5270R7159
5235I978774j5893J31076Q5082P3853M1201M5018O1168J76390K52106J20038j54908
5224A0793905M6327N0112K79440J75367N1319K07054J98262K6072k0164Q6714
5214A1894408J40839K59056J53204K31269K46548K09715J63153J85212K29825
5205A3713229K79454K65195L13698K41469J57058P1565J32957J39843K19756K97530
5195A5831754K11541J06444L71440J38716K47163L69355M21612K24351L75871
$$ plain form
5268 8473700 8442985 8516566 8448189 8445152 8479390 8656766 8991023 9057999 8987599 9035513 9246917
5257 9246917 9462244 9513829 9688814 9764844 9828609 9980469 10116223 10123884 10153216 10105758 10118394
5246 10118394 10036184 10068566 9974817 9866003 9886112 10097724 9921986 9818640 9826345 9881615 9978774
5235 9978774 9962881 10093957 10179039 10252892 10294093 10339111 10400279 10576669 10828775 10948813 10793905
5224 10793905 10840232 10890344 11169784 11345151 11396470 11603524 11801786 11827858 11807694 11894408
5214 11894408 12035247 12294303 12447507 12678776 12925324 13135039 13298192 13483404 13713229
5205 13713229 13992683 14257878 14571576 14813045 14970103 15041668 15174625 15314468 15534224 15831754
5195 15831754 16043295 16149739 16521179 16659895 16907058 17276413 17698025 17922376 18298247
5186A8298247K39019J50879K55131L64674N73352N28300M13004M75992L80979
5177B1679577N83654N09120M82006O15531O69088N49873N62164M91531N70533
5168B6713077M99833N65329P11892Q93230R17654Q71503R48997J191223J164226
5159C4476964J358599J421913J239296J331187J173431J073852J166983J170989
5151D4413214Q71679R45031J426516J241720J343553J668757J742779K120173
5143E5773422K335902K604577K828372L104176L839366M388839M053012L089825
5135H2017491J126744O45035J290247J865661K158778K577714K887090L038234
5127I7606994K694093K814426L229509M249515L734447K666943J692400J851370
$$ plain form
5186 18298247 18537266 18688145 18943276 19307950 19881302 20409602 20822606 21298598 21679577
5177 21679577 22263231 22772351 23254357 23869888 24538976 25088849 25651013 26142544 26713077
5168 26713077 27212910 27778239 28490131 29383361 30301015 31172518 32121515 33312738 34476964
5159 34476964 35835563 37257476 38496772 39827959 41001390 42075242 43242225 44413214
5151 44413214 45284893 46229924 47656440 48898160 50241713 51910470 53653249 55773422
5143 55773422 58109324 60713901 63542273 66646449 70485815 74874654 78927666 82017491
5135 82017491 83144235 83789270 85079517 86945178 89103956 91681670 94568760 97606994
5127 97606994 100301087 103115513 106345022 110594537 114328984 116995927 118688327 120539697
5119A20539697K700967L919759N838672Q471888J1007049J2645114J3671363J5421335
5111A94215844J8226882K3645221L0163216L3733685J9131667n917259l0787622
5104B82411634m0587877l9590939l6021707k9191135k3615561j6921354j2379264
5097H4103797q889797p197657n969310n148546m128220l810600k977796k406977
5089D3574894k053643j932012j394455j274328q88821r35582p20040m60664m15648
5080C3499701k49877k03982j56676J18426K4225J30796J15894J58945J85641L66362
5070C3989455M55455M19259K05300M09516K58465M54383K98120J34137L9449J18695
5060C6782234J21336O848L0680J56597M12202K05045K8360R4012k5935p348J5843
$$ plain form
5119 120539697 123240664 127160423 132999095 141470983 152478032 165123146 178794509 194215844
5111 194215844 212442726 236087947 266251163 299984848 319116515 313199256 282411634
5104 282411634 241823757 202232818 166211111 137019976 113404415 96483061 84103797
5097 84103797 75214000 68016343 62047033 56898487 52770267 48959667 45981871 43574894
5089 43574894 41521251 39589239 38194784 36920456 36031635 35096053 34376013 33915349 33499701
5080 33499701 33249824 33045842 32889166 33007592 33031817 33162613 33278507 33437452 33623093 33989455
5070 33989455 34444910 34864169 35069469 35478985 35737450 36191833 36489953 36624090 36663539 36782234
5060 36782234 36903570 36910418 36941098 37097695 37509897 37714942 37743302 37837314 37811379 37804031 37819874
5049C7819874l8503k12106k25512k89714l60374l41375l00960m69886k30867m60247
5039C4890330m81022m18019m40568l38981k69631j82811q79M3642L20112L89442
5029C3511615K02511Q4344k41290o26662o47823r83696j097037j157936j053443
5020B7990583o44569q17925n99545k88722j77200k55663j01354K9015o7715l6934
5010B5029971j8798l1119j8546K55289L19106J96478L74780M11533L87235K28041
5000B7133970R8001J76940J52830J9864n0033j52494k73331m16597l62769l66130
4990B5960251m57384l22308j05266o0817J85217K76965O24056N47074O74362R29997
4980B8252147J144062J162583J270520J621332J890223K387654K893851K858846
$$ plain form
5049 37819874 37781371 37569265 37343753 37054039 36693665 36352290 36051330 35581444 35350577 34890330
5039 34890330 34409308 33991289 33550721 33211740 32942109 32759298 32758419 32802061 33122173 33511615
5029 33511615 33714126 33798470 33557180 32930518 32282695 31298999 30201962 29044026 27990583
5020 27990583 27346014 26528089 25928544 25639822 25462622 25206959 25105605 25134620 25066905 25029971
5010 25029971 25011173 24980054 24961508 25216797 25535903 25732381 26107161 26518694 26905929 27133970
5000 27133970 27231971 27408911 27561741 27581605 27531572 27379078 27105747 26689150 26326381 25960251
4990 25960251 25502867 25180559 25075293 25014476 25199693 25476658 26100714 26647788 27322150 28252147
4980 28252147 29396209 30558792 31829312 33450644 35340867 37728521 40622372 43481218
4972D3481218J261338j318197l047001l491637l407110k924614k265224j785550
4964B6503223j173190p20146n04849l93537j86629j79944J14834N6899Q7173K98085
4954B3901919J12444r9711p2112q0471l92956j89644m5578k50588r3568j44112
4944B2645623j40052m5674J19590J97713J73045K404J26485Q5458M8214p0818
4934B3141988M422J295K08615J58994J65617K38087L61958L24826J96570L21356
4924B5123728K74004K39588J20180R0010j12337j54159l35911l70090l94028j94272
4914B4286713j59471r8308k7879j32633m9905J44518K49582J77999J30218K64700
4904B4785534K17953Q1796J64241N4145Q6272J68729K75803L85793L61078L08184
$$ plain form
4972 43481218 44742556 43424359 40377358 36885721 33478611 30553997 28288773 26503223
4964 26503223 25330033 24609887 24105038 23711501 23524872 23344928 23459762 23516661 23603834 23901919
4954 23901919 24014363 23914652 23842540 23762069 23369113 23179469 23133891 22883303 22789735 22645623
4944 22645623 22505571 22459897 22579487 22777200 22950245 22952649 23079134 23164592 23212806 23141988
4934 23141988 23146410 23147705 23356320 23515314 23680931 23919018 24280976 24605802 24802372 25123728
4924 25123728 25397732 25637320 25757500 25847510 25735173 25581014 25245103 24875013 24480985 24286713
4914 24286713 24127242 24028934 24001055 23868422 23818517 23963035 24212617 24390616 24520834 24785534
4904 24785534 25003487 25085283 25249524 25303669 25389941 25558670 25834473 26220266 26581344 26889528
4894B6889528N70067M24565o506m91004r17343j065509j101336r71040q29762
4885B2501660p64412n03502l42207m34844j7313r737k9402K418J10906J53821
4875B0667388L23082M48429N48747N91135P57038Q34251Q40599J230053J747527
4866B7988249J634964Q40532n51130j787914k225508j995032j839449j477148
4858B0587564j050311q67944o29232n67363m48490k05756m15880l12218k95863
4849A5794507n21216m35240l01369n26646n64527l94679l57271k03330m00310
4840A2089919m11157l54217j30722j14141k03213j90873j08999j17162j89376
4831A0270059n9114L7904o3303j47103j95184j18336o8174k5911l7763j5894j23426
$$ plain form
4894 26889528 27459595 27884160 27877654 27386650 26469307 25403798 24302462 23331422 22501660
4885 22501660 21737248 21233746 20891539 20456695 20439382 20429645 20400243 20402661 20513567 20667388
4875 20667388 20990470 21438899 21987646 22578781 23335819 24170070 25010669 26240722 27988249
4866 27988249 29623213 30463745 29912615 28124701 25899193 23904161 22064712 20587564
4858 20587564 19537253 18669309 18040077 17472714 17024224 16818468 16402588 16090370 15794507
4849 15794507 15273291 14838051 14536682 14010036 13445509 13050830 12693559 12490229 12089919
4840 12089919 11678762 11324545 11193823 11079682 10876469 10685596 10576597 10459435 10270059
4831 10270059 10210945 10248849 10185546 10038443 9843259 9724923 9656749 9630838 9593075 9577181 9453755
4820I453755r5361J31560j23710j40748m6735J26764j1039j17241J12462j04407
4810I185300r0400O6420J50028n8702K2688Q8952n3160R7564r2748M1327K6586
4799I383855L6503K07903K37907J22331J67809R0290n4272m397K48188K01182
4789A0637299q8108j09994l18170k13153k04860j67396j67494j33650p1998j20543
4779I041933K4079n187q7544Q8164L0409J66079J84276r3924o0693M0903M0198
4768I368693J75877l3954k0389Q4439J46425j47980q784K21988r0042R9872r6988
4757I699157j39400L2743O5055P4089J19984P2523K39Q2579K88378J31669O4255
4746A0491271L5603l5779k55107j50576l2719l3777L3784j4810l3365l2503J1875
$$ plain form
4820 9453755 9358394 9489954 9366244 9225496 9178761 9305525 9294486 9177245 9289707 9185300
4810 9185300 9094900 9161320 9311348 9252646 9275334 9364286 9311126 9408690 9315942 9357269 9383855
4799 9383855 9420358 9628261 9866168 9988499 10156308 10246598 10192326 10187929 10436117 10637299
4789 10637299 10549191 10439197 10121027 9907874 9703014 9535618 9368124 9234474 9162476 9041933
4779 9041933 9066012 9060825 8973281 9061445 9091854 9257933 9442209 9348285 9287592 9328495 9368693
4768 9368693 9544570 9510616 9490227 9574666 9721091 9573111 9564327 9786315 9696273 9796145 9699157
4757 9699157 9559757 9592500 9657555 9731644 9851628 9924151 9924390 10006969 10295347 10427016 10491271
4746 10491271 10526874 10491095 10235988 10085412 10052693 10018916 10052700 10037890 10004525 9972022 9983897
4735I983897J8888q2025q0888j638J77480J36529J02374k2613K7945J14418k2812
4724A0351555M2816J9517J92911L3331M0637K8880J96500J45836O2763J37186
4714A1251932J52771J39814Q3418K17945J97711l4601J97247K45201J67778J87688
4704A2806904J73163K97417J48872J95223K11953L68170K39679K37509K95956
4695A4974846K67103M96013M70858M24579L22071M46675M79719M13807L41968
4686A8637639K48066K50575M28916L63471K89307M53737M44290N61820N89219
4677B2267040O64310O81349O94195Q87076Q01154R56932Q64294Q75184J009801
4668B9701335J074503J383154J086429J260010J673669J756585J979473K183617
$$ plain form
4735 9983897 10002785 9920760 9839872 9838234 10015714 10152243 10254617 10232004 10259949 10374367 10351555
4724 10351555 10394371 10413888 10606799 10640130 10680767 10709647 10906147 11051983 11114746 11251932
4714 11251932 11404703 11544517 11627935 11845880 12043591 12008990 12206237 12451438 12619216 12806904
4704 12806904 12980067 13277484 13426356 13621579 13833532 14201702 14441381 14678890 14974846
4695 14974846 15241949 15737962 16208820 16633399 16955470 17402145 17881864 18295671 18637639
4686 18637639 18885705 19136280 19565196 19928667 20217974 20671711 21116001 21677821 22267040
4677 22267040 22931350 23612699 24306894 25193970 25995124 26952056 27816350 28691534 29701335
4668 29701335 30775838 32158992 33245421 34505431 36179100 37935685 39915158 42098775
4660D2098775K041693J021491l15415j444849k250304k415071k036093j715834
4652C4984393j381690r75718p29684m76831k93056M1240J53136K36154J91246
4643C1749190l8052l74784j100427j495073j860744j847193j741015j495754j184219
4634B0611929j075475p71990n85111m59356m26976l83846k63270k44550k21054
4625A6180301k60481j95425m50653l43530k71838k89397k48771q9292k00314j01719
4615A3728881Q0342M4576J9398j63375R7857J4916M0733o7905j50574J4862j72428
4604A3487283k85262j54844k66095l34584k82138j65365j54017k67895j20180
4595A1456903j79047j39172k8128k44415p1894p2898k3503M5017N1885J01257
$$ plain form
4660 42098775 44140468 45161959 44846544 43401695 41151391 38736320 36700227 34984393
4652 34984393 33602703 32626985 31897301 31420470 31127414 31168654 31321790 31557944 31749190
4643 31749190 31711138 31336354 30235927 28740854 26880110 25032917 23291902 21796148 20611929
4634 20611929 19536454 18764464 18179353 17719997 17293021 16909175 16645905 16401355 16180301
4625 16180301 15919820 15724395 15273742 14930212 14658374 14368977 14120206 14030914 13830600 13728881
4615 13728881 13809223 13853799 13873197 13709822 13807679 13822595 13863328 13795423 13644849 13659711 13487283
4604 13487283 13202021 13047177 12781082 12446498 12164360 11998995 11844978 11577083 11456903
4595 11456903 11277856 11138684 11110556 10866141 10794247 10721349 10697846 10742863 10794748 10896005
4585A0896005M255j23271j06733n115K22206J05356M112N9485J48991r3100l020
4574A1109171q6360L6233k4996J21173J92503N5885O0572j29322p5787N8086l1175
4563A1285983j40330j00016j86037K9330j1867j8580j0128n0166o4051N33k1777
4552A0712894N0154N5210J23559k7201J72849J29367J04528J52327P7751K21168
4542A1772606J51765K15948J62090Q8968K22187K17939J85794K90219K48545J82540
4532A3738601Q7044R9303J8654j54148K266K7062J21061R7448Q2568J22268J02876
4521A4345003J63065j09425k8432o2033j4684J23218J62185K07638K28821M97491
4511A5512847M92538N24212O83134P14027P43361N94469Q07892L52845m09218
$$ plain form
4585 10896005 10900260 10776989 10670256 10665141 10887347 10992703 10996815 11056300 11205291 11112191 11109171
4574 11109171 11022811 11059044 11034048 11155221 11347724 11403609 11464181 11334859 11259072 11317158 11285983
4563 11285983 11145653 11045637 10859600 10888930 10877063 10858483 10848355 10798189 10734138 10734671 10712894
4552 10712894 10763048 10818258 10941817 10914616 11087465 11216832 11321360 11473687 11551438 11772606
4542 11772606 11924371 12140319 12302409 12391377 12613564 12831503 13017297 13307516 13556061 13738601
4532 13738601 13825645 13924948 13943602 13789454 13791720 13818782 13939843 14037291 14119859 14242127 14345003
4521 14345003 14508068 14398643 14370211 14308178 14293494 14416712 14578897 14786535 15015356 15512847
4511 15512847 16005385 16529597 17212731 17926758 18670119 19264588 20072480 20425325 20016107
4502B0016107j079210j312800j411878j286281j150479j135385p97560o05260
4494A1237254m21516m73552k38677j79600j55908j61651k31103j88153k74517
4485H912577k23728j07367M2314j59257m5849q8028j21802q8241M639O4906j39441
4474H050723m6732k22746n557Q4417n8205k1260M6724j3491L2308l2391J30421
4463G944211M932O1702o2513j9865l6894J9025j17018j42523q6920L9204M880
4452G608221m5602N1132N4240J59028J75123k8414r5643j01262P506J28801j787
4441G911343j42830J0908j6762r817J56018J05554J42363J37593K78778O0596
4431H633744R6494R9450m4796m8298N926M1274J24840l3160K4361K1808J01528
$$ plain form
4502 20016107 18936897 17624097 16212219 14925938 13775459 12640074 11842514 11237254
4494 11237254 10815738 10342186 10103509 9923909 9768001 9606350 9375247 9187094 8912577
4485 8912577 8688849 8581482 8623796 8464539 8418690 8330662 8208860 8120619 8125258 8190164 8050723
4474 8050723 8003991 7781245 7775688 7860105 7801900 7780640 7827364 7813873 7846181 7813790 7944211
4463 7944211 7949143 8010845 7948332 7928467 7891573 7910598 7793580 7651057 7564137 7603341 7608221
4452 7608221 7562619 7613751 7667991 7827019 8002142 7973728 7878085 7776823 7784329 7913130 7911343
4441 7911343 7768513 7779421 7762659 7752842 7908860 8014414 8156777 8294370 8573148 8633744
4431 8633744 8730238 8829688 8784892 8736594 8742520 8783794 8908634 8875474 8899835 8921643 9023171
4420I023171l0030l8830L8937j52982j15541L770R2671J00987J50248J38528K84170
4409I495099K34239L39303L58808J71031N03755N82680L36991p8762n04707o83761
4399A0754676p01064p39076n32556m69249k78071j35775k76456q7329k918j09933
4389G422249j6720l7830o5891p2814j01933k670P0530j3097K523J11204n0163
4378G245388j64998M4885J30593r0495j94933M5807J7083J7380R1393J1397m8367
4367G105133o550o4256K9253O0461R718P328o3744Q6552q717q8860J5251J56001
4355G237570J38044O2629L3842m8662K8811L8407j4191N4167r67o7123P9307N8245
4343G600079Q0246m4542l0992o91O3778M8967M137J36234Q8461J5900J3039N3413
$$ plain form
4420 9023171 8993141 8954311 8993248 8840266 8724725 8728495 8821166 8922153 9072401 9210929 9495099
4409 9495099 9729338 10068641 10427449 10598480 11102235 11684915 12021906 11943144 11438437 10754676
4399 10754676 10053612 9314536 8781980 8312731 8034660 7898885 7622429 7535100 7532182 7422249
4389 7422249 7405529 7367699 7301808 7228994 7127061 7124391 7194921 7181824 7184347 7295551 7245388
4378 7245388 7080390 7125275 7255868 7165373 6970440 7016247 7033330 7050710 7142103 7153500 7105133
4367 7105133 7098583 7034327 7063580 7124041 7133759 7141087 7077343 7163895 7155178 7066318 7081569 7237570
4355 7237570 7375614 7438243 7472085 7423423 7452234 7490641 7476450 7530617 7529650 7462527 7541834 7600079
4343 7600079 7680325 7635783 7604791 7604100 7667878 7716845 7720982 7857216 7945677 7961577 7974616 8028029
4331H028029K3415O4573J29151K81337J34882Q2265J59589m8050n3428Q1000p5163
4320H807600o0448r638j23722j65495j54126k9160k7434r1498K8571M8662K1298
4309H244610L8057l5255p404N5879N6814J4852O0481K25071m3901O4497L1007
4298H704708q2529Q4859K6397Q3073K9481m3618J4980R813j29420J85406O5074
4287H948224j0445N2223N8519J11207J3564o2943N8244K37934m5434L8210J22039
4276I521342J737J1588P4964M1170J46926O6125L7116M534m6564L3573J35377
4265A0027888m2920k7149J01836K6567l1666J00403O5287j4198l0707j9632J12807
4254A0268516M554m5383k7450R765J05103J57158L475j72455n8154R9310M5047
$$ plain form
4331 8028029 8051444 8116017 8245168 8526505 8661387 8743652 8903241 8855191 8801763 8882763 8807600
4320 8807600 8747152 8737514 8613792 8448297 8294171 8265011 8237577 8146079 8174650 8223312 8244610
4309 8244610 8282667 8247412 8240008 8295887 8352701 8367553 8428034 8653105 8609204 8673701 8704708
4298 8704708 8622179 8707038 8733435 8816508 8845989 8802371 8817351 8827164 8697744 8883150 8948224
4287 8948224 8937779 8990002 9048521 9159728 9173292 9110349 9168593 9406527 9361093 9399303 9521342
4276 9521342 9523079 9534667 9609631 9650801 9797727 9863852 9900968 9905502 9858938 9892511 10027888
4265 10027888 9984968 9957819 10059655 10086222 10054556 10154959 10220246 10206048 10175341 10155709 10268516
4254 10268516 10273070 10227687 10200237 10210002 10315105 10472263 10475738 10303283 10245129 10344439 10389486
4243A0389486o0857N0084P5816n332L8174L8717K4412p4680M1786j37934p8917
4232A0300755P426l057l3425J0870o4202m3529R3339o1775o6461M0150kr6303
4220A0083786j6083j73828l0089Q3450l5900m4070j4774j4953q6815k90361O6214
4209I526577m3147j05026p1624n2883p838j5283q6175j05777J25524j5299r8909
4198I050140j40166o6914n0119n1070M259L530Q475r6695P3840P1649m5656p4213
4186H687060k6492P412j88835o044n3757J4409N4264j72154j19473k7785j80606
4175G987999j12574q2174L9487q0051J05619o1497j0523m1327L7245o634m3788
4164G731782R0538j02927L4923P7164m0281k1339j06580l02273j16245O119N3921
$$ plain form
4243 10389486 10328629 10378713 10454529 10449197 10487371 10526088 10550500 10475820 10517606 10379672 10300755
4232 10300755 10308181 10305124 10271699 10282569 10218367 10174838 10268177 10206402 10139941 10180091 10180089 10083786
4220 10083786 10067703 9893875 9863786 9947236 9911336 9867266 9852492 9837539 9750724 9460363 9526577
4209 9526577 9483430 9378404 9306780 9253897 9246059 9230776 9144601 9038824 9164348 9149049 9050140
4198 9050140 8909974 8843060 8792941 8741871 8746130 8749660 8758135 8661440 8735280 8806929 8761273 8687060
4186 8687060 8660568 8667980 8479145 8473101 8419344 8433753 8488017 8315863 8196390 8168605 7987999
4175 7987999 7875425 7793251 7832738 7752687 7858306 7796809 7786286 7744959 7782204 7775570 7731782
4164 7731782 7822320 7719393 7754316 7831480 7791199 7769860 7663280 7361007 7244762 7250881 7304802
4153G304802n7112j51164j40242j74725q304j17073j64604L1012j9111J2604n2442
4142F463641r1929M2051P3013N2939Q0095j78377p5792m2003P5968j9874j07255
4131F272477j56325j69250j56709O8647R5033J40976l241r5004j53249l3055j2837
4120E797463N5348J5082q6156j31211K8368L8484j86807P1458j01524L7857m3357
4109E495005r861r3831j01934L5982j5310l6559P9076j7134M2956j12357m0872
4098E225161J2803k19744m6640M9747q0707J975j870m7270O6986L874J2540j00150
4086D876705O4062l3947j23158n0496j00998O5180j2077l3355J32094l7532r1862
4075D654616l1312J74594m3281j53558J12095N6663P5107o1553R638k1381J6690
$$ plain form
4153 7304802 7247690 7096526 6956284 6781559 6773255 6656182 6491578 6522590 6503479 6516083 6463641
4142 6463641 6371712 6413763 6486776 6539715 6619810 6441433 6365641 6323638 6399606 6379732 6272477
4131 6272477 6116152 5946902 5790193 5858840 5953873 6094849 6091608 5996604 5843355 5810300 5797463
4120 5797463 5852811 5867893 5781737 5650526 5678894 5717378 5530571 5602029 5500505 5538362 5495005
4109 5495005 5485144 5391313 5289379 5325361 5310051 5273492 5352568 5335434 5378390 5266033 5225161
4098 5225161 5237964 5018220 4971580 5021327 4940620 4942595 4940725 4893455 4960441 4964315 4976855 4876705
4086 4876705 4940767 4906820 4783662 4733166 4632168 4697348 4685271 4651916 4784010 4746478 4654616
4075 4654616 4623304 4797898 4754617 4601059 4713154 4769817 4844924 4783371 4793009 4771628 4788318
4064D788318n2562J5031n9754J281L3780k5652j17164n2133J4422j8711o29M0049
4052D566276j66743p1214P6424m1995o1060K1197J06519o4190j04948O3348J6026
4041D339640L742N5770k6253j1709q9316J08635P035k1449n8148M4103k1278l5008
4029D295764L6131O8108j17051J4788R0522m0553l9060q6933K9513L0208j5652
4018D265785K0598k6766q5289N688M1676O6904N0896n3481K9382l9137n5721N1652
4006D272187j45393k6330R0594l8439K323O3337R9797O4767j14896j08630N5683
3995D215000Q666L3760j6118j3323j6088Q2442r3389n5640l0160L8887K2208N702
3983D181947p9416o4587n1465O8738k5551q1446L1579J52K9505p3708j17870M0117
$$ plain form
4064 4788318 4735756 4750787 4691033 4692314 4726094 4700442 4583278 4531145 4545567 4526856 4526227 4566276
4052 4566276 4399533 4328319 4404743 4362748 4301688 4322885 4429404 4365214 4260266 4323614 4339640
4041 4339640 4343382 4399152 4372899 4361190 4271874 4380509 4387544 4366095 4307947 4352050 4330772 4295764
4029 4295764 4331895 4400003 4282952 4297740 4388262 4347709 4308649 4221716 4251229 4281437 4265785
4018 4265785 4286383 4259617 4174328 4180016 4221692 4288596 4339492 4286011 4315393 4276256 4220535 4272187
4006 4272187 4126794 4100464 4191058 4152619 4154942 4218279 4318076 4382843 4267947 4159317 4215000
3995 4215000 4223666 4257426 4241308 4227985 4211897 4294339 4200950 4145310 4115150 4154037 4176245 4181947
3983 4181947 4102531 4037944 3986479 4055217 4029666 3948220 3979799 3979951 4009456 3935748 3817878 3857995
3971C857995P8107m4110m4703j0832P2310j71310n5979J89531j637K9899o7321
3960C831950j34524O1872n3555N8705Q5345J22001q3833j8495j26681n2276N7164
3949C747673n5270n7453N5110O3813o8023l1647o7445l7017O1221Q1981K2144
3938C715087J4314O7816j64952j7499J52094j23815M1251k8963j50936o990p8076
3927C419331J23743q1352m147L2062o4607R1430j9535J3551J38242k1700m5836
3916C581182O3702N631j243N3036j28496M3424j1718j0416P5751O8646K5297j4621
3904C750175j3729r5469n4187k8531J19313J26769j79854j23246L5677M4741M2635
3893C624294p4165k9058J04355N0020l5545M3987R4956j09333j01402M6222l1918
$$ plain form
3971 3857995 3936102 3891992 3847289 3836457 3908767 3737457 3681478 3871009 3869372 3899271 3831950
3960 3831950 3697426 3759298 3705743 3764448 3849793 3971794 3887961 3869466 3742785 3690509 3747673
3949 3747673 3692403 3634950 3690060 3753873 3685850 3654203 3586758 3549741 3610962 3692943 3715087
3938 3715087 3729401 3797217 3632265 3614766 3766860 3643045 3684296 3655333 3504397 3497407 3419331
3927 3419331 3543074 3461722 3457575 3489637 3425030 3516460 3496925 3510476 3648718 3627018 3581182
3916 3581182 3644884 3650515 3649272 3702308 3573812 3617236 3605518 3595102 3670853 3739499 3764796 3750175
3904 3750175 3736446 3640977 3586790 3558259 3677572 3804341 3624487 3501241 3536918 3581659 3624294
3893 3624294 3550129 3521071 3625426 3675446 3639901 3683888 3778844 3669511 3568109 3614331 3582413
3882C582413Q5341l3467K1446P4871j9856q416J05023n3137J4866o0181L561J57328
3870C869792P7014o4920k7680L582P6187n6179p091L2718k2310M0836J4705R879
3858C946533o2117l7544L0816O581M523N2303J9457n8861m8149N1189n7879K4108
3846C870960l3615J5567J05490k4653j42587J3300K6759J06134L4792j24254K6880
3835C874773K0827J01970r303J27771j00677M6374n0569r4612J13184o4404R5709
3824D061043m0099R5216J3611l4820j7627K9704L6403q2260m0283J08093l7946
3813D091035p0865J47054m6230M5903N6253Q8674P53M5254j6082j9626l1606k8295
3801D262222L4879Q9980K1282o0409Q5384l7263j02133J11197J60261k4761J974
$$ plain form
3882 3582413 3667754 3634287 3655733 3730604 3710748 3702332 3807355 3754218 3769084 3708903 3712464 3869792
3870 3869792 3946806 3881886 3854206 3857788 3933975 3877796 3870705 3903423 3881113 3921949 3936654 3946533
3858 3946533 3884416 3846872 3877688 3884269 3888792 3941095 3960552 3901691 3853542 3904731 3846852 3870960
3846 3870960 3837345 3852912 3958402 3933749 3791162 3804462 3831221 3937355 3972147 3847893 3874773
3835 3874773 3895600 3997570 3988267 4116038 4015361 4061735 4011166 3916554 4029738 3965334 4061043
3824 4061043 4020944 4116160 4129771 4094951 4077324 4107028 4143431 4061171 4020888 4128981 4091035
3813 4091035 4020170 4167224 4120994 4166897 4223150 4311824 4312577 4357831 4341749 4322123 4290517 4262222
3801 4262222 4297101 4387081 4408363 4347954 4433338 4396075 4293942 4405139 4565400 4540639 4542613
3790D542613N2334k8736j10493J24500J41122l8236M1803M1888J6374p7604N3
3779D705618k6218K3668k8167p3427Q9500n7336J42190K142O0679J43217J3151
3768D995017p7410P0764J70871l954K130j6512l1334r4209N7655N1115m900k533
3756E116700j2389M0981Q6315p9188o9236j01706J49825J91556r5713j7184P5674
3745E285635l9919j576J29336L0645j2878k3064o0347l2397R3616Q9004J4413
3734E472468j4824K4900m4680j2294p093M1578j25432O606M2651N1286L5833M5498
3722E516497j65426k30603J13750L6428L7079P9944j21613P0657J46298q7816
3712E395195o0870O6353j32548j1051j37157j31126J17788Q6963q8098Q6655N2415
$$ plain form
3790 4542613 4594947 4566211 4455718 4580218 4721340 4683104 4724907 4766795 4783169 4705565 4705618
3779 4705618 4679400 4703068 4674901 4601474 4690974 4633638 4775828 4777970 4838649 4981866 4995017
3768 4995017 4917607 4988371 5159242 5155288 5157418 5140906 5109572 5015363 5073018 5124133 5119233 5116700
3756 5116700 5104311 5145292 5231607 5152419 5083183 4981477 5131302 5322858 5227145 5209961 5285635
3745 5285635 5245716 5244140 5373476 5404121 5391243 5368179 5307832 5275435 5369051 5458055 5472468
3734 5472468 5457644 5482544 5437864 5425570 5418477 5460055 5334623 5341229 5383880 5435166 5470999 5516497
3722 5516497 5351071 5120468 5234218 5270646 5307725 5387669 5266056 5336713 5483011 5395195
3712 5395195 5334325 5400678 5268130 5257079 5119922 4988796 5106584 5193547 5105449 5192104 5244519
3701E244519r9860n7617J42980R7553j32526m559n2552n8304J31131r2494j452
3690E116819P1180L6725p9144k2275N0365j08561m1737p0366k7716k0592R0641
3679D995339n7233j23595N4496m4918K4807o0204J9992Q8659p615J29355L3764
3668E052847o6290q9765O7879K7686J03735m1991o2471P0787J97202K3898m0346
3657E243171l5921k5698N6300O5921j05712O0373J00046J4470L2316J32356n102
3646E532520k7467J3915o644j48759k7610M091Q3938k334r1066p7386J92352N6636
3634E502186j8816R4805j2507Q1010Q8197R0952J33804O5206q6432R631J05778
3623F053814J39338J5215P794k4074j1434J37365J80246J37985K758J01596J03876
$$ plain form
3701 5244519 5144659 5087042 5230022 5327575 5195049 5190490 5137938 5079634 5210765 5118271 5116819
3690 5116819 5187999 5224724 5145580 5123305 5173670 5065109 5023372 4953006 4925290 4904698 4995339
3679 4995339 4938106 4814511 4869007 4824089 4848896 4788692 4808684 4897343 4889728 5019083 5052847
3668 5052847 4986557 4896792 4964671 4992357 5096092 5054101 4991630 5062417 5259619 5283517 5243171
3657 5243171 5207250 5181552 5237852 5303773 5198061 5258434 5358480 5372950 5405266 5537622 5532520
3646 5532520 5505053 5518968 5512324 5363565 5335955 5340046 5423984 5421650 5330584 5253198 5445550 5502186
3634 5502186 5483370 5578175 5565668 5646678 5734875 5825827 5959631 6024837 5938405 5948036 6053814
3623 6053814 6193152 6208367 6216161 6192087 6180653 6318018 6498264 6636249 6639007 6740603 6844479
3612F844479j22227k26128j23125P7781K702j1223O1225M577P531q4629J18778
3601F549741P1547o8913j04030k3962R5674J89529M4879K14719N3853j2230k0650
3590F990157M0442J51518N6860Q838Q1614R7038J18832P0778O0576J65311j0444
3579G831520j01379p0565P4448M9639O1999l9297R3567K0825J11202j4417J33052
3568H150594j5549J01090M8092P4682J56359K33752J12261l98J07486J62696q3685
3557I047380L24200l1485M8916J25648J94516J70481J47262K89823J8897j12111
3547A0223527l0532N7291Q1664J48867J40822Q6873o1413k9955K3665J33698P2790
3536A0847297L9430o6576K17096K15900N5118J44161J12778J18788N600K35967
$$ plain form
3612 6844479 6722252 6496124 6372999 6450780 6453482 6442259 6503484 6508061 6515592 6430963 6549741
3601 6549741 6621288 6552375 6448345 6424383 6520057 6709586 6754465 6969184 7023037 7010807 6990157
3590 6990157 7030599 7182117 7238977 7247815 7329429 7426467 7545299 7616077 7676653 7841964 7831520
3579 7831520 7730141 7659576 7734024 7783663 7845662 7806365 7899932 7920757 8031959 8017542 8150594
3568 8150594 8135045 8236135 8284227 8358909 8515268 8749020 8861281 8860883 8968369 9131065 9047380
3557 9047380 9371580 9340095 9389011 9514659 9709175 9879656 10026918 10316741 10335638 10223527
3547 10223527 10192995 10250286 10331950 10480817 10621639 10708512 10647099 10617144 10640809 10774507 10847297
3536 10847297 10886727 10820151 11037247 11253147 11308265 11452426 11565204 11683992 11689592 11925559
3526A1925559J36631J43267J76001J52254K31708J89652J96307J04423K01931
3517A3457733K97562K98346Q8598n8171p4328r9420n1289N9321J08672N7658J1073
3506A4095755P8522M8549J46479J22494K36365J63482M5740J06442Q2542J16178
3496A5242548J4238J9389J26046Q6151J34897N282K22251m0553J23253M8240M0008
3485A6021750J40614R7408J62967J19239o3271j0481N3731M9681J09803J29226
3475A6810667K2739J86939K19141J25573J44451P7319K24656J32959l7617J78929
3465A8085756J19395J50915J16548K3933q4800k35214j32830j35978j62808l31633
3455A7413284l59209m38431m59133n56216n15732m80353l97825l04240m25717
$$ plain form
3526 11925559 12062190 12205457 12381458 12533712 12765420 12955072 13151379 13255802 13457733
3517 13457733 13755295 14053641 14142239 14084068 14009740 13910320 13859031 13918352 14027024 14084682 14095755
3506 14095755 14174277 14222826 14369305 14491799 14728164 14891646 14937386 15043828 15126370 15242548
3496 15242548 15256786 15276175 15402221 15488372 15623269 15628551 15850802 15810249 15933502 15981742 16021750
3485 16021750 16162364 16259772 16422739 16541978 16478707 16468226 16521957 16571638 16681441 16810667
3475 16810667 16833406 17020345 17239486 17365059 17509510 17586829 17811485 17944444 17906827 18085756
3465 18085756 18205151 18356066 18472614 18496547 18411747 18176533 18043703 17907725 17744917 17413284
3455 17413284 17054075 16615644 16156511 15600295 15084563 14604210 14206385 13902145 13476428
3446A3476428k09039j48250r5159l0814J53009N5695J9275j26450j74954j8727
3436A2901014j08639K2192K20505K12847N4826J17226K54531K34637K73390M63740
3426A4646269N14138L36516J54297l08555n56967p11858o70055p95984o46031
3417A1961770n51690n56336l06073l89200k87975k21360m3612k48236j61583n117
3407I190588j07375k060p9811l2101m4419j38982n595L556J27414J08440K19245
3396I238900O9780J62960J10118R1833P6038j88835l75295l93081m24312k59578
3386H108528l53441l77034k65339k29794j04820k25543n4090J2902o4663j52447
3376F294259k48452j00986L3062k2909j19109n8443P4731N8296q3144j04809j08250
$$ plain form
3446 13476428 13267389 13119139 13023980 12993166 13146175 13201870 13221145 13094695 12919741 12901014
3436 12901014 12792375 12814567 13035072 13247919 13302745 13419971 13674502 13909139 14182529 14646269
3426 14646269 15160407 15496923 15651220 15342665 14785698 14073840 13403785 12607801 11961770
3417 11961770 11410080 10853744 10547671 10158471 9870496 9649136 9605524 9357288 9195705 9190588
3407 9190588 9083213 9081153 9001342 8969241 8924822 8785840 8780245 8783801 8911215 9019655 9238900
3396 9238900 9308680 9471640 9581758 9673591 9749629 9560794 9185499 8792418 8368106 8108528
3386 8108528 7755087 7378053 7112714 6882920 6778100 6552557 6498467 6511369 6446706 6294259
3376 6294259 6045807 5944821 5977883 5954974 5835865 5777422 5852153 5910449 5827305 5722496 5614246
3365E614246J44974q1951r4967r9844p9982K9590M4746K0143k61258j29741L7388
3354E143344O4387k4917J4669P369j66055j760N5150L1859l8503M395o5853P0064
3342E094149o2191j01592o407n5281o1852L5559O635n2072K1410L4718j07761
3331D745315k37198N5009N3610j72516J8824K01137j04604J3216P88J1022J00493
3320D685096p8003n2200l3136O7369J5218R1517P7443l0283K4714L2145k2260
3309D777620l9396o7118P0108p0357j58715J325r0904N5269r1490l6668K9349
3298D379023P7766k0462q3945q9294Q5926N4752n8419m7086M455q9471L0282P8331
3286D321858L7512l8797q0611J6751j485j32428k0889O5042O8297L8028p4170
$$ plain form
3365 5614246 5759220 5677269 5582302 5482458 5402476 5432066 5476812 5496955 5235697 5105956 5143344
3354 5143344 5207731 5182814 5197483 5204852 5038797 5037037 5092187 5124046 5085543 5089938 5024085 5094149
3342 5094149 5031958 4930366 4923959 4868678 4806826 4842385 4849020 4796948 4818358 4853076 4745315
3331 4745315 4508117 4563126 4616736 4444220 4463044 4664181 4559577 4572793 4573581 4584603 4685096
3320 4685096 4607093 4554893 4521757 4589126 4604344 4695861 4773304 4743021 4767735 4799880 4777620
3309 4777620 4738224 4671106 4741214 4670857 4512142 4513467 4422563 4477832 4386342 4349674 4379023
3298 4379023 4456789 4436327 4352382 4263088 4349014 4403766 4345347 4298261 4302716 4213245 4243527 4321858
3286 4321858 4359370 4320573 4239962 4256713 4255228 4122800 4101911 4166953 4235250 4273278 4199108
3275D199108R4648J43199n8500m8661M1900j7396l1495M3369R9598K3284k04710
3264D284344k2639Q8878J10540P3252L6922m5200M929M0453q4375P1352q6243
3253D472213N627O1474P5423O2100K4369P884m6422J83897Q56j0944J36734P4453
3241E047664J36946P0052M149Q7323j16363r5037O0972O3911j36929j6981K8545
3230E134252O7725Q6413Q0945r0819n9094J13700N7343J80050l8566r1709J16482
3219E556722K19194O9211O8408K04315Q9943J10491J36826R8069J04540J41974
3209F799693K52528J21968J51072J09748j18757p4444r312k8064j45564J1601
3199G070469P7953p0875j11948R2270O9646j39095K7897n8509Q3241J77156M8045
$$ plain form
3275 4199108 4293756 4436955 4378455 4329794 4371694 4354298 4322803 4366172 4465770 4489054 4284344
3264 4284344 4261705 4350583 4461123 4534375 4571297 4526097 4531026 4571479 4487104 4558456 4472213
3253 4472213 4477840 4539314 4614737 4676837 4701206 4709090 4662668 4846565 4847421 4836477 4973211 5047664
3241 5047664 5184610 5254662 5258811 5346134 5229771 5134734 5195706 5259617 5122688 5105707 5134252
3230 5134252 5201977 5288390 5369335 5278516 5219422 5333122 5390465 5570515 5531949 5440240 5556722
3219 5556722 5775916 5845127 5913535 6117850 6207793 6318284 6455110 6553179 6657719 6799693
3209 6799693 7052221 7174189 7325261 7435009 7316252 7241808 7232496 7204432 7058868 7070469
3199 7070469 7148422 7077547 6965599 7057869 7127515 6988420 7016317 6957808 7041049 7218205 7266250
3188G266250l4841L3024J65763J07902k4144J80873J41036R1477K38024J34933
3178H300297O9376J61313O2320J00203j079J04776Q4929J76054K87534J73757
3168I519480k473L1301N0550j3697j26073k8389q2368J49763n2050p6447O1612
3157I431209k4198l0973O0333J33160P3509p861m3714L5819J0304R7225M7432
3146I782245n2169L9916P0772k6560l2283J11133J61283J55680r3562O5259K52688
3135A0434402M2091K03323k7208q3049j4959J41347j14452o9574P5274O8064J1866
3124A0667125L0831j26630l45770k03268j17410j90610l13902j89582j99898k37031
3114H773855l8611M2683j07481j87541j44115p5793K5677P4031l0652m5529M0643
$$ plain form
3188 7266250 7231409 7264433 7430196 7538098 7513954 7694827 7835863 7927340 8165364 8300297
3178 8300297 8369673 8530986 8593306 8693509 8692430 8797206 8882135 9058189 9345723 9519480
3168 9519480 9517007 9548308 9598858 9585161 9459088 9430699 9348331 9498094 9446044 9369597 9431209
3157 9431209 9407011 9376038 9436371 9569531 9643040 9635179 9591465 9627284 9637588 9734813 9782245
3146 9782245 9730076 9769992 9840764 9814204 9781921 9893054 10054337 10210017 10116455 10181714 10434402
3135 10434402 10476493 10679816 10652608 10569559 10554600 10695947 10581495 10511921 10587195 10655259 10667125
3124 10667125 10697956 10571326 10225556 10022288 9904878 9714268 9400366 9210784 9010886 8773855
3114 8773855 8735244 8777927 8670446 8482905 8338790 8262997 8288674 8362705 8332053 8286524 8327167
3103H327167K2969j3253l1077N2092j05569J30681Q6540k51241j37772j22205
3093G958332j46446j03250k05630j98131k04284p9398j70903j45973j33763K0320
3083F590874L9673l4098j82160j19964j13757q6183q5931o3047l1607j16172q6275
3072E711353q8399j946j30563j26841M4286l7421k48764q3735l2265l4399q3714
3061D887592J09629j11980j38418r6788J2246Q822j89920O9803l742j84292L0554
3050D393506k3343j09169j50339R3469O1469o7364r5653q9326K1099o2470K3688
3039C995567p0635j21370p4096n0924L9677j07131J6836Q9602j3998j20596p5484
3028C507448j11174K3627N0884p5193J1842l1974j13009j29814j6829n5691P5678
$$ plain form
3103 8327167 8350136 8336883 8305806 8357898 8252329 8383010 8469550 8218309 8080537 7958332
3093 7958332 7811886 7708636 7503006 7304875 7100591 7021193 6850290 6704317 6570554 6590874
3083 6590874 6630547 6596449 6414289 6294325 6180568 6094385 6008454 5945407 5913800 5797628 5711353
3072 5711353 5622954 5621008 5490445 5363604 5407890 5370469 5121705 5037970 5005705 4971306 4887592
3061 4887592 4997221 4885241 4746823 4650035 4662281 4671103 4481183 4550986 4547244 4362952 4393506
3050 4393506 4370163 4260994 4110655 4204124 4265593 4198229 4102576 4013250 4034349 3971879 3995567
3039 3995567 3924932 3803562 3729466 3678542 3718219 3611088 3627924 3717526 3703528 3582932 3507448
3028 3507448 3396274 3419901 3470785 3395592 3407434 3375460 3262451 3132637 3115808 3060117 3135795
3017C135795N7314J8560P801J585j56445K1436p7117K2528J7899M4275j89439
3006B904192j4403Q1052k189p6426R267k2254q7666J6013k4223r2016r0238l2207
2994B568902m4682O7734o0132m8510R1093M9152m2002P2456k71654M2669J5736
2983B440762l3309M5481k9428j01684r783O3867j35171M6141m7536j07414L917
2972B135843J22852j05928K5642O0386q1999j62787l0034J34824M8299j45002
2962B002096p0245P3269n7015K6550o179p8911M1113K9552j96341J0120q0715
2951A693294k2767J30432O486p7391J82767r7188j13674J04514m5006j59608J4481
2940A616340M0628j01371k6667J58862p4015M2969j8537j14946Q9535N7727l4154
$$ plain form
3017 3135795 3193109 3211669 3219470 3221055 3064610 3086046 3008929 3031457 3049356 3093631 2904192
3006 2904192 2889789 2970841 2968652 2892226 2901493 2879239 2791573 2807586 2783363 2691347 2601109 2568902
2994 2568902 2524220 2591954 2531822 2483312 2574405 2623557 2581555 2654011 2382357 2425026 2440762
2983 2440762 2407453 2452934 2423506 2321822 2312039 2375906 2240735 2286876 2239340 2131926 2135843
2972 2135843 2258695 2152767 2178409 2238795 2156796 1994009 1963975 2098799 2147098 2002096
2962 2002096 1931851 2005120 1948105 1974655 1968476 1889565 1930678 1960230 1763889 1774009 1693294
2951 1693294 1670527 1800959 1807445 1730054 1912821 1815633 1701959 1806473 1761467 1601859 1616340
2940 1616340 1656968 1555597 1528930 1687792 1613777 1656746 1638209 1523263 1612798 1670525 1636371
2929A636371J1549r8041L9415p1453J17728n8048o296N9138j03341O1058j38167
2918A449913n064N978r2028m7677J08618k2482j1676K7281K1594r0324k8534M9461
2906A365060p5843N6240M9388j2966J8735J548k5512j70203l222r5337J05571
2895A213459J28858M0781p4448Q1411N9466j39247l5592l3839l5004n8123R1243
2884A238965j8132l4920k6766l758M8112M4004J7931o0467l3184j33127L2200
2873A070858P344O5756j48053L2818J28929N4822j06843j03533l5754N2809J945
2862A021098J13190K924q5625K4964K0028J10750J4712j03482j27677j645k0376
2851I68861m9477l1265N4095M2241Q5015L5164j05124n3619J107r561n927l152
$$ plain form
2929 1636371 1647920 1549879 1589294 1517841 1635569 1577521 1571225 1630363 1527022 1588080 1449913
2918 1449913 1444849 1450827 1358799 1311122 1419740 1397258 1385582 1412863 1434457 1344133 1315599 1365060
2906 1365060 1289217 1345457 1394845 1381879 1400614 1402162 1376650 1206447 1203225 1107888 1213459
2895 1213459 1342317 1383098 1308650 1390061 1449527 1310280 1274688 1240849 1205845 1147722 1238965
2884 1238965 1220833 1185913 1159147 1155389 1203501 1247505 1265436 1204969 1171785 1038658 1070858
2873 1070858 1078202 1143958 995905 1028723 1157652 1212474 1105631 1002098 966344 1019153 1021098
2862 1021098 1134288 1137212 1051587 1076551 1096579 1207329 1222041 1118559 990882 989237 968861
2851 968861 919384 888119 942214 984455 1069470 1104634 999510 945891 946998 937437 931510 928358
2839I28358J3391N5945k0891k5003j9054q1866J23876r7453j1681l6674k2101
2828H06847j40j8236J4174K0094m4286J19352n2916q185n8001o8069J83250m3023
2816H50861j1192p8864r2838J40928o6826M319K38194k2474m6582m7767j12431
2805G55328j243R3603o1812l3466j3836P3098O8861r1193o9183K1598J10984K3929
2793H76668m6090O1036p763j13036k566p4129r074R2192k4342r5231o3642L3251
2781F27274k2774J5805Q2944R5663m943j02230j34805Q1859k8865J0705K18995
2770H39628L7905j92661l9651J16404N8770j9684r8345j04964R64J28386j0419
2759G16333o0903p4778R537k5331J9960j1814J1928O399q2600m0440P0653j1729
$$ plain form
2839 928358 941749 997694 976803 951800 932746 850880 974756 877303 865622 828948 806847
2828 806847 806707 788471 802645 822739 778453 897805 844889 836704 778703 710634 893884 850861
2816 850861 839669 760805 667967 808895 742069 746388 984582 962108 915526 867759 755328
2805 755328 754085 847688 785876 752410 738574 811672 880533 789340 720157 741755 852739 876668
2793 876668 830578 891614 883851 770815 768249 694120 685046 777238 752896 657665 594023 627274
2781 627274 604500 620305 703249 798912 793969 691739 556934 638793 609928 620633 839628
2770 839628 877533 684872 645221 761625 820395 800711 702366 597402 598366 726752 716333
2759 716333 655430 580652 590189 564858 584818 573004 584932 591331 508731 468291 538944 527215
2747E27215J4431R5019M0858J43525J8086r5463j34997l1527J17793n2967j53519
2736D88454N3437J01315j8436K2986j03999p9163R426N1226N8780O3362j47974
2725D99414L4233J27201j07365q0468J13384J33907j74646n5253l5313m8985R4860
2714E00969Q8507o6974M7119J16693l9554j04170K9196o1850L2552P3647o9618
2703E46517j50732n803J1223J77J11231J07812q1168o0816J25141o2532p5832
2692D65218J62449R277j35760O2019R33J2102r1907N4715j48814m2354K31457
2681E79335o8543o5618n203L8485N4524M7305J9799j50248o5741K4165J04434
2670E12694O0302l5203n718j26754o8109J01698J66165k3665p0676K5437L5667
$$ plain form
2747 527215 541646 636665 677523 821048 839134 743671 608674 577147 694940 641973 488454
2736 488454 541891 643206 624770 647756 543757 464594 474020 525246 584026 647388 499414
2725 499414 533647 660848 553483 473015 586399 720306 545660 490407 455094 406109 500969
2714 500969 589476 522502 569621 686314 646760 542590 571786 509936 542488 616135 546517
2703 546517 395785 389982 401205 401382 512613 620425 539257 478441 603582 541050 465218
2692 465218 627667 636944 501184 563203 564136 576238 484331 539046 390232 347878 579335
2681 579335 510792 445174 439971 478456 532980 580285 600084 449836 384095 408260 512694
2670 512694 572996 537793 532075 405321 337212 438910 605075 581410 510734 536171 571838
2659E71838P9863n9678j37354J9329n850r910J07234r7469n8415P2472K4392L2566
2647E39018Q2457M6751m7827L8343j881K5483j9489j09471j35334l0812J2407
2636C99645M4552n339P8848P1079r1448l5264J40516q8705n3572P8802j17966
2625D21148J69548N9065j26284q1717Q5446J866o9700o9674n0380k0116O8164
2614C87366J27926l3817j9135J09617P3118o4821J6910K9766o5671J9760K8636
2603F09655l57j3364j54644J3723J08532p9399L056K01445l1754P4575l9147k851
2591F89470J45783p2890l9351n5840j88202j5613N593J077J14445n2246J2523
2580E44749j13641j8183m8335Q1234n2029m786N7981p5780K5612M1453N918p9953
$$ plain form
2659 571838 651701 592023 454669 473998 468148 458238 565472 468003 409588 482060 506452 539018
2647 539018 621475 668226 620399 658742 656861 682344 662855 553384 418050 387238 399645
2636 399645 444197 438858 517706 588785 497337 462073 602589 513884 460312 539114 421148
2625 421148 590696 649761 523477 441760 527206 529072 459372 389698 339318 319202 387366
2614 387366 515292 481475 462340 571957 645075 580254 597164 626930 561259 581019 609655
2603 609655 609298 595934 441290 455013 563545 484146 487202 688647 656893 731468 692321 689470
2591 689470 835253 762363 723012 667172 478970 463357 468950 470027 584472 532226 544749
2580 544749 431108 412925 364590 445824 393795 389009 446990 371210 396822 438275 444193 364240
2568C64240K2927O2706o1800L0416L2444R975k2580J2336J4819j03050L035K4307
2556C89775p2292O7759M6926k195L2579o4776L4162j35715L8924J76417n499J2630
2544E18695n572k4972K0516J34219N7624j61863k9945l7590P3885L8124k0092
2533E63029q8700R3861j8382r319j6387m6413j06527J48114N4857j54257m304
2522D15572N2141O894N0438j7870j4618P9863n4449q295j1091O122q5049p052
2510D12606L9249K5159N286N6833o4070L6478P088m8581o449L5152k4926R3994
2498E67819P9045j70279j00342R4878O0757m1N9132J0630r4257n5447j3338P1533
2486E10090N709J59546J19578q3339j30333J6969L2704p7619J07810J48285N1189
$$ plain form
2568 364240 387167 449873 388073 418489 450933 460908 438328 450664 465483 362433 365468 389775
2556 389775 317483 385242 432168 429973 462552 397776 431938 296223 335147 511564 506065 518695
2544 518695 513123 488151 508667 642886 700510 538647 508702 471112 544997 583121 563029
2533 563029 474329 568190 549808 540489 524102 477689 371162 519276 574133 419876 415572
2522 415572 467713 474607 525045 507175 492557 572420 517971 509676 498585 504707 419658 412606
2510 412606 451855 477014 482300 539133 475063 511541 518629 470048 463599 498751 473825 567819
2498 567819 646864 476585 376243 471121 531878 531837 590969 601599 507342 451895 438557 510090
2486 510090 515799 675345 794923 711584 581251 598220 630924 553305 661115 809400 860589
2475H60589l299j02591j26572P0468L9477o4350k6579K5376P4204r3125P1463
2464G25061J76142n2019O0162p2348j58315R658J56091N2729k8463j73386j2014
2453F83298J703M9126P1549M9165P993P2512J15186l9292n9396k3630n543L2758
2441I55429J430m708Q8054O0433L3699j61917M3362P2059P0301l2086j36779K4909
2429A014186Q6592r3024l1445J9880J32083K6849n2534J97254Q5768l1721J5209
2418A369097l5829J16745j0168p496l9562J2985J03107Q0535R4486R666n2233
2407A641333R8119k0340R9235M9617j83870K33475J78774K4839N1514M6729o0634
2396B158791J09857L4099O5429J13758m8903J98317O2053N572p356J52328R4793
$$ plain form
2475 860589 857290 754699 628127 698595 738072 673722 647143 672519 746723 653598 725061
2464 725061 901203 849184 909346 836998 678683 688341 844432 897161 868698 695312 683298
2453 683298 685001 734127 805676 854841 862834 935346 1050532 1011240 951844 928214 922671 955429
2441 955429 956859 952151 1040205 1100638 1134337 972420 1015782 1087841 1158142 1126056 989277 1014186
2429 1014186 1100778 1007754 976309 996189 1128272 1155121 1102587 1299841 1385609 1353888 1369097
2418 1369097 1333268 1450013 1439845 1432349 1392787 1405772 1508879 1589414 1683900 1693566 1641333
2407 1641333 1739452 1719112 1818347 1867964 1684094 1917569 2096343 2121182 2172696 2219425 2158791
2396 2158791 2268648 2302747 2368176 2481934 2433031 2631348 2693401 2698973 2691617 2843945 2938738
2385B938738K5621k5362P518K40803K28918K28174J4607K63406K40897O1035J38835
2374D363190K72833J87995J17518M5859J22078J45168J98231K22889K53382J94189
2364F123332J09792L67001L28593M28411L33377K65537M78879O47323O91419M30078
2354A0203742L17901J22637k17685J63153J92400K02640K02590M24130M87097
2345A2098605K10451J63514J66701L40657N45992O38095M59315O48012O47415
2336A5918757P00714J221253J475944J889412K052748K108747K407308K958413
2328C0733296L925980N333990N263647J562044k718441n963121o338218n880131
2320B5919046m870819m114272l188010k285282j508953j119120r24390p34247
$$ plain form
2385 2938738 2964359 2938997 2946515 3187318 3416236 3644410 3659017 3922423 4163320 4224355 4363190
2374 4363190 4636023 4824018 4941536 4987395 5109473 5254641 5452872 5675761 5929143 6123332
2364 6123332 6233124 6600125 6928718 7357129 7690506 7956043 8434922 9082245 9773664 10203742
2354 10203742 10521643 10644280 10426595 10589748 10782148 10984788 11187378 11611508 12098605
2345 12098605 12309056 12472570 12639271 12979928 13525920 14164015 14623330 15271342 15918757
2336 15918757 16619471 17840724 19316668 21206080 23258828 25367575 27774883 30733296
2328 30733296 34659276 39993266 45256913 46818957 44100516 38137395 31799177 25919046
2320 25919046 21048227 16933955 13745945 11460663 9951710 8832590 7908200 7173953
2312G173953p06818m96109m46510m26756m65228l83928m61612m03108k04853l15185
2302B863846l07187o8511m9851j57372j81005j35003k0490L6740j56141O3249
2292A888275k7673j66588r5435j45377R426L4449j29068L9383j42928J02935J2742
2281A380141j00054r536j5071O2189p8350J13970j59339k94786j2810Q2653j8167
2270I50840p3384O5036k6979r2163k2175m6843k8193M4809J08197o4001j46607
2259F68537O5641p5539J04451j10759j04650n3830J06603j4198n8957J4927o591
2248E35635k9099J17102m6957K6172O901M2171P1194j31032j23427J08842Q9549
2237F67051r0146r080M2973p5610j47651P0594N4125j0888j764O2521j547q666
$$ plain form
2312 7173953 6467135 5971026 5524516 5097760 4632532 4248604 3786992 3383884 3179031 2863846
2302 2863846 2556659 2488148 2438297 2280925 2099920 1964917 1944427 1981167 1825026 1888275
2292 1888275 1860602 1694014 1598579 1453202 1462628 1497077 1368009 1407392 1264464 1367399 1380141
2281 1380141 1280087 1270551 1255480 1317669 1239319 1353289 1193950 899164 886354 969007 950840
2270 950840 877456 942492 915513 823350 801175 754332 726139 770948 879145 815144 668537
2259 668537 734178 658639 763090 652331 547681 493851 600454 586256 527299 542226 535635
2248 535635 506536 623638 576681 602853 609754 651925 723119 592087 468660 577502 667051
2237 667051 576905 567825 610798 535188 387537 458131 512256 501368 499604 562125 560578 551912
2225E51912k3343j36199l1945L5236n5644l8022J28127k4734k440l917k0331r47
2213C77753N0780K9207l2963m4332J17580M0976k12701m5652L7072J19914M5028
2202D82662p1722l3987n0964J26468n4350j10126N1932R352j02847O177m885L5476
2190B83186J43165p1156j20397Q8470k5979j12760J44956r1778q1185L9086k8808
2179A66800K0822J06528l6788J19398j09052j08483K7568J50070L681k0433j38036
2168A82075R0174J3208j59782J09659Q6839k7809r3622Q1291P3771k9210j72N2105
2156C78527k7844j52599j7261o2313n9483J08822K9864K121J42994j06500O8276
2145C04604l1089r2569m0452J2610J07869J30178j34161j14191n4821m3366Q9565
$$ plain form
2225 551912 528569 392370 360425 395661 340017 301995 430122 405388 402948 399031 378700 377753
2213 377753 428533 457740 424777 380445 498025 539001 326300 280648 317720 437634 482662
2202 482662 410940 376953 325989 452457 398107 287981 339913 349265 246418 252595 247710 283186
2190 283186 426351 355195 234798 323268 297289 184529 329485 237707 156522 195608 166800
2179 166800 187622 294150 257362 376760 267708 159225 186793 336863 340544 320111 182075
2168 182075 272249 285457 125675 235334 322173 294364 200742 282033 355804 326594 326422 378527
2156 378527 350683 198084 180823 118510 59027 167849 197713 199834 342828 236328 304604
2145 304604 273515 180946 140494 153104 260973 391151 256990 142799 87978 44612 134177
2134A34177K3703P9304J05610K1741j11356j2754R0727l3886j50797j01859J92871
2123B37481k3479K2585O0362l0777j33061l7039N0079o5416J39130J00072N1501
2112C71438j2817J8730j37993R285j3998K4413P1421p7084K2316m214j2240j5438
2100B43819j29022N7797r26P477L1616j8766p848M491L9245Q6088Q04L5944k7545
2087C23174p086q9553N9311k102P4329n0653n8979p393j3919N6238L5170o3331
2075B55206j24695l5261J24378J3409K0030Q3410n0324k7061k7531R3460M2348
$$ plain form
2134 134177 157880 237184 342794 364535 253179 240425 331152 297266 146469 44610 237481
2123 237481 214002 236587 296949 266172 133111 96072 146151 80735 219865 319937 371438
2112 371438 358621 377351 239358 248643 234645 259058 330479 253395 275711 271497 259257 243819
2100 243819 114797 172594 171668 179145 210761 191995 184147 188638 227883 313971 314775 350719 323174
2087 323174 316088 226535 285846 283744 358073 307420 248441 241048 227129 283367 318537 255206
2075 255206 130511 95250 219628 233037 253067 336477 286153 259092 231561 325021 367369
$$ [...]
##END NTUPLES=NMR SPECTRUM
##END=
