##TITLE=1H_Cg-1222
 200.13MHz, CDCl3,
 8 sc
 
 10.9.2025
##JCAMPDX= 6.0         $$ Bruker NMR JCAMP-DX V2.0
##DATA TYPE= NMR SPECTRUM
##DATA CLASS= NTUPLES
##ORIGIN= UXNMR, Bruker Analytische Messtechnik GmbH
##OWNER= pz
$$ XWIN-NMR		Version 3.5
$$ Wed Sep 10 15:41:18 2025 Russian Standard Time (UT+4h)  she@DPX200
##.OBSERVE FREQUENCY= 200.1313
##.OBSERVE NUCLEUS= ^1H
##.ACQUISITION MODE= SIMULTANEOUS
##.ACQUISITION SCHEME= undefined
##.AVERAGES= 8
##.DIGITISER RES= 18
##SPECTROMETER/DATA SYSTEM= spect
##.PULSE SEQUENCE= zg30
##.SOLVENT NAME= CDCl3
##.SHIFT REFERENCE= (INTERNAL, CDCl3, 0, 15.4604)
##AUDIT TRAIL= $$ (NUMBER, WHEN, WHO, WHERE, WHAT)
$$ ##TITLE= Audit trail, XWIN-NMR		Version 3.5
$$ ##JCAMPDX= 5.01
$$ ##ORIGIN= Bruker BioSpin GmbH
$$ ##OWNER= she
$$ F:/spectra/data/she/nmr/H-C/1/pdata/1/auditp.txt
$$ ##AUDIT TRAIL=  $$ (NUMBER, WHEN, WHO, WHERE, WHAT)
(   1,<2025-09-10 15:39:49.31 +0400>,<she>,<DPX200>,
      <created by zg, POWCHK disabled, PULCHK disabled
       configuration hash MD5:
       00 E9 B6 7A A2 85 ED C7 34 08 36 98 17 FE 4E 26
       data hash MD5: 16K
       11 39 D2 12 09 43 63 A7 5A 87 B8 7D 31 A9 33 42>)
(   2,<2025-09-10 15:39:52.15 +0400>,<she>,<DPX200>,
      <Start of raw data processing
       efp BC_mod = 2 LB = 0.25 FT_mod = 6 PKNL = 1 PHC0 = -1722.718 PHC1 = 15.19228 SI = 16K 
       data hash MD5: 16K
       2E 91 FB 92 C2 53 74 C0 6F F9 F4 75 20 DD A9 26>)
(   3,<2025-09-10 15:40:12.45 +0400>,<she>,<DPX200>,
      <pk PHC0 = 0.8764316 PHC1 = 0 
       data hash MD5: 16K
       A4 F7 D2 91 34 45 DC 85 80 31 29 4E D8 C3 F6 81>)
(   4,<2025-09-10 15:40:16.82 +0400>,<she>,<DPX200>,
      <abs ABSG = 5 
       data hash MD5: 16K
       D3 7F D6 EF 5E FF 92 98 63 DB EE 14 47 7A D2 F9>)
$$ ##END=
$$ 
$$ hash MD5
$$ 6F 40 18 7F 13 F4 85 6C 8D 98 A9 DB C7 07 DB 25
##$RELAX= 
##$RELAX= 
##$RELAX= 
##$RELAX= 
##$RELAX= 
##$RELAX= 
$$ Bruker specific parameters
$$ --------------------------
##$DU= <F:/spectra>
##$EXPNO= 1
##$NAME= <H-C>
##$PROCNO= 1
##$TYPE= <nmr>
##$USER= <she>
##$AMP= (0..31)
100 100 100 100 100 100 100 100 100 100 100 100 100 100 100 100 100 100 
100 100 100 100 100 100 100 100 100 100 100 100 100 100 
##$AQSEQ= 0
##$AQ_mod= 1
##$AUNM= <au_zg>
##$AUTOPOS= <>
##$BF1= 200.13
##$BF2= 200.13
##$BF3= 200.13
##$BF4= 200.13
##$BF5= 200.13
##$BF6= 200.13
##$BF7= 200.13
##$BF8= 200.13
##$BYTORDA= 1
##$CFDGTYP= 0
##$CFRGTYP= 5
##$CHEMSTR= <none>
##$CNST= (0..31)
1 1 145 1 1 1 1 1 1 1 1 1 1 1 1 1 1 1 1 1 1 1 1 1 1 1 1 1 1 1 1 1 
##$CPDPRG= <>
##$CPDPRG1= <>
##$CPDPRG2= <>
##$CPDPRG3= <>
##$CPDPRG4= <mlev>
##$CPDPRG5= <mlev>
##$CPDPRG6= <mlev>
##$CPDPRG7= <mlev>
##$CPDPRG8= <mlev>
##$CPDPRGB= <>
##$CPDPRGT= <>
##$D= (0..31)
0 0.7 0 0 0 0 0 0 0 0 0 0.03 0 0 0 0 0 0 0 0 0 0 0 0 0 0 0 0 0 0 0 0 
##$DATE= 1757504388
##$DBL= (0..7)
120 120 120 120 120 120 120 120 
##$DBP= (0..7)
150 150 150 150 150 150 150 150 
##$DBP07= 0
##$DBPNAM0= <>
##$DBPNAM1= <>
##$DBPNAM2= <>
##$DBPNAM3= <>
##$DBPNAM4= <>
##$DBPNAM5= <>
$$ [...]
##$SUBNAM3= <"">
##$SUBNAM4= <"">
##$SUBNAM5= <"">
##$SUBNAM6= <"">
##$SUBNAM7= <"">
##$SUBNAM8= <"">
##$SUBNAM9= <"">
##$SW= 18.0517328524113
##$SWIBOX= (0..15)
0 0 2 0 0 0 0 0 0 0 0 0 0 0 0 0 
##$SW_h= 3612.71676300578
##$TD= 16384
##$TD0= 1
##$TE= 0
##$TE2= 300
##$TE3= 300
##$TEG= 300
##$TL= (0..7)
0 120 120 120 120 120 120 120 
##$TP= (0..7)
150 150 150 150 150 150 150 150 
##$TP07= 0
##$TPNAME0= <>
##$TPNAME1= <>
##$TPNAME2= <>
##$TPNAME3= <>
##$TPNAME4= <>
##$TPNAME5= <>
##$TPNAME6= <>
##$TPNAME7= <>
##$TPOAL= (0..7)
0.5 0.5 0.5 0.5 0.5 0.5 0.5 0.5 
##$TPOFFS= (0..7)
0 0 0 0 0 0 0 0 
##$TUNHIN= 0
##$TUNHOUT= 0
##$TUNXOUT= 0
##$USERA1= <user>
##$USERA2= <user>
##$USERA3= <user>
##$USERA4= <user>
##$USERA5= <user>
##$V9= 5
##$VALIST= <valist>
##$VCLIST= <CCCCCCCCCCCCCCC>
##$VD= 0
##$VDLIST= <DDDDDDDDDDDDDDD>
##$VPLIST= <PPPPPPPPPPPPPPP>
##$VTLIST= <TTTTTTTTTTTTTTT>
##$WBST= 1024
##$WBSW= 4
##$XGAIN= (0..3)
0 0 0 0 
##$XL= 0
##$YL= 0
##$YMAX_a= 598024
##$YMIN_a= -504734
##$ZGOPTNS= <>
##$ZL1= 120
##$ZL2= 120
##$ZL3= 120
##$ZL4= 120
##$ABSF1= 15.48025
##$ABSF2= -2.571599
##$ABSG= 5
##$ABSL= 3
##$ALPHA= 0
##$AQORDER= 0
##$ASSFAC= 0
##$ASSFACI= 0
##$ASSFACX= 0
##$ASSWID= 0
##$AUNMP= <proc_1d>
##$AZFE= 0.1
##$AZFW= 0.1
##$BCFW= 0
##$BC_mod= 2
##$BYTORDP= 0
##$COROFFS= 0
##$CY= -3
##$DATMOD= 1
##$DC= 0
##$DFILT= <>
##$DTYPP= 0
##$F1P= 0
##$F2P= 0
##$FCOR= 1
##$FTSIZE= 16384
##$FT_mod= 6
##$GAMMA= 0
##$GB= 0
##$INTBC= 1
##$INTSCL= 3.241238e-09
##$ISEN= 128
##$LB= 0.25
##$LEV0= 0
##$LPBIN= 0
##$MAXI= 10000
##$MC2= 0
##$MEAN= 0
##$ME_mod= 0
##$MI= 1.114404
##$NCOEF= 0
##$NC_proc= -6
##$NLEV= 6
##$NOISF1= 3.799351
##$NOISF2= 2.8
##$NSP= 0
##$NTH_PI= 0
##$NZP= 0
##$OFFSET= 15.46042
##$PC= 1
##$PHC0= -1721.842
##$PHC1= 15.19228
##$PH_mod= 1
##$PKNL= yes
##$PPARMOD= 0
##$PSCAL= 0
##$PSIGN= 0
##$REVERSE= no
##$SF= 200.130012263379
##$SI= 16384
##$SIGF1= 3
##$SIGF2= 2
##$SINO= 0.751879
##$SIOLD= 32768
##$SREGLST= <19F.Aceton>
##$SSB= 0
##$STSI= 16384
##$STSR= 0
##$SW_p= 3612.71676300578
##$SYMM= 0
##$S_DEV= 0
##$TDeff= 16384
##$TDoff= 0
##$TI= <>
##$TILT= no
##$TM1= 0
##$TM2= 0
##$TOPLEV= 0
##$USERP1= <user>
##$USERP2= <user>
##$USERP3= <user>
##$USERP4= <user>
##$USERP5= <user>
##$WDW= 1
##$XDIM= 16384
##$YMAX_p= 339972823
##$YMIN_p= -85878
$$ End of Bruker specific parameters
$$ ---------------------------------
##NTUPLES= NMR SPECTRUM
##VAR_NAME=  FREQUENCY,     SPECTRUM/REAL,   SPECTRUM/IMAG
##SYMBOL=    X,             R,               I
##VAR_TYPE=  INDEPENDENT,   DEPENDENT,       DEPENDENT
##VAR_FORM=  AFFN,          ASDF,            ASDF
##VAR_DIM=   16384,         16384,           16384
##UNITS=     HZ,            ARBITRARY UNITS, ARBITRARY UNITS
##FACTOR=    0.220516191357247, 1,           1
##FIRST=     3094.09397512135, 0,            0
##LAST=      -518.622787884426, 0,           0
##MIN=       -518.622787884426, -85878,      0
##MAX=       3094.09397512135, 339972823,    0
$$ Real data points
##PAGE= N=1
##DATA TABLE= (X++(R..R)), XYDATA
$$ [...]
6484A659630l7952l4280o0875n0259l4638l3642k2399j3096j6853k5017m7774
6473A282845k8588n7352j4177j2521O124k1634k5677k4783l2252n4831l0067j881
6461I85206j4978r209j3840K0651k5215N040m196q485k0736k9869K4494J1383
6449I20246r575j1870J23J51J5099j9857m358K4208J6195J7042N222J1881j6742
6436I47765N036p360M5581q358j3965L4284O512J147J2194J3962q56J4868K7631
6423A078441J9907J7964K2529L7638J7449M1960M7793N168n460N9448N1768J8588
6411A413193L1860N6188J4081L2227M6242K8782M0110L93j2482r900j5814j5330
6399A609550m5773n7734l1890n7583n0879l2474l1851n6400k0060j4945J6660
$$ plain form
6484 1659630 1621678 1587398 1526523 1476264 1441626 1407984 1385585 1372489 1355636 1330619 1282845
6473 1282845 1254257 1196905 1182728 1170207 1176331 1154697 1129020 1104237 1071985 1017154 987087 985206
6461 985206 970228 961019 947179 967830 942615 947655 943459 934974 914238 884369 908863 920246
6449 920246 910671 898801 898924 899075 914174 894317 889959 914167 930362 947404 952626 964507 947765
6436 947765 952801 945441 991022 982664 968699 1002983 1009495 1010642 1022836 1036798 1035942 1050810 1078441
6423 1078441 1098348 1116312 1138841 1176479 1193928 1235888 1283681 1288849 1283389 1342837 1394605 1413193
6411 1413193 1445053 1501241 1515322 1547549 1593791 1622573 1662683 1663076 1650594 1640694 1624880 1609550
6399 1609550 1563777 1506043 1474153 1416570 1365691 1333217 1301366 1244966 1224906 1209961 1226621
6388A226621l8777l3085J076m7180q339L8355K2463m9212l6521R281j1140k2040
6376A051502J2814q900J7989j7379j6291k5023j9119J6141n93O866l1618m038
6364I82351J2979K6847N112P004o642K5084O617L1530J0543k3816j3535N5290
6352A119364M133m4283P573J3752N05J977L0049L9349J6001J0986P4848L0826
6340A305080J3946M5043O7660K4659M7329R574Q8194K5361R1824R1797O7625P6671
6328A954763J13936Q0322J08077J06750Q0240M6465N4698Q1704L0050P2045O6320
6317B795370N1479M7908K0087K4257P7117K9718L1851O2480J18876J19376J07348
6306C485867J00595J13168J12467J43345J09487J84822J82414J73848J90271J71378
$$ plain form
6388 1226621 1187844 1154759 1155835 1108655 1100316 1138671 1161134 1111922 1075401 1084682 1073542 1051502
6376 1051502 1064316 1055416 1073405 1056026 1039735 1014712 995593 1011734 1011141 1018007 986389 982351
6364 982351 995330 1022177 1027289 1034293 1027651 1052735 1059352 1090882 1101425 1077609 1064074 1119364
6352 1119364 1123497 1079214 1086787 1100539 1101044 1103021 1133070 1172419 1188420 1199406 1274254 1305080
6340 1305080 1319026 1364069 1431729 1456388 1503717 1513291 1601485 1626846 1718670 1810467 1878092 1954763
6328 1954763 2068699 2149021 2257098 2363848 2444088 2490553 2545251 2626955 2657005 2729050 2795370
6317 2795370 2846849 2894757 2914844 2939101 3016218 3045936 3077787 3140267 3259143 3378519 3485867
6306 3485867 3586462 3699630 3812097 3955442 4064929 4249751 4432165 4606013 4796284 4967662
6296D967662J18446J32558P8567L0449p0831j09598j39523j66627r2901r0749
6286D657453r7603m3630j0048K5118J9012M2918O4704R6262J10383J43825R3091
6275E101485R9045O7291M951j7579n6707j01529j64412k15349k41781j95741j64969
6264D114705j54328j77459j62061j33219q2776j12254j13946j11057p8711q3116
6254B905778o4687o8794q3739r7249r592m3146k3236n068k4374m678L124L6787
6242B521126K9583N7875Q8414J9426J03877J39632J29989J26377J33725J48729
6232C498753J78680K11481J99241K31352K00084J34076J35417N2708L1836O6010
6222D939638k5670o9404n2663k3067p9972o0597j2135j4458k3615L405M4802R9583
$$ plain form
6296 4967662 5086108 5218666 5297233 5327682 5256851 5147253 5007730 4841103 4748202 4657453
6286 4657453 4559850 4516220 4506172 4531290 4550302 4593220 4657924 4754186 4864569 5008394 5101485
6275 5101485 5200530 5267821 5272772 5255193 5198486 5096957 4932545 4717196 4475415 4279674 4114705
6264 4114705 3960377 3782918 3620857 3487638 3404862 3292608 3178662 3067605 2988894 2905778
6254 2905778 2841091 2772297 2688558 2591309 2581717 2538571 2515335 2510267 2485893 2481215 2484339 2521126
6242 2521126 2550709 2608584 2696998 2716424 2820301 2959933 3089922 3216299 3350024 3498753
6232 3498753 3677433 3888914 4088155 4319507 4519591 4653667 4789084 4841792 4873628 4939638
6222 4939638 4913968 4844564 4791901 4768834 4688862 4628265 4616130 4601672 4578057 4581462 4626264 4725847
6210D725847J18166P6696J01398J47570J29529J37210P1062J6113k6500k9716
6200E467375m7415l8589j09144q6112o9829p5472m1418p7951j01480p3556k6857
6189D719552k0576l6599m243l610K3801L3774J2934K5334L7044Q4008P1097J00369
6177E042885R7629J41371J33608Q1056J23681J14557J00522N6653l2919l2899
6167E826144n7818j09414q6946r5287r7287n5538o2746Q560m912k0433J1702n1038
6155E204987j2996O1542O160k1942o8101j23473r7785p6989j32148r2309l7102
6144D609844o0900m0754o9172l2630N246q2549l8496j5138m5491j3038l9632m0303
6132D136987n9217o4444n5606p3796j28383j08514j03139j47180j18584j19624
$$ plain form
6210 4725847 4844013 4920709 5022107 5169677 5299206 5436416 5507478 5523591 5497091 5467375
6200 5467375 5419960 5381371 5272227 5186115 5116286 5040814 4999396 4921445 4819965 4746409 4719552
6189 4719552 4698976 4662377 4658134 4654524 4678325 4712099 4725033 4750367 4787411 4871419 4942516 5042885
6177 5042885 5140514 5281885 5415493 5496549 5620230 5734787 5835309 5891962 5859043 5826144
6167 5826144 5768326 5658912 5571966 5476679 5379392 5323854 5261108 5269668 5264756 5244323 5256025 5204987
6155 5204987 5191991 5253533 5259693 5237751 5169650 5046177 4948392 4871403 4739255 4646946 4609844
6144 4609844 4548944 4508190 4439018 4406388 4411634 4329085 4290589 4275451 4229960 4216922 4177290 4136987
6132 4136987 4077770 4013326 3957720 3883924 3755541 3647027 3543888 3396708 3278124 3158500
6122C158500j25124r7792r7181p4736q2425r3470q2321n9343n7110m0864o5851
6111B282283o6165q2790m6190m6279m9659l9888n0043l1165l1884l2085m4089
6100A762046k8314j8431K6227l704l8354j3187j9348r00J1557l9078j6463p995
6088A614056k485p339j9235k0862k4024N309L1962l4774j503m6731k4484L0563
6076A500453J0211k0436k4682k6284r363o352O960j1358n097k2804J76J1094j6697
6063A385821k8608Q780K9234k2435K386J4101j5163k4106J1566p75n915j4876
6051A340010o699j7460l4919K2109j684P934k359j1968l210j0152Q708j3954K1091
6038A297447l6647k928J4556J3086j5053P10K948J0964J3870M560J672J4523N282
$$ plain form
6122 3158500 3033376 2935584 2838403 2763667 2681242 2587772 2505451 2446108 2388998 2348134 2282283
6111 2282283 2216118 2133328 2087138 2040859 1991200 1951312 1901269 1870104 1838220 1806135 1762046
6100 1762046 1733732 1715301 1741528 1737824 1699470 1686283 1666935 1666035 1677592 1638514 1622051 1614056
6088 1614056 1611571 1604232 1584997 1564135 1540111 1545420 1577382 1542608 1541105 1494374 1469890 1500453
6076 1500453 1510664 1490228 1465546 1439262 1429899 1423547 1430507 1419149 1414052 1391248 1391424 1402518 1385821
6063 1385821 1357213 1365993 1395227 1372792 1375178 1389279 1374116 1350010 1361576 1360801 1354886 1340010
6051 1340010 1333311 1315851 1280932 1303041 1301357 1309291 1306932 1294964 1291754 1281602 1290310 1276356 1297447
6038 1297447 1260800 1257872 1272428 1285514 1270461 1271171 1274119 1285083 1298953 1303513 1305185 1319708 1324990
6025A324990J0527K6703M0828j9811J8602O626P759L2052K2050O907L2224M7602
6013A557059q659j5755J3410M5200P78K5826N306j842k4729n346K3484K1492Q470
6000A644694r236J9329R789J0238l040L9115M5438K8243K3229N3820Q7528M6074
5988A995221K2969L7504M7551P6330L5656O2393P6174R6457R6134Q2689J29530
5977B758608J20938J14015J69047J59676J23798J67301J78327J76745J74695K26871
5967D370021K41141L02341L37047L72370M25648M68662M09615L63593L04365K25731
5957G820534R6770k3492j75597k73066l53322l54043l12145k78690k88869k26118
5947E631962j85906k26811k09457k01556k15502j61325j40535j59808j52680j48623
$$ plain form
6025 1324990 1335517 1362220 1403048 1383237 1401839 1408465 1416224 1448276 1470326 1477233 1509457 1557059
6013 1557059 1548400 1532645 1546055 1591255 1592033 1617859 1623165 1621323 1596594 1591248 1614732 1636224 1644694
6000 1644694 1635458 1654787 1664576 1674814 1671774 1710889 1756327 1784570 1807799 1861619 1949147 1995221
5988 1995221 2018190 2055694 2103245 2179575 2215231 2277624 2353798 2450255 2546389 2629078 2758608
5977 2758608 2879546 2993561 3162608 3322284 3446082 3613383 3791710 3968455 4143150 4370021
5967 4370021 4611162 4913503 5250550 5622920 6048568 6517230 6926845 7290438 7594803 7820534
5957 7820534 7917304 7893812 7718215 7445149 7091827 6737784 6425639 6146949 5858080 5631962
5947 5631962 5446056 5219245 5009788 4808232 4592730 4431405 4290870 4131062 3978382 3829759
5937C829759j14795j12921j14430j56950r4398l7314q2088o0389q4481j28221
5927B843772l2873o3041n2358j8149k4946m6427m9808l1956l5579k2895m679M7232
5915B508293J2210l7512J7976K7406n992J3319J5157K1479M8175j07N766j45j355
5902B624670P762L3592R992Q419j8118n960L4142J314L3578R131K8910Q821K2442
5889B798695N039J0654K6796J3106Q332m1211l9636j8112j0922l9603J633j9052
5877B695719l4870K0392K4709m8180m3696j2250o072N533l9199j1772k3667n8297
5865B468350o1294l7814l3377o6063J7699J3383m3683j5303O776j3127q296l6646
5853B190605o507k6523l2593J0027j4791j1329m2950j827r059J0018p750n38J6458
$$ plain form
5937 3829759 3714964 3602043 3487613 3330663 3236265 3198951 3116863 3056474 2971993 2843772
5927 2843772 2810899 2747858 2695500 2677351 2652405 2605978 2556170 2524214 2488635 2465740 2461061 2508293
5915 2508293 2520503 2482991 2500967 2528373 2522381 2535700 2550857 2572336 2620511 2620404 2626170 2626025 2624670
5902 2624670 2632432 2666024 2676016 2684435 2666317 2660357 2694499 2695813 2729391 2738522 2767432 2776253 2798695
5889 2798695 2803734 2814388 2841184 2854290 2862622 2821411 2781775 2763663 2752741 2713138 2714771 2695719
5877 2695719 2660849 2681241 2705950 2657770 2614074 2601824 2595752 2601285 2562086 2550314 2526647 2468350
5865 2468350 2407056 2369242 2335865 2269802 2287501 2300884 2257201 2241898 2248674 2235547 2227251 2190605
5853 2190605 2184098 2157575 2124982 2135009 2120218 2108889 2065939 2064112 2055053 2065071 2057321 2056783 2073241
5840B073241k1404K1520j6268J1053J6961m3528J715j790J6296K1498O427k5838
5828B059883l5602J769j0343k2520J8585n389J4850K9581N312O650L2222n9272
5816B035726J414J4138m657J1462R334M2437K9580J4606j7863j0287j6542Q268
5804B117616K2686J5612O59M3650L2126J4845L1548J8304M5608P153K8940L8466
5792B417213P611Q1788R663L0722K7697k2725J7569N5424J3372M5422N9098K6412
5780B769266L4191L3271L0422L0702J3869L77K2194N9964J4649K5539P1372Q7597
5768C193413O2725R1710R2087J25326J35086J32963J05415O080l3246k8922M3033
5757C925670J6608p817L2487P7336M6051N2272Q0347P0304L9977R1134Q8447O1996
$$ plain form
5840 2073241 2051837 2073357 2057089 2068142 2085103 2041575 2043290 2041500 2057796 2079294 2085721 2059883
5828 2059883 2024281 2026050 2015707 1993187 2011772 2006383 2021233 2050814 2056126 2062776 2094998 2035726
5816 2035726 2037140 2051278 2046621 2058083 2067417 2109854 2139434 2154040 2136177 2125890 2109348 2117616
5804 2117616 2140302 2155914 2156573 2200223 2232349 2247194 2278742 2297046 2342654 2349807 2378747 2417213
5792 2417213 2424824 2506612 2516275 2546997 2574694 2551969 2569538 2624962 2638334 2683756 2742854 2769266
5780 2769266 2803457 2836728 2867150 2897852 2911721 2912098 2934292 2994256 3008905 3034444 3105816 3193413
5768 3193413 3256138 3347848 3439935 3565261 3700347 3833310 3938725 3944805 3911559 3882637 3925670
5757 3925670 3942278 3934461 3966948 4044284 4090335 4142607 4222954 4293258 4333235 4424369 4512816 4574812
5745D574812R7096J25369O7579O8634J11491J00397J57368J95887J92896J70216
5735E861745K05554J96684J89567J02817o7198j31534j49609q7852j12333j19658
5725E888183j04490l8972l1600p3925n4177r2850q8207p4641l6604p3797n5388
5714E163532l6116J2241n7989o7491k9198Q746N6151J486J6286o514m4682j9444
5702D997008j4566j30479j44157j02899j69845r4273j01730o9787j7448m2036
5692D109788m9549p1319j7951k6197k0727o7069m0406j1094k3422k292l2911k6281
5680C720570j0456k6153J0891O009j6329k7080L8852N798J217L7128j4746J841
5668C727542L3826L8827M1626M1324M0729M9318J4036q549L1269O9621J12828
$$ plain form
5745 4574812 4671908 4797277 4864856 4933490 5044981 5145378 5302746 5498633 5691529 5861745
5735 5861745 6067299 6263983 6453550 6556367 6489169 6357635 6208026 6120174 6007841 5888183
5725 5888183 5783693 5744721 5713121 5639196 5585019 5492169 5403962 5329321 5292717 5218920 5163532
5714 5163532 5127416 5139657 5081668 5014177 4984979 4993725 5049876 5051362 5067648 5061134 5016452 4997008
5702 4997008 4982442 4851963 4707806 4604907 4435062 4340789 4239059 4169272 4151824 4109788
5692 4109788 4060239 3988920 3970969 3944772 3924045 3856976 3816570 3805476 3782054 3779762 3746851 3720570
5680 3720570 3710114 3683961 3694852 3700861 3684532 3657452 3696304 3702102 3703319 3740447 3725701 3727542
5668 3727542 3761368 3800195 3841821 3883145 3923874 3973192 3987228 3978679 4009948 4079569 4192397
5657D192397P7237M3232P6153O2677J09555J43037Q4232J14009J13020J39106
5647E154655J23474J31986Q7272N3204K8942Q9733N8967O8501J13093P9387O2631
5636F051845J04132J24915J33418J32915J14221J84286J39699K06632J60380J68951
5626G521394K05620K25800K70293K86865L41639M01795M50764M63674N45613N19605
5616A1233062N03366N69682N71615N87540N68591O10586O66611P05586Q06855
5607A6823494Q25257Q53946R55367J043129J228062J343966J444588J603184J759660
5598B7880653J944362K211554K610623K963111L303168L583643L839084M045915
5590E2382113M132502M172551M167060L990620L833238L695565L415211L077817
$$ plain form
5657 4192397 4269634 4312866 4389019 4451696 4561251 4704288 4788520 4902529 5015549 5154655
5647 5154655 5278129 5410115 5497387 5550591 5579533 5669266 5728233 5796734 5909827 5989214 6051845
5636 6051845 6155977 6280892 6414310 6547225 6661446 6845732 6985431 7192063 7352443 7521394
5626 7521394 7727014 7952814 8223107 8509972 8851611 9253406 9704170 10167844 10713457 11233062
5616 11233062 11736428 12306110 12877725 13465265 14033856 14644442 15311053 16016639 16823494
5607 16823494 17648751 18502697 19458064 20501193 21729255 23073221 24517809 26120993 27880653
5598 27880653 29825015 32036569 34647192 37610303 40913471 44497114 48336198 52382113
5590 52382113 56514615 60687166 64854226 68844846 72678084 76373649 79788860 82866677
5582H2866677K517084J637868L86287r19213j957269k495541k691474k698297
5574G6646122k672873k699715k960967l343973l707014l882515l865081l685492
5566D9828492l357462l115159k859637k660286k513120k345447k168628j951962
5558B8856791j739677j606551j487150j352141j234745j180678j052829q91320
5550A8311700q59636p46628p19738o74750n64175n75329o02557n15559m81301
5541A2572027m56170m15823m12516l76465m11389m08285l72864l16252l48360
5532I053903l28772k93614l05499k83740k92190k23641k00799k05492k12193j70249
5522F537714j53144j42018j42338j50199j09152j45617j25621j05651r5773r1138
$$ plain form
5582 82866677 85383761 87021629 87407916 86488703 84531434 82035893 79344419 76646122
5574 76646122 73973249 71273534 68312567 64968594 61261580 57379065 53513984 49828492
5566 49828492 46471030 43355871 40496234 37835948 35322828 32977381 30808753 28856791
5558 28856791 27117114 25510563 24023413 22671272 21436527 20255849 19203020 18311700
5550 18311700 17452064 16705436 15985698 15310948 14746773 14171444 13568887 13053328 12572027
5541 12572027 12115857 11700034 11287518 10911053 10499664 10091379 9718515 9402263 9053903
5532 9053903 8725131 8431517 8126018 7842278 7550088 7326447 7125648 6920156 6707963 6537714
5522 6537714 6384570 6242552 6100214 5950015 5840863 5695246 5569625 5463974 5368201 5277063
5512E277063j21334q8750p5542j03496m5441l2402r6330r1265m8799l3717o6730
5501D473257m9637m6136o6773l9279m5618l7512m9561o3088k7547j8472j2944
5490D016690o8409m0876j3079m8604n7047k7362l5512m8446n3501m0213p654j2969
5478C563018l4766n7399j1636r5311n1534K857j0267l91l6600k4050J3785j760
5466C255946j3124o0281l2981k6125j7391k7898l6678m3936n533M508k4975l8460
5454B933072j4354k4912n405m0307m2175J3989j3883r227j7162J169K694q243
5442B775256K9830J4914q731R934K0298P191k2972n0919J6905N2245J6766Q686
5430B869403r420K4542J3641j6005N2629K1747k3707M681N6789N893K7989P6001
$$ plain form
5512 5277063 5155729 5066979 4991437 4887941 4842500 4810098 4713768 4622503 4573704 4539987 4473257
5501 4473257 4423620 4377484 4310711 4271432 4225814 4188302 4138741 4075653 4048106 4029634 4016690
5490 4016690 3948281 3907405 3894326 3845722 3788675 3761313 3725801 3677355 3623854 3583641 3575987 3563018
5478 3563018 3528252 3470853 3459217 3363906 3312372 3315229 3304962 3304571 3267971 3243921 3257706 3255946
5466 3255946 3242822 3182541 3149560 3123435 3106044 3078146 3041468 2997532 2991999 2996507 2971532 2933072
5454 2933072 2918718 2893806 2888401 2848094 2805919 2819908 2806025 2796798 2779636 2780805 2783499 2775256
5442 2775256 2805086 2820000 2811269 2821203 2841501 2848692 2825720 2774801 2791706 2843951 2860717 2869403
5430 2869403 2859983 2884525 2898166 2882161 2934790 2956537 2932830 2937511 2994300 3000193 3028182 3104183
5418C104183O5288O3806P2214P4396P1863R2191P7347O6613M8206J8679m947L0995
5406C780834j2638k1056l3723n5287n9648p6848j02624n4489m4276m8801k9055
5395C242389p7091m3815j0706p735L48n0192k7485J1320k0260P988L1591p18K1758
5382C077392K9497M3711K9072o180K4327M8438K8310P2581N3051N9430P6718R1750
5370C628097L5429Q5513J7738N7146Q5716O2702J36620K02416K20234L14878L18938
5359E165427K63893K80735K42622K80229J70593j01100k11971k44497k02662j67130
5349E476139j88232k30400j77858j03831p1094n0774l5635p4068q8772n5384p4021
5338D326070p5166r4091p6476q3846j02179j37962p0465o8989p9537m6807j0030
$$ plain form
5418 3104183 3169471 3233277 3305491 3379887 3451750 3543941 3621288 3687901 3736107 3754786 3749839 3780834
5406 3780834 3768196 3747140 3713417 3658130 3598482 3521634 3419010 3364521 3320245 3271444 3242389
5395 3242389 3165298 3121483 3110777 3103042 3103390 3053198 3025713 3037033 3016773 3024761 3056352 3055634 3077392
5382 3077392 3106889 3150600 3179672 3173492 3197819 3246257 3274567 3347148 3400199 3459629 3536347 3628097
5370 3628097 3663526 3749039 3766777 3823923 3909639 3972341 4108961 4311377 4531611 4846489 5165427
5359 5165427 5429320 5710055 5952677 6232906 6403499 6302399 6090428 5845931 5643269 5476139
5349 5476139 5287907 5057507 4879649 4775818 4704724 4653950 4618315 4544247 4455475 4400091 4326070
5338 4326070 4250904 4156813 4080337 3996491 3894312 3756350 3685885 3616896 3537359 3490552 3480522
5327C480522p0416q6014o4003n2894o1868m0867J533k6113m7947j5503L843o369
5315C013904k525L6146L915M6625J1408L6195L2883j923J7885J928k3177n2714
5303C120550r161n0347m6371k6749n4302k4496K4182m8839m3422J2906J7455K3639
5291B895045K6221p69j1760o831K7451O3568L660L8703N3564M3946N1201O8015
5279C252014M9831P8682J14571P6506N2227O0330L1206K283n1494o9071q2641
5268C514444o4918n0140l1364n3467l7162p1346l9763n2510q3624m869l27o5253
5256B959701k3168m4421o6895l6384p9955k6805j8928k3379k2864q915m49o09
5244B606929j0943J2747J1284l846J9558J2363j3745l5867K588k8876m5044l5284
$$ plain form
5327 3480522 3410106 3324092 3260089 3207195 3145327 3104460 3105993 3079880 3031933 3016430 3020273 3013904
5315 3013904 3011379 3047525 3051440 3098065 3109473 3145668 3178551 3176628 3194513 3196441 3173264 3120550
5303 3120550 3111389 3061042 3014671 2987922 2933620 2909124 2933306 2884467 2841045 2853951 2871406 2895045
5291 2895045 2921266 2920497 2908737 2901906 2929357 2992925 2996585 3035288 3088852 3132798 3183999 3252014
5279 3252014 3301845 3380527 3495098 3571604 3623831 3684161 3715367 3717650 3666156 3597085 3514444
5268 3514444 3449526 3399386 3368022 3314555 3277393 3206047 3166284 3113774 3030150 3025281 3024954 2959701
5256 2959701 2936533 2892112 2825217 2788833 2708878 2682073 2663145 2639766 2616902 2607987 2607538 2606929
5244 2606929 2595986 2608733 2620017 2616171 2635729 2648092 2634347 2598480 2601068 2572192 2527148 2491864
5232B491864k6102r125j5280J0568K8622J8852n7217P393k9617m0116Q527n904
5220B382465J9979O278m379n329m325J5652L5950J1927k7377L2640K0726L4430
5208B518637M0579K7547K2063L2677o331J91J5398Q242J6970k0029N086j145k9487
5195B630398k0324L3687L5944K5302K978M121M338O162j0163O102O2139L316m715
5182B779285L5720K0968J4697K5651j7183K0815K7549L7542L16L4373K3009r424
5170B993318L536k9082K366J9616j0987J0832l1730J842J5597L6988L5522K2892
5158C070710K7804K9566J7874J7678M305j4941L5235M4467K4712M6654K8331J8020
5146C350415M3751K3089K7702L4699Q6973K2720K2797N6511N5370M3156M2967
$$ plain form
5232 2491864 2465762 2456637 2441357 2451925 2480547 2499399 2442182 2449575 2419958 2379842 2388369 2382465
5220 2382465 2402444 2408722 2404343 2399014 2394689 2410341 2446291 2458218 2430841 2463481 2484207 2518637
5208 2518637 2559216 2586763 2608826 2641503 2635172 2635363 2650761 2659003 2675973 2655944 2661030 2659885 2630398
5195 2630398 2610074 2643761 2679705 2705007 2707985 2712106 2716444 2722606 2712443 2718545 2780684 2784000 2779285
5182 2779285 2815005 2835973 2850670 2876321 2859138 2879953 2907502 2945044 2945360 2979733 3002742 2993318
5170 2993318 2996854 2967772 2970138 2989754 2978767 2989599 2957869 2959711 2975308 3012296 3047818 3070710
5158 3070710 3098514 3128080 3145954 3163632 3167937 3152996 3188231 3232698 3257410 3304064 3332395 3350415
5146 3350415 3394166 3417255 3444957 3479656 3566629 3589349 3612146 3668657 3724027 3767183 3810150
5135C810150O9944O2795N8765J23166R2846M2381N1673R2297P7773P9055O6847
5124D627692Q0199O6233Q7291Q0317R8089J55140J32676J16185P1668J20285J09274
5113E745049N3623N8241J07146J05078J29633J41316J36597J28658J92401K00661
5103F998403K17313L08730K58045K88575K22077J63499J43179J39415K7218j63009
5093H603445j84563j79889j71685j30246j32713n9965m5450k0826n6788o0919
5083G560401q7841o3857m7374q7700m6201p3043m6638k7344J2110Q216K6251n803
5071G121177m289J1236p4767j07272j22561j03946j21123j11192r0040r6729j38824
5060F161670j11889p0078o8765n2724n1093o1783n1755o9997q9126j7023l002
$$ plain form
5135 3810150 3880094 3942889 4001654 4124820 4217666 4260047 4311720 4404017 4481790 4560845 4627692
5124 4627692 4707891 4774124 4861415 4941732 5039821 5194961 5327637 5443822 5515490 5635775 5745049
5113 5745049 5798672 5856913 5964059 6069137 6198770 6340086 6476683 6605341 6797742 6998403
5103 6998403 7215716 7524446 7782491 8071066 8293143 8456642 8599821 8739236 8766454 8603445
5093 8603445 8418882 8238993 8067308 7937062 7804349 7744384 7698934 7678108 7621320 7560401
5083 7560401 7472560 7408703 7361329 7273629 7227428 7154385 7107747 7080403 7092513 7100729 7126980 7121177
5071 7121177 7116888 7128124 7053357 6946085 6823524 6719578 6598455 6487263 6397223 6300494 6161670
5060 6161670 6049781 5979703 5910938 5858214 5807121 5745338 5693583 5623586 5534460 5517437 5514435
5049E514435l3428k1172j6589M7785K8840L9331N2004J7572M9294O9999P3515
5038E821586R8565Q3413J04003J27902R8354Q6340J41959J50727J23713J92896
5028G029458J63662J60729J93965K08158K40541K55667K91529L16441L10328L27199
5018I497677L62874M25105M72838N04172N06133N41950O21916O88240O79590O63972
5008A4964467P25669P86001P35381P58397P66351O86377O76069O43194O02773
4999B1344679N85360N61344O10589N70474N78551N72330N76153N18058N85706
4990B6503244O59242P65188Q38218R49628J029624J068041J164065J253416J323673
4981C5554339J302398J277536J226894J195774J071422J001814Q94664P61979
$$ plain form
5049 5514435 5481007 5459835 5443246 5491031 5519871 5559202 5611206 5628778 5678072 5748071 5821586
5038 5821586 5920151 6003564 6107567 6235469 6333823 6420163 6562122 6712849 6836562 7029458
5028 7029458 7193120 7353849 7547814 7755972 7996513 8252180 8543709 8860150 9170478 9497677
5018 9497677 9860551 10285656 10758494 11262666 11768799 12310749 12932665 13620905 14300495 14964467
5008 14964467 15690136 16476137 17211518 17969915 18736266 19422643 20098712 20741906 21344679
4999 21344679 21930039 22491383 23101972 23672446 24250997 24823327 25399480 25917538 26503244
4990 26503244 27162486 27927674 28765892 29715520 30745144 31813185 32977250 34230666 35554339
4981 35554339 36856737 38134273 39361167 40556941 41628363 42630177 43524841 44286820
4973D4286820P34994N28630L08259N2572j47519l61055m35705m03534l41799k51964
4963D3969699j75122j14225j37824r8936q9207J2319P8137J26309K38574L47757
4953D4157481L76195K92506K65279J38972o175j18344k54725m47089o71370p64717
4943D2968013q46571r51141r97726j033550j140000j201332j290576j290107j342857
4934C2874153j283028j193360j072703r74952p93217o40929n78870m77305l51380
4925B5508409k56574k08369j48595j41268r7549K3175J9301P3132J19803K10828
4915B5102293K60269L37190M21394M40187N09817N68794O75030P15859P69956
4906B9800789Q61104R89222J142759J241382J468724J703414J918725K210994
$$ plain form
4973 44286820 45021814 45550444 45858703 45911275 45763756 45402701 44966996 44563462 44221663 43969699
4963 43969699 43794577 43680352 43542528 43443592 43354385 43366704 43444841 43571150 43809724 44157481
4953 44157481 44533676 44826182 45091461 45230433 45224258 45105914 44851189 44404100 43732730 42968013
4943 42968013 42121442 41170301 40172575 39139025 37999025 36797693 35507117 34217010 32874153
4934 32874153 31591125 30397765 29325062 28350110 27556893 26915964 26337094 25859789 25508409
4925 25508409 25251835 25043466 24894871 24753603 24656054 24679229 24698530 24771662 24891465 25102293
4915 25102293 25362562 25699752 26121146 26561333 27071150 27639944 28314974 29030833 29800789
4906 29800789 30661893 31651115 32793874 34035256 35503980 37207394 39126119 41337113
4898D1337113K514651K693154K884300K977732K931679K827451K500367J991071
4890F2657518J213726M33183k94205q76534j382869j880436k150968k164859k015233
4881E3539323j746518j417611j138906q09864m73502k29433Q1341M61865R05684
4872D9172379J219635J335729J498236J594476J455547J108705M58653l64736
4864E7478624r61129j414018j779304j852453j759122j600073j522528j457712
4856D5132285j526807j615345j647658j536457j457643j362799j138491r67296
4848C3879789q33399p10698n86036m73917m51212l63961k87709l56722m74075
4839B9342060n55915n47325n79202n73339o31052o65401p56318q37830q91447
$$ plain form
4898 41337113 43851764 46544918 49429218 52406950 55338629 58166080 60666447 62657518
4890 62657518 63871244 64304427 64010222 63133688 61750819 59870383 57719415 55554556 53539323
4881 53539323 51792805 50375194 49236288 48426424 47952922 47723489 47804830 48266695 49172379
4872 49172379 50392014 51727743 53225979 54820455 56276002 57384707 57843360 57478624
4864 57478624 56517495 55103477 53324173 51471720 49712598 48112525 46589997 45132285
4856 45132285 43605478 41990133 40342475 38806018 37348375 35985576 34847085 33879789
4848 33879789 33046390 32335692 31749656 31275739 30824527 30460566 30172857 29816135 29342060
4839 29342060 28786145 28238820 27659618 27086279 26455227 25789826 25033508 24195678 23304231
4830B3304231r04137q96730q82891q19046p38034p42741o77648o78809o80525
4821A6283670o19759n54903n08848m88559m92666m29504l70041l76281k93627
4812A2149482l23630k61047k33925j82920k03828j40804j27183j21635p3664q6683
4802A0394163j13027q8226k5552o5342q1221l9503k7543m3000o5529r1196m5120
4791I708904m6657j16444j33231r6458o3264o6000q1946o3351j8757m2160m7332
4780H933304l86K5125K0766M298R63J7747J9989N3984M9709k3954K6323J4200
4768I142068P529j470k4884k7472j1812o1477m2948k5849m6517j0661j1850j871
4756H882786l609j9453N6198J2744p106K9597j1356N5726K2648m2498k8630o26
$$ plain form
4830 23304231 22400094 21503364 20620473 19801427 19063393 18320652 17643004 16964195 16283670
4821 16283670 15663911 15109008 14600160 14111601 13618935 13189431 12819390 12443109 12149482
4812 12149482 11825852 11564805 11330880 11147960 10944132 10803328 10676145 10554510 10480846 10394163
4802 10394163 10281136 10192910 10167358 10102016 10020795 9981292 9953749 9910749 9845220 9754024 9708904
4791 9708904 9662247 9545803 9412572 9316114 9252850 9186850 9104904 9041553 9022796 8980636 8933304
4780 8933304 8932918 8958043 8978809 8983107 8984070 9001817 9021806 9075790 9125499 9101545 9127868 9142068
4768 9142068 9149597 9148127 9123243 9095771 9083959 9022482 8979534 8953685 8907168 8896507 8884657 8882786
4756 8882786 8879177 8859724 8915922 8928666 8921560 8951157 8939801 8995527 9018175 8975677 8947047 8946421
4744H946421k1126l1594m7742k3152n4119j4994q345j1015O515J4932m7471J5063
4732H723373O1593O6705K9522N9719Q2780M2950L8783M3736R141J8318k4086o9049
4720I083485J9481n3885l5598N826L9276L8234P6451M8492J08999J10443J17089
4709I558293J14376J66200J54851J36470K28019K72495K50200K57574K69621L42069
4699A1750168L22755L64316M33415M94983N16499M85588N25436N44259N42183
4690A5979602N89791O43368O92814Q21589R88004J192370J522796J634503J651792
4681B5716629J560663J440670J485611J329098N55421l06442m60194m48476n43043
4672C0329937m76752k78637k1068L15263N71875P26605P33155P27835Q09811Q98666
$$ plain form
4744 8946421 8925295 8893701 8845959 8822807 8768688 8753694 8745349 8734334 8740849 8755781 8708310 8723373
4732 8723373 8784966 8851671 8881193 8940912 9023692 9066642 9105425 9149161 9158302 9176620 9152534 9083485
4720 9083485 9102966 9049081 9013483 9019309 9058585 9096819 9173270 9221762 9330761 9441204 9558293
4709 9558293 9672669 9838869 9993720 10130190 10358209 10630704 10880904 11138478 11408099 11750168
4699 11750168 12072923 12437239 12870654 13365637 13882136 14367724 14893160 15437419 15979602
4690 15979602 16569393 17212761 17905575 18727164 19715168 20907538 22430334 24064837 25716629
4681 25716629 27277292 28717962 30203573 31532671 32088092 31781650 31321456 30872980 30329937
4672 30329937 29853185 29574548 29553480 29868743 30440618 31167223 31900378 32628213 33438024 34336690
4662C4336690J047018J283349J517596J731317J650455J611611J674962J881393
4654D6734391K226887K645904K975603L449556L965408M658097N655115P076738
4646G9387699R000558J1220971J3181824J4296619J4173063J3566703J2347882
4639A67175319R714662L791374m080040r658961j2447098j2816856j1770106r907386
4631A20000908p867705o261547n572000n584967n411445n099670m751118m505528
4623G4946928m344815m155772l991835l697162l188293k658732k209173j823945
4615D8877201j563066j432514j383295j356251j445592j624955j725998j738692
4607C6606838j740165j625136j494236j382133j243807j149701j128843j045407
$$ plain form
4662 34336690 35383708 36667057 38184653 39915970 41566425 43178036 44852998 46734391
4654 46734391 48961278 51607182 54582785 58032341 61997749 66655846 72310961 79387699
4646 79387699 88388257 99609228 112791052 127087671 141260734 154827437 167175319
4639 167175319 176889981 180681355 176601315 166942354 154495256 141678400 129908294 120000908
4631 120000908 112133203 105871656 100299656 94714689 89303244 84203574 79452456 74946928
4623 74946928 70602113 66446341 62454506 58757344 55569051 52910319 50701146 48877201
4615 48877201 47314135 45881621 44498326 43142075 41696483 40071528 38345530 36606838
4607 36606838 34866673 33241537 31747301 30365168 29121361 27971660 26842817 25797410
4599B5797410j001200r37210r30764r31647r43484q80285r00266q05714p05764
4590A7761076o37571n69224n43297m87499m52753l98354l57768l65853k95186
4581A3653571k60516k47347k32272j66352j89016j82903j49103j77195j54667
4572A1894200j45174q9044j08765j26047j19562n7039n7878p8462n8486m8748
4562A1004995o1610r1328j36025r6823j28139j01440r9714p1501l5154l7220j2538
4551A0133503P8714O9732R0950J61611J41921J43642J28793M8800J6726j8018
4541A0996374p9678q7558j48786j36482q5635m7541J9104L2431Q2537R8411J09242
4530A0752419J08579J44830J33340J26377J56866K06075K22510K74519L41071
$$ plain form
4599 25797410 24796210 23859000 22928236 21996589 21053105 20172820 19272554 18466840 17761076
4590 17761076 17123505 16554281 16010984 15523485 15070732 14672378 14314610 13948757 13653571
4581 13653571 13393055 13145708 12913436 12747084 12558068 12375165 12226062 12048867 11894200
4572 11894200 11749026 11659982 11551217 11425170 11305608 11248569 11190691 11112229 11053743 11004995
4562 11004995 10943385 10852057 10716032 10619209 10491070 10389630 10289916 10218415 10183261 10146041 10133503
4551 10133503 10212217 10281949 10372899 10534510 10676431 10820073 10948866 10997666 11014392 10996374
4541 10996374 10916696 10829138 10680352 10543870 10458235 10410694 10429798 10462229 10544766 10643177 10752419
4530 10752419 10860998 11005828 11139168 11265545 11422411 11628486 11850996 12125515 12466586
4521A2466586L63489M00078N07376N51968N81398O16804N65136N70826N06510
4512A7130171L75759J99889j05103l62996m71688n54474n03409m15230k63818
4503A5029101j92872j71521n4594n6527q2473p1766r7542k09071k74995k68643
4493A3549097k44083k92964k32409k93923m59397m60878n10609m65433m72937
4484A0116464m28629l58412l20088k93102k53167k73926k20662j72395j89148
4475G606935j48825j78166j53865j23455j33215j37329j02224j16457r5450n4670
4465F363279m8340q5587o3797o6743m9326j9995r0958q602J2415k0100k0284r615
4453E892347Q430L8865K2438L5210L0846O4556J18741J37954J80926J94417J92791
$$ plain form
4521 12466586 12830075 13230153 13737529 14289497 14870895 15487699 16052835 16623661 17130171
4512 17130171 17505930 17705819 17600716 17237720 16766032 16211558 15708149 15292919 15029101
4503 15029101 14836229 14664708 14610114 14553587 14471114 14399348 14301806 14092735 13817740 13549097
4493 13549097 13305014 13012050 12779641 12485718 12026321 11565443 11054834 10589401 10116464
4484 10116464 9687835 9329423 9009335 8716233 8463066 8189140 7968478 7796083 7606935
4475 7606935 7458110 7279944 7126079 7002624 6869409 6732080 6629856 6513399 6417949 6363279
4465 6363279 6314939 6229352 6165555 6098812 6049486 6029491 5938533 5929931 5942346 5922246 5901962 5892347
4453 5892347 5900777 5939642 5962080 5997290 6028136 6092692 6211433 6349387 6530313 6724730 6917521
4442F917521K24465K21343J61617L2092o3248k18683k61353k84127k31788j97697
4432F300142j96337j07419r9689j43855j00175j04743j00559j01523j09610p9927
4422E156305j00616j10615j16410o3329m7787m6831m4624m3331q2145o7035k2872
4411D410710m6407q3977r2273n9901n4383o1578l3233n4291m3410j2337l3514
4400C835406n0259m5818J0243j2700m1198m7538l5137j0786k0315K833m1075L0693
4388C574349N653K6026N292J3053R347J1564P659L972n6802k3858j3136O213n0566
4375C518766l3701J8815p124j2671J816j081j4533K408k533K3428L753k6j8887
4362C478430o968n1719m1161p422j1063l2250m0188N880J1134n957K765j0210
$$ plain form
4442 6917521 7141986 7363329 7524946 7557038 7493790 7275107 7013754 6729627 6497839 6300142
4432 6300142 6103805 5996386 5896697 5752842 5652667 5547924 5447365 5345842 5236232 5156305
4422 5156305 5055689 4945074 4828664 4765335 4717548 4670717 4626093 4582762 4500617 4433582 4410710
4411 4410710 4364303 4280326 4188053 4128152 4073769 4012191 3978958 3924667 3881257 3868920 3835406
4400 3835406 3785147 3739329 3749572 3736872 3695674 3648136 3612999 3602213 3581898 3584731 3543656 3574349
4388 3574349 3580002 3606028 3611320 3624373 3633720 3645284 3652943 3656915 3600113 3576255 3563119 3569332 3518766
4375 3518766 3485065 3503880 3496756 3484085 3485901 3484820 3470287 3472695 3470162 3493590 3497343 3497317 3478430
4362 3478430 3471462 3419743 3378582 3371160 3360097 3327847 3287659 3293539 3304673 3298716 3301481 3291271
4350C291271M521J1256M5421j4049k517p819L9591L9261M2327M7114M6148P2299
4338C614824O0355K6607L7846N5083j769j5404n9161p2185o8135p6924p2495n4094
4326C374548j7586j8875k4911j4110m0411j8109L889l2393l2849n6791k5556j9653
4314C077193l3463p379m023l8289j8716J8129j4189p810j775j815P717N587m5448
4301B935719k9904j7104l362M860j667l0877j3764k5141k0684l4091J4231l065
4289B775151r086N4367n368L3791m524K4125P818k9036j2943p296J8261J8106
4277B863366K6892K6574Q568K1056N540M7023K3380p170p872j4355o051k5554
4265B961397j6687l9542j6688Q171n4332m4699J08n2854l8126J8327L321l2572
$$ plain form
4350 3291271 3295792 3307048 3352469 3338420 3335903 3328084 3367675 3406936 3449263 3496377 3542525 3614824
4338 3614824 3675179 3701786 3739632 3794715 3792946 3777542 3718381 3646196 3578061 3501137 3428642 3374548
4326 3374548 3356962 3338087 3313176 3299066 3258655 3240546 3244435 3212042 3179193 3122402 3096846 3077193
4314 3077193 3043730 3036351 3032328 2994039 2975323 2993452 2979263 2971453 2969678 2967863 2975580 2981167 2935719
4301 2935719 2905815 2888711 2885349 2890209 2888542 2857665 2843901 2818760 2798076 2763985 2778216 2775151
4289 2775151 2766065 2820432 2815064 2848855 2844331 2868456 2876274 2847238 2834295 2826999 2845260 2863366
4277 2863366 2890258 2916832 2925400 2946456 2951996 2999019 3022399 3015229 3007357 2993002 2986951 2961397
4265 2961397 2944710 2905168 2888480 2896651 2842319 2797620 2797728 2744874 2706748 2725075 2728396 2695824
4253B695824M10J6398j9019k1595Q080M714j4016j2756k8866o282L3491k304o16
4240B653463R98j0326j5990k18l47o846J3935r470N761k6233j3958K8716M262
4227B623747J0871j0625j1287N79j820M4106o629k8973L5723L7364J3025R008
4215B715089J6934R976O938J9990O2862j3134J2194J9892l609K9365L9492J1580
4203B927569M4120k8121Q658k2866J2508J4710o986M2167l25m19N349J7918J3119
4190C027401L4474J6341K7155M244M2123K5041Q6911m082j4144L3943N2309L1181
4178C362897J2385m0154k848M2084L3572j522J4820N6875N7977L5785P965K6625
4166C606461P002M3816M2945K0814J5245M1500L9253L1016N2827O4002J5152K7691
$$ plain form
4253 2695824 2696234 2712632 2693613 2672018 2680098 2684812 2670796 2658040 2629174 2622892 2656383 2654079 2653463
4240 2653463 2654461 2644135 2628145 2627927 2627580 2620734 2634669 2625199 2630960 2604727 2590769 2619485 2623747
4227 2623747 2634618 2623993 2612706 2613285 2611465 2655571 2648942 2619969 2655692 2693056 2706081 2715089
4215 2715089 2732023 2741999 2748937 2768927 2831789 2818655 2830849 2850741 2847132 2876497 2915989 2927569
4203 2927569 2971689 2943568 2952226 2929360 2941868 2956578 2949592 2991759 2991434 2991015 2996364 3014282 3027401
4190 3027401 3061875 3078216 3105371 3109615 3151738 3176779 3263690 3259608 3245464 3279407 3331716 3362897
4178 3362897 3375282 3335128 3332280 3374364 3407936 3406414 3421234 3478109 3536086 3571871 3579836 3606461
4166 3606461 3613463 3657279 3700224 3721038 3736283 3777783 3817036 3848052 3900879 3964881 3980033 4007724
4154D007724Q63L5085M3473M4415j6257j0012M4187N9899J00033M2985m6L3921
4142D386270N8088j1238J1220K2784M4505L0183J5124M6518l477q267K205O634
4130D600549K8056M2709L3852n004Q058M1293O6582K9523L4719M2416L4691J5276
4118D972720q430M9662J5034r384J5319R220K3662K2246L6908P3593L7680K3868
4106E262098M1403O2050J763J4798J3521j7025J9370K5871J4606Q855N0327K2806
4094E520443O3275L6109p666m904K4764L586J9981M8917J1201J8945L0558J971
4082E767180J7146j3171k2807L0348J7748k9820M096L6740P729K3104J4554M7976
4070E900823J8909n882N2440O0446N306K1895J5960o630J7079P440M3991O1268
$$ plain form
4154 4007724 4008587 4043672 4087145 4131560 4115303 4105291 4149478 4209377 4309410 4352395 4352349 4386270
4142 4386270 4444358 4433120 4444340 4467124 4511629 4541812 4556936 4603454 4599977 4591710 4593915 4600549
4130 4600549 4628605 4671314 4705166 4700162 4708220 4749513 4816095 4845618 4880337 4922753 4957444 4972720
4118 4972720 4964290 5013952 5028986 5019602 5034921 5044141 5067803 5090049 5126957 5200550 5238230 5262098
4106 5262098 5303501 5365551 5367314 5382112 5395633 5378608 5397978 5423849 5438455 5447310 5497637 5520443
4094 5520443 5583718 5619827 5612161 5607257 5632021 5635607 5655588 5704505 5715706 5734651 5765209 5767180
4082 5767180 5784326 5771155 5748348 5778696 5796444 5766624 5770720 5807460 5815189 5838293 5852847 5900823
4070 5900823 5919732 5913850 5966290 6026736 6032042 6053937 6069897 6063267 6080346 6087786 6131777 6193045
4058F193045J9779O0476O1253L2609K8790M2791K9978O6867L7532N4959P1912
4047F699991J19614P0981N0939R3074J02676J38190J01012J29117J15449J51727
4037G772770J20254J42954J46040L4862M2149K0898K3470j5423N8251O0223Q6819
4026H493267J20630J54802J25984J45891J39746R6920Q9390O6081P7851L314K5527
4015I539403N2572P9738J01784J71468K04898K33683K55797K63494K52824K39955
4005A1395616J71647M2418j72642k62551k12577j38664q0583j8461J390J1695
3995A0737288L6185K7736K7361L1750O147K8869k5222l6687p4757q7292p6714
3984A0594664m3781l0502p425L9969Q3455P2139Q0572J16636M6660L8248M1696
$$ plain form
4058 6193045 6212824 6273300 6334553 6367162 6395952 6438743 6468721 6535588 6573120 6628079 6699991
4047 6699991 6819605 6890586 6941525 7034599 7137275 7275465 7376477 7505594 7621043 7772770
4037 7772770 7893024 8035978 8182018 8216880 8259029 8279927 8303397 8287974 8346225 8406448 8493267
4026 8493267 8613897 8768699 8894683 9040574 9180320 9277240 9366630 9432711 9510562 9513876 9539403
4015 9539403 9591975 9671713 9773497 9944965 10149863 10383546 10639343 10902837 11155661 11395616
4005 11395616 11567263 11609681 11437039 11174488 10961911 10823247 10742664 10724203 10725593 10737288
3995 10737288 10773473 10801209 10828570 10860320 10866467 10895336 10870114 10833427 10758670 10671378 10594664
3984 10594664 10550883 10520381 10512956 10552925 10636380 10708519 10789091 10905727 10952387 10990635 11032331
3973A1032331m3889q6045q6717N370m0178k8130J8988J1288K82R381O7253J631
3961A0861565K4488O3545L1831p554K7253K9335O7051R3805Q7596L4550M5143
3950A1358608J08112Q2903J18358Q2194Q2998J02414R2687J62947J09359J06921
3940A2407501J11272J11612J05348J54994J51178J18044R0989J36221J39111J13254
3930A3639524J21654J42261J35999J37809J14930R9128J08387J20748J15518J00587
3920A4836545J01753J18835R0986J34064Q9012O5552J40619Q7917R3995J02848
3910A5862126N8767Q2633J14698R2860N4618J5200O6954O7345Q5306L9613N8510
3899A6598630N5638M0911L3796M5596L7847L3720K9140O2707N1795L5003L0865
$$ plain form
3973 11032331 10988442 10902397 10815680 10821050 10780872 10752742 10771730 10783018 10783300 10792681 10859934 10861565
3961 10861565 10886053 10949598 10981429 10973875 11001128 11030463 11097514 11191319 11278915 11313465 11358608
3950 11358608 11466720 11549623 11667981 11750175 11833173 11935587 12028274 12191221 12300580 12407501
3940 12407501 12518773 12630385 12735733 12890727 13041905 13159949 13250938 13387159 13526270 13639524
3930 13639524 13761178 13903439 14039438 14177247 14292177 14391305 14499692 14620440 14735958 14836545
3920 14836545 14938298 15057133 15148119 15282183 15371195 15436747 15577366 15665283 15759278 15862126
3910 15862126 15920893 16003526 16118224 16211084 16265702 16280902 16347856 16415201 16500507 16540120 16598630
3899 16598630 16654268 16695179 16728975 16774571 16812418 16846138 16875278 16937985 16989780 17024783 17055648
3888A7055648K6874L5992J3138P602L7575M6606J1995M2698N5252M4422K1942
3877A7399744M1088J5043N8535O3314O7312N0186K1249K7480P1638O7135M8915
3866A7931639M2164O8046P4318M5107J9885K5535L7377J4428M3869m97q880M7524
3854A8340515K985J8621J28l8998n1732n4683k2799o6430n7040n9357o7864m9111
3842A7894235k9806o6844p3619o4665l8172p6588j4882n8498p2333m6336k6966
3831A7325526n6127o5194l7382l6405n2416n9634r939n4313n0052m402K6727k5086
3819A6901303L766N808j5461Q641J5377R694N982O532j2993K7083M8261L5565
3807A7039558K3825L0112M8644J9534K1455P570N3045L7913O3014M8686P207M6674
$$ plain form
3888 17055648 17082522 17118514 17131652 17139254 17176829 17223435 17235430 17278128 17333380 17377802 17399744
3877 17399744 17440832 17455875 17514410 17577724 17645036 17695222 17716471 17743951 17815589 17882724 17931639
3866 17931639 17973803 18041849 18116167 18161274 18181159 18206694 18244071 18258499 18302368 18301871 18292991 18340515
3854 18340515 18343500 18362121 18362249 18323251 18271519 18216836 18194037 18127607 18070567 18011210 17943346 17894235
3842 17894235 17864429 17797585 17723966 17659301 17621129 17544541 17529659 17471161 17398828 17352492 17325526
3831 17325526 17269399 17204205 17166823 17130418 17078002 17018368 17008429 16954116 16904064 16899662 16926389 16901303
3819 16901303 16905069 16910877 16895416 16904057 16919434 16929128 16935110 16941642 16928649 16955732 17003993 17039558
3807 17039558 17063383 17093495 17142139 17161673 17183128 17190698 17243743 17281656 17344670 17393356 17400563 17447237
3795A7447237L2214k466O8383Q1301L1370Q2930O1143j5937Q1092M6156N3268
3784A7966691J14877O9642Q2707O1477L4163P9021M5812M8620Q1486O2635J05878
3773A8753009R5559J19113P8922P6109J18118R8965R1608J02504J17296J40942
3763A9792145J20822J11084J06411J17991R7640P9751J04843J10672O1859L1532
3753B0734750O1068P0752M7522J8135K2487o093M4556P9105L4581N7052L1966
3742B1195881L4133O0082N4592Q2040P3962O4799P4499P7802O3073M7185M7998
3731B1876046J02556N5109O506P4305K5558M0185J8179L741l940m11j4624o1421
3719B2121789l4917m4733l902K0614j6531k2124m78N9140K6856k88J0590O2586
$$ plain form
3795 17447237 17479451 17476985 17545368 17626669 17658039 17740969 17802112 17786175 17867267 17913423 17966691
3784 17966691 18081568 18151210 18233917 18295394 18329557 18408578 18454390 18503010 18584496 18647131 18753009
3773 18753009 18848568 18967681 19046603 19122712 19240830 19339795 19431403 19533907 19651203 19792145
3763 19792145 19912967 20024051 20130462 20248453 20346093 20425844 20530687 20641359 20703218 20734750
3753 20734750 20795818 20866570 20914092 20932227 20954714 20948621 20993177 21072282 21106863 21163915 21195881
3742 21195881 21230014 21290096 21344688 21426728 21500690 21565489 21639988 21717790 21780863 21828048 21876046
3731 21876046 21978602 22033711 22040217 22114522 22140080 22180265 22198444 22202185 22198245 22197834 22183210 22121789
3719 22121789 22086872 22042139 22038237 22058851 22042320 22020196 22019718 22078858 22105714 22105426 22116016 22178602
3707B2178602O3145L2354N4901L6946O2016P7469Q2118M7395O6975O0548M6725
3696B2809194N2702L1175M8906J481K1400k5546p106J9601l0918J3255L3727K5837
3684B2993708J2314J6266N3639L2887M0496K4709M0738M5636O8939O4905K8253
3673B3422490O5711R5832R0927P0111P3898O6787O0593P4432N8407O8767R2010
3662B4239965L9881J0053K1648N7898L8531P8811P1068P2859O5032J13001J02314
3651B4911061J07192J28732J07523R8350J30026J36919J49125J50389J57870J78631
3641B6255818J77263J65135K02447J81128K22954K12696J81321J94925K22610
3632B8016297K40918K24288J98367J86374K88582K34646K29342K54570K11258
$$ plain form
3707 22178602 22241747 22274101 22329002 22365948 22427964 22505433 22587551 22634946 22701921 22762469 22809194
3696 22809194 22861896 22893071 22941977 22943458 22964858 22939312 22932206 22951807 22920889 22934144 22967871 22993708
3684 22993708 23006022 23022288 23075927 23108814 23149310 23174019 23214757 23260393 23329332 23394237 23422490
3673 23422490 23488201 23584033 23674960 23745071 23818969 23885756 23946349 24020781 24079188 24147955 24239965
3662 24239965 24279846 24289899 24311547 24369445 24407976 24486787 24557855 24630714 24695746 24808747 24911061
3651 24911061 25018253 25146985 25254508 25352858 25482884 25619803 25768928 25919317 26077187 26255818
3641 26255818 26433081 26598216 26800663 26981791 27204745 27417441 27598762 27793687 28016297
3632 28016297 28257215 28481503 28679870 28866244 29154826 29389472 29618814 29873384 30084642
3623C0084642K01376K32364K23174K24851K24912K46039J88941K54101K54544
3614C2134944J97640K47427K29582K47000K86523K56529K57700K73996K75677
3605C4407018L16488K88069L00753L10803L34922L06437L01558L42129L49425
3596C7257602L52102L47133L11605L69618L61058L82471L51647L82010M11740
3587D0526986M04809M42811M23665M66201M60133M75866M77445N27653O03060
3578D4808629O22202N77546N86608N80075O27108O61090O43924P02028P08118
3569E0517328O66413P60360P62540P81506Q43890Q70513Q73536Q59810Q83245
3560E7819141R23242R54253R78048J042519J023476J026962J112461J181293J182724
$$ plain form
3623 30084642 30286018 30518382 30741556 30966407 31191319 31437358 31626299 31880400 32134944
3614 32134944 32332584 32580011 32809593 33056593 33343116 33599645 33857345 34131341 34407018
3605 34407018 34723506 35011575 35312328 35623131 35958053 36264490 36566048 36908177 37257602
3596 37257602 37609704 37956837 38268442 38638060 38999118 39381589 39733236 40115246 40526986
3587 40526986 40931795 41374606 41798271 42264472 42724605 43200471 43677916 44205569 44808629
3578 44808629 45430831 46008377 46594985 47175060 47802168 48463258 49107182 49809210 50517328
3569 50517328 51183741 51944101 52706641 53488147 54332037 55202550 56076086 56935896 57819141
3560 57819141 58742383 59696636 60674684 61717203 62740679 63767641 64880102 66061395 67244119
3551F7244119J197456J260082J293694J323915J315319J380976J434289J433826
3543G7883676J416710J466492J529011J531359J541516J527610J561071J651591
3535I0109036J671560J716081J789477J886342J998873K090213K159058K234083
3527A05654723K325910K441410K545779K673661K815487K900333L073743L241975
3519A27673021L380538L550726L712126L900595M085013M303472M519980M784086
3511A59909557N024841N398563N897633O343221O892375P469366Q089187Q726529
3503B13751272R337707J0008234J0658580J1247830J1772327J1994102J2100493
3496B90870545J1816617J1060301R788669P984984N622966K828741j46865l003769
$$ plain form
3551 67244119 68441575 69701657 70995351 72319266 73634585 75015561 76449850 77883676
3543 77883676 79300386 80766878 82295889 83827248 85368764 86896374 88457445 90109036
3535 90109036 91780596 93496677 95286154 97172496 99171369 101261582 103420640 105654723
3527 105654723 107980633 110422043 112967822 115641483 118456970 121357303 124431046 127673021
3519 127673021 131053559 134604285 138316411 142217006 146302019 150605491 155125471 159909557
3511 159909557 164934398 170332961 176230594 182573815 189466190 196935556 205024743 213751272
3503 213751272 223088979 233097213 243755793 255003623 266775950 278770052 290870545
3496 290870545 302687162 313747463 323536132 331521116 337144082 339972823 339825958 336822189
3488C36822189n339903o933815p749739q096251q054188p876641p736655p521488
3480B77513509p306733p128826o904478o666818o483802o273395o048205n796051
3472B24905201n524323n209654m967589m743714m492673m324739m137384l980678
3464A87524447l854728l813693l748282l699270l658665l578648l497339l478079
3456A58195743l403295l322217l275083l207481l112616l083284k996145k886219
3448A32909403k882765k810961k682355k611503k541721k404093k316951k203459
3440A12455595k113895k025151j904276j831492j742350j645414j560302j494054
3432I8138661j458313j402233j372639j300343j222837j159453j092258j054089
$$ plain form
3488 336822189 331482286 324548471 316798732 308702481 300648293 292771652 285034997 277513509
3480 277513509 270206776 263077950 256173472 249506654 243022852 236749457 230701252 224905201
3472 224905201 219380878 214171224 209203635 204459921 199967248 195642509 191505125 187524447
3464 187524447 183669719 179856026 176107744 172408474 168749809 165171161 161673822 158195743
3456 158195743 154792448 151470231 148195148 144987667 141875051 138791767 135795622 132909403
3448 132909403 130026638 127215677 124533322 121921819 119380098 116976005 114659054 112455595
3440 112455595 110341700 108316549 106412273 104580781 102838431 101193017 99632715 98138661
3432 98138661 96680348 95278115 93905476 92605133 91382296 90222843 89130585 88076496
3424H8076496j001215q46277q23287p96913p21138p17882p35078p86146q02097
3415H0846463q04810q73876q55433q79449q94319p55291p24768p31997o69953
3406G3656567o43126n87252n91794n76987n18039n45145n38641n46117n78531
3397F8530935n16718m92071m84646m97343m87777l94622l58186l10268k84283
3388F4705021k42336l03458k79178l25326l64750n10497o76044o75412o88462
3379F0639558p07038o54701o36668n91381n28550m85331m68651n07985m67370
3370E5591883m47316m57307m69401m74077m32085m45336m17777l74283l78656
3361E1695645l51152l52734k63096k22574k17809k07564k20440k04849k30793
$$ plain form
3424 88076496 87075281 86229004 85405717 84608804 83887666 83169784 82434706 81648560 80846463
3415 80846463 80041653 79167777 78312344 77432895 76538576 75783285 75058517 74326520 73656567
3406 73656567 73013441 72426189 71834395 71257408 70739369 70194224 69655583 69109466 68530935
3397 68530935 68014217 67522146 67037500 66540157 66052380 65657758 65299572 64989304 64705021
3388 64705021 64462685 64159227 63880049 63554723 63189973 62679476 62003432 61328020 60639558
3379 60639558 59932520 59277819 58641151 58049770 57521220 57035889 56567238 56059253 55591883
3370 55591883 55144567 54687260 54217859 53743782 53311697 52866361 52448584 52074301 51695645
3361 51695645 51344493 50991759 50728663 50506089 50288280 50080716 49860276 49655427 49424634
3352D9424634k25693k82447l65970l52609l35177l03610l05890l13448k51410
3343D6688380k50082k58024k45764k25521k54672k49783j96645k16994k06351
3334D4584544k32948k43283k19438k02525k27439k33946k20395k23093k53061
3325D2528416k74151k71743k52864k78520k61601l00343k65912k36669k87023
3316D0099590k92813k50353k61708k61607k80827k71103k47296k63500k32503
3307C7737880k26467k32980k45342k07940k21492k21270k17742k10722k30656
3298C5723269k13282k27724k80018k46273k70715k89366l11734k81187k89996
3289C3312974k77471l02062l06072k72790l04298k90879k54068k26879k38258
$$ plain form
3352 49424634 49198941 48916494 48550524 48197915 47862738 47559128 47253238 46939790 46688380
3343 46688380 46438298 46180274 45934510 45708989 45454317 45204534 45007889 44790895 44584544
3334 44584544 44351596 44108313 43888875 43686350 43458911 43224965 43004570 42781477 42528416
3325 42528416 42254265 41982522 41729658 41451138 41189537 40889194 40623282 40386613 40099590
3316 40099590 39806777 39556424 39294716 39033109 38752282 38481179 38233883 37970383 37737880
3307 37737880 37511413 37278433 37033091 36825151 36603659 36382389 36164647 35953925 35723269
3298 35723269 35509987 35282263 35002245 34755972 34485257 34195891 33884157 33602970 33312974
3289 33312974 33035503 32733441 32427369 32154579 31850281 31559402 31305334 31078455 30840197
3280C0840197k10231k26867j80382j37868j78151j62158j74305j68366j15695
3271B9286174j02797j02917r3514q2798p8580m2632l5089j4873k8081j7967j4342
3260B8672584m5765m1585p2377l5233o530k5020j3881j1938K6240L6074M5782
3249B8528351Q5581M5986O0611J21924J79381J61445J50653J40034J64699J90024
3239B9828689J58418J99593J96366J82233J92351K57747K36922K68517L10323
3230C1831159L56614L07770L40490L65903L65816L57288L13255L42927K58346
3221C4839568K12070K68756K30921K73757L04319L51909L70770L72868M46656
3212C7671594M26092L89301L94118M36599M37306M64825M97479N24062N84003
$$ plain form
3280 30840197 30629966 30403099 30222717 30084849 29906698 29744540 29570235 29401869 29286174
3271 29286174 29183377 29080460 28986946 28904148 28825568 28782936 28747847 28732974 28704893 28686926 28672584
3260 28672584 28626819 28585234 28512857 28477624 28471094 28446074 28432193 28420255 28446495 28482569 28528351
3249 28528351 28613932 28659918 28720529 28842453 29021834 29183279 29333932 29473966 29638665 29828689
3239 29828689 29987107 30186700 30383066 30565299 30757650 31015397 31252319 31520836 31831159
3230 31831159 32187773 32495543 32836033 33201936 33567752 33925040 34238295 34581222 34839568
3221 34839568 35051638 35320394 35551315 35825072 36129391 36481300 36852070 37224938 37671594
3212 37671594 38097686 38486987 38881105 39317704 39755010 40219835 40717314 41241376 41825379
3203D1825379O49133P23539P52444P85988Q29160Q61524Q85533R69844R76442
3194D9258986J037881J076417J124802J233173J303876J381359J445595J569043
3186E9431132J694688J749929J782722J845101J854910J841780J839410J800577
3178G3840249J706444J579301J497060J384375J304218J362895J316880J340604
3170H5332026J407177J505967J547547J655164J824452K044315K255073K493030
3162A00064751K764414K979688L267290L532847L772476M002066M220124M448363
3154A29052019M508297M479728M102774L526956K835361J979594R29747k59552
3146A51154924j283008j729167j689764j375445r48255m91635j58736K47131N85964
$$ plain form
3203 41825379 42474512 43198051 43950495 44736483 45565643 46427167 47312700 48282544 49258986
3194 49258986 50296867 51373284 52498086 53731259 55035135 56416494 57862089 59431132
3186 59431132 61125820 62875749 64658471 66503572 68358482 70200262 72039672 73840249
3178 73840249 75546693 77125994 78623054 80007429 81311647 82674542 83991422 85332026
3170 85332026 86739203 88245170 89792717 91447881 93272333 95316648 97571721 100064751
3162 100064751 102829165 105808853 109076143 112608990 116381466 120383532 124603656 129052019
3154 129052019 133560316 138040044 142142818 145669774 148505135 150484729 151414476 151154924
3146 151154924 149871916 148142749 146452985 145077540 144129285 143637650 143478914 143726045 144312009
3137A44312009Q33785J084421J323165J532007J718668J830526J871161J999705
3129A56505447J985580J849998J713093J414765R73859M38821r8675p52259j284398
3120A62746231j633346j973807k329964k775511l097608l249721l136204k844692
3112A41705378k470021k155654j888402j686369j419850j233815j101182j026505
3104A28723580r54995j129990j295845j491027j808581k017256k295437k601276
3096A15129173k913558l154396l323924l436507l446544l338645l245949l085181
3088H9184469k975402k870476k651066k579391k432099k270448k168873k055364
3080F9181350j918496j813390j687713j676746j564546j494478j451630j433181
$$ plain form
3137 144312009 145145794 146230215 147553380 149085387 150804055 152634581 154505742 156505447
3129 156505447 158491027 160341025 162054118 163468883 164442742 164881563 164782888 164030629 162746231
3120 162746231 161112885 159139078 156809114 154033603 150935995 147686274 144550070 141705378
3112 141705378 139235357 137079703 135191301 133504932 132085082 130851267 129750085 128723580
3104 128723580 127768585 126638595 125342750 123851723 122043142 120025886 117730449 115129173
3096 115129173 112215615 109061219 105737295 102300788 98854244 95515599 92269650 89184469
3088 89184469 86209067 83338591 80687525 78108134 75676035 73405587 71236714 69181350
3080 69181350 67262854 65449464 63761751 62085005 60520459 59025981 57574351 56141170
3072E6141170j379262j333412j355767j361408j289841j245259j218228j193900
3064D5764093j158909j106025j082448j003384r61153r21600r23363q85873q76003
3055C6845335q80138q24449q08530p89181p16504o69731o34784o19960o06237
3046C0295821n16376n00268n01431m14323m04840m39620m03611l38238l39443
3037B6437671l59220l62973l69463l67659l49787l51564l73638l74668l92307
3028B3136392l97181m12243m19119l89947l83587l59920l54270l55819l46960
3019A9717346l02398k67810k93578k36773k07585k08617j99475k02960k12535
3010A7585615k22085j70226j81734j58953k09181k05851k06723k38220k16244
$$ plain form
3072 56141170 54761908 53428496 52072729 50711321 49421480 48176221 46957993 45764093
3064 45764093 44605184 43499159 42416711 41413327 40452174 39530574 38607211 37721338 36845335
3055 36845335 35965197 35140748 34332218 33543037 32826533 32156802 31522018 30902058 30295821
3046 30295821 29779445 29279177 28777746 28363423 27958583 27518963 27115352 26777114 26437671
3037 26437671 26078451 25715478 25346015 24978356 24628569 24277005 23903367 23528699 23136392
3028 23136392 22739211 22326968 21907849 21517902 21134315 20774395 20420125 20064306 19717346
3019 19717346 19414948 19147138 18853560 18616787 18409202 18200585 18001110 17798150 17585615
3010 17585615 17363530 17193304 17011570 16852617 16643436 16437585 16230862 15992642 15776398
3001A5776398k30091k74275k09758k10093k44290j99192j93715k16635k09852
2992A3788497j99675k24429j82647j82520k08122k04083j71687j58647j53233
2983A2103454j60893j58942j52096j69896j26967j40780j35282j37647j33028
2974A0787923j10698j10607j32622j43807j24991r8520r7775j21901r6410r9013
2964I651579r4026q4138j17818j03328q9178l9908o4389j01925o7765l6660q4993
2953H767451o7380m1612n7032r6852p5580m2407o5628o9420p8578o3470j9533
2942H089959q6002n2846m7245o5375m6413p9462q9170m7111o5904l8922n7352
2931G414157m1298k5810p6445n6993k7405l1532q8134l8088m9511p0072m4514
$$ plain form
3001 15776398 15546307 15272032 15062274 14852181 14607891 14408699 14214984 13998349 13788497
2992 13788497 13588822 13364393 13181746 12999226 12791104 12587021 12415334 12256687 12103454
2983 12103454 11942561 11783619 11631523 11461627 11334660 11193880 11058598 10920951 10787923
2974 10787923 10677225 10566618 10433996 10290189 10165198 10066678 9968903 9847002 9750592 9651579
2964 9651579 9557553 9473415 9355597 9252269 9163091 9123183 9058794 8956869 8889104 8852444 8767451
2953 8767451 8700071 8658459 8601427 8504575 8428995 8386588 8320960 8251540 8172962 8109492 8089959
2942 8089959 8003957 7951111 7903866 7838491 7792078 7712616 7623446 7576335 7510431 7471509 7414157
2931 7414157 7372859 7347049 7270604 7213611 7186206 7154674 7066540 7028452 6978941 6908869 6864355
2920F864355l0010o8246m5475n9962k4093k5518k4864q0934o6654n0346j2926
2909F375327j845l4059o8041m3538r21j4380l9426m7106m7556l0773j5122k4143
2897F008417j3850k3727m0265k1324l9928k8586p821O545l7222n2496m7718m0333
2885E661692n261k5316l7647k7955R971l2049o6974J3468m555l6771K850k4586
2873E426867k5418K937N950j6925j6464l4659K7087n397k6616j1582n6258K4614
2861E294136n0399m0375o1995k3513l617k7811k8100k5074r739L498P66l8480
2849D989297l0707j1028j312k5937J6004l6381l1046l2774p457l402j3985k1184
2837D790088j7397n4832J2938m7989l0258l0650k2850m0322l6506N77o4826k2679
$$ plain form
2920 6864355 6834345 6766099 6720624 6660662 6636569 6611051 6586187 6505253 6438599 6388253 6375327
2909 6375327 6373482 6339423 6271382 6227844 6226923 6212543 6173117 6126011 6078455 6047682 6032560 6008417
2897 6008417 5994567 5970840 5930575 5909251 5869323 5840737 5832916 5839461 5802239 5749743 5702025 5661692
2885 5661692 5656431 5631115 5593468 5565513 5575484 5543435 5476461 5489929 5485374 5448603 5451453 5426867
2873 5426867 5401449 5404386 5410336 5393411 5376947 5342288 5369375 5363978 5337362 5325780 5269522 5294136
2861 5294136 5243737 5203362 5141367 5117854 5114237 5086426 5058326 5033252 5023513 5027011 5027777 4989297
2849 4989297 4958590 4947562 4946250 4920313 4936317 4899936 4868890 4836116 4828659 4825257 4811272 4790088
2837 4790088 4772691 4717859 4730797 4682808 4652550 4621900 4599050 4558728 4522222 4522799 4457973 4435294
2825D435294j759m9646k9675k5209k2649J7958l1953r868n6502m8912k8403k4857
2813D123819n5072o6419p003o9921p0541k8984k8804k7246j1230m0710p6326k2256
2801C619307j3835j8244j4803n6979q1607m721J1818o1285m1237n2820k682M8439
2789C331351k3216m7446n7870m208k5365O261L536l4552m7067m520J0646k690
2777C104860j8974q515P47k2991j2638l2712k7971k099j9679K585L064k8674n5017
2764B881986k0745k1156n0707j8077p89K0477n4244l2258J830j1466K5016m7754
2752B672113k5244j8776m9433k0838j3354j7972k2209l8029m2132j3648l7196
2741B373282j3750j5997q729l1922j4397O634r92k7838K237k7642j1637K0404
$$ plain form
2825 4435294 4433535 4383889 4354214 4329005 4306356 4324314 4292361 4282493 4225991 4177079 4148676 4123819
2813 4123819 4068747 4002328 3995325 3925404 3854863 3825879 3797075 3769829 3758599 3717889 3641563 3619307
2801 3619307 3605472 3587228 3572425 3515446 3433839 3429118 3440936 3379651 3338414 3285594 3282912 3331351
2789 3331351 3308135 3260689 3202819 3198611 3173246 3179507 3183043 3148491 3101424 3096904 3107550 3104860
2777 3104860 3085886 3077371 3078118 3055127 3042489 3009777 2981806 2979707 2960028 2962613 2965677 2937003 2881986
2764 2881986 2861241 2840085 2789378 2771301 2770512 2790989 2736745 2704487 2706317 2694851 2719867 2672113
2752 2672113 2646869 2628093 2578660 2557822 2544468 2526496 2504287 2466258 2424126 2410478 2373282
2741 2373282 2359532 2343535 2334806 2302884 2288487 2295121 2294129 2266291 2268528 2240886 2229249 2249653
2729B249653P84k2807l4264l680m505m493r507n1450j431J5951n0379l9774j5297
2716B028801j3452l063J0459p243m3068j6269l1182j1700r338j6020j9585j5298
2704A853042K6881j1717P630l9353K3073o338k4504o4724K0848K6735o2903j2564
2692A736106k1185j2058j0990J2214k7397M123l2871j7856k4717m6372j883R02
2680A558016J3987o227l3113o539J6592l75k8526l6123l242k0897l0644k731k0385
2667A399793o669K3172J772n5139j597R259k3425P999l1445o806k7748q034q522
2654A272610j095J2891L971m649q673o373k074l0828j9974K3473l4427l3227p342
2641A164283J885k6342k5811j1526J121r159L1958j4503k7151L578l0749l2641
$$ plain form
2729 2249653 2250437 2227630 2193366 2189686 2185181 2180688 2171181 2119731 2118300 2134251 2083872 2044098 2028801
2716 2028801 2015349 2012286 2022745 2015502 1972434 1956165 1924983 1913283 1903945 1887925 1868340 1853042
2704 1853042 1879923 1868206 1875836 1836483 1859556 1853218 1828714 1763990 1784838 1811573 1748670 1736106
2692 1736106 1714921 1702863 1691873 1704087 1676690 1680813 1647942 1630086 1605369 1558997 1557114 1558016
2680 1558016 1572003 1565776 1532663 1526124 1542716 1542341 1513815 1477692 1474450 1453553 1422909 1420178 1399793
2667 1399793 1393124 1416296 1418068 1362929 1361332 1370591 1347166 1355165 1323720 1316914 1289166 1281132 1272610
2654 1272610 1271515 1284406 1288377 1283728 1275055 1268682 1266608 1235780 1215806 1239279 1204852 1171625 1164283
2641 1164283 1166168 1139826 1114015 1102489 1103610 1094451 1126409 1111906 1084755 1088333 1057584 1024943
2629A024943O891Q520l2626j4482l8625J3746j3422j0884J9621j2265J0047j0159
2617I51305k8328l4806m441P294L59J9001j3679l5148k8426j218k095k245o905
2604H20668l444K173l9511l0191l0678j7137l642L6559j2143j3248J2488J0946
2592G32840k1452k9724K8378j3746l599j2609j7782J3940j1384Q736k2614j7460
2580F33524J4602K428p124l2097l1891j2110M046J520K4338j6316k4218k7595
2568E29107J5105M218K182j5456J072M3988K0314k5618l0421K277L967k8398O795
2555E29132J9027j3607q265J2158l4985J141R663j8975J4827j561M760L06j5111
2542D98510j7966m3466r757O3568j4389j5168l0580j0859J8418M509j8300m1763
$$ plain form
2629 1024943 1031834 1040354 1007728 993246 954621 968367 954945 944061 963682 951417 961464 951305
2617 951305 922977 888171 883730 891024 891383 910384 896705 861557 833131 831913 829818 827573 820668
2604 820668 817224 819397 779886 749695 719017 701880 698238 734797 722654 709406 721894 732840
2592 732840 711388 681664 710042 696296 692697 680088 662306 676246 664862 673598 650984 633524
2580 633524 648126 650554 643430 611333 579442 567332 571378 572898 597236 580920 556702 529107
2568 529107 544212 548430 550612 535156 536228 580216 600530 574912 544491 546768 550735 522337 529132
2555 529132 548159 534552 526287 538445 503460 504601 514264 495289 510116 508555 513315 513621 498510
2542 498510 480544 437078 427321 490889 476500 461332 430752 419893 438311 442820 424520 382757
2530C82757L0516M3176j4611q09j1665j6876m865k9727J4312L4181N385m0820
2518C90954j0773m280p357K5171j1849K905M216J2789j5538j7332p004n587j2461
2505C43854q960M8554n538j0241k6381j1254n95K0496M916l3376K6637K1530n443
2492C64199l3190j345j6376q279J9606j9069k3471K5955j1738j3970k1767L5033
2480B95588j9190N978m40p846L0934J0180o133j0929J7159J899l6397K4826J3966
2467C19595k4632p622j4169Q481l854J0403L706j9412k8497K5579R230L1547j0659
2454B99696O489K9412m6541Q427K255k8667L6773K0988l3060l9574P251j4917
2442B48532K1626k5287J7811L3128j9640O585l944m936j5658O48N482k8799O682
$$ plain form
2530 382757 413273 456449 441838 441029 429364 412488 407623 377896 392208 426389 431774 390954
2518 390954 380181 375901 368544 393715 381866 384771 388987 401776 386238 368906 361902 356315 343854
2505 343854 334894 383448 377910 367669 341288 330034 329439 349935 354851 321475 348112 369642 364199
2492 364199 331009 329664 313288 305009 324615 305546 282075 308030 296292 282322 260555 295588
2480 295588 276398 282376 281936 274090 305024 315204 309071 298142 315301 317200 280803 305629 319595
2467 319595 294963 287341 273172 281653 277799 288202 291908 272496 243999 269578 278808 310355 299696
2454 299696 306185 335597 289056 297483 299738 271071 307844 328832 295772 256198 263449 248532
2442 248532 270158 244871 262682 295810 276170 282755 278811 273875 258217 258865 264347 235548 242230
2429B42230L7306K5165l489q3302Q644J0154K0220J5326j0504k379J2717R181
2417B81269l3662K226O29J1029J7297k2507j8953J8239J7481J6573L804J9044
2405C12469j4853l6932j1491K8573j5433K6643J9273J1417K4872j4248j3540p162
2393C09588j3666M1591o966k1787J140n022N6563R211j8594L4182P7942j7776
2381D46406J7002M3047M1125J9122M4621N4690L9375M8258k248j464M8821Q2575
2369H81330N3466Q0527Q8026O2964M7228P3895R9871J10991J53579K38244K91337
2358B181458L83339M27110M36988N38506O25440N44440L17491k82120n96578n63027
2348D013047m95114l52007k74865j69146j87529j93640j78126j31192j23889j01036
$$ plain form
2429 242230 279536 304701 301212 217910 226554 236708 256928 272254 261750 259371 272088 281269
2417 281269 247607 249833 250462 261491 278788 256281 237328 255567 273048 289621 293425 312469
2405 312469 297616 260684 249193 277766 262333 288976 308249 319666 344538 330290 316750 309588
2393 309588 295922 337513 330547 308760 309900 304878 361441 370652 352058 386240 464182 446406
2381 446406 463408 506455 547580 566702 611323 666013 705388 753646 751398 749934 798755 881330
2369 881330 934796 1015323 1103349 1166313 1213541 1287436 1387307 1498298 1651877 1890121 2181458
2358 2181458 2564797 2991907 3428895 3967401 4592841 5137281 5454772 5172652 4576074 4013047
2348 4013047 3517933 3165926 2891061 2721915 2534386 2340746 2162620 2031428 1907539 1806503
2338A806503r8089j34927j58186r6738r8381q8756q0424o0033o6392p1141m7583
2327H05853o6239k7503k4619n4702l4945l9619p242k0624m700l0246l1354M790
2315D68850k3N03l7622n8674p687K2205l6319l3234r523N0418J389R359j5776
2302C53866k7803j4931l9599l85k3240K3237o412n247R012J2632n1245J4981j1184
2289B33682l3367J2476k0109K1916J4951M821K2050N071l6050M8686r2o1606J1407
2276B23836q052k6863J4788r343N8382j7433k7506L2346m7470k6569R664j5126
2264A60654k975K6024l075m4079N1397j1862r489L2891k2696J1326m212q446j3281
2251A62177m065M767j1050J257m649J749K3281l3278l7309O9834k9545k1432L3092
$$ plain form
2338 1806503 1708414 1573487 1415301 1318563 1220182 1131426 1051002 990969 924577 853436 805853
2327 805853 739614 712111 687492 632790 597845 558226 550984 530360 525660 495414 464060 468850
2315 468850 468827 469330 431708 373034 365347 387552 351233 317999 308476 358894 360283 369642 353866
2302 353866 326063 311132 271533 271148 247908 271145 264733 259486 268498 281130 229885 244866 233682
2289 233682 200315 212791 192682 214598 229549 234370 256420 261491 225441 274127 274035 212429 223836
2276 223836 215784 188921 203709 194366 252748 235315 207809 240155 192685 166116 175780 160654
2264 160654 157679 183703 180628 136549 187946 176084 166595 199486 176790 188116 183904 175458 162177
2251 162177 158112 162879 151829 153086 148437 150186 173467 140189 102880 172714 143169 121737 154829
2238A54829J208Q75k4765j1102L5036J3218j4530j59L5886k7325n6059p576J30
2225I9666L5131P212k4845J2875J1855o547L1536j2295L294m5025k945J5303j5396
2212A09819n442P424J938j1476k0280J0968P170L3768k1996r20q419l7368K4247
2199H9433J1545k7225P956k927J0629n383k1759J8149j0069J6061k980n643J5076
2186I2863l045j8427L1602L1348l7445l2171J5300l486j3478j0905J3928K6174
2174I2258l3114j9877J7752K5450P563l9760j2106K4134J7032k5721L4421j7012
2162G1020r160q07k4910K1697K0191R101j5023o374J3548j6784o718K2116J4466
2149I2363M0362O867l1505j193l6184Q744M165r441k060J2271J2649l0433P127
$$ plain form
2238 154829 156037 156912 132147 121045 156081 169299 154769 154610 190496 163171 107112 99536 99666
2225 99666 134797 142009 117164 130039 141894 135347 166883 154588 157882 112857 109912 125215 109819
2212 109819 104377 111801 113739 102263 81983 92951 100121 133889 111893 110973 102554 65186 89433
2199 89433 100978 73753 81709 78782 89411 84028 62269 80418 70349 86410 83430 77787 92863
2186 92863 89818 71391 102993 134341 96896 64725 80025 76539 63061 52156 66084 92258
2174 92258 59144 39267 57019 82469 90032 50272 38166 62300 79332 53611 88032 71020
2162 71020 61860 61053 36143 57840 78031 87132 72109 65735 79283 62499 55781 77897 92363
2149 92363 132725 139592 108087 106894 70710 79454 83619 74178 72118 84389 97038 66605 73732
2136G3732k78K5120j2416k3166p218J3285r003J5928j913j7882Q806J1757k4275
2123E2477l7675J7855K9398K9841l797K1477l3019k0622N966J5164j9764J4127
2111G1428k4380l8130k203P921l029O733J8917J0943n996l2337K3661p491M1875
2098F7912N200n7225J0458K7693N860j661J774o027r858K9481J0861M429o304
2085H2593q779K1415K0204j1447K619j2051j413j7875l5168M2119J3389P398m0679
2072F2325k6785P3j2523J2608J9813J9118j5399k2126j370J2068J3270k604k1119
2059C7349L46o98N438k542K0604J6306J648k8217K1856k309Q852O719p831k4577
2045E2944k0599N919J2410j8229q720J8154j063J4850j6969R459q570K0835L495
$$ plain form
2136 73732 73454 98574 86158 62992 55774 69059 60056 75984 74071 56189 64995 76752 52477
2123 52477 14802 32657 62055 91896 88099 109576 76557 55935 61901 77065 57301 71428
2111 71428 47048 8918 6715 14636 11607 18340 37257 48200 42204 9867 33528 26037 67912
2098 67912 73112 15887 26345 54038 59898 58237 60011 53984 44126 73607 84468 88897 82593
2085 82593 73814 95229 115433 103986 106605 94554 93141 75266 40098 82217 95606 103004 62325
2072 62325 35540 35613 23090 35698 55511 74629 59230 37104 35734 47802 61072 58468 37349
2059 37349 37695 36997 42435 39893 60497 76803 78451 50234 72090 69781 78633 85352 77521 52944
2045 52944 32345 38264 50674 32445 23725 41879 40816 55666 38697 48156 39586 60421 63916
2032F3916j3023m0490Q961J8503N496n211J3850M475j1948n347r668J6540J6132
2019F2186k9074Q985K5876k9662Q501m068K6058Q559k2344K9241j4064k1962m090
2006D4142J0893l4770J0646O1907n4734L152q115O262m556M910K1953j8585j7167
1993B5938K0498M1347N106l8940Q725k709j6658P012j0830k3687J1006K5895k2238
1980C0465j8309o565L2032j283n5087K5873K4351j4588j8439j0093M3941K9116
1968F1414J6990k9242k5693J6854J817j562k309j764L78n647R993m350j3682J6682
1954C9879m4378j2642K7364M1784L948j6761l3217M655K8317k9458J5846K085
1942B7422m36N414l0123k1385L1969Q533r959r657J0233j433l256R337J4657j231
$$ plain form
2032 63916 50893 10403 19364 37867 43363 38152 52002 56477 44529 39182 29514 46054 62186
2019 62186 33112 42097 67973 38311 46812 42744 68802 77361 55017 84258 70194 48232 44142
2006 44142 55035 20265 30911 92818 38084 41236 33121 39383 34827 39737 61690 43105 25938
1993 25938 46436 87783 92889 53949 62674 59965 43307 50319 39489 15802 26808 52703 30465
1980 30465 12156 5591 37623 36340 -18747 7126 31477 16889 -1550 -11643 32298 61414
1968 61414 78404 49162 23469 40323 42140 40578 38269 36505 36883 31236 41229 36879 23197 39879
1954 39879 -4499 -17141 10223 52007 55955 39194 5977 10632 38949 9491 25337 27422
1942 27422 26986 32400 2277 -19108 12861 21394 11435 1778 12011 10578 7322 16659 31316 30085
1928C0085J7476N888r66l5302K3906K0729K642J2656p371k327k3892l6713p022
1915b11M731o221L68L431j75J4169L19j8469P653J6230L3397k9282j1739N671
1901A9872J321K9125l5907L883J9256l3203K8485J8269p221k912k1508k0813j1044
1888a2397J6307K0478M4892K378m260l1122J8999o860k2610k4217N0833k0198
1876C2223j0507K0250o867L6181P29k2184j6112O810k5184o169l7328l454K0896
1863a0716L5214N745J0685N207J0690l3316J8462l64j5964J949n25j2563J3260
1850B7764m883j5612l9425J546L6003L7675l053l9421J2026K8174q672k1527J2459
1837B3054Q589j2609q001j569P384J3295j3086j9408k022K4319m829n885p346
$$ plain form
1928 30085 47561 53449 52483 17181 41087 61816 64458 77114 69743 67416 43524 6811 -211
1915 -211 4520 -1701 -1333 2098 1923 16092 16411 -2058 5595 21825 55222 25940 14201 19872
1901 19872 21193 50318 14411 18294 37550 4347 32832 51101 43880 40968 19460 -1353 -12397
1888 -12397 3910 24388 69280 71658 67398 36276 55275 48415 25805 1588 52421 32223
1876 32223 21716 41966 35099 71280 72009 49825 33713 40523 15339 9170 -28158 -31612 -10716
1863 -10716 24498 30243 40928 46135 56825 23509 41971 41607 25643 27592 27067 14504 27764
1850 27764 22881 7269 -32156 -30610 5393 43068 40015 594 12620 40794 32122 10595 23054
1837 23054 31643 19034 11033 9464 16848 30143 17057 -2351 -4373 19946 15117 9232 1886
1824A886J8038o580N288J1376O777N014q980p032k0657J5387L5840j5482k7194
1811A3681K1071k5056k4183J4631K7766o835q062q916k905j4026p459k8178K0492
1798b7979M3065L0927J4517k8143N076j0759r661J5958k6562j3761J7876R61j8587
1785g072Q202J2283L706M393M495K4021j7426o870l5927J9693j3104j643J8873
1772A3624l0139K8192n950j5976k962J0253P545K3455M5468n1473j1265j0683
1760H9l893L0200J4909k071j3650r428P418J5143j5450q464J0920k121j3205k5602
1746a5205K6239l434j4827J1504k4907M1464j1754N46L2207k2906l8764J7197
1734b640L1433J2688J9689Q152k1295k1591n647K8681K816m4113J266j4030o40
$$ plain form
1824 1886 19924 13344 18632 30008 36785 41799 32819 25787 5130 20517 56357 40875 13681
1811 13681 34752 9696 -14487 144 27910 21075 13013 4097 1192 -12834 -20293 -48471 -27979
1798 -27979 15086 46013 60530 32387 37463 26704 17043 33001 6439 -7322 10554 11515 -7072
1785 -7072 1130 13413 17119 21512 26007 50028 32602 25732 -10195 9498 -3606 -5249 13624
1772 13624 -16515 11677 5727 -10249 -13211 -2958 4587 28042 73510 22037 10772 89
1760 89 -3804 26396 41305 39234 25584 16156 23574 38717 23267 14803 25723 23602 10397 -15205
1746 -15205 11034 7600 -7227 4277 -20630 20834 9080 9626 41833 18927 -19837 -2640
1734 -2640 28793 41481 61170 69322 48027 26436 20789 49470 52286 8173 9439 -4591 -5231
1721e231J0543J0613J4933j8559p373J1811n1740q626J1568K774J9195k400M834
1708g658p486N883J1524J2640P669J967j3299q817J1510l018J8736m579L271j6445
1694A1898J341j4054K59K337J7131J301R864l470k648m49k0024l0504K8324Q453
1680I759j7823L8105J7025p812k0677j4797L2499J839j9651j2932j8578L773J9599
1667A0329J2095k7214L0261l0762j4342N628K0909P290l21k141J2881l0596O573
1654E90R123o185J484k9195o819L4014L9105j8552j6790L881k8969L602l16Q218
1640f809P267J5560j6915j0314J297j1846L642K3415J2642L07p818j3413K0679
1627A7694j981L714l695k5778J9166O088j2252M5327j2361l5611q141j6462M597
$$ plain form
1721 -5231 5312 15925 30858 12299 4926 16737 -35003 -43629 -32061 -29287 -10092 -12492 -7658
1708 -7658 -15144 -9261 2263 14903 22572 24539 11240 2423 13933 10915 29651 25072 28343 11898
1694 11898 13239 -815 -556 1781 18912 20213 30077 26607 23959 23510 3486 -27018 1306 9759
1680 9759 -8064 30041 47066 39254 18577 3780 36279 38118 18467 5535 -13043 -9270 10329
1667 10329 22424 -4790 25471 -5291 -19633 -14005 6904 14194 13873 11732 24613 -5983 590
1654 590 9713 3528 5012 -24183 -31002 3012 42117 23565 6775 10656 -18313 -14711 -15027 -6809
1640 -6809 458 16018 -897 -11211 -9914 -21760 -18118 5297 17939 18246 10428 -2985 17694
1627 17694 15713 19427 15732 -10046 9120 15208 2956 48283 35922 311 -7830 -24292 -19695
1614a9695K8624L2585k1205J1547r350k9362J038J9677p076J2179m731j2124K2954
1601B5061L5072j7711l2403K8388j0265k5356j675J0424l0046J3425l129Q884
1589F69J604J4123M2970m6996k4677L0181l4373j4397J404P443M9376j5159l4790
1576b2622k4670K7687L2050p882L9104O062k5509j8837k7878k5330K1276J8266
1564h283M5279Q943k7705j6336j1337j2868K9745J0706J961q681J4706O076l4326
1551b120J1525K5003r921N314j151j0065m1502L1953J9773k6864j8364J8831j64
1538B248J6230j1794m1790j658M3304J9153j167j5244j6405R253l0542K3563r889
1525a4738J6325J7827N389k5298J4766j1955J616J2145J2734j5978j0161Q10k1107
$$ plain form
1614 -19695 8929 41514 20309 31856 22506 -6856 -5818 13859 6783 18962 14231 2107 25061
1601 25061 60133 42422 10019 38407 28142 2786 1111 11535 -18511 -5086 -8215 669
1589 669 2273 16396 59366 12370 -12307 17874 -16499 -30896 -29492 -22049 27327 12168 -22622
1576 -22622 -47292 -19605 12445 4563 43667 49729 24220 5383 -22495 -47825 -26549 -8283
1564 -8283 36996 45939 18234 1898 -9439 -22307 7438 18144 20105 11424 26130 32206 -2120
1551 -2120 9405 34408 24487 29801 28650 18585 -22917 9036 28809 1945 -16419 2412 2248
1538 2248 18478 6684 -35106 -36764 6540 25693 24526 9282 -7123 2130 -28412 -4849 -14738
1525 -14738 1587 19414 24803 -495 14271 2316 3932 16077 28811 12833 2672 3482 -17625
1512a7625J439K0310j3736M729R205J0393j7619j3830M1589K3493m3953j4735
1500a0340N007Nk5376j5345M9823k2749J994l458J5664Jj6781K706J0543j3631
1486b1937K1311L3693j3244Q879m0452J1943K4603k9114j6658O983J3963J437
1474A407q114L409L378P994o402M1221J3473l9929l3641O24L4977J687K1936k7719
1460A4301r879L8P790k6142j1148L0354j8226K149l160K7196p45k6514O7k365
1446a6284K3928K6426P43m460k4499P817l208J4590l1740k0719P208L093M040
1433a3065J0484K072j5264P895Q274l5449J6132J1844k2944K4330j5835J179j8629
1420c8976K941M0511r341m0185k4969j1421O0401L3355K099K990m5532J6292N0952
$$ plain form
1512 -17625 -16186 4124 -9612 -4883 4322 14715 -2904 -16734 24855 48348 4395 -10340
1500 -10340 -5333 -5328 -30704 -46049 3774 -18975 -16981 -20439 -4775 -4774 -21555 -18849 -8306 -21937
1486 -21937 -626 33067 19823 28702 -11750 193 24796 -4318 -20976 -13993 -30 1407
1474 1407 -6707 -3298 80 8074 1672 42893 56366 16437 -17204 -16580 18397 20084 42020 14301
1460 14301 4422 4460 12250 -13892 -25040 5314 -12912 -10763 -13923 13273 12528 -13986 -13919 -16284
1446 -16284 7644 34070 34813 30353 5854 13671 10463 25053 -6687 -27406 -20198 -17105 -13065
1433 -13065 -2581 -509 -15773 -7878 396 -35053 -18921 -7077 -30021 -5691 -21526 -20347 -38976
1420 -38976 -36035 4476 -4865 -45050 -70019 -81440 -21039 12316 14415 17405 -28127 -11835 39117
1407C9117j6949r970Q051j4766n009k4567J3913l490J9562J5961k096L9539k9427
1394B9869m8019p806O1566l8154j8837l1635r162K3281J6624j3020j4231P324
1382d2200J9551j7868k513K0988M640M814J1098K7555M337n761p007L0979o800
1369D1813o0282J5126K2064R10j7682O186K2475k4691m636J751J0597M166r622
1356H175J286k525n628r284l0034L0986L0192j989j7583J1340j8409j6612k9771
1343d9856P154Q494j3626M9267J4006K4901k5929j5453L2661j148R899J9847k0467
1330C9750k4917j8753J7228j395k8699J2330J5887L3982j13k5896j0986j870j3381
1317f833R100j4626K4434M7580k5375k5918k1425K6580P561q780J3883j6311R28
$$ plain form
1407 39117 22168 12198 20249 5483 474 -24093 -10180 -13670 5892 21853 19757 59296 29869
1394 29869 -18150 -25956 35610 -2544 -21381 -53016 -62178 -38897 -22273 -35293 -49524 -42200
1382 -42200 -22649 -40517 -43030 -22042 -17402 -12588 -1490 26065 30402 24641 17634 48613 41813
1369 41813 -18469 -3343 18721 19631 1949 8135 30610 5919 1283 3034 13631 17797 8175
1356 8175 9461 6936 1308 -7976 -38010 -7024 23168 21179 3596 14936 -3473 -20085 -49856
1343 -49856 -42702 -34208 -47834 1433 15439 40340 14411 -1042 31619 30471 40370 60217 39750
1330 39750 14833 -3920 13308 11913 -16786 -4456 11431 45413 45300 19404 8418 6548 -6833
1317 -6833 2267 -12359 12075 59655 34280 8362 -13063 13517 21078 12298 26181 9870 10798
1304A0798p450J6417J8308j6579j7643K5012K9233n416n3332o213J9877P784K034
1291B2830L0567k8893j5885j355k4603K1410N742j3972K395J7622p540k4861K0766
1278D223J076J0321k7634J0082o959j2697K5195l401j378J4604q347M509k0165
1265a0571l2254J0346J1861n111J0033K1323K3560q979j2234m046k665j0426O941
1252b222J4457j8417k1730R35M2333K967J6395l8848j9541L5204J2457m3485P654
1239a1841P007K346J857j4988j0176N08k10o169n390L0013k7592M5225R77j1534
1225C3j8975J0994J7979J3723j8408k6575K6715K138j0843k1735M0350O143l2466
1212a0927Q525J0887l599O700M120j8541j233q251L0433j8817k8076K4356K4810
$$ plain form
1304 10798 3348 19765 38073 21494 3851 28863 58096 52680 -652 -6865 13012 20796 22830
1291 22830 53397 24504 8619 7264 -17339 4071 9813 -4159 -1764 15858 8318 -16543 4223
1278 4223 5299 15620 -12014 -1932 -8891 -21588 3607 206 -1172 13432 5085 9594 -10571
1265 -10571 -42825 -32479 -20618 -25729 -15696 5627 29187 20208 7974 3928 1263 -9163 -2222
1252 -2222 12235 -6182 -27912 -26977 15356 18323 34718 -4130 -23671 11533 23990 -19495 -11841
1239 -11841 -4834 -2488 -631 -15619 -25795 -25287 -25497 -31666 -37056 -7043 -34635 10590 11567 33
1225 33 -18942 -7948 10031 23754 5346 -21229 5486 7624 -3219 -24954 15396 21539 -10927
1212 -10927 -2402 8485 4886 11586 15706 -2835 -4068 -12319 18114 -703 -28779 -4423 20387
1199B0387k3600k1891m3381J249M2594j9496J3558J6608k4494M597M5597k0009
1187h281j6094M195N0503J783l7801J6419K5201j3414L324M593J3752j4758l9129
1174i707O669O965j7068L2013k1485K2898r25k6632N0760k3845l2358R554K7293
1161B4132j2142m446k2649P235L2478r694j6895j3200k1264L1453K4338m3967
1149b4621o163L3110J2889j335j7453k1815M165J9666l140k2400J1588J2250j2199
1136a5458P648P350K960j7314R600M1009j2012J2445j2484j3276J9028N350n5356
1123b0510J5454Q903l9523J4155J256j1981J3918O539O240n616J0807l079J5542
1110A2105L523N835k1410L6k6885o979J661J0386k3968m043O101K3286R691j7772
$$ plain form
1199 20387 -3213 -25104 -68485 -67236 -24642 -44138 -30580 -13972 -38466 -33869 11728 -8281
1187 -8281 -24375 -20180 30323 32106 -5695 10724 35925 22511 25835 30428 44180 29422 -9707
1174 -9707 -3038 3927 -13141 18872 -2613 20285 19360 -7272 43488 19643 -12715 -3161 24132
1161 24132 11990 7544 -15105 -7870 24608 14914 -1981 -15181 -36445 -4992 19346 -24621
1149 -24621 -30784 2326 15215 13880 -3573 -25388 -21223 -1557 -4697 -27097 -15509 -3259 -15458
1136 -15458 -7810 -460 2500 -14814 -5214 35795 23783 36228 23744 10468 29496 34846 -20510
1123 -20510 -5056 3847 -35676 -21521 -20265 -32246 -18328 -11789 -5549 -11165 -358 -3437 12105
1110 12105 15628 21463 53 89 -26796 -33775 -32114 -21728 -45696 -49739 -43638 -20352 -10661 -28433
1096b8433N624k87J4358K486j6060J0559o762k438j994l5174J2639j6968K6770
1083c5680J2379q813K6086L8362J863j5857j9192l1432J481M2881L093k3168J6031
1070H034O0N84J7184p258l651l4403K7667P254J007j3435k1274K827R204j6064
1056b2264o467K3464J2189j9004J3538L3983n006j4272m351k4186M289K8662m1808
1043b1233k6572L0942L5209N146j7468P00j9224J8127J2288p084l4368L8965J403
1030A6831l8042J9182j3666J1891o444O264K4651L197O462K2556Q189p2885j5002
1017b6816J9143J8638j5449r088J3227J9968k2038j2451L9169K7979k1523n0368
1005a9609K5186L4558j8917j5645N212k7374O994J5894P40J1091l5705J5884o344
$$ plain form
1096 -28433 -22809 -23096 -8738 -6252 -22312 -11753 -18515 -20953 -22947 -58121 -45482 -62450 -35680
1083 -35680 -23301 -32114 -6028 32334 34197 18340 -852 -32284 -30803 12078 15171 -7997 8034
1070 8034 8094 8678 25862 18604 14953 -19450 8217 15471 16478 3043 -18231 -15404 -6200 -22264
1056 -22264 -28731 -5267 6922 -12082 1456 35439 30433 16161 11810 -12376 -8087 20575 -21233
1043 -21233 -47805 -16863 18346 23492 6024 6724 -12500 5627 17915 10831 -23537 15428 16831
1030 16831 -21211 -2029 -15695 -3804 -10248 -3984 20667 23864 30326 52882 61071 -11814 -26816
1017 -26816 -7673 10965 -4484 -13572 -345 19623 -2415 -14866 24303 52282 30759 -19609
1005 -19609 5577 40135 21218 5573 10785 -16589 -9595 6299 7039 18130 -17575 -1691 -8035
992h035K0340K5490j0232R532j4617k4169j5620K292J0889J3276r492m658m754
979i758j703k3552K0241j6173j0041j1818J0604J3910J9812k5430j6174K3959
967b6123p661j6477j0544J9594L133J4202K7088j6079O978J4335K5755l938m0330
954a0067j7363L6039n296k0460j4122J9956J9878O974p130J9043j3109j2073p081
941d811K1128q790k2682p590M1759m663m4704j409l2973O135M1536J1442P481
928A859J118k1918j474j596M640J1978J964J4320M417l7094N3294k1136j6728
915f356j0857j2118O823j30K8506j8888K0005k905k9446J7756J3596j1426k1985
902b7425O492m92L8411L5989R691j7324J3440j5236O981j3262o091j5708l3160
$$ plain form
992 -8035 12305 37795 27563 37095 22478 -1691 -17311 -15019 -4130 9146 -346 -5004 -9758
979 -9758 -11461 -35013 -14772 -30945 -40986 -52804 -42200 -28290 -8478 -33908 -50082 -26123
967 -26123 -33784 -50261 -60805 -41211 -38078 -23876 3212 -12867 -5889 8446 34201 30263 -10067
954 -10067 -27430 8609 3313 -17147 -31269 -11313 8565 15539 8409 27452 14343 2270 -4811
941 -4811 16317 7527 -15155 -22745 19014 14351 -30353 -31762 -64735 -58600 -17064 -5622 1859
928 1859 2977 -18941 -20415 -22011 -17371 -5393 -3429 10891 15308 -21786 31508 10372 -6356
915 -6356 -17213 -29331 -22508 -22638 5868 -13020 6985 4080 -25366 -7610 5986 -5440 -27425
902 -27425 -20933 -21425 16986 52975 62666 45342 58782 43546 50527 37265 31174 15466 -17694
889a7694q973L3402K1937J6211l0909q362n90l7892j5708K5398K1349k3844J759
876b3916J7389j0190R924l812q892M7861l6207j2247Q968J9013l793r098j4033
863a9033k7338j5885M7546J2361m875k1264K872L7691j4906K203m87M344k661
850E68k633p650k394L123K5603j0444j1044j3204k9562J4634J3866J935J6964
837b38J2009R341l3539M863N862j7391L967k646J1725O952l210k8428p67j8483
823d9983K1126J5923o703K7367j1901J2048k4979o1493N0561O089j0646J3399
811a9192J6019J6695j356J630r661l1208o767L0362J564j9339j0365l558p854
798d3030J0413J1183J3917K4323J3508k1062j1471k7727j6458N6978j3248j1288
$$ plain form
889 -17694 -26667 6735 28672 44883 13974 5612 5022 -32870 -48578 -23180 -1831 -25675 -23916
876 -23916 -6527 -16717 -6793 -10605 -19497 28364 -7843 -20090 -11122 7891 4098 -5000 -19033
863 -19033 -46371 -62256 -14710 -2349 -7224 -28488 -25616 12075 -2831 -628 -1115 3229 568
850 568 -2065 -9715 -12109 -8986 16617 6173 -4871 -18075 -47637 -33003 -19137 -17202 -238
837 -238 11771 21112 -12427 -7564 -1702 -19093 -15126 -17772 -6047 905 -2305 -30733 -31500 -49983
823 -49983 -28857 -12934 -19637 7730 -4171 7877 -17102 -78595 -28034 -21945 -32591 -19192
811 -19192 -3173 13522 12166 13796 4135 -27073 -33840 -3478 -1914 -21253 -31618 -35176 -43030
798 -43030 -32617 -21434 -7517 16806 30314 9252 -2219 -29946 -46404 10574 -2674 -13962
786a3962p951L9038j2044n0384J6942n979K3963M6166o657k8630j9876L740J5763
773A29j9207N321j563L727j8468j5145J4529l0843O462N538O817K4564K8106k2200
759a2233n19J3539L9971n4980l7829J7313p181J5993k0766N2688m315j9093k8650
746d6062K4606J8359k5101J8731J1077j9624k2581n441J2726m808J2111k0732
734d6739K8123N572K0167k732k4355k7988M7129j4192j9782K8151J5088J3078
722B1520j4888p769j1570j2831J6266J2988l3941j0427L1592K9655m6052K3219
710b238Q882j4293j082R642J1938R846Q392j1707l6396q603L721M923r075j1739
696c7789j375M724K3711k5819j2256J0687K0670J5569J6557J2734j5054j7161
$$ plain form
786 -13962 -21913 17125 5081 -45303 -28361 -34340 -10377 35789 29132 502 -19374 -15634 129
773 129 -19078 -13757 -15320 -11593 -30061 -45206 -30677 -61520 -55058 -49520 -42703 -18139 9967 -12233
759 -12233 -12752 787 40758 -14222 -52051 -34738 -41919 -25926 -46692 5996 1681 -17412 -46062
746 -46062 -21456 -3097 -28198 -9467 1610 -18014 -40595 -46036 -33310 -38118 -26007 -46739
734 -46739 -18616 -13044 7123 4391 -19964 -47952 -823 -15015 -34797 -6646 8442 21520
722 21520 6632 -1137 -12707 -25538 -9272 3716 -30225 -40652 -9060 20595 -25457 -2238
710 -2238 6644 -7649 -8731 911 12849 22695 31087 19380 -17016 -25619 -21898 -16975 -26050 -37789
696 -37789 -39164 -34440 -10729 -36548 -48804 -38117 -17447 -1878 14679 27413 12359 -4802
684d802m7017J1299J8875J3727j804k232J1543m100L893k1824p276L1167J6566
671A8015M655m0933j1672J8316K2845K1750P644p2308j7348M0951j537q811j6891
658c5324L8467L3814j8541n1368J3849J8132l6708J557K7380K8860j1786j7687
646i355J3297J3476m303K0021k2711m0340J0447K8380J3591L0380j6092k9777
634G014K1470R30l8315p524o183K8638j6922k4577R326k2672J3416K4544j919
621a2774r573J8512m239k6192M458L6731R225q981k5188m1177K6663j4329k7517
608g4381L6168J887L1303J3837l0924j4091J4669J1695j7517k0946K8650Q422
596a1228m25j1666O185R612N989J5605j1960j3175M9994n8263r246J1085o275
$$ plain form
684 -4802 -51819 -40520 -21645 -7918 -9722 -11954 -411 -4511 -618 -22442 -29718 1449 18015
671 18015 22670 -18263 -29935 -11619 11226 32976 40620 -31688 -49036 -8085 -9622 -18433 -35324
658 -35324 3143 36957 18416 -32952 -19103 -971 -37679 -36122 -8742 20118 8332 -9355
646 -9355 3942 17418 13115 33136 10425 -29915 -19468 8912 22503 52883 36791 7014
634 7014 28484 29414 -8901 -16425 -22608 6030 -10892 -35469 -26143 -48815 -35399 -10855 -12774
621 -12774 -22347 -3835 -8074 -34266 -29808 6923 16148 7167 -18021 -59198 -32535 -46864 -74381
608 -74381 -38213 -36326 -5023 8814 -22110 -36201 -21532 -9837 -27354 -48300 -19650 -11228
596 -11228 -11653 -23319 -17134 -7522 -1533 14072 2112 -11063 38931 -19332 -28578 -17493 -23768
583b3768Q431j9828L183Q270K968M9725l176p812J674K8423j8925m5041m644j7527
569c8047K1131p700j3000l722o434l421K9853J2753j5599p909p389J5837M535
556a9112j1540K9457M3252p12l0830n110P693K084m1513J5990J6858j6623k0472
543c0578j2093J1140K3059k674K6857o1N733l4399n213M4089K52j1528r035l7242
529c1693K0112K3455k4272j586K7936J4698p437j4669l1727n049J7178j1356j3281
516c7691L2749J3630k5760l4132J3228P407J7906J6840j7383j4629j5659J4841
504b8653K8861k0831J4279n111l495J8128j7938p262J3434N706k1881K2897J3957
491A2091k1386p658K1360m561K5046j0438m1196J5413N965j4085j6753O4854M25
$$ plain form
583 -23768 -15337 -35165 -31982 -23712 -20744 28981 25805 17993 19667 48090 29165 -15876 -20520 -38047
569 -38047 -16916 -24616 -37616 -41338 -47772 -51193 -21340 -8587 -24186 -32095 -39484 -23647 -19112
556 -19112 -30652 -1195 42057 41345 10515 5405 13098 15182 -26331 -10341 6517 -10106 -30578
543 -30578 -42671 -31531 -8472 -11146 15711 15650 21383 -13016 -18229 25860 26112 14584 5549 -31693
529 -31693 -11581 11874 -12398 -13984 13952 28650 21213 6544 -25183 -30232 -13054 -24410 -37691
516 -37691 -4942 8688 -17072 -51204 -37976 -30569 -12663 4177 -13206 -27835 -43494 -28653
504 -28653 208 -20623 -6344 -11455 -14950 3178 -14760 -22022 -8588 -2882 -24763 -1866 12091
491 12091 -9295 -16953 4407 -154 24892 14454 -26742 -11329 -5364 -19449 -36202 28652 29077
478B9077k1335R970j1469l6376j8627K6795K546M0741K5207k6252k9197K820L628
465b472l6104K8743o48k4981L4137J0259j1182j5009l5850K705L9451l823n63
452a5337K3017j657l497m1805J22J6751r71J5118K806j0098j4398J5442J1890
439b617q369J8468K5214l3860j4242J9058J7998k4562K593l2784n492J7342l009
426b4262J4752k6365j2743L2053J9805M023Q058k8927K4192q999j1698K2888j6845
413d068l1122J5851j2575j4344K821J2685J4600k6137O726j2185L8520J4819l2974
400b7383j3130O0842J2225k5263k0111j3102J0066M443K4867p982k2471J784q8
387a5303J416j0112J4052q92p827M1363J2887j5354J862J9116k9684j7912l928
$$ plain form
478 29077 7742 17712 6243 -30133 -48760 -21965 -19419 21322 46529 20277 -8920 -6100 -2472
465 -2472 -38576 -9833 -10481 -35462 -1325 8934 -2248 -17257 -53107 -50402 -10951 -14774 -15337
452 -15337 7680 6023 2526 -39279 -39157 -22406 -23377 -8259 -5453 -15551 -29949 -14507 -2617
439 -2617 -10986 7482 32696 -1164 -15406 3652 21650 -2912 -319 -33103 -38595 -21253 -24262
426 -24262 -9510 -35875 -48618 -16565 3240 7263 15321 -13606 10586 1587 -10111 12777 -4068
413 -4068 -35190 -19339 -31914 -46258 -43437 -30752 -16152 -42289 -35563 -47748 -9228 5591 -27383
400 -27383 -40513 20329 32554 7291 -12820 -25922 -15856 -11413 13454 5472 -16999 -15215 -15303
387 -15303 -13887 -23999 -9947 -10839 -18666 22697 35584 20230 22092 41208 11524 -6388 -10316
374a0316M975j0399O628j5357K7373J7105K460k1220j357K2063J423k4374k0904
361b1900L2200R818J4721l9952Q363J2303J1481L4639m1163m066J891r487M034
348A2882l6954K0076m865o629K2306m7310l033J8241k1339J986L0190N289k8760
335c7920J6706J9722Q529R322J2461j400l8514R185J6737k0789p160m916J2205
322e832j0145j8476m105O452j2837L5829L67j4570J9931P196J4532j2779K196
309G759l0903j2270R162j1406m941R611J845m218N488l497K867l509M40K1894
295a1678N169j8546j6677K2397k9080K043M664K3798j0379J1471K4535q570J1272
282A0419K7664r264M518K34o2534J0321O656n0896K0763L0567K974R818k3713
$$ plain form
374 -10316 -5341 -15740 -9112 -24469 2904 20009 22469 1249 -108 21955 23378 -996 -21900
361 -21900 10300 20118 34839 -5113 3250 15553 27034 61673 20510 16444 18335 8848 12882
348 12882 -24072 -3996 -8861 -15490 6816 -40494 -43527 -25286 -46625 -44639 -14449 -9160 -37920
335 -37920 -21214 -1492 7037 16359 28820 27420 -11094 -1909 14828 -5961 -13121 -18037 -5832
322 -5832 -15977 -34453 -38558 -32106 -44943 -9114 -8747 -23317 -3386 3810 18342 5563 7759
309 7759 -23144 -35414 -26252 -37658 -42599 -32988 -31143 -35361 -29873 -33370 -30503 -34012 -33572 -11678
295 -11678 -6509 -25055 -41732 -19335 -48415 -46372 -41708 -17910 -28289 -16818 7717 -853 10419
282 10419 38083 28819 33337 33571 -28963 -18642 -11986 -62882 -42119 -11552 -8578 1240 -22473
269b2473K4700O821j2590q216M46P624k7324L2159K8937K6441o533k2144k4024
256C824m7324R556L6315K2265k1971o143j5960J2892o634L3648k7035o3J049K2419
242A6838K7186J633l2491j1930J992J0701j2134k1791M4773j7157k3263J0013
230e630Q700l8146o027J2572K9933k0426o95K0725J9935L6886m0196l7257o293
217b5919K7443J3888L8454n1497j0873p159k897K5344l0131N9905k7632m9293
205d0367L0933K1005j3420Q59J257l798J3255K8937j2178K1711k5530k1109K1560
192B3115k69j3014m614j1095J8670k6579J2130j8891L0657J251k9510q702L210
179b3641L9058k3644J3588p598j0852k3329K4872K5876o519j4257R82J3258k1537
$$ plain form
269 -22473 2227 9048 -3542 -11758 -11312 -3688 -31012 1147 30084 56525 49992 27848 3824
256 3824 -43500 -33944 2371 24636 2665 -3478 -19438 -6546 -13180 20468 -6567 -6630 -5581 16838
242 16838 44024 45657 13166 1236 3228 13929 1795 -19996 24777 7620 -15643 -5630
230 -5630 3070 -35076 -41103 -28531 1402 -19024 -19719 1006 20941 57827 17631 -19626 -25919
217 -25919 1524 15412 53866 2369 -8504 -15663 -18560 6784 -23347 36558 8926 -40367
205 -40367 -9434 11571 -1849 -990 267 -3531 9724 38661 26483 48194 22664 1555 23115
192 23115 22846 9832 5218 -5877 12793 -13786 -1656 -20547 10110 11361 -18149 -26851 -23641
179 -23641 15417 -8227 5361 -2237 -13089 -36418 -11546 14330 7811 -6446 -5464 7794 -13743
166a3743k9443J9163k2688k1296L5768J8231J7578l274j741j1912J6523J1073
154A4239k7345q015k5290K1861K6102r739j085J9553j6872k8300J3798Q710J2308
$$ plain form
166 -13743 -43186 -24023 -46711 -68007 -32239 -14008 3570 296 -1445 -13357 3166 14239
154 14239 -13106 -21121 -46411 -24550 1552 -8187 -9272 10281 -6591 -34891 -21093 -12383 -75
$$ [...]
##END NTUPLES=NMR SPECTRUM
##END=
