##TITLE=1H_CG-1222-2
 200.13MHz, CDCl3,
 8 sc
 
 12.9.2025
##JCAMPDX= 6.0         $$ Bruker NMR JCAMP-DX V2.0
##DATA TYPE= NMR SPECTRUM
##DATA CLASS= NTUPLES
##ORIGIN= UXNMR, Bruker Analytische Messtechnik GmbH
##OWNER= pz
$$ XWIN-NMR		Version 3.5
$$ Fri Sep 12 13:47:37 2025 Russian Standard Time (UT+4h)  she@DPX200
##.OBSERVE FREQUENCY= 200.1313
##.OBSERVE NUCLEUS= ^1H
##.ACQUISITION MODE= SIMULTANEOUS
##.ACQUISITION SCHEME= undefined
##.AVERAGES= 8
##.DIGITISER RES= 18
##SPECTROMETER/DATA SYSTEM= spect
##.PULSE SEQUENCE= zg30
##.SOLVENT NAME= CDCl3
##.SHIFT REFERENCE= (INTERNAL, CDCl3, 0, 15.4968)
##AUDIT TRAIL= $$ (NUMBER, WHEN, WHO, WHERE, WHAT)
$$ ##TITLE= Audit trail, XWIN-NMR		Version 3.5
$$ ##JCAMPDX= 5.01
$$ ##ORIGIN= Bruker BioSpin GmbH
$$ ##OWNER= she
$$ F:/spectra/data/she/nmr/H-C/1/pdata/1/auditp.txt
$$ ##AUDIT TRAIL=  $$ (NUMBER, WHEN, WHO, WHERE, WHAT)
(   1,<2025-09-12 13:46:09.07 +0400>,<she>,<DPX200>,
      <created by zg, POWCHK disabled, PULCHK disabled
       configuration hash MD5:
       00 E9 B6 7A A2 85 ED C7 34 08 36 98 17 FE 4E 26
       data hash MD5: 16K
       76 6C 57 93 D9 3A D3 06 73 8E 04 CF 78 C4 25 9E>)
(   2,<2025-09-12 13:46:11.17 +0400>,<she>,<DPX200>,
      <Start of raw data processing
       efp BC_mod = 2 LB = 0.25 FT_mod = 6 PKNL = 1 PHC0 = -1559.521 PHC1 = 12.19226 SI = 16K 
       data hash MD5: 16K
       81 5D B2 15 E1 94 53 C4 73 98 09 5E 31 80 59 75>)
(   3,<2025-09-12 13:46:35.81 +0400>,<she>,<DPX200>,
      <pk PHC0 = -159.3628 PHC1 = 0.9999999 
       data hash MD5: 16K
       7D 9B 91 FA 95 7B 67 53 38 C0 E0 93 09 28 B2 4E>)
(   4,<2025-09-12 13:46:45.93 +0400>,<she>,<DPX200>,
      <abs ABSG = 5 
       data hash MD5: 16K
       5E 21 28 89 96 E6 C2 D9 02 99 4E 8D EF 1E B0 84>)
$$ ##END=
$$ 
$$ hash MD5
$$ 95 44 F7 86 C4 25 1C 02 BE EB A0 5D BB 03 E2 39
##$RELAX= 
##$RELAX= 
##$RELAX= 
##$RELAX= 
##$RELAX= 
##$RELAX= 
$$ Bruker specific parameters
$$ --------------------------
##$DU= <F:/spectra>
##$EXPNO= 1
##$NAME= <H-C>
##$PROCNO= 1
##$TYPE= <nmr>
##$USER= <she>
##$AMP= (0..31)
100 100 100 100 100 100 100 100 100 100 100 100 100 100 100 100 100 100 
100 100 100 100 100 100 100 100 100 100 100 100 100 100 
##$AQSEQ= 0
##$AQ_mod= 1
##$AUNM= <au_zg>
##$AUTOPOS= <>
##$BF1= 200.13
##$BF2= 200.13
##$BF3= 200.13
##$BF4= 200.13
##$BF5= 200.13
##$BF6= 200.13
##$BF7= 200.13
##$BF8= 200.13
##$BYTORDA= 1
##$CFDGTYP= 0
##$CFRGTYP= 5
##$CHEMSTR= <none>
##$CNST= (0..31)
1 1 145 1 1 1 1 1 1 1 1 1 1 1 1 1 1 1 1 1 1 1 1 1 1 1 1 1 1 1 1 1 
##$CPDPRG= <>
##$CPDPRG1= <>
##$CPDPRG2= <>
##$CPDPRG3= <>
##$CPDPRG4= <mlev>
##$CPDPRG5= <mlev>
##$CPDPRG6= <mlev>
##$CPDPRG7= <mlev>
##$CPDPRG8= <mlev>
##$CPDPRGB= <>
##$CPDPRGT= <>
##$D= (0..31)
0 0.7 0 0 0 0 0 0 0 0 0 0.03 0 0 0 0 0 0 0 0 0 0 0 0 0 0 0 0 0 0 0 0 
##$DATE= 1757670368
##$DBL= (0..7)
120 120 120 120 120 120 120 120 
##$DBP= (0..7)
150 150 150 150 150 150 150 150 
##$DBP07= 0
##$DBPNAM0= <>
##$DBPNAM1= <>
##$DBPNAM2= <>
##$DBPNAM3= <>
##$DBPNAM4= <>
$$ [...]
##$SUBNAM3= <"">
##$SUBNAM4= <"">
##$SUBNAM5= <"">
##$SUBNAM6= <"">
##$SUBNAM7= <"">
##$SUBNAM8= <"">
##$SUBNAM9= <"">
##$SW= 18.0517328524113
##$SWIBOX= (0..15)
0 0 2 0 0 0 0 0 0 0 0 0 0 0 0 0 
##$SW_h= 3612.71676300578
##$TD= 16384
##$TD0= 1
##$TE= 0
##$TE2= 300
##$TE3= 300
##$TEG= 300
##$TL= (0..7)
0 120 120 120 120 120 120 120 
##$TP= (0..7)
150 150 150 150 150 150 150 150 
##$TP07= 0
##$TPNAME0= <>
##$TPNAME1= <>
##$TPNAME2= <>
##$TPNAME3= <>
##$TPNAME4= <>
##$TPNAME5= <>
##$TPNAME6= <>
##$TPNAME7= <>
##$TPOAL= (0..7)
0.5 0.5 0.5 0.5 0.5 0.5 0.5 0.5 
##$TPOFFS= (0..7)
0 0 0 0 0 0 0 0 
##$TUNHIN= 0
##$TUNHOUT= 0
##$TUNXOUT= 0
##$USERA1= <user>
##$USERA2= <user>
##$USERA3= <user>
##$USERA4= <user>
##$USERA5= <user>
##$V9= 5
##$VALIST= <valist>
##$VCLIST= <CCCCCCCCCCCCCCC>
##$VD= 0
##$VDLIST= <DDDDDDDDDDDDDDD>
##$VPLIST= <PPPPPPPPPPPPPPP>
##$VTLIST= <TTTTTTTTTTTTTTT>
##$WBST= 1024
##$WBSW= 4
##$XGAIN= (0..3)
0 0 0 0 
##$XL= 0
##$YL= 0
##$YMAX_a= 634624
##$YMIN_a= -517108
##$ZGOPTNS= <>
##$ZL1= 120
##$ZL2= 120
##$ZL3= 120
##$ZL4= 120
##$ABSF1= 15.47365
##$ABSF2= -2.578199
##$ABSG= 5
##$ABSL= 3
##$ALPHA= 0
##$AQORDER= 0
##$ASSFAC= 0
##$ASSFACI= 0
##$ASSFACX= 0
##$ASSWID= 0
##$AUNMP= <proc_1d>
##$AZFE= 0.1
##$AZFW= 0.1
##$BCFW= 0
##$BC_mod= 2
##$BYTORDP= 0
##$COROFFS= 0
##$CY= -3
##$DATMOD= 1
##$DC= 0
##$DFILT= <>
##$DTYPP= 0
##$F1P= 0
##$F2P= 0
##$FCOR= 1
##$FTSIZE= 16384
##$FT_mod= 6
##$GAMMA= 0
##$GB= 0
##$INTBC= 1
##$INTSCL= 3.241238e-09
##$ISEN= 128
##$LB= 0.25
##$LEV0= 0
##$LPBIN= 0
##$MAXI= 10000
##$MC2= 0
##$MEAN= 0
##$ME_mod= 0
##$MI= 1.114404
##$NCOEF= 0
##$NC_proc= -6
##$NLEV= 6
##$NOISF1= 3.799351
##$NOISF2= 2.8
##$NSP= 0
##$NTH_PI= 0
##$NZP= 0
##$OFFSET= 15.49678
##$PC= 1
##$PHC0= -1718.884
##$PHC1= 13.19226
##$PH_mod= 1
##$PKNL= yes
##$PPARMOD= 0
##$PSCAL= 0
##$PSIGN= 0
##$REVERSE= no
##$SF= 200.130004988501
##$SI= 16384
##$SIGF1= 3
##$SIGF2= 2
##$SINO= 0.751879
##$SIOLD= 32768
##$SREGLST= <19F.Aceton>
##$SSB= 0
##$STSI= 16384
##$STSR= 0
##$SW_p= 3612.71676300578
##$SYMM= 0
##$S_DEV= 0
##$TDeff= 16384
##$TDoff= 0
##$TI= <>
##$TILT= no
##$TM1= 0
##$TM2= 0
##$TOPLEV= 0
##$USERP1= <user>
##$USERP2= <user>
##$USERP3= <user>
##$USERP4= <user>
##$USERP5= <user>
##$WDW= 1
##$XDIM= 16384
##$YMAX_p= 331450790
##$YMIN_p= -153327
$$ End of Bruker specific parameters
$$ ---------------------------------
##NTUPLES= NMR SPECTRUM
##VAR_NAME=  FREQUENCY,     SPECTRUM/REAL,   SPECTRUM/IMAG
##SYMBOL=    X,             R,               I
##VAR_TYPE=  INDEPENDENT,   DEPENDENT,       DEPENDENT
##VAR_FORM=  AFFN,          ASDF,            ASDF
##VAR_DIM=   16384,         16384,           16384
##UNITS=     HZ,            ARBITRARY UNITS, ARBITRARY UNITS
##FACTOR=    0.220516191357247, 1,           1
##FIRST=     3101.37073785868, 0,            0
##LAST=      -511.346025147097, 0,           0
##MIN=       -511.346025147097, -153327,     0
##MAX=       3101.37073785868, 331450790,    0
$$ Real data points
##PAGE= N=1
##DATA TABLE= (X++(R..R)), XYDATA
$$ [...]
7519A323353P5551M1698J9367q0308O790K9784k7047j2330J4855k6466r628j632
7507A353987K1195k9199N747N8193J0286o7071K2003R2709j3759j4996N3203l8308
7495A453990Q139O3313j3057Q5555J12090M7955j2220J21507J22508J5551L2048
7484B037379J23645J22591P9833J57819J11458J9191R0141R3489L8500P2354p7854
7473B868546j4265O758n1705j37306o3140P588j06088q7151o4702o7884n8149
7462B232502n0361p7785q524l2564m3752l3995m8025n6961j12027J7505j7478
7451A768535k9205K9335l6473K7406n1210o0280N7156O540p5140M7788k9449L1594
7439A686597o8543j9991J1521o0167l765j7667k0409P217l4784k3550n3463n2302
$$ plain form
7519 1323353 1398904 1440602 1459969 1379661 1386451 1416235 1389188 1376858 1391713 1365247 1355619 1353987
7507 1353987 1375182 1345983 1351730 1409923 1420209 1353138 1375141 1467850 1454091 1439095 1492298 1453990
7495 1453990 1462129 1525442 1512385 1597940 1710030 1757985 1745765 1867272 1989780 2005331 2037379
7484 2037379 2161024 2283615 2363448 2521267 2632725 2651916 2742057 2835546 2874046 2946400 2868546
7473 2868546 2854281 2861039 2809334 2672028 2608888 2616476 2510388 2423237 2358535 2290651 2232502
7462 2232502 2182141 2104356 2095832 2063268 2019516 1985521 1937496 1880535 1768508 1786013 1768535
7451 1768535 1739330 1768665 1732192 1759598 1708388 1648108 1705264 1711804 1636664 1684452 1655003 1686597
7439 1686597 1618054 1598063 1609584 1549417 1545652 1527985 1507576 1514793 1480009 1456459 1402996 1350694
7427A350694j6609j0251j787n9146m9534N6040N043k8518o8667l8720j1150k6026
7415A101369O745l1556l4229m7269n5440k0445m018L0567K9087l0653l7273m7232
7403H59653K5451m5009J234l9876l3313j0232M1118p7502J7585j4660k544k2824
7391F99081q213k5797L3365J5287l7599j06014k9776O2207j3975O8041K4759j533
7379F79833n3376k7488k2235L4614o0207r126k62K9061m5927O2425o206N4910
7367F36016j3958O082l7161N7725l463o2002K9424j0129M450n3704j3327K2219
7355E62172K0573l0201k740l5042N9459J4971L1730k1661m4230M5694l8471M0312
7343F02566K2781l3040l0916k4486M6534k6169R833k4885M7719K0111n0050K0671
$$ plain form
7427 1350694 1334085 1323834 1322047 1262901 1213367 1269407 1274450 1245932 1177265 1138545 1127395 1101369
7415 1101369 1108114 1076558 1042329 995060 939620 919175 915157 945724 974811 944158 906885 859653
7403 859653 885104 840095 841329 801453 768140 757908 799026 721524 739109 724449 721905 699081
7391 699081 690868 665071 698436 713723 676124 570110 540334 602541 588566 656607 681366 679833
7379 679833 626457 598969 576734 611348 551141 542015 541753 570814 524887 587312 581106 636016
7367 636016 622058 628140 590979 648704 645241 583239 612663 602534 606984 553280 539953 562172
7355 562172 582745 552544 549804 514762 574221 589192 620922 599261 555031 600725 562254 602566
7343 602566 625347 592307 561391 536905 583439 557270 567103 542218 589937 610048 559998 580669
7331E80669k0971J8958k1583L5805o7278p0248Q9712q210n2183L4687L0625K5911
7319E75894k0747L7963L8974o1955n5436l3792M3477L4715K8229q1189M8807O2148
7307F17088k8926m4737j7070k1962L3861n71O4200L1344o8983M4056m9290k9383
7295E29627P373l5110j7730M1487N1871k4312L5568k3128K3060p4744n4021M1726
7283E01667M4429j8884L7212k8081J3495j7715m1864l2660O1803k4114r9756P5033
7271D70565K5243J4248l8790K8850m8880l0296J0973K7207P0731p5612l7063J9616
7259D36792M723J0019l9594J2198k2533n2997K8091N952M8584p4704j8922O6398
7247D04007l9765m2051j1659K3811L5085N3109J7976l840o3168j2701l6728M0789
$$ plain form
7331 580669 559698 578656 557073 592878 525600 455352 545064 536854 484671 519358 549983 575894
7319 575894 555147 593110 632084 570129 514693 480901 524378 559093 587322 506133 554940 617088
7307 617088 588162 543425 526355 504393 538254 537683 601883 633227 564244 608300 559010 529627
7295 529627 537000 501890 484160 525647 577518 553206 588774 565646 588706 513962 459941 501667
7283 501667 546096 527212 564424 536343 549838 532123 490259 457599 519402 495288 395532 470565
7271 470565 495808 510056 471266 500116 451236 420940 431913 459120 529851 454239 417176 436792
7259 436792 441515 451534 411940 424138 401605 348608 376699 382651 431235 356531 337609 404007
7247 404007 364242 322191 310532 334343 369428 422537 440513 436673 373505 360804 324076 364865
7235C64865R482k2088o0185O522J6122N0279M4058l9489M055J8402P782K5672
7223D25477j07130P82M8987N5404N7344j5961j5310m744L929n0304l0721O9844
7211D37597K2830J2953o2193M5280N7261m6525j1132J5678q936k1995k8725M9467
7199D61560L3644k9153m6115L2174L3085o3342J125L7410K3875M881k4620K1726
7187D86250j9309j6096O1949k0104L9561q541o9481q112K6105K6165P9769p3659
7175E04497q2425j0489j4308Q3122O0402J7703o8923N173J0243k65p89O0458l858
7162E60541l7434o880j690N8547n729r014l9677K8962L0079O8971m0166n3876
7150E52634j5721J5863R7701N6053k0523M6387o4294J6500j5077J6788M2092l918
$$ plain form
7235 364865 374347 352259 292074 298596 314718 364997 409055 369566 373621 392023 399805 425477
7223 425477 318347 319129 368116 423520 480864 464903 449593 444849 448778 398474 367753 437597
7211 437597 460427 473380 411187 456467 513728 467203 456071 471749 462813 440818 412093 461560
7199 461560 495204 466051 419936 452110 485195 421853 422978 460388 484263 489144 464524 486250
7187 486250 466941 450845 512794 492690 532251 523710 454229 446117 472222 498387 578156 504497
7175 504497 422072 411583 397275 480397 540799 558502 489579 494752 504995 504730 503941 564399 560541
7162 560541 523107 516227 514537 573084 567355 558341 518664 547626 577705 646676 606510 552634
7150 552634 536913 552776 650477 706530 686007 732394 668100 684600 669523 686311 728403 724485
7138G24485L8348l7831J6637R1068M2376O6110k3681k0809L7673O4084M3893K2170
7126A064523P5549Q9360p7455n0737J37984O5363j0350K3109j1191j4264Q3680
7115A375571Q6621K5909j551n0928j5827k3665r1080m276l6920K5109M919p089
7103A286793J0985j7608k7007l3640J5856l865P740K263K7498j0275j1735L109
7091A250114l774M0308J0624k4405n5059O7247P3171j4084O8541P0533K2140K3942
7079A529298J4630M3409N1143J08090L9470O0416M3060J14622R7389J18278J25244
7068B345049J19678K27244K91755L14285L57502L05775L71551M54791M63483M74716
7058E725829L56515J23691Q6687O2849K0812k7048k36937l39168k12236k73823
$$ plain form
7138 724485 762833 725002 741639 832707 875083 941193 917512 896703 934376 998460 1042353 1064523
7126 1064523 1140072 1229432 1151977 1101240 1239224 1304587 1294237 1317346 1306155 1291891 1375571
7115 1375571 1462192 1488101 1486550 1435622 1419795 1396130 1305050 1300774 1263854 1288963 1293882 1286793
7103 1286793 1297778 1280170 1253163 1219523 1235379 1231514 1239254 1241517 1269015 1258740 1247005 1250114
7091 1250114 1246340 1286648 1297272 1272867 1217808 1285055 1358226 1344142 1412683 1483216 1505356 1529298
7079 1529298 1543928 1587337 1638480 1746570 1786040 1846456 1889516 2004138 2101527 2219805 2345049
7068 2345049 2464727 2691971 2983726 3298011 3655513 3961288 4332839 4787630 5251113 5725829
7058 5725829 6082344 6206035 6292722 6355571 6376383 6349335 6112398 5773230 5560994 5287171
7048E287171l71962k57929j73562j63677j51043o6758j02455j78280j43960m0508
7038C637037l9973j00261p5671q7182j19641q8623j00568N1780p5656p8665m1383
7027B881194j5349j2840l2343N5650J2817Q5463Q4025M4754M3109J7755l8333
7016C125902j4435J02668K577J3630J1545K1255j4744K0920N66M7839l246k4972
7004C289505k2835L5424P2934J344j4289O950r393J57530J52438P8864K17674
6993C966146K42000K21724J50957K65116L65912M84241M04730K32527J58494J24127
6983F615974L9819l0994j06820k45217k52101k35070l56642l07772k94920k64894
6973D561363k06802j75525k19125j43852j49581o0624j86962j68694m9325r2771
$$ plain form
7048 5287171 4915209 4657280 4483718 4320041 4168998 4102240 3999785 3821505 3677545 3637037
7038 3637037 3597064 3496803 3421132 3333950 3214309 3125686 3025118 3076898 3001242 2922577 2881194
7027 2881194 2865845 2853005 2820662 2876312 2889129 2974592 3058617 3103371 3146480 3164235 3125902
7016 3125902 3111467 3214135 3216712 3230342 3241887 3263142 3248398 3269318 3269884 3317723 3314477 3289505
7004 3289505 3266670 3302094 3375028 3376372 3362083 3369033 3359640 3517170 3669608 3748472 3966146
6993 3966146 4208146 4429870 4580827 4845943 5211855 5696096 6100826 6333353 6491847 6615974
6983 6615974 6655793 6624799 6517979 6272762 6020661 5785591 5428949 5121177 4826257 4561363
6973 4561363 4354561 4179036 3959911 3816059 3666478 3605854 3418892 3250198 3200873 3108102
6963C108102q4351q5762j93201j46790j13388p7889j54300r4683r4787j09459
6953A953492j43404m1094j6021n5472j2605q5343m1941p9628j6504k4071J3466
6942A450875Q243n9672k2175L160p9268J0789J7042J7714N14M1665l1288j427
6930A356172j0178p2364L516O1165m2331m6774Q4356J906j677J8860q7232K4735
6918A290154J1374q0213M7351j1556k0170O6775p0993k8923P6196L8410k1127
6907A297278R5665p3272m9354L5169L256j6082l8907n562M6336N059j3696m4825
6895A241065o2642L6922M1929m8323l6700P8661k7370j7872N7581o5619k9865
6884A167767k7732O201n3465J2650N1225k1130O0033j3318k4060K9699R7247j5984
$$ plain form
6963 3108102 3023751 2937989 2744788 2597998 2484610 2406721 2252421 2157738 2062951 1953492
6953 1953492 1810088 1768994 1752973 1697501 1684896 1599553 1557612 1477984 1461480 1437409 1450875
6942 1450875 1459118 1399446 1377271 1380431 1301163 1311952 1328994 1346708 1347222 1388887 1357599 1356172
6930 1356172 1345994 1273630 1277146 1338311 1295980 1249206 1333562 1335468 1333791 1352651 1265419 1290154
6918 1290154 1301528 1221315 1268666 1257110 1236940 1303715 1232722 1203799 1279995 1318405 1297278
6907 1297278 1392943 1319671 1270317 1305486 1308742 1292660 1253753 1248191 1294527 1299586 1285890 1241065
6895 1241065 1178423 1215345 1257274 1208951 1172251 1250912 1223542 1205670 1263251 1197632 1167767
6884 1167767 1140035 1146236 1092771 1105421 1156646 1135516 1195549 1182231 1158171 1187870 1285117 1269133
6872A269133n8164L364N7613m1548k9217L3303j6178K378j0627o4763K7138R2926
6860A265358L4814j347J9513p2871O5888R2107j3701j6765O1153M4728r818k4840
6848A444219o4443M0627M4813J3382l6586r691J0167q0051J4445J1541m7358k5282
6836A315783P6294M832M7345M1382k0423O5099o0612m3574j5769o4004j840l918
6824A340595k8389N5199k5526O161k3813j4216O2427J1669o301L671n7121j7669
6812A306687K2725j8581N2796n974J7383p012N571n0882K3535L9819N3328j5762
6800A423633n4184K4596M2955L0536L8934M2251l5594J9863l129L9818l4048n5702
6788A479929J414L2139r645N5511O3545j2137L9704J08811J3231L1088M7170K4016
$$ plain form
6872 1269133 1210969 1214333 1271946 1230398 1201181 1234484 1218306 1220684 1210057 1145294 1172432 1265358
6860 1265358 1300172 1298825 1318338 1245467 1311355 1403462 1389761 1372996 1434149 1478877 1469059 1444219
6848 1444219 1379776 1420403 1465216 1478598 1442012 1432321 1442488 1362437 1376882 1388423 1341065 1315783
6836 1315783 1392077 1396909 1444254 1485636 1465213 1530312 1469700 1426126 1410357 1346353 1344513 1340595
6824 1340595 1312206 1367405 1341879 1348040 1324227 1310011 1372438 1384107 1377806 1381477 1324356 1306687
6812 1306687 1329412 1310831 1363627 1357653 1375036 1368024 1373595 1322713 1346248 1386067 1439395 1423633
6800 1423633 1369449 1394045 1437000 1467536 1506470 1548721 1513127 1532990 1529861 1569679 1535631 1479929
6788 1479929 1481343 1513482 1503837 1559348 1622893 1610756 1650460 1759271 1772502 1803590 1850760 1874776
6776A874776j4744l8860J08307R1889N3194n193M8152P499Q4524M6909J29698
6765B386151J45439J43138R8569J17979K31398K86148L59455L00288L83116L89322
6755D841003M11794N32023M64012J90009J49534P4234O4738r3747j16400j78615
6745F338585k53240l69506l37659k43571k13752k10936j53135q2590r8492j19988
6735D255716j26343j00510j03812p0354n2346n0305q8579j14478l5441o2910k2068
6724C428570j99j4019P298N6319J27324J31169K62062K63172K58820K75774L42129
6713E138419M09370L71011L95831K79316J21043R6143P8397n6518j90485k94056
6703F348471k41421l23530l68313k57509k89311j81356k24862j63638j43830l2617
$$ plain form
6776 1874776 1860032 1821172 1929479 2021368 2074562 2069369 2117521 2125020 2209544 2256453 2386151
6765 2386151 2531590 2674728 2773297 2891276 3122674 3408822 3768277 4068565 4451681 4841003
6755 4841003 5252797 5784820 6248832 6438841 6588375 6662609 6727347 6633600 6517200 6338585
6745 6338585 6085345 5715839 5378180 5134609 4920857 4709921 4556786 4474196 4375704 4255716
6735 4255716 4129373 4028863 3925051 3854697 3802351 3752046 3663467 3548989 3513548 3450638 3428570
6724 3428570 3428371 3414352 3421650 3477969 3605293 3736462 3998524 4261696 4520516 4796290 5138419
6713 5138419 5547789 5918800 6314631 6593947 6714990 6811133 6889530 6833012 6642527 6348471
6703 6348471 6107050 5783520 5415207 5157698 4868387 4687031 4462169 4298531 4154701 4122084
6693D122084j22880j70132j20155r0542l9582j19938k00465m6328q7039j40962
6683B984061j02608p7974l2832j25474j48168r7576m4331p5039k0889m3289K0737
6672B236618l7448m1542o9872L7557M4086o6792l9136n7957L7423p691K4715q961
6660B051000k6954j557l0455m1121M5561R0084M554k0051j4242l629L1842p3517
6648B011515L3893J947n3603N4321J8424R238k6033q452R70K5254p778n256M0243
6635B094683o2541n883P6841O9101J643k2975j1532R7517Q7618l5166j2769M1825
6623B318362O2984m0117j9015m9498N2491R0452M0558M6480L2367k5015L0100
6612B540149K2508K5697k0896J0404Q4775N2431q618L1764M176n7050J38649K2210
$$ plain form
6693 4122084 3999204 3829072 3708917 3618375 3578793 3458855 3258390 3212062 3125023 2984061
6683 2984061 2881453 2803479 2770647 2645173 2497005 2399429 2355098 2280059 2259170 2215881 2236618
6672 2236618 2199170 2157628 2087756 2125313 2169399 2102607 2063471 2005514 2042937 2035246 2059961 2051000
6660 2051000 2024046 2022489 1992034 1950913 1996474 2086558 2091112 2071061 2056819 2053190 2085032 2011515
6648 2011515 2045408 2047355 1993752 2048073 2066497 2075735 2049702 2041250 2042220 2067474 2059696 2054440 2094683
6635 2094683 2032142 2026259 2103100 2172201 2173844 2150869 2139337 2236854 2324472 2289306 2276537 2318362
6623 2318362 2381346 2341229 2322214 2272716 2325207 2415659 2456217 2502697 2535064 2510049 2540149
6612 2540149 2562657 2588354 2567458 2577862 2662637 2715068 2706450 2738214 2742390 2685340 2823989 2846199
6600B846199l380N734j6752R6179j3691n843N5277K0145J6021L6560k488M1133
6588C075094q774N1946j3228j0018L313J2451K2584l2954K4073J8851N928o2305
6576C086961R992J6520M2180J4044j6023o9530p048P1974O2492l5328J4708L7530
6564C228472k9912K6161j706J4434M5091K199n646K1786L2275j6718l3220r90
6552C282226k6657O9249J8972N4764m25n5037N9513N3685L1687m3629N3691M1260
6540C539299l6490o448O7993Q0917M6655o4313J6393P1978q359l0464O1206n91
6528C737776M499J03239K2310p4827J0574J1930r150J57719L9360j19P9059N8470
6516D140840J8838Q6706M0145M7982O6139O9505L3387M7279P6168J42869N3120
$$ plain form
6600 2846199 2842819 2848553 2831801 2927980 2914289 2908446 2963723 2983868 2999889 3036449 3033961 3075094
6588 3075094 3066320 3118266 3105038 3095020 3098333 3110784 3133368 3100414 3124487 3143338 3149266 3086961
6576 3086961 3096953 3113473 3155653 3169697 3153674 3084144 3077096 3149070 3211562 3176234 3190942 3228472
6564 3228472 3198560 3224721 3223015 3237449 3282540 3284739 3279093 3300879 3333154 3316436 3283216 3282226
6552 3282226 3255569 3324818 3343790 3398554 3398129 3343092 3402605 3456290 3487977 3444348 3498039 3539299
6540 3539299 3502809 3496361 3564354 3645271 3691926 3627613 3644006 3715984 3707625 3677161 3738367 3737776
6528 3737776 3742275 3845514 3867824 3792997 3803571 3815501 3806351 3964070 4003430 4003311 4082370 4140840
6516 4140840 4159678 4246384 4286529 4334511 4400650 4470155 4503542 4550821 4626989 4769858 4822978
6505D822978N0900J35943J92809J50245J53502J12008J93800K29062J47579K31699
6495F420525K12315K58934L09861K73981K25693L38176K80843J74612J66743J75767
6485H837450J19012J4602k8733l4089r7074n4249p0788p393j15159r5955P0945
6474H538569j01850j14139r133n8833p7058j30228o1891q8130l5175o6099p4153
6463G721880j27601r1769o5500n9730p7307j15911m4295J2526k0575q3486j33073
6452F915159n6099J4497n0700m6223o5766o0590j15449q7330o7057M962l5861
6441F349543l030m1167o7006J0635J5751r1982l0020N007l7818k0423L7645l3804
6429F093331j4379N6118k0316K5337j7042K1487j0554M1951L820Q3646J0369l7308
$$ plain form
6505 4822978 4873878 5009821 5202630 5352875 5506377 5618385 5812185 6041247 6188826 6420525
6495 6420525 6632840 6891774 7201635 7475616 7701309 8039485 8320328 8494940 8661683 8837450
6485 8837450 8956462 8971064 8942331 8908242 8811168 8756919 8686131 8678738 8563579 8467624 8538569
6474 8538569 8436719 8322580 8313447 8254614 8177556 8047328 7985437 7897307 7862132 7796033 7721880
6463 7721880 7594279 7502510 7437010 7377280 7299973 7184062 7139767 7152293 7131718 7048232 6915159
6452 6915159 6859060 6873557 6822857 6776634 6710868 6650278 6534829 6447499 6380442 6385404 6349543
6441 6349543 6346513 6305346 6238340 6248975 6264726 6172744 6142724 6147731 6109913 6089490 6127135 6093331
6429 6093331 6078952 6135070 6114754 6140091 6123049 6144536 6133982 6175933 6179753 6263399 6273768 6236460
6417F236460P6655P720L2059n0111L0202Q0032J3005K9496l52J265K821j3754
6405F445498M9203L0791O2929j113K0900J040P8555o003N1503R8498L8248j690
6393F868359L0341N5693N7164o031r208Q493Q0767n4054J5066J01710O8261N1907
6381G268468r983K0464K3290M7763M3136M1421J8846M6054J17445k3537l7013
6370G556354N0713Q1983K9194k2919J48706R968N2344R580R4987J3553O2320l39
6358H086444P1305K7126K1470J52146R0908Q9911k8299O5140Q1697P5094N0289
6347H783231R6933O5008J1330J17166J05917J01836K4935N5592J12229J05644
6337I579821J08997O4371N2923J21002N2218J23936J42564R2027J00278J09461
$$ plain form
6417 6236460 6313115 6320835 6352894 6302783 6332985 6413017 6426022 6455518 6455166 6456431 6459252 6445498
6405 6445498 6494701 6525492 6588421 6587308 6608208 6609248 6687803 6681800 6733303 6831801 6870049 6868359
6393 6868359 6898700 6954393 7011557 7005526 6996318 7004811 7085578 7031524 7046590 7148300 7216561 7268468
6381 7268468 7258485 7278949 7302239 7350002 7393138 7434559 7453405 7499459 7616904 7593367 7556354
6370 7556354 7607067 7689050 7718244 7695325 7844031 7853999 7906343 7915923 8010910 8024463 8086783 8086444
6358 8086444 8157749 8184875 8206345 8358491 8449399 8539310 8511011 8576151 8657848 8732942 8783231
6347 8783231 8880164 8945172 8956502 9073668 9179585 9281421 9306356 9361948 9474177 9579821
6337 9579821 9688818 9753189 9806112 9927114 9979332 10103268 10245832 10337859 10438137 10547598
6327A0547598M1259R2190J16117J18480J03437J47615J72911J28284Q4396J34855
6317A1687142J30870J38782K10225J18337J11296J35309K03808J19421K20560
6308A3075750J85990J85450K13841K24232K33769K25585K50998L22621K70588
6299A5188824L06756L27385L09328L59322M33993M69718M43175M65181N78598
6290A8882280O63233O54186O97112Q27482R29967Q37518R31963J075935J111938
6281B6611614J176647J248786J313923J371045J275217J221949J209682J133014
6273C6561877J117048J193931J194364J226598J142638J151346J139812J077778
6265D5805392J181478J243389J298258J420662J500232J733910J945949K085122
$$ plain form
6327 10547598 10588857 10681047 10797164 10915644 11019081 11166696 11339607 11467891 11552287 11687142
6317 11687142 11818012 11956794 12167019 12285356 12396652 12531961 12735769 12855190 13075750
6308 13075750 13261740 13447190 13661031 13885263 14119032 14344617 14595615 14918236 15188824
6299 15188824 15495580 15822965 16132293 16491615 16925608 17395326 17838501 18303682 18882280
6290 18882280 19545513 20199699 20896811 21724293 22654260 23491778 24423741 25499676 26611614
6281 26611614 27788261 29037047 30350970 31722015 32997232 34219181 35428863 36561877
6273 36561877 37678925 38872856 40067220 41293818 42436456 43587802 44727614 45805392
6265 45805392 46986870 48230259 49528517 50949179 52449411 54183321 56129270 58214392
6257E8214392K269345K405683K371457K363031K361489K423541K530344K566947
6249G7506229K589947K409318J968167J312982P72264J57556k75299o13620o78730
6240H5148814n72929m16623l08365J1688K73357N01739O90811R54951J237970
6231H7521413J385569J544606J479131J388754J035512N66107J13291m60777j042720
6222I3530886j621921k001650k326267k516194k630630k649911k498983k406976
6214G4878354k237325k108668j875940j584812j431791j320806j083658q65330
6206F2370024p82990n94150m16776l13757k28447l2675Q0536J85130M72649O32063
6196F1371607P77727R87426J134954J343522J575722J761070J923324K033330
$$ plain form
6257 58214392 60483737 62889420 65260877 67623908 69985397 72408938 74939282 77506229
6249 77506229 80096176 82505494 84473661 85786643 86558907 86716463 86441164 85827544 85148814
6240 85148814 84575885 84159262 83850897 83862585 84135942 84637681 85328492 86283443 87521413
6231 87521413 88906982 90451588 91930719 93319473 94354985 94921092 95034383 94573606 93530886
6222 93530886 91908965 89907315 87581048 85064854 82434224 79784313 77285330 74878354
6214 74878354 72641029 70532361 68656421 67071609 65639818 64319012 63235354 62370024
6206 62370024 61587034 60992884 60576108 60262351 60033904 60001229 60081765 60266895 60739544 61371607
6196 61371607 62149334 63136760 64271714 65615236 67190958 68952028 70875352 72908682
6188G2908682K031688J988817J847023J746086J433635J043006P22791M01112
6180H4122840J66446p8957q2555j3353M9238R0132K14989L41967M64693N26649
6170H5802089N34415Q03378J057210J133427J274062J184871Q23489M27092j00369
6161I2939664n85583q65459j201909j373937j470173j535297j539533j605798
6153H2761975j605772j651123j601737j598296j582478j461234j427424j344191
6145G0489720j262036j093128j008707j031345r94280j160275j226450j190369
6137F1523130j337161j247403j267643j408976j353423j285029j374219j474516
6129E0774760j523125j401579j302813j268899j222502j111311j116000j061166
$$ plain form
6188 72908682 74940370 76929187 78776210 80522296 81955931 82998937 83721728 84122840
6180 84122840 84289286 84210329 84127774 84114421 84163659 84253791 84468780 84810747 85275440 85802089
6170 85802089 86336504 87139882 88197092 89330519 90604581 91789452 92612941 93040033 92939664
6161 92939664 92354081 91488622 90286713 88912776 87442603 85907306 84367773 82761975
6153 82761975 81156203 79505080 77903343 76305047 74722569 73261335 71833911 70489720
6145 70489720 69227684 68134556 67125849 66094504 65100224 63939949 62713499 61523130
6137 61523130 60185969 58938566 57670923 56261947 54908524 53623495 52249276 50774760
6129 50774760 49251635 47850056 46547243 45278344 44055842 42944531 41828531 40767365
6121D0767365q76915p66838p45613o92123n88465n15565l94013k43693k60555
6112C5683585k19212j94311j23020q5715p7960o4652m1529k1913j66305j78770
6102C4510198m11324n11845n51093o13820p43380q44338p15838p69270q14339
6093B8534951p93182p40097p58915p80862o64978o43936n78184n62446n55804
6084B2456547o04740n35390n28475n15318n36983n53030m54581n29190m62090
6075A7736750n13815n09469m41192l60387m09840l84588l82394l87893l53172
6066A3994000l00687l02083j98669k25413k46404j41321k13335j90177j39082
6057A2036829k27980k09733p8712j11482j09933j49094j42406j60265j23427j23838
$$ plain form
6121 40767365 39890450 39123612 38377999 37685876 37097411 36581846 36187833 35944140 35683585
6112 35683585 35464373 35270062 35147042 35061327 34983367 34918715 34877186 34855273 34688968 34510198
6102 34510198 34098874 33587029 33035936 32422116 31678736 30834398 30118560 29349290 28534951
6093 28534951 27741769 27001672 26242757 25461895 24796917 24152981 23574797 23012351 22456547
6084 22456547 21851807 21316417 20787942 20272624 19735641 19182611 18728030 18198840 17736750
6075 17736750 17222935 16713466 16272274 15911887 15502047 15117459 14735065 14347172 13994000
6066 13994000 13693313 13391230 13192561 12967148 12720744 12579423 12366088 12175911 12036829
6057 12036829 11808849 11599116 11520404 11408922 11298989 11149895 11007489 10847224 10723797 10599959
6047A0599959r6777j24984j41814j44899o1164o6743j01609q1661j28495p7643
6037I574170j2726j04975k1125q8271j24599r9795k8352k5304j15019q0415k9620
6026H843969p92j01555m4188P686l5466l4724m7317k8987j8447m4335M950l4631
6014H466163q6152L6683J7592m176n1556K3632J737M3885k4207K0854m8639L8896
6002H434712Q7363m0758O672R111Q6606J20698p384n0050M2667M591M1462Q737
5990H744427J13016O1742m0868J2612k5649L3834J6276Q390k441R7083R2258P8550
5978I189230M9926j8166J01938R6263o832O804M8919J228J16685P4786j7567J9856
5966I663070N1274p844m2397p1067J9312m68n6889k9332l9100n5366o199o4423
$$ plain form
6047 10599959 10503182 10378198 10236384 10091485 10030321 9963578 9861969 9780308 9651813 9574170
6037 9574170 9561444 9456469 9435344 9347073 9222474 9122679 9094327 9069023 8954004 8873589 8843969
6026 8843969 8843177 8741622 8697434 8705120 8669654 8634930 8587613 8558626 8540179 8495844 8500794 8466163
6014 8466163 8380011 8416694 8434286 8430110 8378554 8402186 8403923 8447808 8423601 8444455 8395816 8434712
6002 8434712 8522075 8481317 8487989 8497100 8583706 8704404 8697020 8646970 8689637 8694228 8735690 8744427
5990 8744427 8857443 8919185 8878317 8890929 8865280 8899114 8915390 8923780 8921339 9018422 9110680 9189230
5978 9189230 9239156 9220990 9322928 9419191 9412359 9419163 9468082 9469310 9585995 9660781 9643214 9663070
5966 9663070 9714344 9706500 9664103 9593036 9612348 9611880 9554991 9525659 9486559 9431193 9424994 9360571
5954I360571J8560J3025N23k0721n1006Q372j4144m80L7530j9525K2174L284R1086
5941I449249O2944L5791M5257P2542J49237J96127Q9274J56639J66403K28248
5931A0651711K64153K94998K64171K46634K75942K50684J81807K24870J23037
5922A2778007J12625J9668o0341r0608p5719j54547j30120o8518j81169r8020
5912A2051258j59636n0372p2181j29564j31965J9425l3011l0439o2893p1936q7503
5901A1241183p5558L6040r233r7884m9183n5843j4590l3807o3753Q828j2545k825
5889A0870830r258r1454k4742n8268p3920j04331p7440l8370n5700k3704q1552
5878A0232091p2423M106q9368o9131M0274l9378o7961P70K1121j0141j2616r0687
$$ plain form
5954 9360571 9379131 9392156 9392679 9371958 9320952 9329324 9315180 9314700 9352230 9332705 9354879 9358163 9449249
5941 9449249 9512193 9547984 9593241 9665783 9815020 10011147 10100421 10257060 10423463 10651711
5931 10651711 10915864 11210862 11475033 11721667 11997609 12248293 12430100 12654970 12778007
5922 12778007 12890632 12910300 12849959 12759351 12683632 12529085 12398965 12330447 12149278 12051258
5912 12051258 11891622 11841250 11769069 11639505 11507540 11526965 11493954 11463515 11400622 11328686 11241183
5901 11241183 11165625 11201665 11192432 11094548 11045365 10989522 10974932 10941125 10877372 10886200 10873655 10870830
5889 10870830 10861572 10770118 10745376 10687108 10613188 10508857 10431417 10393047 10337347 10313643 10232091
5878 10232091 10159668 10163774 10074406 10005275 10045549 10006171 9938210 9938980 9960101 9949960 9937344 9846657
5866I846657o6590L0140k9732j33987j21703n7155p9714m4876l8411p0375q2766
5855I151488j02930j19728q4130p8405m7665l0649j25071o0853l9080j8078o8258
5844H376641n3193m2259k8520K1188j41804q6249l6052J536n5519n1388j25174
5833G779207r7965o5022l1313n7460o6059k5748r6711j9835N5388r3870o9226
5822G211386L4511q0704q3599K4246J2718J470q9496n5080J1220J03177L9677
5811G129526N642n5779M1820J6957p211L3467K3558n576o8256Q469j9997r438
5799G093182L9966J14347m9215L1849N3098j1330J3312O303N4777L1150L7978
5788G415417M14m9071m5449Q0397Q2346K4585K5602K24N3895l0793N827o7912
$$ plain form
5866 9846657 9780067 9810207 9780475 9646488 9524785 9467630 9387916 9343040 9304629 9234254 9151488
5855 9151488 9048558 8928830 8844700 8766295 8718630 8687981 8562910 8502057 8462977 8444899 8376641
5844 8376641 8323448 8281189 8252669 8273857 8132053 8045804 8009752 8011288 7955769 7904381 7779207
5833 7779207 7681242 7616220 7584907 7527447 7461388 7435640 7338929 7319094 7374482 7280612 7211386
5822 7211386 7245897 7165193 7081594 7105840 7118558 7120028 7030532 6975452 6986672 7089849 7129526
5811 7129526 7135168 7079389 7121209 7138166 7130955 7164422 7187980 7182404 7114148 7122617 7102620 7093182
5799 7093182 7133148 7247495 7198280 7230129 7283227 7271897 7285209 7291512 7346289 7377439 7415417
5788 7415417 7415831 7366760 7321311 7401708 7484054 7508639 7534241 7534465 7588360 7557567 7563394 7495482
5776G495482j2822J6579j5218M8054j225n8005p401J2049m158o8949j3321n9207
5764G331858n0433m943p183n6942r9746p4985m8806K6998M0547j8542m2518j1497
5752F983808k7443j02493L887l7127m5192j1284J6568l9598m1409j1726k2636
5741F665355P921l5412Q4384k1198k6873N8011K1522m9638n248R4591M6624k9388
5729F810651n1606J919J9166P6835k9090K3494L4004j7968L833k4845L0621L1112
5717F908126l0657k4572K6867N1721M5935J8492m1074K3602Q628n3432n5629k9195
5705F848812O7816J14705l6838K5604N4460K2208J0796J0815Q9693J1729q342
5694G211458Q3090J6698L1076Q9842N1578K9405N5961K5840Q6529K3596K381j3025
$$ plain form
5776 7495482 7482660 7499239 7484021 7532075 7530850 7472845 7465444 7477493 7473335 7404386 7391065 7331858
5764 7331858 7281425 7276482 7269299 7212357 7112611 7037626 6988820 7015818 7056365 7037823 6995305 6983808
5752 6983808 6956365 6853872 6857759 6820632 6775440 6764156 6780724 6741126 6699717 6687991 6665355
5741 6665355 6673276 6637864 6722248 6701050 6674177 6732188 6753710 6704072 6698824 6793415 6840039 6810651
5729 6810651 6759045 6760964 6780130 6856965 6827875 6851369 6885373 6867405 6871238 6846393 6877014 6908126
5717 6908126 6877469 6852897 6879764 6931485 6977420 6995912 6954838 6978440 6987068 6933636 6878007 6848812
5705 6848812 6916628 7031333 6994495 7020099 7074559 7096767 7107563 7118378 7208071 7219800 7211458
5694 7211458 7294548 7311246 7342322 7432164 7483742 7513147 7569108 7594948 7681477 7705073 7707454 7694429
5682G694429J20477R8326j4320J21021J03464O3103L8177L9298O0935J07836R678
5671H442424J02858J85295Q6975L0893R208Q8248Q6090L4611J03988K3538L0492
5660I224620r976P5742N2135L2427L4099O3864K2390R5096M3132n638N0191M1365
5648I719447M3990J74851Q5243O6497P0168Q5683J39458J07966J33275J98855
5638A0825433K04504J52681J19405J66984J94978J67726J38903J75947K09496
5629A2356057J58315L03580J81762J02700K45651J92963J90387K34660K55893
5620A4221968J93046K92045K81718K39896K48004K64998K62997K44243K58932
5611A6507847L15625K53620L42205L40851L28708L76191L80124L27037M46472
$$ plain form
5682 7694429 7814906 7913232 7898912 8019933 8123397 8186500 8224677 8263975 8324910 8432746 8442424
5671 8442424 8545282 8730577 8817552 8848445 8857653 8945901 9031991 9066602 9170590 9194128 9224620
5660 9224620 9214644 9290386 9342521 9374948 9409047 9472911 9495301 9590397 9633529 9627891 9678082 9719447
5648 9719447 9763437 9938288 10023531 10090028 10160196 10245879 10385337 10493303 10626578 10825433
5638 10825433 11029937 11182618 11302023 11469007 11663985 11831711 11970614 12146561 12356057
5629 12356057 12514372 12817952 12999714 13102414 13348065 13541028 13731415 13966075 14221968
5620 14221968 14415014 14707059 14988777 15228673 15476677 15741675 16004672 16248915 16507847
5611 16507847 16823472 17077092 17419297 17760148 18088856 18465047 18845171 19172208 19618680
5602A9618680M02935N07101M71106M80681O07678O04596N93574O75154P15090
5593B4676595O89094Q00988P11648Q75550R04493R97800R38299R88880J127578
5584C2710925J130287J213011J309017J355000J512816J623886J590289J742138
5576D4187369J990754K044287K273849K474160K633129K975072L309133L710688
5568F5598441M095458M559145N078275N560316O121172O683127P128779P513820
5560A12338533P882990P992767Q008904P723702P465304O762828O011355M974118
5552A69160501L602874K089192O48692o24345j608170k369618k827137l169393
5544A64902596l271951l234409l153631k965114k599785k304124k043612j890855
$$ plain form
5602 19618680 20021615 20528716 20999822 21480503 22088181 22692777 23286351 23961505 24676595
5593 24676595 25365689 26166677 26878325 27753875 28658368 29656168 30594467 31583347 32710925
5584 32710925 33841212 35054223 36363240 37718240 39231056 40854942 42445231 44187369
5576 44187369 46178123 48222410 50496259 52970419 55603548 58578620 61887753 65598441
5568 65598441 69693899 74253044 79331319 84891635 91012807 97695934 104824713 112338533
5560 112338533 120221523 128214290 136223194 143946896 151412200 158175028 164186383 169160501
5552 169160501 172763375 174852567 175501259 174876914 173268744 170899126 168071989 164902596
5544 164902596 161630645 158396236 155242605 152277491 149677706 147373582 145329970 143439115
5536A43439115j654371j505912j691377j728531j973225k189100k529439k732794
5528A27434366l069849l506457l775786l955084m113515m139278l942187m013831
5520I6918379l954867l745384l584089l453010l236836l092679k878530k719325
5512G0253659k578090k387140k333148k157958k059079j963370j872939j673375
5504E3228560j611912j600424j390760j215690j152761j108591j010062q08571
5496D3329789n79972m97236l91930l54174k48835j49101j01507N1710m6047K7879
5486D1040576L1986j13478j00469j64566k77829l08251m28537n22579n64455n84117
5476C8008281p07608p63748p32425p03842p78229p98339p71905p52011o99952
$$ plain form
5536 143439115 141784744 140278832 138587455 136858924 134885699 132696599 130167160 127434366
5528 127434366 124364517 120858060 117082274 113127190 109013675 104874397 100932210 96918379
5520 96918379 92963512 89218128 85634039 82181029 78944193 75851514 72972984 70253659
5512 70253659 67675569 65288429 62955281 60797323 58738244 56774874 54901935 53228560
5504 53228560 51616648 50016224 48625464 47409774 46257013 45148422 44138360 43329789
5496 43329789 42749817 42252581 41860651 41506477 41257642 41108541 41007034 41058744 41012697 41040576
5486 41040576 41072562 40959084 40858615 40694049 40416220 40107969 39679432 39156853 38592398 38008281
5476 38008281 37300673 36536925 35804500 35100658 34322429 33524090 32752185 32000174 31300222
5467C1300222p58247o93771o81210p39898p00430o61026p15551o56352n81969
5458B5111768n08569n41765n78451m66032m84786m22430l88645m21115m31347
5449B0868628m06282l70037l22795k76694k80276l90703k68095k46036k49871
5440A8057839k33235k51491k30908k34778k90733k14970k65724k37381k15843
5431A5882776k34474k09154j93331k70221k54740k30669k49630j84352j45410
5422A3910795j38044k60844j53618j71634j98869j66028j91062j91563j30807
5413A2308326j79241j56343j33496j72363j47763r2419r5744j84170j54260j30692
5403A0861835o0473j15497p2055l9204o7796j47344j24887n3472q1608j23322
$$ plain form
5467 31300222 30541975 29848204 29166994 28427096 27726666 27065640 26350089 25693737 25111768
5458 25111768 24603199 24061434 23482983 23016951 22532165 22109735 21721090 21299975 20868628
5449 20868628 20462346 20092309 19769514 19492820 19212544 18821841 18553746 18307710 18057839
5440 18057839 17824604 17573113 17342205 17107427 16816694 16601724 16336000 16098619 15882776
5431 15882776 15648302 15439148 15245817 14975596 14720856 14490187 14240557 14056205 13910795
5422 13910795 13772751 13511907 13358289 13186655 12987786 12821758 12630696 12439133 12308326
5413 12308326 12129085 11972742 11839246 11666883 11519120 11426701 11330957 11146787 10992527 10861835
5403 10861835 10801362 10685865 10613810 10574606 10506810 10359466 10234579 10181107 10099499 9976177
5393I976177k2072k1403p1651n6708j22679q0250j7340m4942r3617m5000o154
5382I394361m6970k6984m6960o7396j3345k4659o5377k2541n9533r7420n1322
5371H871854n6179k3272j6000l4385r8452j43164n0056J2130l0755n9112k6519
5360H346090n7031l5425j22087p2397q9214m2476q475n2910n4056k8410n7003
5349G726606q0206r594l7834q2076o7299q9727j18621k1015q8240L087l3056q8789
5337G013236o5463l2201J2430P671j29037n5966k1335P1428O567M3228j49795
5326F700763o5745J7136m73m1622O644J787k1767K2406q9217l4970P341l5112
5314F467171j2031L937R040m1341M2370l7115L5347L2059l272O335j4264M7001
$$ plain form
5393 9976177 9954105 9932702 9861051 9804343 9681664 9601414 9584074 9539132 9445515 9400515 9394361
5382 9394361 9347391 9320407 9273447 9206051 9192706 9168047 9102670 9080129 9020596 8923176 8871854
5371 8871854 8815675 8792403 8776403 8742018 8643566 8500402 8450346 8462476 8431721 8372609 8346090
5360 8346090 8289059 8253634 8131547 8059150 7969936 7927460 7918985 7866075 7812019 7783609 7726606
5349 7726606 7646400 7636806 7598972 7516896 7449597 7359870 7241249 7220234 7131994 7135081 7102025 7013236
5337 7013236 6947773 6915572 6928002 6935673 6806636 6750670 6729335 6800763 6807330 6850558 6700763
5326 6700763 6635018 6652154 6651681 6610059 6616703 6618490 6596723 6619129 6529912 6494942 6502283 6467171
5314 6467171 6455140 6459077 6468117 6426776 6469146 6432031 6467378 6499437 6496165 6502500 6488236 6535237
5302F535237J3421k5908j9510O235m5911k0747l5119N334q2178N1320l7853o1963
5290F282358j5711k6466J310l3781k2404K908M8110K366M6115m5385Q050k2632
5278F224838m5972k1654K2133N9551j4400N1005k7743J6420K83K1605r069N4136
5266F331133k06k7290P3324N6428J0856o6996L306J02284M4318q823m2637q560
5254F467137L1096L7522o1010k9124P2329O4019k9925k5894p438N7016L0604q2320
5242F524012N938K4247n5514l825k9034m3348J8363L2685k7701L2170O5928j9332
5230F524589o1131L3210J6367l4944J0702L1369l5301r269L4848n3477k7014j8832
5218F411117n4804n321K6805n1419j3802P446J4416j2580k776l4250J390j7690
$$ plain form
5302 6535237 6548658 6522750 6503240 6509475 6463564 6442817 6407698 6413032 6330854 6382174 6344321 6282358
5290 6282358 6266647 6240181 6241491 6207710 6185306 6188214 6236324 6238690 6284805 6239420 6247470 6224838
5278 6224838 6178866 6157212 6179345 6238896 6224496 6275501 6247758 6264178 6264461 6286066 6276997 6331133
5266 6331133 6330927 6303637 6376961 6433389 6444245 6377249 6380555 6482839 6527157 6518334 6475697 6467137
5254 6467137 6498233 6535755 6474745 6445621 6517950 6581969 6552044 6526150 6518712 6575728 6606332 6524012
5242 6524012 6529950 6554197 6498683 6494858 6465824 6422476 6440839 6473524 6445823 6477993 6543921 6524589
5230 6524589 6463458 6496668 6513035 6478091 6488793 6520162 6484861 6475592 6510440 6456963 6429949 6411117
5218 6411117 6356313 6350992 6377797 6326378 6312576 6320022 6334438 6321858 6319082 6284832 6286222 6268532
5206F268532J111R6065r5290k3971o770M9763m6335J0284M3290m2692J0448j9330
5194F245105L6921l3147k8255Q4524k5672j9674r28J526J33425N4971J8376Q5209
5182F552381K8832p0776L4544J03796L2091O1808P6954P658N6883J62932O2939
5171G110042N5350K2472M2325J35022M4585M2484J19276L8208O9560O7044J12669
5160G859037O4435R6490J18835J12948J34145N5808J04444P7739J64839J05382
5150H894102J33911J25664J23613J91438J53563R2159K70154K27827J57713J60885
5140A0531029J71636K19155J88516J71415J45339J39622J12683J03640J10244
5131A1893279P0539J5086L0885m4812q9178n5895n0557l8732q0913n7923m2999
$$ plain form
5206 6268532 6269643 6365708 6270418 6246447 6239677 6289440 6243105 6253389 6296679 6253987 6264435 6245105
5194 6245105 6282026 6248879 6220624 6305148 6279476 6259802 6258874 6260400 6393825 6448796 6467172 6552381
5182 6552381 6581213 6510437 6544981 6648777 6680868 6742676 6819630 6827288 6884171 7047103 7110042
5171 7110042 7165392 7187864 7230189 7365211 7409796 7452280 7571556 7609764 7679324 7746368 7859037
5160 7859037 7923472 8019962 8138797 8251745 8385890 8441698 8546142 8623881 8788720 8894102
5150 8894102 9028013 9153677 9277290 9468728 9622291 9714450 9984604 10212431 10370144 10531029
5140 10531029 10702665 10921820 11110336 11281751 11427090 11566712 11679395 11783035 11893279
5131 11893279 11963818 11978904 12009789 11964977 11875799 11819904 11769347 11730615 11649702 11591779 11548780
5120A1548780J8334k6683r2210m9333n3242n9460k6323o0964m8611J9543k7374
5109A1142457J8516L0851j7722k599L4047M9712J50189L4194k3876R7191J00353
5098A1613313J34438O4023J11864J35366J23465J79075J88008R3431K12146J48436
5088A3003565R3452M9781Q8127R9831J47003J31967J08965N1093P8928J49686
5078A4002398J64820Q8564O3924J18485K2848m6019q1456k9021j0894l0776l6507
5067A4226366k963l6611l8280j8784q8517L7631L0791j1870n1998M4833l3410
5056A4057188r2502K533p5965l3083j04844n7601k500l0594J2229j5707p0688
5045A3588466q7094p8016o4119n8469p146n8961M9066j00068j10983q0464q1013
$$ plain form
5120 11548780 11567114 11540431 11448221 11398888 11345646 11286186 11259863 11198899 11150288 11169831 11142457
5109 11142457 11160973 11191824 11174102 11171503 11205550 11255262 11405451 11439645 11415769 11512960 11613313
5098 11613313 11747751 11811774 11923638 12059004 12182469 12361544 12549552 12642983 12855129 13003565
5088 13003565 13097017 13146798 13234925 13334756 13481759 13613726 13722691 13773784 13852712 14002398
5078 14002398 14167218 14255782 14319706 14438191 14461039 14415020 14333564 14304543 14293649 14262873 14226366
5067 14226366 14223403 14186792 14148512 14129728 14041211 14078842 14109633 14097763 14045765 14090598 14057188
5056 14057188 13964686 13967219 13891254 13858171 13753327 13695726 13693226 13662632 13674861 13659154 13588466
5045 13588466 13501372 13423356 13359237 13300768 13293622 13234661 13283727 13183659 13072676 12992212 12911199
5034A2911199q4188n0161J0048j4196o3317r9437o4857K073j1636k3361k5456
5023A2486711m2141L9328J6978k1263K6647j5941o1690O1401K1778q31j5227k1528
5011A2474222J07912R74q6600M3677N532j6264m8382p2706P4407p0243j5327K5124
4999A2422326P8022L2722J3946M0699J6290M7376R4072K8533L0810Q8465K23933
4988A3117194R5645J42908J21219P3638K20205J23871J98259J87458J91240K17170
4978A4688807K25071K76516K64257K13876K45116L54841K87622K69756L23509
4969A7149371L28809K35002K96392L57476L59220L08907L57873L28429L49804
4960B0071283M52238K62542L17092L53460K69000L07798K82233L47046L52413
$$ plain form
5034 12911199 12827011 12776850 12786898 12772702 12709385 12609948 12545091 12547164 12535528 12512167 12486711
5023 12486711 12444570 12483898 12500876 12479613 12506260 12490319 12428629 12490030 12511808 12510977 12495750 12474222
5011 12474222 12582134 12583108 12496508 12540185 12545717 12529453 12481071 12408365 12482772 12412529 12397202 12422326
4999 12422326 12500348 12533070 12547016 12587715 12604005 12651381 12745453 12773986 12804796 12893261 13117194
4988 13117194 13212839 13355747 13476966 13550604 13770809 13894680 14092939 14280397 14471637 14688807
4978 14688807 14913878 15190394 15454651 15668527 15913643 16268484 16556106 16825862 17149371
4969 17149371 17478180 17713182 18009574 18367050 18726270 19035177 19393050 19721479 20071283
4960 20071283 20523521 20786063 21103155 21456615 21725615 22033413 22315646 22662692 23015105
4951B3015105L66782M30437L82996M22729M48045M28210M70451M28208M13554
4942B6806517L80585L69749L57254M11565L62329K87524M51913L11451K85607
4933C0024494K95479L55288L32348L28966L53705M83434M04561M85259N37852
4924C3601386M75306N12949O20731N99829N90857O78658O61891O78030P23921
4915C9143558N96526O01719O39777O67801O45388O61947O57817O30519Q02560
4906D5047612P63369P67275Q22039R19735J090216J127851J223190J299030J351852
4897E4412169J592743J693710J817892K032543K143670K302668K498808K707143
4889G1201346K916651L017711L248487L551077L779149M211235M704393N295262
$$ plain form
4951 23015105 23381887 23812324 24195320 24618049 25066094 25494304 25964755 26392963 26806517
4942 26806517 27187102 27556851 27914105 28325670 28687999 28975523 29427436 29738887 30024494
4933 30024494 30319973 30675261 31007609 31336575 31690280 32173714 32578275 33063534 33601386
4924 33601386 34076692 34589641 35210372 35810201 36401058 37079716 37741607 38419637 39143558
4915 39143558 39740084 40341803 40981580 41649381 42294769 42956716 43614533 44245052 45047612
4906 45047612 45810981 46578256 47400295 48320030 49410246 50538097 51761287 53060317 54412169
4897 54412169 56004912 57698622 59516514 61549057 63692727 65995395 68494203 71201346
4889 71201346 74117997 77135708 80384195 83935272 87714421 91925656 96630049 101925311
4881A01925311O011633O764202P684134Q672401R663880J0725740J1741634J2726339
4873A75915274J3696585J4424934J4513645J4405103J3972491J3194675J1800185
4866B71922892R704317O769852L568675L53809k562435m860238o706542q015060
4858B70175270q805171r232488r349585r137644q797298q390567p814396p264753
4850B01383368o858036o358410o065546n985895o003511o111522o230923o133503
4842A51636022o072036o053245o017493n817358n626464n218084m959315m644872
4834A07227155m298261l847397l487605l296357k968952k607312k498814k221599
4826H2000858k037327j885588j669612j409980j276501j221145r71369q70558
$$ plain form
4881 101925311 107936944 114701146 122385280 131057681 140721561 151447301 163188935 175915274
4873 175915274 189611859 204036793 218550438 232955541 246928032 260122707 271922892
4866 271922892 281627209 288397061 291965736 292319545 289757110 284896872 278190330 270175270
4858 270175270 261370099 252137611 242788026 233650382 224853084 216462517 208648121 201383368
4850 201383368 194525332 188166922 182101376 176115481 170111970 164000448 157769525 151636022
4842 151636022 145563986 139510741 133493248 127675890 122049426 116831342 111872027 107227155
4834 107227155 102928894 99081497 95593892 92297535 89328583 86721271 84222457 82000858
4826 82000858 79963531 78077943 76408331 74998351 73721850 72500705 71529336 70658778
4818G0658778p38691n62406m51701k66433j08937P3181L06801M84796O66180R85263
4808G1046831J288011J395733J442505J561461J534371J285477Q26638J07643
4800H0488670m08499q69813j090983j374236j260875j189548r64949p75212o32349
4791G1922206m46646k99573k47523k85214k51024k43360j97386j84917m8693m2469
4781F9675401o496R6984K08935L38147M63927N66222O11917N83099N76714N64072
4771G3678922N70292O20537N67471L96774L50395K52089K06252J26914J49931
4762G6919577K09101J84567L15858M45024M93420O58991P02301P49384P91944
4753H1470167Q48468P59832P84466O61353N21718M00912L40272J34609k761l904
$$ plain form
4818 70658778 69920087 69357681 68905980 68639547 68530610 68603791 68910592 69395388 70061568 71046831
4808 71046831 72334842 73730575 75173080 76734541 78268912 79554389 80381027 80488670
4800 80488670 80080171 79210358 78119375 76745139 75484264 74294716 73329767 72554555 71922206
4791 71922206 71475560 71175987 70928464 70643250 70392226 70148866 69951480 69766563 69717870 69675401
4781 69675401 69668905 69765889 69974824 70312971 70776898 71343120 71955037 72538136 73114850 73678922
4771 73678922 74249214 74869751 75437222 75833996 76184391 76436480 76642732 76769646 76919577
4762 76919577 77128678 77313245 77629103 78074127 78567547 79226538 79928839 80678223 81470167
4753 81470167 82318635 83078467 83862933 84524286 85046004 85446916 85787188 85921797 85919036 85915132
4743H5915132q6135j03886j88467k34285j44375j72436k86014k06654k76130k80636
4733H3936114k68705l74574l80056l80916m39033n00201n15429n38397n69916
4724G9968887n94315o16304o07161o04668p67525o79635o77289o38203o21655
4715G4162132p15865o67378q15040p44849p50606q84753r03308q12215q00478
4706F7067640q18500p56731p73183p45450p14814p51733o59760o22790n96539
4697F0628140m57821m77217l99235l48143l81618k19511k47358j57174n8146r1117
4687E7790800o1891J3986O623P3079J14603K24376K27941L96554M08810N11283
4677E9706164N84095O65501P47498Q86014J118663J282195J545239J944628K310852
$$ plain form
4743 85915132 85828997 85725111 85536644 85302359 85157984 84985548 84699534 84492880 84216750 83936114
4733 83936114 83667409 83292835 82912779 82531863 82092830 81592629 81077200 80538803 79968887
4724 79968887 79374572 78758268 78151107 77546439 76778914 76099279 75421990 74783787 74162132
4715 74162132 73446267 72778889 71963849 71219000 70468394 69583641 68680333 67868118 67067640
4706 67067640 66249140 65492409 64719226 63973776 63258962 62507229 61847469 61224679 60628140
4697 60628140 60170319 59693102 59293867 58945724 58564106 58344595 58097237 57940063 57881917 57790800
4687 57790800 57728909 57742895 57749518 57822597 57937200 58161576 58389517 58786071 59194881 59706164
4677 59706164 60290259 60955760 61703258 62589272 63707935 64990130 66535369 68479997 70790849
4668G0790849K353380J934167J744389J735376K023951K584122L088367L742411
4660H9997012M492952N241391O435078P964847R428495J0785316J2647061J5331316
4652A62323468J7316828J5702543J4993464J8097195K1483094K0835637J8048820
4645B88801049J2773756P32034p466389q843694r445393j1797396j2188631j1084703
4637B41480633j0228065q850001p928210o864493n957731n251714m175251k761965
4629A89463203j220463l35287o44367j716708k005314j191394j15114J089401
4621A83323957K350690K769618L204983N065652P057837R021458J1073308J3170090
4613B37037593J4697382J5238695J4868396J4137015J3299408J1468672P914745
$$ plain form
4668 70790849 73144229 75078396 76822785 78558161 80582112 83166234 86254601 89997012
4660 89997012 94489964 99731355 106166433 114131280 123559775 134345091 146992152 162323468
4652 162323468 179640296 195342839 210336303 228433498 249916592 270752229 288801049
4645 288801049 301574805 302306839 294840450 285996756 276551363 264753967 252565336 241480633
4637 241480633 231252568 222402567 214474357 207609864 201652133 196400419 192225168 189463203
4629 189463203 188242740 187907453 187263086 185546378 183541064 182349670 182234556 183323957
4621 183323957 185674647 188444265 191649248 196714900 203772737 212794195 223867503 237037593
4613 237037593 251734975 266973670 281842066 295979081 309278489 320747161 328661906
4606C28661906K788884k680037o748535r443919j0948693j1490196j1171549j0422297
4598B68545564r375717q249517p019378n754157m446443l189113k069639j125851
4590B27315749o03486m49503n69399o29149n74094m39663p26599j426276k697199
4581B19200381m322936n738086o806506p380734p581625p634005p368625o942871
4573A65424993o453923o027765n483761m965173m582162m113926l842162l659913
4565A26296208l535344l542200l691857l706928l557262l460362l337596l228789
4557I8235870l106609l008506k769911k474284k231852j923481j712967j584076
4549G9424184j305413j252273j162899r77877r87084r86968r38248r53705j013367
$$ plain form
4606 328661906 331450790 328770753 322022218 312578299 301629606 290139410 278967861 268545564
4598 268545564 259169847 250920330 243900952 238146795 233700352 230511239 228441600 227315749
4590 227315749 226712263 226262760 225693361 225064212 224490118 224050455 223323856 221897580 219200381
4581 219200381 214877445 209139359 202332853 194952119 187370494 179736489 172367864 165424993
4573 165424993 158971070 152943305 147459544 142494371 137912209 133798283 129956121 126296208
4565 126296208 122760864 119218664 115526807 111819879 108262617 104802255 101464659 98235870
4557 98235870 95129261 92120755 89350844 86876560 84644708 82721227 81008260 79424184
4549 79424184 78118771 76866498 75703599 74725722 73738638 72751670 71813422 70859717 69846350
4540F9846350q81111q91517r10278j011386r83051j003822r49676r03260q29088
4531F1483161p72056o76361n26120n32347n52259m02225l74389l37074l00689
4522E7009641l24451l35137k73130l09091l77971k90625k40409j21571r6325O1808
4512E4702739K21159L76334M20061N12270O06135Q07520R29981J037892J275653
4503F0889744J324302J361845J390059J181486R47064N18531J04648l85385p46294
4494F6586000j056024j088264j202360j183623j085096j016943r47912r31580
4486E8074198q97036q72767j004908j126272j177083j183751j304556j284793
4478D9223032j253206j223032j089344j066815r56212r36219p87996o08581n94125
$$ plain form
4540 69846350 68965239 68073722 67163444 66152058 65169007 64165185 63215509 62312249 61483161
4531 61483161 60711105 60034744 59508624 58976277 58424018 58021793 57647404 57310330 57009641
4522 57009641 56685190 56350053 56076923 55767832 55389861 55099236 54858827 54737256 54640931 54702739
4512 54702739 54923898 55300232 55720293 56232563 56838698 57646218 58576199 59614091 60889744
4503 60889744 62214046 63575891 64965950 66147436 67094500 67613031 67717679 67332294 66586000
4494 66586000 65529976 64441712 63239352 62055729 60970633 59953690 59005778 58074198
4486 58074198 57177162 56304395 55299487 54173215 52996132 51812381 50507825 49223032
4478 49223032 47969826 46746794 45657450 44590635 43634423 42698204 41910208 41301627 40707502
4469D0707502n37470m05178l55415l00246j38697k36928m1625J37247K25952K65034
4459C9320176M27775O27033O80563O68837O66929Q27270Q26402Q21406N58397
4450D5424788O6895n31542r27695j104482j258230j277161j256086j243851j277141
4441C6615495j145297j086901j045864r63954r78847p50572p49677o28655n39384
4432B8726344o00744o95373o28733p52755p55679o72260o32229o25566n98915
4423B2764090n74989o30839n50173l59222l68649l77656l96791l30857l46131
4414A8828783l09961l17428k22983k15417k32855j47928o3242p0852j24188k61975
4404A6861954j15439r2220o5589K1504j08165j05460j02374j22822j46782j87219
$$ plain form
4469 40707502 40170032 39764854 39409439 39109193 38970496 38733568 38691943 38829190 39055142 39320176
4459 39320176 39747951 40374984 41055547 41724384 42391313 43218583 44044985 44866391 45424788
4450 45424788 45491683 44960141 44032446 42927964 41669734 40392573 39136487 37892636 36615495
4441 36615495 35470198 34383297 33337433 32373479 31394632 30644060 29894383 29265728 28726344
4432 28726344 28125600 27430227 26801494 26048739 25293060 24620800 23988571 23363005 22764090
4423 22764090 22189101 21558262 21008089 20648867 20280218 19902562 19505771 19174914 18828783
4414 18828783 18518822 18201394 17978411 17762994 17530139 17382211 17318969 17248117 17123929 16861954
4404 16861954 16746515 16654295 16588706 16610210 16502045 16396585 16294211 16171389 16024607 15837388
4394A5837388j47518j22835r3629j03309j08700o751r961j64688q9368n3383p0977
4383A4866269k4400r7839p4226l2504j67743j46579n1189j06437j18315l8901
4373A4008136j32191p2153m2660J9454m0099L783R772o7523m5482L6246R7676
4362A3774959M2593M0967M9128J0160P135n3570o5049K0997l2994k869l5652q5641
4350A3670164j00800r6743n9516p5308p5106j09883q2480m2185j08178p647j2602
4339A2899716q4639n0161p885m1823J4508Q4241N1855j3322N1215O0336J23333
4328A3087374L0748k9216L4419M9692r4141o2232J257n3339n3524M5721p0505
4317A2886254L7639R159O8737J10424P6872Q9724K03586R5052J59875R6773J23207
$$ plain form
4394 15837388 15689870 15567035 15473406 15370097 15261397 15254646 15244685 15079997 14990629 14937246 14866269
4383 14866269 14841869 14744030 14669804 14637300 14469557 14322978 14271789 14165352 14047037 14008136
4373 14008136 13875945 13803792 13761132 13780586 13740487 13744270 13754042 13686519 13641037 13677283 13774959
4362 13774959 13817552 13858519 13907647 13917807 13924942 13871372 13806323 13827320 13794326 13791457 13755805 13670164
4350 13670164 13569364 13472621 13413105 13337797 13262691 13152808 13070328 13028143 12919965 12912318 12899716
4339 12899716 12815077 12764916 12757031 12715208 12729716 12813957 12865812 12852490 12903705 12964041 13087374
4328 13087374 13118122 13088906 13123325 13173017 13078876 13016644 13017901 12964562 12911038 12956759 12886254
4317 12886254 12923893 12933052 13001789 13112213 13189085 13278809 13482395 13577447 13737322 13834095 13957302
4306A3957302J39397R3989J84089K31847R8826K10031J68867J72536K35242K66445
4296A5758571J52809J70984K04502K56679K12326L29491L18720L38669L49882
4287A8092633M01199M24931M16257M71601O80492O45508R26192J072066J573994
4278B4704873J436235Q56407M85678N19184P00485R45988J132027J592674K068224
4269C4441775K569820K843683L626099M299760N209989O078585P210278Q647587
4261G4927576J1740129J3130367R621315J0931137J5975454J5163243J4300076
4254A65789297J1635842l247060r168961o534051r259808j1832195r818166r102105
4246A18462793p576302p194600o990442n851318n203794m336512l179519j736885
$$ plain form
4306 13957302 14096699 14190688 14374777 14606624 14705450 14915481 15084348 15256884 15492126 15758571
4296 15758571 15911380 16082364 16286866 16543545 16755871 17085362 17404082 17742751 18092633
4287 18092633 18493832 18918763 19335020 19806621 20487113 21132621 22058813 23130879 24704873
4278 24704873 26141108 26997515 27483193 28002377 28702862 29648850 30780877 32373551 34441775
4269 34441775 37011595 39855278 43481377 47781137 52991126 59069711 66279989 74927576
4261 74927576 86667705 99798072 109419387 120350524 136325978 151489221 165789297
4254 165789297 177425139 174178079 165009118 158475067 149215259 137383064 127564898 118462793
4246 118462793 110886491 103691891 96701449 90850131 85646337 81309825 78130306 76393421
4238G6393421j288836j364902l177035m441539l969072l627390l379171k665844
4230E2479632l383780m545655l919402l230482k725963k284741j973830j762665
4222B8653114j565592j347602j229957j212473r33284q65782q89005p79851o76931
4213A9152637n90798o62128m68295n28752m27057m23460n21427n45535l94943
4204A4590242l63404l27726l96333l42988k73992j98329l48087k12569k37166
4195A1889648k37136k17874k28316k39119j76372j85174j06998j17296j69018
4186A0212345j71408j04003j50947j14202j70126j52420j62045j79471q9258q7167
4176H831298j35864r8186j34995j30935m2026N6903j01476k4529j15762j02136
$$ plain form
4238 76393421 75104585 73739683 70562648 66121109 62152037 58524647 55145476 52479632
4230 52479632 49095852 44550197 40630795 37400313 34674350 32389609 30415779 28653114
4222 28653114 27087522 25739920 24509963 23297490 22364206 21498424 20609419 19829568 19152637
4213 19152637 18561839 17899711 17431416 16902664 16475607 16052147 15530720 14985185 14590242
4204 14590242 14226838 13899112 13502779 13159791 12885799 12687470 12339383 12126814 11889648
4195 11889648 11652512 11434638 11206322 10967203 10790831 10605657 10498659 10381363 10212345
4186 10212345 10040937 9936934 9785987 9671785 9501659 9349239 9187194 9007723 8918465 8831298
4176 8831298 8695434 8597248 8462253 8331318 8289292 8346195 8244719 8220190 8104428 8002292
4166H002292N811p5826j24812o3232j43585l6340n1145p6915j7516m2624m1897
4155G334211l9330o6492j7995l2598L5738m3675k625J3621J6900P5127J9480O1626
4143G353988O7691k91M4443R6415M3462k556j51o5411k5363j9727r041j9062j10746
4130G353651p5834r9218k0419j9742j23845q5040o7621m7065O228j64165m0400
4119F616530l6236o7080l2159p064m2494N7021N8217k6656L254M4457q0069N0197
4107F537918R4628Q3101R6138R7837N3910m8004l9351L1064p8191l8043l8260
4096F752747j71154o4976n6106j36562j0224j2489j09501j5681n1949n942L2289
4085F150452l3022O8354N7958J7427M6101j1523J5995J8966j5083Q4860J01625
$$ plain form
4166 8002292 8008103 7932277 7807465 7744233 7600648 7564308 7513163 7436248 7418732 7376108 7334211
4155 7334211 7294881 7228389 7210394 7177796 7213534 7169859 7167234 7180855 7197755 7272882 7292362 7353988
4143 7353988 7421679 7421388 7465831 7562246 7605708 7603152 7603001 7537590 7512227 7492500 7483459 7464397 7353651
4130 7353651 7277817 7178599 7158180 7138438 7014593 6929553 6861932 6814867 6821095 6656930 6616530
4119 6616530 6580294 6513214 6481055 6473991 6431497 6488518 6546735 6520079 6523333 6567790 6487721 6537918
4107 6537918 6632546 6715647 6811785 6909622 6963532 6915528 6876177 6907241 6829050 6791007 6752747
4096 6752747 6581593 6516617 6460511 6323949 6313725 6301236 6191735 6176054 6124105 6118163 6150452
4085 6150452 6117430 6185784 6243742 6261169 6307270 6295747 6311742 6330708 6315625 6400485 6502110
4074F502110Q1872J6582P4308Q6396J44787O9988J62114J70067O8568Q7964J14115
4063G578871R7791P4267J57529Q5942R6031J90566J65284J35300J15702J55434
4053H852717K24995J42605M8889R8660J63961J56043J42060J31149J59664N2063
4043A0172806J21508J18161P0344L9342J23614J10900L2405J33639Q7757Q9886
4033A1100362J47864M9024J36287J58865O8870k912O8581N4316Q4874K285q2260
4022A1786156o6374k5038q0804j25591r5590j42936j27029p6231j03842j86818
4012A0755903l2736n3307j31889j25086j7948l0417j21434j18878q4349r9447
4002I940412j92497j79718j26092j30560k01303j98556j77751j90662j83727j83709
$$ plain form
4074 6502110 6583982 6600564 6674872 6761268 6906055 6976043 7138157 7308224 7376792 7464756 7578871
4063 7578871 7676662 7750929 7908458 7994400 8090431 8280997 8446281 8581581 8697283 8852717
4053 8852717 9077712 9220317 9269206 9367866 9531827 9687870 9829930 9961079 10120743 10172806
4043 10172806 10294314 10412475 10482819 10522161 10645775 10756675 10789080 10922719 11010476 11100362
4033 11100362 11248226 11297250 11433537 11592402 11661272 11658360 11726941 11781257 11866131 11868416 11786156
4022 11786156 11719782 11694744 11613940 11488349 11392759 11249823 11122794 11046563 10942721 10755903
4012 10755903 10723167 10669860 10537971 10412885 10394937 10364520 10243086 10124208 10039859 9940412
4002 9940412 9747915 9568197 9442105 9311545 9110242 8911686 8733935 8543273 8359546 8175837
3992H175837k23308k32192j04985j54839j86569k38364j73476j56105j55962j38059
3982F411978j28891j31727j04702q5117j50901j00410j18660j58862m7202r3553
3972E291953o5616j0140m2048l2994k9229R684o3554o9247l8510K909j14547r5261
3960D743400j13332j18161r7986j12767k7939j03221r0476j1825j02497j48330
3950C816866k0250n7385k1736p5768k5980n0204q0481m8109L9112k2296o4010
3939C389759m1039o7879l1969j4134p1318k0047N179l8251n2906p97m6542n5074
3927B954982r251l1496q457J6383j9266l4483N602K2634k7221q1993L993m5392
3915B746035K9565j4538p1418J1828Q3218m9073j9015j7710J0864K7843m3478
$$ plain form
3992 8175837 7952529 7720337 7615352 7460513 7273944 7035580 6862104 6705999 6550037 6411978
3982 6411978 6283087 6151360 6046658 5961541 5810640 5710230 5591570 5432708 5385506 5291953
3972 5291953 5226337 5216197 5174149 5141155 5111926 5121610 5058056 4988809 4950299 4953208 4838661 4743400
3960 4743400 4630068 4511907 4413921 4301154 4273215 4169994 4079518 4067693 3965196 3816866
3950 3816866 3796616 3739231 3717495 3641727 3615747 3565543 3485062 3436953 3476065 3453769 3389759
3939 3389759 3348720 3280841 3248872 3234738 3163420 3143373 3148552 3110301 3057395 3056598 3010056 2954982
3927 2954982 2945731 2914235 2905778 2922161 2902895 2868412 2874014 2896648 2869427 2787434 2791427 2746035
3915 2746035 2775600 2761062 2689644 2701472 2784690 2735617 2716602 2698892 2709756 2737599 2694121
3904B694121m6665o632l9507k0616o1168K5918k8394N0817l9775l9940l2676K0204
3892B475687M7273j5277j5089M582K1381k1223o6205o211K1296o4431m6065k0940
3880B314778N2507K428k7263n641K8125k0915m001n2889K6587J0830p9563j3172
3868B231811m9986M7035N7395n4071l1368J8358J8537k372K124J7640J8543o5533
3856B208113P642N2893l4676n3281j2773n9006K1761K8502r764Q356m5025n839
3844B106903N8181k969j0268M1499l5550n5659M408J5801L2458L5843j10066j19694
3832A960887N5708L4856N7168p795j8252M5872N0250n614J4142j5320l5712m8824
3820B087366m2717L2460J0281k3681k7971J8583j8629N6344N0230M8270m6689
$$ plain form
3904 2694121 2647456 2640824 2601317 2580701 2519533 2545451 2517057 2567874 2528099 2488159 2455483 2475687
3892 2475687 2522960 2507683 2492594 2497176 2518557 2497334 2431129 2424918 2446214 2381783 2335718 2314778
3880 2314778 2367285 2369713 2342450 2336809 2364934 2344019 2340018 2287129 2313716 2324546 2244983 2231811
3868 2231811 2181825 2228860 2286255 2232184 2200816 2219174 2237711 2235339 2237463 2255103 2273646 2208113
3856 2208113 2215755 2268648 2233972 2180691 2167918 2108912 2130673 2159175 2149411 2157767 2112742 2106903
3844 2106903 2165084 2162115 2151847 2193346 2157796 2102137 2106545 2122346 2154804 2190647 2080581 1960887
3832 1960887 2016595 2051451 2108619 2100824 2082572 2128444 2178694 2173080 2187222 2171902 2136190 2087366
3820 2087366 2044649 2077109 2087390 2063709 2035738 2054321 2035692 2092036 2142266 2190536 2143847
3809B143847n5316K1538J2102M7920J5308j0969l3064p085l7448L2682M7130L6660
3797B213305k2161m7468k6325J2094K9225K4535q538l2832L2867K8824m7366m9546
3785B106614O0811J8719k7136K2563j7568P2780N5566o506J2755j868J5501M6910
3773B359141L9313J9893J7211J3414k773O4700J38827M4962m2711K4546Q751l0373
3761B654901L7810o7919k4922J1408J151j2621m5343n4272j5755J6685m4711J4182
3749B470594L4768p4148J6170Q3328K1847j6728j765J9041j1712M730L7479K8097
3737B611701k2301k1770L3240Q5357m6574N0249j2556n0309k546n0923l1412j05311
3725B436845R6421K1529p8852k5668o1316o0503N7315o072l6602J2236l6758r69
$$ plain form
3809 2143847 2088531 2110069 2122171 2170091 2185399 2174430 2141366 2134281 2096833 2129515 2176645 2213305
3797 2213305 2191144 2143676 2117351 2129445 2158670 2183205 2174667 2141835 2174702 2203526 2156160 2106614
3785 2106614 2167425 2186144 2159008 2181571 2164003 2236783 2292349 2285843 2298598 2296730 2312231 2359141
3773 2359141 2398454 2418347 2435558 2448972 2446199 2510899 2649726 2694688 2651977 2676523 2685274 2654901
3761 2654901 2692711 2624792 2599870 2611278 2612429 2599808 2554465 2500193 2484438 2501123 2456412 2470594
3749 2470594 2505362 2431214 2447384 2530712 2552559 2535831 2534066 2553107 2541395 2546125 2583604 2611701
3737 2611701 2589400 2567630 2600870 2686227 2639653 2689902 2677346 2627037 2624491 2573568 2542156 2436845
3725 2436845 2533266 2554795 2475943 2450275 2388959 2328456 2385771 2379699 2343097 2355333 2318575 2317606
3713B317606j9500k3956n5343K5203N048j16135J2393M3935k7204J5009j012p7475
3701B098569N5234n1082j8656M5289K7361N5292o8708k5778n2762M2071M3565
3690B150395N5259k6834k2532J7908m0130M9134O8079L5194J414j7850J19859
3679B389896l063P6329M1548M1251J20531N4255k3983N5672Q7377J12877J05721
3668C058411O2208R5551J29782R1318Q4988J09291j5877J17134Q7812R1645N2199
3657C964462K3758O191m4147o4520l7325L524M1104o4044k0093j1962L4055r3762
3645C737241n7789L0710J6783K8489O645K4870L3027j6051L0255J7566j6940M0815
3633C875621Q8330P0286L8294Q0808K1363j05482J8899j1940m6193p0772j6570
$$ plain form
3713 2317606 2298106 2274150 2218807 2244010 2249058 2132923 2145316 2189251 2162047 2177056 2176044 2098569
3701 2098569 2153803 2102721 2084065 2129354 2156715 2212007 2143299 2117521 2064759 2106830 2150395
3690 2150395 2205654 2178820 2156288 2174196 2134066 2183200 2251279 2286473 2287887 2270037 2389896
3679 2389896 2386833 2463162 2504710 2545961 2666492 2720747 2696764 2752436 2839813 2952690 3058411
3668 3058411 3120619 3216170 3345952 3437270 3522258 3631549 3615672 3732806 3820618 3912263 3964462
3657 3964462 3988220 3994411 3950264 3885744 3848419 3851943 3893047 3829003 3808910 3796948 3831003 3737241
3645 3737241 3679452 3710162 3726945 3755434 3762079 3786949 3819976 3803925 3834180 3851746 3834806 3875621
3633 3875621 3963951 4034237 4072531 4153339 4174702 4069220 4088119 4076179 4029986 3959214 3942644
3622C942644o9549k7297K3890j52312j04366n5523l1789r6372j45765o5629q7566
3611C130366o3449q0057p0367k0379p6782q3656q9878m5598o1876k4092J1874
3600B526106n1155q7529l7189k2896K5270m4177j8623o1427k3112j8208L0930
3589B217990m3195j5292m1140m2680K0442q1366m2440j02J4354J2892k8742n112
3577A965609P1727l6659O416j6857k9156l1458j6921K3492r986J4706M0623j9465
3565A962071p2637R9989k4833M5108l4933l1531K0051j6792L9775m5581k035R0622
3553B029274J1654Q50J72o2932n5775J00324Q1147m3504j2835j2857N5147p832
3541B082833p415J3510K0929m2584N057N6370Q0556L2642P200L3469L0285K6383
$$ plain form
3622 3942644 3873095 3845798 3869688 3717376 3613010 3557487 3525698 3429326 3283561 3217932 3130366
3611 3130366 3066917 2986860 2916493 2896114 2819332 2735676 2645798 2600200 2538324 2514232 2526106
3600 2526106 2474951 2387422 2350233 2327337 2352607 2308430 2289807 2228380 2205268 2187060 2217990
3589 2217990 2174795 2159503 2118363 2075683 2096125 2014759 1972319 1972217 1986571 1999463 1970721 1965609
3577 1965609 2037336 2000677 2007093 1990236 1961080 1929622 1912701 1936193 1926207 1940913 1981536 1962071
3565 1962071 1889434 1989423 1964590 2009698 1974765 1943234 1963285 1946493 1986268 1940687 1938652 2029274
3553 2029274 2040928 2041778 2041950 1979018 1923243 2023567 2104714 2061210 2048375 2035518 2090665 2082833
3541 2082833 2075418 2088928 2109857 2067273 2072330 2128700 2209256 2241898 2249098 2282567 2312852 2339235
3529B339235K1488k5728l3433M1004M2558L5844J1274n882P7918M641K0181O4575
3517B593675L5733J01037n41J5136R0786J4808M3384Q8209j7484O538K4775L6013
3505C032069O9294M3703O1066N7859J4218M1424Q4669J25241J6296O5333K8593
3494C639765L1078J05268N4197N3510R2443R2807J7964O9556J23471P3324J27137
3483D480520R8468Q6104L7960J49479J80003J88256J45617R5473J76061K22886
3473E860827K39495K46210L39681K51177K71672L18272L71448K95689K71441J98617
3463H664529K46253J09339J25080k0622j04142m1951q0897j78822j84734j27815
3453H406218j69866j57037k09357j04394j35287j78455j37633p0902j35293k09550
$$ plain form
3529 2339235 2360723 2334995 2301562 2342566 2385124 2420968 2432242 2426360 2504278 2508919 2529100 2593675
3517 2593675 2629408 2730445 2729904 2745040 2835826 2850634 2894018 2982227 2964743 2971281 2996056 3032069
3505 3032069 3101363 3145066 3206132 3263991 3278209 3319633 3404302 3529543 3545839 3611172 3639765
3494 3639765 3670843 3776111 3830308 3883818 3976261 4069068 4087032 4156588 4280059 4353383 4480520
3483 4480520 4578988 4665092 4703052 4852531 5032534 5220790 5366407 5461880 5637941 5860827
3473 5860827 6100322 6346532 6686213 6937390 7209062 7527334 7898782 8194471 8465912 8664529
3463 8664529 8910782 9020121 9145201 9124579 9020437 8978486 8897589 8718767 8534033 8406218
3453 8406218 8236352 8079315 7869958 7765564 7630277 7451822 7314189 7243287 7107994 6898444
3443F898444j33161j45559k05343q4236q6145j59546p2507q1689m3201l7267k2782
3432E827008n4469r2183j09120m3084j55497j86228k9997j32622j74126j12873
3422D736809j09812n4578q4880j55023j10126j20102q568n6118j07171j04233
3412C826198o7566m5705r7533n1667n6395j10369p4561k4188q0399n6372J4818
3401C176261M539o2072o9988m9369j5385l9326o5376r835N006j5133j27482l2618
3389B699222M7937o9721J8307k0832m6291J8787N6826p89n0152m4358o3979R2591
3377B637548j3968j6528j8490L0285o297j11479j6517k3759L4451q6443m7160
3366B361643j2238N5926l14n6605k6239K46k3765n3259O6404o9008J9524L9771
$$ plain form
3443 6898444 6765283 6619724 6414381 6330145 6244000 6084454 6011947 5930258 5887057 5849790 5827008
3432 5827008 5772539 5680356 5571236 5528152 5372655 5186427 5156430 5023808 4849682 4736809
3422 4736809 4626997 4572419 4487539 4332516 4222390 4102288 4093720 4037602 3930431 3826198
3412 3826198 3758632 3712927 3615394 3563727 3507332 3396963 3322402 3298214 3217815 3161443 3176261
3401 3176261 3180800 3118728 3048740 2999371 2983986 2944660 2879284 2869449 2874455 2859322 2731840 2699222
3389 2699222 2747159 2677438 2695745 2674913 2628622 2647409 2704235 2703446 2653294 2608936 2544957 2637548
3377 2637548 2623580 2607052 2588562 2618847 2612550 2501071 2484554 2460795 2495246 2408803 2361643
3366 2361643 2349405 2405331 2405017 2348412 2322173 2322419 2298654 2245395 2311799 2242791 2262315 2302086
3354B302086l6410N3434K375j2577J5319o7409l3435J686o946J9235j9662N8352
3342B276048l1096j6505K9676k2564J5221n5710j2821k8535l4637l3501J480N393
3330B092449j6532l1267o1289k58o639O093M1386j5338m9745K2387q992o7676
3318A904579m4762K2357O83p9166m8311j3461r15k6577L4909L221l1170o4080
3306A657307l291N0350m8552q3697k1227M0542J7063J0922J5611m5427o8772k864
3294A517965k9534M950K3187j458J0645m1795m0432K9340K994p601l5177m1844
3282A391240M2981j7916J0060l0467l5019o7918O135J5274K6944K9678j7842l1533
3270A321617k7248l2638J724j5835N8305j0571r274l7295l9742l1050k5479j700
$$ plain form
3354 2302086 2265676 2319110 2321485 2308908 2324227 2256818 2223383 2225069 2218123 2237358 2217696 2276048
3342 2276048 2244952 2228447 2258123 2235559 2250780 2195070 2182249 2153714 2119077 2085576 2087056 2092449
3330 2092449 2075917 2044650 1983361 1983103 1976464 1982557 2023943 2008605 1958860 1981247 1972255 1904579
3318 1904579 1859817 1882174 1882857 1803691 1755380 1741919 1741004 1714427 1749336 1752557 1721387 1657307
3306 1657307 1654016 1704366 1655814 1572117 1550890 1591432 1608495 1619417 1635028 1589601 1520829 1517965
3294 1517965 1488431 1493381 1516568 1515110 1525755 1483960 1443528 1472868 1475862 1468261 1433084 1391240
3282 1391240 1434221 1416305 1426365 1395898 1360879 1292961 1299096 1314370 1341314 1370992 1353150 1321617
3270 1321617 1294369 1261731 1263455 1247620 1305925 1295354 1286080 1248785 1209043 1177993 1152514 1150814
3258A150814o8058O5292J0138l5156P5858K1776m0406m4756J8545L254j3080J0926
3246A155147n2422r569p390o319j5824P9582J9261m2640l3555Q9592k6086l0759
3234A119018n7196J9680M8528q571k1814L5927m3398K3962L585Q044j1066k0800
3222A095899R682p545L915L0139R227J9948m7431N007N0157J7038M2197k7891
3210A200342p8722k8321N4072J248K8853l4807j1595M7612K4094P4291j5332m0417
3198A221318O0578p4257Q6067J6056r550p584k962j4496l0575J9401k8592l750
3186A231654Q7318K9182m5663m749L0468j164k289K5985l4025K0402M0282J7032
3174A394433O4055k5916l8254L9270L5233O827L8998R47m0797L3014J02205L0907
$$ plain form
3258 1150814 1082756 1148048 1158186 1123030 1198888 1220664 1180258 1135502 1154047 1157301 1144221 1155147
3246 1155147 1102725 1093156 1085766 1079447 1063623 1143205 1162466 1119826 1086271 1175863 1149777 1119018
3234 1119018 1061822 1081502 1130030 1121459 1099645 1135572 1092174 1116136 1119721 1127765 1116699 1095899
3222 1095899 1105581 1098036 1101951 1132090 1141317 1161265 1113834 1118841 1168998 1186036 1228233 1200342
3210 1200342 1121620 1093299 1147371 1148619 1177472 1142665 1131070 1178682 1202776 1277067 1261735 1221318
3198 1221318 1281896 1207639 1293706 1309762 1300212 1292628 1289666 1275170 1244595 1263996 1235404 1231654
3186 1231654 1318972 1348154 1302491 1297742 1328210 1327046 1324757 1350742 1316717 1337119 1377401 1394433
3174 1394433 1458488 1432572 1394318 1433588 1468821 1475648 1514646 1515593 1474796 1507810 1610015 1640922
3162A640922M0704M0985o024M1682M6206L9936N7414L5253J9655Q4968O1508J02618
3150B205827L2658J3193M6799m085J03665N3189J03033N7700N1315R7369k4411
3139B736252n1605L6863K9909O4347Q3552N7643L2975k140K0976N1406M7758M3273
3127C151209J37090P3088J45937J06339J7480J47512J05768J18257J72340J27779
3117D302799O4737J39404L5685j03538j8783j02198k3568j37933j6405l3581n8246
3106D048373n3767O1767R4254K6508j9822n5366K1269l1867j8399K4174l7355
3095D059769N0976M1357n2636O286k772j8677m6793l2155k2875m4102j3860o8324
3083C856194q4070n6174j04463k6892q0298n7491L621r5743o5509m6050l6708
$$ plain form
3162 1640922 1681626 1722611 1716587 1758269 1804475 1844411 1901825 1937078 1956733 2041701 2103209 2205827
3150 2205827 2238485 2251678 2298477 2294392 2398057 2451246 2554279 2611979 2663294 2760663 2736252
3139 2736252 2684647 2721510 2751419 2815766 2899318 2956961 2989936 2987796 3008772 3060178 3107936 3151209
3127 3151209 3288299 3361387 3507324 3613663 3631143 3778655 3884423 4002680 4175020 4302799
3117 4302799 4367536 4506940 4542625 4439087 4420304 4318106 4294538 4156605 4140200 4106619 4048373
3106 4048373 3994606 4056373 4150627 4177135 4157313 4101947 4123216 4091349 4072950 4097124 4059769
3095 4059769 4110745 4152102 4099466 4105752 4102980 4084303 4037510 4005355 3982480 3938378 3924518 3856194
3083 3856194 3772124 3715950 3611487 3584595 3504297 3446806 3450427 3354684 3289175 3243125 3206417
3072C206417K3667k3022J5420o6383j11464p7017j02225o7919q4982o8526r4290
3061B549676o4658r1225o1418J5578p0824n7675p3261p6558k7744j8169j02981
3050A920741m6739n4096o029l0783p8154j21600O095k1916k6329l9745m5677l2173
3038A423595j8773k037l2058m7363p61m0985m7023K0710m0081j5209j4959o1059
3026A123997n5945J2116K3413m7287l9982l2003L5617k4576n67l871n4243j0249
3014I26420n7219m0703J7370k1935M9764M476k3776m1589L9769Q98m3144n1710
3002G58621K6134j234l4626k371o282j1525m0328j9282p83P5934r383K1906j12198
2989F44583L3929q370j7859k7132l6526L9293J0153m8732q306J1270m3662J2835
$$ plain form
3072 3206417 3230084 3207062 3222482 3156099 3044635 2967618 2865393 2797474 2712492 2643966 2549676
3061 2549676 2485018 2393793 2332375 2347953 2277129 2219454 2146193 2069635 2041891 2023722 1920741
3050 1920741 1874002 1819906 1813877 1783094 1704940 1583340 1589435 1567519 1541190 1501445 1455768 1423595
3038 1423595 1404822 1402785 1370727 1323364 1322603 1281618 1234595 1255305 1215224 1200015 1185056 1123997
3026 1123997 1068052 1080168 1103581 1056294 1016312 984309 1019926 995350 994783 990912 936669 926420
3014 926420 869201 828498 845868 823933 873697 878173 854397 812808 852577 853475 810331 758621
3002 758621 784755 783521 748895 746524 740242 728717 688389 669107 668324 744258 734875 756781 644583
2989 644583 678512 670142 652283 625151 588625 627918 638071 589339 581033 592303 548641 561476
2977E61476P6782l5819K3702l5048o2220J4433K1114P0460j4977j55829m8409
2966D15665P8924O9977j7313j0182m3525K9298J1570j9295P895m3832J9312n087
2954D93407m3508l2427j316J0457L740j3151K6569j435l6664j1903k0438O3336
2942D36667J5208P343j9947j7209j3137j5646M6835o1457l2572k1088r474M9301
2930C64824l6625m844K9234k5741l4145K496O931P3473m0244O420m9952L204N4758
2917C49789J1611l2343R244k5957J824R289l5327Q7836k158k2074j9097m8152
2905B84485J2346J7234J2055m019j4137M143p5388L0476l5207J3629L4073n5568
2893B24122o0245K5687K2530J4026k2778Q0730O429j5272M1438m6185K0853k2858
$$ plain form
2977 561476 638258 602439 626141 591093 528873 543306 564420 634880 619903 464074 415665
2966 415665 494589 564566 547253 537071 493546 522844 534414 515119 523014 479182 498494 493407
2954 493407 449899 417472 416156 426613 430353 417202 443771 442336 405672 393769 373331 436667
2942 436667 451875 459218 439271 422062 408925 393279 440114 378657 346085 324997 315523 364824
2930 364824 328199 323355 352589 326848 292703 295199 302130 375603 335359 341779 291827 295031 349789
2917 349789 361400 329057 338301 312344 314168 323457 288130 375966 373808 351734 332637 284485
2905 284485 296831 314065 326120 322101 307964 312107 236719 267195 231988 245617 279690 224122
2893 224122 163877 189564 212094 226120 203342 284072 290501 275229 316667 270482 291335 268477
2881B68477J566k698m72K7844k7211K7272j9758K9452l2910k3075K912j3617o5425
2868A72357L8396M9930O205j0678j8143k6609M8326l2859l1421j3358J1854K0530
2856B14530Q794M7045J5031j0747n8822j958P8576M437j24324J5995M1045M1681
2844B71283o1367k308K5465k4743m0157Q6171n8374j9624P9821q9157J4220J5037
2832A96267Q7722o8722Q511k1798L0091L5540l6171j06667k0911N4077K897L0724
2820A91560J13510l8179q5874o4975K5600L7371j923L405m5194N2837k1367k4231
2808A42540L9815n8858N1543L7970o1964k7415j1094Q3920M2468L4934n8220P9040
2796B94679r6808l4812K4322j6193q6684P5039J713o1953L8710O0849j085L45
$$ plain form
2881 268477 270043 267345 266873 294717 267506 294778 275020 304472 271562 248487 251399 237782 172357
2868 172357 210753 260683 266888 256210 238067 211458 259784 226925 195504 182146 194000 214530
2856 214530 223324 270369 285400 274653 215831 213873 292449 296886 172562 188557 229602 271283
2844 271283 209916 207608 233073 208330 168173 254344 195970 176346 256167 167010 181230 196267
2832 196267 283989 215267 223778 201980 232071 267611 231440 124773 103862 157939 160836 191560
2820 191560 305070 266891 181017 116042 141642 179013 177090 180495 135301 188138 166771 142540
2808 142540 182355 123497 175040 213010 151046 123631 112537 196457 238925 273859 215639 294679
2796 294679 197871 163059 187381 171188 84504 159543 161256 99303 138013 198862 197777 198122
2784A98122m5760k7453N37n7345J4052N9096N8435j2602m8442K0022O978L173
2772A68813K4681K2893K4055l4430j3520o66L5465J2439q1313j7655K3175j1875
2760A52062K8913l1369k0783K1320K185L608O0007L540l3956m559J6693k4112
2748A73549n9487k7984j1962R673j4568O394O6299L3445l3994n4844K2035J0311
2736A18867l9346M4111Q078M4650M6601m0369j19432K3535J1439m6681L0697K4692
2724A06842L22L6113L555q431K7419J852m4794j7834N9721Q582k6646J6859n5410
2711A08150j9147P6228k8582j9228j2636Q783R492m6306R784k7214N960K7521
2699I2805Q0991K4676o0073P4649o3545m9580L491l7521l9870J0097K2162N4126
$$ plain form
2784 198122 152362 124909 125446 68101 82153 141249 199684 187082 138640 158662 165640 168813
2772 168813 193494 216387 240442 206012 192492 191826 227291 239730 158417 140762 163937 152062
2760 152062 180975 149606 128823 150143 152328 155936 215943 219483 185527 180968 197661 173549
2748 173549 114062 86078 74116 83789 69221 75615 141914 175359 141365 86521 108556 118867
2736 118867 79521 123632 131710 176360 222961 182592 63160 86695 98134 51453 82150 106842
2724 106842 107164 143277 146832 138401 165820 167672 122878 105044 164765 173347 146701 163560 108150
2711 108150 89003 165231 136649 117421 104785 113568 123060 76754 86538 59324 65284 92805
2699 92805 173796 198472 138399 213048 149503 99923 103414 65893 26023 36120 58282 112408
2687A12408o4920k8660N8304m3334N6883r04m4481K3107K142k9696K2651M6778
2675A10278K3152j7749j0656Q440L8106K4979p3696o7871L8630L023K6007J5636
2663A18279n8521K7030k6347J5098k8792K6278N318o2999k4980N2663J2409O748
2651F2184M8788p372p2030Q522o12N2590K772k6761l2585L6792M9804r2031o9771
2638c9710Q1723M5688k0280K7510J5799P451K1088k4491j12829j8119J3489M7733
2626D5052k5330j8433N722M6502N0539n7627L2480k1346N2522p7759P9384K1772
2614A33478j7616L3440k2063J0516n3852L657m2652K1436M7794p1295n3083M6969
2602C6729n977k9642J3953K5063j0410J08287j5506k9043K6605M2428r776K2884
$$ plain form
2687 112408 47488 18828 77132 33798 90681 89777 45296 68403 70545 40849 63500 110278
2675 110278 133430 115681 105025 113465 151571 176550 102854 34983 73613 76636 102643 118279
2663 118279 59758 86788 60441 75539 46747 73025 78343 15344 -9636 43027 55436 62184
2651 62184 110972 103600 31570 40092 39480 92070 94842 68081 35496 72288 122092 30061 -39710
2638 -39710 42013 87701 67421 94931 110730 118181 139269 114778 1949 -16170 -2681 45052
2626 45052 19722 1289 7011 53513 104052 46425 78905 57559 110081 32322 111706 133478
2614 133478 115862 149302 127239 137755 83903 87560 44908 66344 114138 42843 -10240 36729
2602 36729 30752 1110 15063 40126 29716 138003 122497 93454 120059 162487 152711 175595
2590A75595j9098m1460j8786k1959j3486P118n346J1004M2403J092p2863O649
2578E0863K2165Q217J942m5050K8640M735q0452k240M1591P221N198k6069L0895
2565D7656O2132K4340k5k454o3023o0852R2490K3391j2673n0219j8736j9137J9765
2552D2655l2251n4219P688J0793M1635O5161L4912m8095M3399j5007l9859J6000
2540G2812k847l8643m7417J3427L703k2019J9956J614J2257l1386q373M2786P2910
2527H8780l3842n0437O0633k0721o309m4831l524Q780L3992p671L834k8934j8585
2514a8835L3486L7729l614P300k2373j2920l691n585M1505M5165n5396k3859K3151
2501D2063k9598K2345k1186O5913k4334l5081N2692j1424k306j5508k911K1387
$$ plain form
2590 175595 156497 115037 96251 74292 60806 67924 62578 73582 115985 117077 44214 50863
2578 50863 73028 81245 83187 38137 66777 71512 -8940 -11180 30411 37632 42830 16761 47656
2565 47656 109788 134128 134103 131649 68626 7774 100264 123655 110982 60763 42027 22890 42655
2552 42655 10404 -43815 -36127 -25334 16301 81462 116374 68279 111678 96671 56812 72812
2540 72812 69965 31322 -16095 -2668 1035 -20984 -1028 586 12843 -18543 -26916 15870 88780
2527 88780 54938 4501 65134 44413 38104 -6727 -10251 -1471 32521 24850 28684 -250 -18835
2514 -18835 14651 52380 48766 56066 33693 20773 17082 11497 53002 98167 42771 18912 42063
2501 42063 12465 34810 13624 79537 55203 20122 72814 61390 59084 43576 40665 62052
2489F2052M2120K6893k9736l2590J0525n0485r7485L8511K7141L903K6028m6691
2477a9814l6187Q091L9914N8834J1736j6539J3897k7714n0916Q8904l8500N433
2465C7139J1333q8409M4309Q5459k6831J2905k0673N3212o3307l8150N4490l7649
2453B3828m6925L484M9786O2594n799j1010K6395k9826m7988j1073l4701j0490
2441c1725r415J6818J6577K6199K0833L2184P4164q730p5746q883P2816l5634
2429H9458l5260j9757K2525K5521K055j433J0838l9899m8290R1850Q581k6260
2417G9929r137n8581K8438L7820M9559J2896k5585M118m3876M6936l7333M224
2405H9408n5753p2968N6968O9737r659j0818J3834L4399l1575l0985j2299J5097
$$ plain form
2489 62052 104172 131065 101329 68739 79264 28779 -68706 -30195 -3054 849 26877 -19814
2477 -19814 -56001 -47910 -7996 50838 62574 46035 59932 32218 -18698 70206 31706 37139
2465 37139 48472 -39937 4372 89831 63000 75905 55232 108444 45137 6987 61477 23828
2453 23828 -23097 -19613 30173 92767 86968 75958 102353 72527 24539 13466 -21235 -31725
2441 -31725 -41140 -24322 -7745 18454 39287 71471 145635 136905 61159 52276 125092 89458
2429 89458 54198 34441 56966 82487 84542 83109 93947 54048 5758 97608 106189 79929
2417 79929 70792 12211 40649 78469 128028 140924 115339 119457 75581 122517 85184 89408
2405 89408 33655 -39313 17655 87392 77733 66915 80749 115148 83573 52588 40289 55386
2393E5386o638J7554M9194o5180N983N2126P971j4611j3260l702P6992k6063k1679
2380A14073L424K8429q692m3502P1556m908j1143N4667K1496M1920m1585M0371
2368B66106m7923m821M6079j770n8639J02212l9954l3868K3857P251N8011N9749
2356C76290K9155J6797l356L2338M7427K1606J2388O1009J7067K5679m8739k7116
2344E60545Q4332K2007N503MM9645R9621R3305Q9154J36394J21386R4196J45609
2332A501701K02014J32706K33283L02215L76391M11454M56258O65005P67457Q77487
2322E925971O33866M82105J0421n60235o19721o25232n46337n09193m29136k82162
2312C480347k28831k32683j45233j16570m5160p2635p1006j91751j53737j06902
$$ plain form
2393 55386 48748 66302 115496 50316 56299 108425 116396 101785 88525 84823 161815 135752 114073
2380 114073 117497 145926 137234 93732 165288 160380 149237 203904 225400 267320 225735 266106
2368 266106 218183 213362 259441 257671 199032 301244 261290 227422 251279 258530 316541 376290
2356 376290 405445 422242 418886 451224 498651 520257 532645 593654 610721 636400 587661 560545
2344 560545 644877 666884 672387 672391 722036 821657 914962 1004116 1140510 1261896 1356092 1501701
2332 1501701 1703715 1836421 2069704 2371919 2748310 3159764 3616022 4281027 5048484 5925971
2322 5925971 6559837 7041942 7052363 6492128 5872407 5247175 4700838 4191645 3762509 3480347
2312 3480347 3251516 3018833 2873600 2757030 2711870 2639235 2568229 2376478 2222741 2115839
2302B115839j30124k21021j77396j0709r0864j81431p3831j3132n4356j52031
2292A010944l3981l5261q9692p3740j142m4426K8499q4020r530l3785n7873n101
2280E70892l4048j7011p6466L7967P610l8655m2603Q4461j5675n3511J8297J5304
2268D56562n1058k7748k5003l4364Q477p890k6151N517L425m4162Q63k923j2620
2255B42925O828k2116k6894l389m7292K2129j1023M7987L6065j1886L69j7051
2243B16652K8054J1925K6850j2658K0632n9645n2131K3647j1330k151m6407M4986
2231A88424M5670K5438m3632n6189J5894M1505k4165r2921M5037L0369j972k900
2219A70558J5433j968k1170m3875M9109k5265j3553k1792n1393n14o1737L7357
$$ plain form
2302 2115839 1985715 1764694 1587298 1576589 1485725 1304294 1230463 1217331 1162975 1010944
2292 1010944 976963 941702 852010 778270 777128 732702 761201 677181 667651 633866 575993 570892
2280 570892 536844 519833 443367 481334 488944 450289 407686 492147 476472 422961 441258 456562
2268 456562 405504 377756 352753 318389 326866 318976 292825 298342 301767 257605 258468 255545 242925
2255 242925 249753 227637 200743 197354 150062 172191 161168 209155 245220 233334 233703 216652
2243 216652 244706 256631 283481 270823 291455 231810 179679 203326 191996 189845 143438 188424
2231 188424 234094 259532 215900 159711 175605 217110 192945 100024 145061 175430 173458 170558
2219 170558 185991 184023 162853 118978 168087 142822 129269 107477 56084 55570 -6167 31190
2207C1190R2046j0147k6802K6489L1532l3104k8776n247J6836J5079L7771q603
2195A38264n0800N9538j9791K3059p1679N8734K9972m7890j0267j1340L1686p3882
2183E5604j1920J8092j4583L5076l6431m88L5377m0072O7549L8139k0069k9310
2171I6964l0207J878k497j0055N6057m0630j6134j3791K4711J497K967k1131L0162
2158G9791J4573j18295p401M5162L8391R0349L6967m7184p9655q686J0228k6469
2146B7771m6021J8918K6083K9311m144K94J9435K5774J2852j0007l7794q718k0255
2133C3499j5442L2552m1177j8595Q8904l844K8768l0650q142O924l925L8094J9841
2120A26807m418j13002k5426l0829M8016M3146m402m7005N6962j5038K6298K208
$$ plain form
2207 31190 123236 113089 86287 112776 144308 111204 82428 77181 94017 109096 146867 138264
2195 138264 87464 147002 127211 150270 78591 137325 167297 119407 109140 97800 129486 55604
2183 55604 43684 61776 47193 82269 45838 45350 80727 40655 108204 146343 126274 96964
2171 96964 66757 68635 66138 56083 112140 71510 55376 41585 66296 67793 70760 49629 79791
2158 79791 94364 -23931 -31332 13830 52221 142570 179537 132353 52698 44012 54240 27771
2146 27771 -18250 668 26751 56062 51918 52212 71647 97421 110273 100266 62472 53754 33499
2133 33499 18057 50609 9432 -9163 79741 75897 104665 74015 65873 72797 68872 106966 126807
2120 126807 122389 9387 -16039 -46868 1148 44294 39892 -7113 49849 34811 61109 63317
2108F3317K6176m2227q027N0054k6886n0756m8769K0703M7418M0055l4803o850
2096B9405J1849J2822o8522L6124N809m087M48K3860N3607o9356R370N0694N690
2083I7713K90m4438n1143o4229m318O7480k0682J6036n468J3220k5487J7964p1206
2070g4268M881N2500Q0590L0570j952J6609k4623m0465r6013l4493N9130P5478
2058D7944p4126k8427O8352L9202n5554L6862P0779Q0117m6950n6029K234j8317
2046F6087J419n8320L9584p6898J5730N6054k9709k9609J1134m9373M5360P0332
2034F1791l7848K1628m6643P0000j4994n9607O0050O9145n5775n0971j1758J7542
2022B2560N4205o108m7133L0790p733j5721o1325K8998M8357l4806o4002K1579
$$ plain form
2108 63317 89493 47266 39239 89293 62407 11651 -37118 -16415 31003 71058 36255 29405
2096 29405 41254 54076 -14446 21678 27487 23400 23848 47708 101315 31959 41329 92023 97713
2083 97713 98003 53565 2422 -61807 -66125 1355 -19327 -3291 -8759 4461 -21026 -3062 -74268
2070 -74268 -69387 -16887 63703 94273 92321 108930 84307 43842 -52171 -86664 -27534 47944
2058 47944 -26182 -54609 13743 52945 -2609 34253 105032 185149 138199 82170 84404 66087
2046 66087 67506 9186 48770 -28128 -12398 43656 13947 -15662 -4528 -53901 -8541 61791
2034 61791 23943 45571 -1072 68928 53934 -5673 54377 123522 67747 16776 5018 22560
2022 22560 76765 70657 23524 54314 46581 30860 -30465 -1467 46890 12084 -51918 -30339
2010c0339M5819j7339R473J5372M774j6535J3887J0011K6137k5901O4094l8344
1998F1109m2550K3721k7124R87o0404k0736L0939n522J5251O6771L3648l8802
1986C7288k430J5331l129M0976o2599o3449j4713N0311j7252k5429K9196K8628
1974A2729P17l3295L5039j5952n8759N1132M5443m1865p7103P8216M0960n3841
1962a6579J076J4909k211n8813j9358n80N375J9862M5353J5670k433K5164j1896
1949A5539K7881O0033p9948k4931l3983m7880J3824K3884k3259M0303O6434K498
1937D0395R835K3741M134m9281J884O076m5210J2727m2805N536m382j8615o040
1924f2005k0866L6223J2033Q0125j3452k1533l2665p176J2717K1952J5792O215
$$ plain form
2010 -30339 15480 -1859 7614 22986 27760 11225 25112 35123 61260 35359 99453 61109
1998 61109 18559 42280 15156 16143 -44261 -64997 -34058 -39580 -24329 42442 76090 37288
1986 37288 34858 50189 47060 88036 25437 -38012 -52725 -2414 -19666 -45095 -15899 12729
1974 12729 13446 -19849 15190 -762 -59521 -8389 37054 -4811 -81914 -3698 37262 -16579
1962 -16579 -15503 -594 -2805 -61618 -80976 -81556 -76181 -56319 -10966 4704 2271 27435 15539
1949 15539 43420 103453 23505 -1426 -35409 -83289 -69465 -45581 -68840 -28537 37897 40395
1937 40395 50230 73971 78105 28824 30708 36784 -8426 4301 -38504 -32968 -37350 -55965 -62005
1924 -62005 -82871 -46648 -34615 45510 32058 10525 -22140 -29316 -16599 5353 21145 27360
1912B7360l200m6277K5234O2794l2720J0561k3879k0477L3173m3690J6791P8788
1900H4458k7415l1146p190k8027r955L2952r791k2768L2350k463j233o7889N7248
1887h69q378r7318N3570P0094p0689K476L8778k1089O4882N219J0208J2029n5812
1874C101k1991j6864M7931O013J3197O372J8268o0499k9691N5422j326k6149K1265
1861A5049j6054o3604j0844K8805l369r413N2542k6155j0659N8241m1756L8550
1849A1333L553j0732N2858p6956k8195P0305Q1212p7143l8012m9402M8687m3795
1837e6287r5888M6715M4643P1649m94m4044m6743j181j766N2970L7016J7250p5863
1824e2023j8560K7871M5118N2234J0101l4310j7083l4352j4440Q484M2121L65
$$ plain form
1912 27360 24160 -22117 3117 65911 33191 43752 19873 -604 32569 -11121 5670 84458
1900 84458 57043 25897 18707 -9320 -19275 13677 3886 -18882 13468 11005 9772 -58117 -869
1887 -869 -9247 -106565 -52995 17099 -53590 -51114 -12336 -33425 31457 36676 46884 58913 3101
1874 3101 -18890 -35754 12177 18190 31387 37759 56027 -4472 -34163 21259 19933 -6216 15049
1861 15049 -1005 -64609 -75453 -46648 -50017 -59430 -6888 -33043 -43702 14539 -27217 11333
1849 11333 14886 4154 57012 -19944 -48139 22166 103378 26235 -11777 -61179 -12492 -56287
1837 -56287 -152175 -105460 -60817 10832 10338 -33706 -80449 -81630 -83396 -30426 6590 23840 -52023
1824 -52023 -70583 -42712 2406 54640 64741 30431 13348 -21004 -35444 -26960 15161 15526
1812A5526L456l7547K6553P1674q4790K9973l9268k7373R0051o94q5467m3353
1800h1259M4041K7273L380J5048k2684P9102j9339o3047L0984l5091l7194L8622
1788b0164n9219P068P6132O7439r4145J4288k5147k6763Q3880l2626L330K420
1776c507J5590J985k1382l232k0751N2134o609l4457N7620l0447k2396l3273K8991
1763a9734j389k2730O7982m3628p261l0840N6318k4980q333L1169l7042P965j8995
1750e1498M2428L1004k7023k4342L8856r327n007K8925K5828j3551K1087l3022
1738B4358j444j5512Q1O3351k32j03100R461J0347N457m8103j9629K3167J9283
1725c2515N1824o419o71O8266p108k4367n7110m9610k5458J1115N8187k7342N2389
$$ plain form
1812 15526 18982 -18565 7988 79662 -5128 24845 -14423 -41796 48255 47561 -37906 -81259
1800 -81259 -37218 -9945 -6565 8483 -14201 64901 45562 -17485 13499 -21592 -58786 -20164
1788 -20164 -79383 -72315 3817 71256 -22889 -8601 -33748 -60511 23369 -9257 -5927 -3507
1776 -3507 12083 14068 -7314 -10546 -31297 20837 14228 -20229 37391 6944 -15452 -48725 -19734
1763 -19734 -21123 -43853 24129 -19499 -26760 -57600 -1282 -26262 -34595 -3426 -40468 -32503 -51498
1750 -51498 -9070 21934 -5089 -29431 9425 98 -4909 24016 49844 36293 57380 24358
1738 24358 22914 7402 7483 70834 70602 -32498 -23037 -12690 -7233 -55336 -74965 -51798 -32515
1725 -32515 19309 12890 12219 80485 73377 49010 -8100 -57710 -83168 -72053 -13866 -41208 11181
1712A1181P5120k5235o6587n7541J6594O6591p075M25K1208j6980q0733N99N6110
1699f323N4929n6326P052M3001l2273l4495K1665J0628Q46N2194n549o9377R96
1686a3032K888K8545N186J8170R370l8805l3147m5765P2937L0498k1130K7026
1674D2741N3283n0513m7337L3507j06836M5188O7761l5060K7583J391n839M9873
1662G5742j923j5690o2138q414R549q465k2152J1259N322l479p953m5322L7637
1649c6027j3047K7295O4494K9382n9175M128m6545L062m371L5786K3600L4110
1637F2692j1604j7434m5192O3568q939K0850K9616l4002n8523J2114j6051j7928
1625b0833m9463j0047M2485p1631P5151m7539P4708m76o2144k3937P407L4945
$$ plain form
1712 11181 86301 61066 -5521 -63062 -46468 20123 13048 13473 34681 17701 -63032 -62433 -6323
1699 -6323 48606 -7720 -668 42333 10060 -24435 -2770 7858 8704 60898 55349 -14028 -13032
1686 -13032 -10144 18401 23587 41757 51127 12322 -20825 -66590 6347 36845 15715 42741
1674 42741 96024 45511 -1826 31681 -75155 -29967 37794 2734 30317 31708 25869 75742
1662 75742 73819 58129 -4009 -12423 -2874 -11339 -33491 -22232 -16910 -20389 -28342 -73664 -36027
1649 -36027 -49074 -21779 42715 72097 12922 17050 -29495 -26433 -30804 4982 28582 62692
1637 62692 51088 33654 -11538 52030 43091 63941 93557 59555 1032 13146 -2905 -20833
1625 -20833 -70296 -80343 -37858 -109489 -34338 -81877 -7169 -7645 -69789 -93726 -86319 -51374
1613e1374j0427O2842N5055o9849J5391Q026j2755P167K6709K1671L9897n8229
1601C4124m6228M3616j671R016j9355l2709L3056K2172k9394l4301l2068J194
1589e2548j0610K7068K2509J7781l3005m0721N4079J7238K9082m7916n5345K0478
1577e1910J0046L7924J6328m9171l650j7571n841R7219m3815p5191Q143M7370
1565c0119j789N1251j4238n7328K7652o208l7697J4700J8270q98L3941L5704k8101
1552E140m6856j8095L77O6798k1726j4934K6686k6698J388P1017n5411l1354L8914
1539d754L6357k2088o3206j4789R7566O486j1044m7988J9596M979o3939J9939
1527d2885n436Q0016M7610j0330n7918l5558n7944l9K841P4613N0151M5641j6371
$$ plain form
1613 -51374 -61801 1041 56096 -13753 1638 9664 -3091 4076 30785 52456 92353 34124
1601 34124 -12104 31512 29841 38857 19502 -13207 19849 42021 12627 -21674 -53742 -52548
1589 -52548 -63158 -36090 -13581 4200 -28805 -69526 -15447 1791 30873 -17043 -72388 -51910
1577 -51910 -41864 -3940 12388 -36783 -40433 -58004 -63845 33374 -10441 -85632 -77489 -30119
1565 -30119 -31908 19343 5105 -52223 -24571 -30779 -68476 -53776 -35506 -36404 -2463 33241 5140
1552 5140 -41716 -59811 -59434 7364 -14362 -29296 -2610 -29308 -27920 43097 -12314 -43668 -4754
1539 -4754 31603 9515 -53691 -68480 29086 35572 24528 -23460 -3864 1115 -62824 -42885
1527 -42885 -48321 31695 79305 68975 11057 -24501 -82445 -82484 -79643 -5030 45121 90762 74391
1514G4391n7299k2254n0762p928L4388m4091M5754J2722K0656K3917l7690L6322
1502B8126L0044M03l5988K8872j4269p6543j7330M0942M1217l1171k7020J7814
1490a4903k849L7680K6027n1959O721M5872k1841m3488m779J4021j6981J4777
1478a1702k1803L611j5876L6264k2577m166p204j7407J5335J1937k684m9797K1609
1465f4460O9790K449L6669k2701q9854k637M0779k3096L7687K3361r1901P437
1453g6477Q8990k6558K8769r180K6366J5068K5272L3017j25112m8057N5737M1742
1441B9577p4666P382o496N0120L5459p4376k2761l0762L1304Q1242J6265o481
1429C5807j8109o03l7415J7964K8147p1492m6934M5138K906L9684j7890J9133
$$ plain form
1514 74391 17092 -5162 -55924 -63852 -29464 -73555 -27801 -15079 5577 29494 -8196 28126
1502 28126 58170 58573 22585 51457 37188 -39355 -56685 -15743 25474 -5697 -32717 -14903
1490 -14903 -17752 19928 45955 -6004 717 46589 24748 -18740 -23519 -9498 -26479 -11702
1478 -11702 -33505 -29894 -45770 -9506 -32083 -36249 -43453 -60860 -45525 -33588 -36272 -86069 -64460
1465 -64460 5330 7779 44448 21747 -68107 -70744 -29965 -53061 -15374 7987 -83914 -76477
1453 -76477 12513 -14045 14724 5544 31910 46978 72250 105267 -19845 -67902 -12165 29577
1441 29577 -45089 -37707 -44203 5917 41376 -33000 -55761 -86523 -55219 26023 42288 35807
1429 35807 17698 17095 -20320 -2356 25791 -45701 -92635 -47497 -44591 -4907 -22797 -3664
1417c664N0180n0872n5716O610O2166L6933O945l6734L3293J1488q2163L6378
$$ plain form
1417 -3664 46516 -4356 -60072 -53462 8704 45637 52582 15848 49141 60629 -21534 14844
$$ [...]
##END NTUPLES=NMR SPECTRUM
##END=
