##TITLE=1H_Cg-1222-1
 200.13MHz, CDCl3,
 8 sc
 
 10.9.2025
##JCAMPDX= 6.0         $$ Bruker NMR JCAMP-DX V2.0
##DATA TYPE= NMR SPECTRUM
##DATA CLASS= NTUPLES
##ORIGIN= UXNMR, Bruker Analytische Messtechnik GmbH
##OWNER= pz
$$ XWIN-NMR		Version 3.5
$$ Wed Sep 10 15:35:13 2025 Russian Standard Time (UT+4h)  she@DPX200
##.OBSERVE FREQUENCY= 200.1313
##.OBSERVE NUCLEUS= ^1H
##.ACQUISITION MODE= SIMULTANEOUS
##.ACQUISITION SCHEME= undefined
##.AVERAGES= 8
##.DIGITISER RES= 18
##SPECTROMETER/DATA SYSTEM= spect
##.PULSE SEQUENCE= zg30
##.SOLVENT NAME= CDCl3
##.SHIFT REFERENCE= (INTERNAL, CDCl3, 0, 15.4803)
##AUDIT TRAIL= $$ (NUMBER, WHEN, WHO, WHERE, WHAT)
$$ ##TITLE= Audit trail, XWIN-NMR		Version 3.5
$$ ##JCAMPDX= 5.01
$$ ##ORIGIN= Bruker BioSpin GmbH
$$ ##OWNER= she
$$ F:/spectra/data/she/nmr/H-C/1/pdata/1/auditp.txt
$$ ##AUDIT TRAIL=  $$ (NUMBER, WHEN, WHO, WHERE, WHAT)
(   1,<2025-09-10 15:33:32.93 +0400>,<she>,<DPX200>,
      <created by zg, POWCHK disabled, PULCHK disabled
       configuration hash MD5:
       00 E9 B6 7A A2 85 ED C7 34 08 36 98 17 FE 4E 26
       data hash MD5: 16K
       A7 29 F0 C1 EF 00 0F CC CA 9D 8B A5 F1 18 46 DF>)
(   2,<2025-09-10 15:33:35.79 +0400>,<she>,<DPX200>,
      <Start of raw data processing
       efp BC_mod = 2 LB = 0.25 FT_mod = 6 PKNL = 1 PHC0 = -1565.027 PHC1 = 15.79228 SI = 16K 
       data hash MD5: 16K
       DD 7B 37 93 AC 15 66 9A 31 59 DE 35 4F 28 15 DD>)
(   3,<2025-09-10 15:33:59.76 +0400>,<she>,<DPX200>,
      <pk PHC0 = -157.6907 PHC1 = -0.6 
       data hash MD5: 16K
       A6 DB D6 60 D8 17 66 AD 46 16 9D 9C A7 3C 26 9B>)
(   4,<2025-09-10 15:34:04.42 +0400>,<she>,<DPX200>,
      <abs ABSG = 5 
       data hash MD5: 16K
       75 DE 52 58 9C 3B 71 F5 A7 6A FC FB 6B 3C 1D B3>)
$$ ##END=
$$ 
$$ hash MD5
$$ 92 A6 EA 77 80 8B BD 3E 56 10 2D F2 B2 E2 1C C1
##$RELAX= 
##$RELAX= 
##$RELAX= 
##$RELAX= 
##$RELAX= 
##$RELAX= 
$$ Bruker specific parameters
$$ --------------------------
##$DU= <F:/spectra>
##$EXPNO= 1
##$NAME= <H-C>
##$PROCNO= 1
##$TYPE= <nmr>
##$USER= <she>
##$AMP= (0..31)
100 100 100 100 100 100 100 100 100 100 100 100 100 100 100 100 100 100 
100 100 100 100 100 100 100 100 100 100 100 100 100 100 
##$AQSEQ= 0
##$AQ_mod= 1
##$AUNM= <au_zg>
##$AUTOPOS= <>
##$BF1= 200.13
##$BF2= 200.13
##$BF3= 200.13
##$BF4= 200.13
##$BF5= 200.13
##$BF6= 200.13
##$BF7= 200.13
##$BF8= 200.13
##$BYTORDA= 1
##$CFDGTYP= 0
##$CFRGTYP= 5
##$CHEMSTR= <none>
##$CNST= (0..31)
1 1 145 1 1 1 1 1 1 1 1 1 1 1 1 1 1 1 1 1 1 1 1 1 1 1 1 1 1 1 1 1 
##$CPDPRG= <>
##$CPDPRG1= <>
##$CPDPRG2= <>
##$CPDPRG3= <>
##$CPDPRG4= <mlev>
##$CPDPRG5= <mlev>
##$CPDPRG6= <mlev>
##$CPDPRG7= <mlev>
##$CPDPRG8= <mlev>
##$CPDPRGB= <>
##$CPDPRGT= <>
##$D= (0..31)
0 0.7 0 0 0 0 0 0 0 0 0 0.03 0 0 0 0 0 0 0 0 0 0 0 0 0 0 0 0 0 0 0 0 
##$DATE= 1757504012
##$DBL= (0..7)
120 120 120 120 120 120 120 120 
##$DBP= (0..7)
150 150 150 150 150 150 150 150 
##$DBP07= 0
##$DBPNAM0= <>
##$DBPNAM1= <>
##$DBPNAM2= <>
##$DBPNAM3= <>
##$DBPNAM4= <>
$$ [...]
##$SUBNAM3= <"">
##$SUBNAM4= <"">
##$SUBNAM5= <"">
##$SUBNAM6= <"">
##$SUBNAM7= <"">
##$SUBNAM8= <"">
##$SUBNAM9= <"">
##$SW= 18.0517328524113
##$SWIBOX= (0..15)
0 0 2 0 0 0 0 0 0 0 0 0 0 0 0 0 
##$SW_h= 3612.71676300578
##$TD= 16384
##$TD0= 1
##$TE= 0
##$TE2= 300
##$TE3= 300
##$TEG= 300
##$TL= (0..7)
0 120 120 120 120 120 120 120 
##$TP= (0..7)
150 150 150 150 150 150 150 150 
##$TP07= 0
##$TPNAME0= <>
##$TPNAME1= <>
##$TPNAME2= <>
##$TPNAME3= <>
##$TPNAME4= <>
##$TPNAME5= <>
##$TPNAME6= <>
##$TPNAME7= <>
##$TPOAL= (0..7)
0.5 0.5 0.5 0.5 0.5 0.5 0.5 0.5 
##$TPOFFS= (0..7)
0 0 0 0 0 0 0 0 
##$TUNHIN= 0
##$TUNHOUT= 0
##$TUNXOUT= 0
##$USERA1= <user>
##$USERA2= <user>
##$USERA3= <user>
##$USERA4= <user>
##$USERA5= <user>
##$V9= 5
##$VALIST= <valist>
##$VCLIST= <CCCCCCCCCCCCCCC>
##$VD= 0
##$VDLIST= <DDDDDDDDDDDDDDD>
##$VPLIST= <PPPPPPPPPPPPPPP>
##$VTLIST= <TTTTTTTTTTTTTTT>
##$WBST= 1024
##$WBSW= 4
##$XGAIN= (0..3)
0 0 0 0 
##$XL= 0
##$YL= 0
##$YMAX_a= 378560
##$YMIN_a= -251676
##$ZGOPTNS= <>
##$ZL1= 120
##$ZL2= 120
##$ZL3= 120
##$ZL4= 120
##$ABSF1= 15.8736
##$ABSF2= -2.178257
##$ABSG= 5
##$ABSL= 3
##$ALPHA= 0
##$AQORDER= 0
##$ASSFAC= 0
##$ASSFACI= 0
##$ASSFACX= 0
##$ASSWID= 0
##$AUNMP= <proc_1d>
##$AZFE= 0.1
##$AZFW= 0.1
##$BCFW= 0
##$BC_mod= 2
##$BYTORDP= 0
##$COROFFS= 0
##$CY= -3
##$DATMOD= 1
##$DC= 0
##$DFILT= <>
##$DTYPP= 0
##$F1P= 0
##$F2P= 0
##$FCOR= 1
##$FTSIZE= 16384
##$FT_mod= 6
##$GAMMA= 0
##$GB= 0
##$INTBC= 1
##$INTSCL= 3.241238e-09
##$ISEN= 128
##$LB= 0.25
##$LEV0= 0
##$LPBIN= 0
##$MAXI= 10000
##$MC2= 0
##$MEAN= 0
##$ME_mod= 0
##$MI= 1.114404
##$NCOEF= 0
##$NC_proc= -7
##$NLEV= 6
##$NOISF1= 3.799351
##$NOISF2= 2.8
##$NSP= 0
##$NTH_PI= 0
##$NZP= 0
##$OFFSET= 15.48025
##$PC= 1
##$PHC0= -1722.718
##$PHC1= 15.19228
##$PH_mod= 1
##$PKNL= yes
##$PPARMOD= 0
##$PSCAL= 0
##$PSIGN= 0
##$REVERSE= no
##$SF= 200.130008295083
##$SI= 16384
##$SIGF1= 3
##$SIGF2= 2
##$SINO= 0.751879
##$SIOLD= 32768
##$SREGLST= <19F.Aceton>
##$SSB= 0
##$STSI= 16384
##$STSR= 0
##$SW_p= 3612.71676300578
##$SYMM= 0
##$S_DEV= 0
##$TDeff= 16384
##$TDoff= 0
##$TI= <>
##$TILT= no
##$TM1= 0
##$TM2= 0
##$TOPLEV= 0
##$USERP1= <user>
##$USERP2= <user>
##$USERP3= <user>
##$USERP4= <user>
##$USERP5= <user>
##$WDW= 1
##$XDIM= 16384
##$YMAX_p= 396485601
##$YMIN_p= -167155
$$ End of Bruker specific parameters
$$ ---------------------------------
##NTUPLES= NMR SPECTRUM
##VAR_NAME=  FREQUENCY,     SPECTRUM/REAL,   SPECTRUM/IMAG
##SYMBOL=    X,             R,               I
##VAR_TYPE=  INDEPENDENT,   DEPENDENT,       DEPENDENT
##VAR_FORM=  AFFN,          ASDF,            ASDF
##VAR_DIM=   16384,         16384,           16384
##UNITS=     HZ,            ARBITRARY UNITS, ARBITRARY UNITS
##FACTOR=    0.220516191357247, 1,           1
##FIRST=     3098.06263267289, 0,            0
##LAST=      -514.654130332895, 0,           0
##MIN=       -514.654130332895, -167155,     0
##MAX=       3098.06263267289, 396485601,    0
$$ Real data points
##PAGE= N=1
##DATA TABLE= (X++(R..R)), XYDATA
$$ [...]
7530E98032r1888M8679n1321J6339M6801k6672j0337o1033j8902L7073M9289j4408
7518E21652j9775J6183K0384l7538j9688L1285N5883p6981J345L07J6367M1581
7506E51005M4207k7361J2217j529l0867n3088L138l7139M0309O2686l0948j532
7494E31098j4931q692O4936o1868k640R2382p8403o4840Q8412R94j3154k6538
7482E06756M4035N6612Q076j9179L3258P411j0561o446j9375L3946M7821N152
7470F87506M0224o0765j3089P6013k9585J19304N4170l866L7177n2696m1032o785
7458H06576L1667J05775O2431j3705n8537Q9619m1739p029k8822J3053L5034O1764
7446A056087M5184L9532k4661J3025j1354l3747R1500M4531Q1115K1067M0542
$$ plain form
7530 598032 506144 554823 503502 519841 566642 539970 529633 468600 449698 486771 536060 521652
7518 521652 501877 518060 538444 500906 481218 512503 568386 491405 492750 493057 509424 551005
7506 551005 595212 567851 580068 578539 547672 494584 497722 460583 500892 563578 532630 531098
7494 531098 516167 507475 572411 510543 507903 600285 521882 457042 545454 546448 533294 506756
7482 506756 550791 607403 615479 596300 629558 636969 626408 619962 600587 634533 682354 687506
7470 687506 727730 666965 653876 729889 700304 819608 873778 869912 907089 854393 813361 806576
7458 806576 838243 944018 1006449 992744 934207 1023826 982087 975058 946236 959289 994323 1056087
7446 1056087 1101271 1140803 1116142 1129167 1117813 1084066 1175566 1220097 1301212 1322279 1362821
7435A362821j676O0578J13009J70753N9429o8807M793N6982M5768N8174P1305
7424A933129l2264L3337J2172N3799O533J8871M9221m0144l1539K7536J11697
7413B142348P6919L5886P8219R7358O3532K8816J19541J85547R9257R6855M3351
7402C067629J04466J96953J79290J15975J24783J41244P7053J03228M8466N014
7392D164101n783n4395p4186l5661p4944r2362n9877Q906r7035j36578j9375n1015
7380C471796p0026o1235o2514l6504k2462l9105q6731j36666l3801q7811l4314
7369B800627k72j13249r1123p5492p7280Q544j09177o1362n3232p2627r0286j2744
7357B052327o1018n9082r017j19442r0943l5217j5027o5440m2224j13432n0296
$$ plain form
7435 1362821 1361145 1421723 1534732 1705485 1764914 1696107 1700900 1757882 1803650 1861824 1933129
7424 1933129 1900865 1934202 1946374 2000173 2006706 2025577 2074798 2034654 2003115 2030651 2142348
7413 2142348 2219267 2255153 2333372 2430730 2494262 2523078 2642619 2828166 2927423 3024278 3067629
7402 3067629 3172095 3369048 3548338 3664313 3789096 3930340 4007393 4110621 4159087 4164101
7392 4164101 4158318 4103923 4029737 3994076 3919132 3826770 3766893 3775799 3678764 3542186 3522811 3471796
7380 3471796 3401770 3340535 3278021 3241517 3219055 3179950 3093219 2956553 2922752 2834941 2800627
7369 2800627 2800355 2687106 2595983 2520491 2443211 2451755 2342578 2281216 2227984 2155357 2065071 2052327
7357 2052327 1991309 1932227 1923210 1803768 1712825 1677608 1662581 1597141 1554917 1441485 1391189
7346A391189K5910o2510j4713p5385l3018K7472k4456l1740o6171k0229o3518
7335A052831K5045j6299R3204Q157j9191J7994J4435q8477n8857J7683M9111M8844
7323A144480o1619k9868k279L3948k8495O8654o2510l545l8705r6907n218r845
7311I08091M5105l8461J3546l2856M813l7193n3016q513o322q6102q632O9671
7299G70131L6032L4912l2714k5075n4121k6372J7653k2551j3291l2878M189M3642
7287F99557j5205j08913L8550M0647j2135J9260k0318o0960j0501L5829n8875
7276E46936K2065n891j7723l721R09l9976K7534O0826j0735n6802j1499l4567
7264D77356K3229P2134n178m0198j4262n2811k2315M5367Q074j3466K1528L5116
$$ plain form
7346 1391189 1417099 1354589 1339876 1264491 1231473 1258945 1234489 1202749 1136578 1116349 1052831
7335 1052831 1077876 1061577 1154781 1162938 1143747 1161741 1176176 1087699 1028842 1046525 1095636 1144480
7323 1144480 1082861 1052993 1050714 1084662 1056167 1124821 1062311 1058766 1020061 923154 917936 908091
7311 908091 953196 914735 928281 895425 900238 863045 810029 801516 795194 709092 700460 770131
7299 770131 806163 841075 808361 783286 729165 702793 720446 697895 684604 651726 655915 699557
7287 699557 684352 575439 613989 654636 642501 661761 641443 580483 569982 605811 546936
7276 546936 569001 563110 545387 541666 542575 502599 530133 590959 580224 523422 511923 477356
7264 477356 500585 572719 567541 527343 513081 460270 437955 483322 491396 477930 499458 534574
7252E34574P8969l5642j9998p2581k8380K5318j9949m611J2084J0075k2471l2764
7240D24624M5914L1675o8942j0945l7563P2202k1589N6798N3953o9698m0980J01816
7228E37265N4448n9047o2590m8672J0041N130L4949O9302K1081j2949J9K9690
7216E78667k6887o9659j1033J04007k741J9396K4345m2515O412l696M5875n0133
7204E72038R806k056L6048l626j8534l0188m6077J6247M6053k2790N4465K4122
7192F35508J377j7758k2183o5400O3390K3972J6039j3630k4876n5163m877P8524
7180F14923O0433m908L2747l4283o6839p4224j9837J33564L7305n9974j38225
7169D80682M0608M7826K0115j5691J6647N8092P4342p5437j3749k9588M4833N0721
$$ plain form
7252 534574 613543 577901 557903 485322 456942 482260 462311 457700 469784 479859 457388 424624
7240 424624 470538 502213 433271 422326 384763 456965 435376 492174 546127 476429 435449 537265
7228 537265 591713 532666 470076 421404 431445 436575 471524 540826 561907 548958 548977 578667
7216 578667 551780 482121 471088 575095 572354 591750 616095 573580 579992 576296 622171 572038
7204 572038 581844 579788 615836 612210 593676 563488 517411 533658 579711 556921 611386 635508
7192 635508 636885 619127 596944 531544 594934 618906 634945 621315 596439 541276 536399 614923
7180 614923 675356 670448 703195 668912 602073 527849 508012 641576 678881 618907 480682
7169 480682 521290 569116 589231 573540 590187 648279 722621 647184 633435 603847 648680 699401
7157F99401K3479m5555l523L3690m4495j7297J8453M3661j7823Q620K3523K6199
7145G48333P2879k8511m5109O9149R1411l1143K9836O930L2594O748J4980N6574
7133A024671N0463L0439M5689j1098j9971J4545M4452L1835o418K9986o3545L2670
7121A203718j8738L8299n048J1749M0695P6377K9159o0247K5474N4627j9790k5601
7109A350674Q2928P5122K7408N9315J7821L3124J09673O9593O3012Q7535M7590
7098B023795R3407K01270R5976J27351J68906K44541J14800J93833K19342J58971
7088C642192J83586K49912K96944L59539L96886N29774O00381P15893Q13797Q26479
7078H615383R02764R45558J001648Q87015M90232K50323J01951J0826j45209n51246
$$ plain form
7157 699401 722880 677325 673802 707492 662997 645700 664153 707814 689991 698611 722134 748333
7145 748333 821212 792701 747592 816741 908152 877009 906845 913775 946369 953117 968097 1024671
7133 1024671 1075134 1105573 1151262 1140164 1120193 1134738 1179190 1211025 1204607 1234593 1171048 1203718
7121 1203718 1184980 1223279 1218231 1229980 1270675 1347052 1376211 1315964 1341438 1396065 1376275 1350674
7109 1350674 1433602 1508724 1536132 1595447 1613268 1646392 1756065 1825658 1888670 1976205 2023795
7098 2023795 2117202 2318472 2414448 2541799 2710705 2955246 3070046 3263879 3483221 3642192
7088 3642192 3825778 4075690 4372634 4732173 5129059 5658833 6259214 6975107 7788904 8615383
7078 8615383 9518147 10463705 11465353 12352368 12842600 13092923 13194874 13205700 13060491 12509245
7068A2509245p71322o60770o67942o26736n54769o85075n80247m39403k85274
7059G237707k34506l15369m17068m29483l91645k72427k39178k92490k24579j50245
7049D270717j09696o9367l3947j22934m2059N0358K6722n7501j2366R2457j126
7038C991258J1596r671L7237K4981J2016M508L4764m9849N4007p144N6831J5746
7026D176280N6927j0707l5146Q1255J11223K9744L4145M5098J27159J55779J04817
7015D876574J29922K14096K01658K28334L30744N03063O07994O82495O71700P28264
7005I174844Q00072R27201P74335N88021K27400O8933M0228j40748m09071o61220
6995A1389995p40875o69573n34143o11552o37137n96793m54098l78314l62268
$$ plain form
7068 12509245 11737923 11077153 10409211 9782475 9227706 8542631 7962384 7522981 7237707
7059 7237707 7003201 6687832 6270764 5841281 5449636 5177209 4938031 4645541 4420962 4270717
7049 4270717 4161021 4091654 4057707 3934773 3892714 3943072 3969794 3912293 3899927 3992384 3991258
7038 3991258 4002854 3993183 4030420 4055401 4067417 4071925 4106689 4056840 4110847 4103703 4160534 4176280
7026 4176280 4233207 4222500 4187354 4268609 4379832 4409576 4443721 4488819 4615978 4771757 4876574
7015 4876574 5006496 5220592 5422250 5650584 5981328 6484391 7092385 7774880 8446580 9174844
7005 9174844 9974916 10902117 11676452 12264473 12491873 12560806 12601034 12460286 12051215 11389995
6995 11389995 10649120 9979547 9445404 8833852 8196715 7599922 7145824 6767510 6405242
6986F405242l96843l89101l51184l62209l49637l81550k44272l02981l06121j99034
6976C122310j38295k07711j73861r6753j19555r7784j09819N474m2202q4873j04575
6965A952356L9074r5420m7042l5910j9450m2005l7558m1665J6861p9183p5336
6954A534722k0794o106J0835m508m5685K9294n6614J9673j04440m9551m3924J11442
6942A374344J1895o1579j3565k1880q3494k6187M2004J2338J6718J5428l1581
6931A234441m8818n8983N576K6540M036L9074l0372l8681j5241Q3177p2480l0271
6919A097998P7583p1068k6802r184J9521M0073n6337m1466n853M3693L5383Q006
6907A111547m6555l690R857p2876p5188M6697j1624L2257j5600l4750M409o1252
$$ plain form
6986 6405242 6008399 5619298 5268114 4905905 4556268 4174718 3930446 3627465 3321344 3122310
6976 3122310 2984015 2776304 2602443 2505690 2386135 2288351 2178532 2184006 2141804 2056931 1952356
6965 1952356 1991430 1896010 1848968 1813058 1793608 1751603 1714045 1672380 1689241 1610058 1534722
6954 1534722 1513928 1507822 1518657 1514149 1468464 1497758 1441144 1460817 1356377 1306826 1262902 1374344
6942 1374344 1386239 1324660 1311095 1289215 1205721 1179534 1221538 1233876 1250594 1266022 1234441
6931 1234441 1185623 1126640 1132216 1158756 1162792 1201866 1171494 1132813 1117572 1200749 1128269 1097998
6919 1097998 1175581 1104513 1077711 1068527 1088048 1128121 1071784 1030318 1024465 1068158 1103541 1111547
6907 1111547 1064992 1061302 1071159 998283 923095 969792 958168 990425 974825 940075 944484 883232
6895H83232K038j5380O4834O2146j25195k4271J1108L8443J0739k8484p23J4452
6883H92939J1428R837M3126N7536q1449M1525M6409k2129n1726l7365K0430K3676
6871I54237O4154j3060o7647j848O3629J8929O0361P1394j0103m1298J345J1328
6859A111421K8835L8901J0952M5790m6714m1445OL5682P819m7212m4144o5921
6847A033970M7178J9966r382j9651J5029k3389m050J6744n7862k1581l8002M2549
6835A001519M1204k6007k3546M0470J8387l389m8836L466j2547J9744j9938k1548
6823I68979P3453j2924K6887K6263l2036M152P396P4381R8394L4238k6732N105
6811A247556L5242L8250k1016O3611P0400M4254j4806P9001K1947Q691R2438n269
$$ plain form
6895 883232 885270 869890 934724 996870 871675 847404 858512 896955 907694 879210 878487 892939
6883 892939 904367 914204 957330 1014866 933417 974942 1021351 999222 947496 910131 930561 954237
6871 954237 1018391 1005331 937684 935836 999465 1018394 1078755 1150149 1140046 1098748 1100093 1111421
6859 1111421 1140256 1179157 1190109 1235899 1189185 1147740 1147746 1183428 1191247 1144035 1099891 1033970
6847 1033970 1081148 1101114 1091732 1072081 1087110 1063721 1059671 1076415 1018553 996972 958970 1001519
6835 1001519 1042723 1016716 993170 1033640 1052027 1048638 999802 1003268 990721 1010465 990527 968979
6823 968979 1042432 1029508 1056395 1082658 1050622 1054774 1062170 1136551 1234945 1269183 1242451 1247556
6811 1247556 1282798 1321048 1300032 1363643 1434043 1478297 1463491 1542492 1564439 1573130 1665568 1660299
6799A660299m1325K3086K6106J06509R4447K6522L6706P7170Q0267Q2944N1244
6788B223975R7103R7919J30583J22200J73025J68428J61092J52635J72460K82505
6778C781925K40948K10145K83843L44395M26370N95792P06246P00694P98729Q25078
6768H914165Q76954R14491Q88821P89520L69950J53309J16413l4185l27482n66314
6758A2095642o12187o92215p04453n40176n43114n18234m14710l27799l45676
6749G397078j69488l49202l30703l20162l33946k15612j12321j10934j29506j61994
6739E163210m0466n1158J08193P6318R0726J93809K28527L04651M37385N45270
6729G056465O53947O66683P72014Q27293P94668Q71378O81540L39041J37773l642
$$ plain form
6799 1660299 1618974 1642060 1668166 1774675 1869122 1895644 1932350 2009520 2089787 2172731 2223975
6788 2223975 2321078 2418997 2549580 2671780 2844805 3013233 3174325 3326960 3499420 3781925
6778 3781925 4022873 4233018 4516861 4861256 5287626 5883418 6589664 7290358 8089087 8914165
6768 8914165 9791119 10705610 11594431 12383951 12753901 12907210 13023623 12989438 12661956 12095642
6758 12095642 11483455 10791240 10086787 9546611 9003497 8485263 8070553 7742754 7397078
6749 7397078 7227590 6878388 6547685 6227523 5893577 5677965 5565644 5454710 5325204 5163210
6739 5163210 5122744 5071586 5179779 5256097 5346823 5540632 5769159 6073810 6511195 7056465
6729 7056465 7710412 8377095 9149109 9976402 10771070 11642448 12323988 12663029 12800802 12797160
6719A2797160q1616k24164n98046o95387p06220p32899n74694n91576o08779n12715
6709G471064m33296l32366l78313l63496l60035m54573l42055k82030k29461l28514
6699C966925k24201k41289k01539j17614j35883j78989j49612j27469p3087m5618
6689B471624r5174m0695n2158o4044J1012K23n3333o333m9840k7725P224o3152
6677B037629m8167q627K904m5616p6036j5114k6637o7438k2539K7972K5630k2453
6665A761508p2656N5884n826J8070Q9618K9395m2223n27n7238Q66l739m3297m088
6652A725747M3629j7085K9847J8048o971j2199M0944L660J5843l5956R115j8497
6640A796125N8904L6370j6821O793M5735m7320k0124O4968m523j825K1088M0824
$$ plain form
6719 12797160 12715544 12491380 11893334 11197947 10491727 9758828 9184134 8592558 7983779 7471064
6709 7471064 7037768 6705402 6327089 5963593 5603558 5148985 4806930 4524900 4295439 3966925
6699 3966925 3742724 3501435 3299896 3182282 3046399 2867410 2717798 2590329 2517242 2471624
6689 2471624 2376450 2335755 2283597 2219553 2230565 2230788 2177455 2171122 2121282 2093557 2100781 2037629
6677 2037629 1989462 1980835 1983739 1938123 1862087 1846973 1820336 1752898 1730359 1758331 1783961 1761508
6665 1761508 1688852 1744736 1738910 1756980 1846598 1875993 1833770 1833243 1776005 1776871 1773132 1729835 1725747
6652 1725747 1769376 1752291 1782138 1800186 1793215 1781016 1821960 1825620 1841463 1805507 1814622 1796125
6640 1796125 1855029 1891399 1874578 1881371 1927106 1879786 1859662 1924630 1920107 1918282 1939370 1980194
6628A980194J2385o2655P4772L9815m8086L0901N3257k2952M2290j8465l2103
6617B049353j783L0293K0397O7964l5548o4337J2821M6717N7833m9736O441O9739
6605B210154J30146N879p4833J9056p34n6570M8315k8642l3975N6251m72K866
6593B277441L7673K8642o6740j8518Q9411j2558m7846N6465O1789Q6365L2624
6582B524748j700o005L6732m4723L4569j877o7791j0273k8414k4829j3372L5366
6570B432431j1310n0721k0260L8368l0587K8834n9556r1175k829N38J5634J1073
6558B260440J599R316j7168J0656j0419K0287j8563J625M1200K6487N755m5256
6546B285959J4059M7208J8216P8276r035M6291o4700J3893R2845O9767j8952J3396
$$ plain form
6628 1980194 1992579 1929924 2004696 2044511 1996425 2027326 2080583 2057631 2099921 2081456 2049353
6617 2049353 2047570 2077863 2098260 2166224 2130676 2066339 2079160 2125877 2183710 2133974 2140415 2210154
6605 2210154 2340300 2346179 2271346 2290402 2289668 2233098 2281413 2252771 2218796 2275047 2274575 2277441
6593 2277441 2315114 2343756 2277016 2258498 2347909 2335351 2287505 2343970 2405759 2492124 2524748
6582 2524748 2523048 2517043 2553775 2509052 2543621 2541744 2473953 2463680 2435266 2410437 2397065 2432431
6570 2432431 2421121 2370400 2350140 2388508 2357921 2386755 2327199 2236024 2233195 2233733 2249367 2260440
6558 2260440 2262039 2271355 2254187 2264843 2254424 2274711 2256148 2257773 2298973 2325460 2331215 2285959
6546 2285959 2300018 2347226 2365442 2443718 2434683 2480974 2416274 2430167 2523012 2592779 2573827 2587223
6534B587223J05098J16772k3508J30071M6621N9432L6760J03574P0482K0978O6077
6523C319580J29368Q8770J51574J21842J84931J96982J75485J87404J48090L11612
6513E015638K67393K83836K65242K55080L92588L31937K21330K19566J20855O3989
6503G437454M7015k6765j20824r3959j46261j34748j58836q6538j33151j25744
6493F457643j33918j20590n0325o7404o4752j06202q9936j16972j14577j11942
6483E481025j62105k39186j66032r4761j86493j51380j67002j10962j29542r8842
6473C974720o3924n9750j5248r9402j02478j9342o7873n82j6137L7500n6163j55952
6461C355369j4540K797o8818q3603m0431j3978r975R9769k1373j23603r7024M3793
$$ plain form
6534 2587223 2692321 2809093 2785585 2915656 2962277 3021709 3058469 3162043 3232525 3253503 3319580
6523 3319580 3448948 3537718 3689292 3811134 3996065 4193047 4368532 4555936 4704026 5015638
6513 5015638 5283031 5566867 5832109 6087189 6479777 6811714 7033044 7252610 7373465 7437454
6503 7437454 7484469 7457704 7336880 7242921 7096660 6961912 6803076 6716538 6583387 6457643
6493 6457643 6323725 6203135 6152810 6085406 6020654 5914452 5824516 5707544 5592967 5481025
6483 5481025 5318920 5079734 4913702 4818941 4632448 4481068 4314066 4203104 4073562 3974720
6473 3974720 3910796 3851046 3835798 3736396 3633918 3614576 3546703 3546121 3529984 3567484 3511321 3355369
6461 3355369 3340829 3343626 3274808 3191205 3150774 3136796 3126821 3226590 3205217 3081614 2984590 3028383
6449C028383q25p5187k5730l4287l9933N2203N3324j7389j6898j372n8643O9470
6437B933116L1079K2492K4667N6646L5351j4188R103J8919J921l5230k3078J2840
6425C073638J5119o758J5974Q858l9665R90M5739L4840M1330p733L0218L0226
6413C242776K9239K3223N2181L9145k546K3176m5036l7065M0340K1350j4510M8356
6401C420629r4J534M1016N167K5702l0984J4846O831J5566K4231L9382N2109M9927
6388C665862P9965K2385N8795k4893R1192R1879n3056P9585O2320K2031O6350
6377D162415j7880J09181N7628J6556R759K7859J46946N2854M30q8559N9719Q3796
6365D620704M2844K8368M4550R3572O7244j8883R2712N8896L5544P4419O9907
$$ plain form
6449 3028383 3027558 2952371 2926641 2892354 2852421 2904624 2957948 2940559 2923661 2922289 2863646 2933116
6437 2933116 2964195 2986687 3011354 3068000 3103351 3089163 3098266 3117185 3119106 3083876 3060798 3073638
6425 3073638 3088757 3081999 3097973 3106831 3067166 3068156 3113895 3148735 3190065 3182332 3212550 3242776
6413 3242776 3272015 3295238 3347419 3386564 3384018 3407194 3362158 3325093 3365433 3386783 3372273 3420629
6401 3420629 3420535 3422069 3463085 3468252 3493954 3462970 3477816 3484647 3500213 3524444 3563826 3615935 3665862
6388 3665862 3745827 3768212 3827007 3802114 3893306 3985185 3932129 4011714 4074034 4096065 4162415
6377 4162415 4144535 4253716 4311344 4327900 4337659 4365518 4512464 4565318 4565748 4477189 4536908 4620704
6365 4620704 4663548 4691916 4736466 4830038 4897282 4878399 4971111 5030007 5065551 5139970 5209877
6354E209877O4468P1974J4932o213J31687J25526O5924L3783O3430O1799K4347
6343E861534J10365J26029m3937M885J00109R9267R8515M8314J43559J63961J22949
6332F835550N2059J30620J19664J69446J66628J03700J58550J68328J77397K32050
6322H313992J59608K23639K40135L23052K51742K83614L65638L58113L49786L84801
6312A1254120M66223N17435N47037N67067O94499P18605P76097Q61643Q84919
6303A7287645J039439J068580J133665J263361J342204J457736J523696J529612
6295B7645938J570328J430710J379478J360647J214641J291806J407990J346812
6287C8648350J350149J337229J247400J264247J232869J187726J358825J540930
$$ plain form
6354 5209877 5274345 5346319 5361251 5355038 5486725 5612251 5678175 5711958 5775388 5837187 5861534
6343 5861534 5971899 6097928 6053991 6058876 6158985 6258252 6356767 6405081 6548640 6712601 6835550
6332 6835550 6887609 7018229 7137893 7307339 7473967 7577667 7736217 7904545 8081942 8313992
6322 8313992 8473600 8697239 8937374 9260426 9512168 9795782 10161420 10519533 10869319 11254120
6312 11254120 11720343 12237778 12784815 13351882 14046381 14764986 15541083 16402726 17287645
6303 17287645 18327084 19395664 20529329 21792690 23134894 24592630 26116326 27645938
6295 27645938 29216266 30646976 32026454 33387101 34601742 35893548 37301538 38648350
6287 38648350 39998499 41335728 42583128 43847375 45080244 46267970 47626795 49167725
6279D9167725J621709J927999J994423K208107K368220K443304K476380K555243
6271F6763110K655439K712872K768804K977838K906502K822417K547430K128218
6263H8282630J422401O08548n6134n25444q13172r30211p95319n51152l13449
6254H6328698r7360J38682M62690P72018J100502J416840J494568J512781J300913
6245I4430332J206629P46715J38188l76189j034678j654285k160768k473074k762050
6236H6060820k921420k940538k811425k716900k612899k395563k247929k224072
6228F5190074k031104j734875j617197j504958j345570j189920j029256q62869
6220E3874325m88812j94107J15833N04408Q90454J326852J601891J899732K169001
$$ plain form
6279 49167725 50789434 52717433 54711856 56919963 59288183 61731487 64207867 66763110
6271 66763110 69418549 72131421 74900225 77878063 80784565 83606982 86154412 88282630
6263 88282630 89705031 90313579 90257445 89732001 88918829 87988618 87193299 86642147 86328698
6254 86328698 86231338 86370020 86832710 87604728 88705230 90122070 91616638 93129419 94430332
6245 94430332 95636961 96383676 96521864 96145675 95110997 93456712 91295944 88822870 86060820
6236 86060820 83139400 80198862 77387437 74670537 72057638 69662075 67414146 65190074
6228 65190074 63158970 61424095 59806898 58301940 56956370 55766450 54737194 53874325
6220 53874325 53385513 53191406 53307239 53811647 54702101 56028953 57630844 59530576 61699577
6211F1699577K385485K600851K772177K753169K719238K655053K411380K063055
6203H2059985J652065J087348P31582K11632k18080l39175m38492l42829j49074
6194H4254962J08515K93336M62966O35052P03700P84250Q46184R60632J121528
6185I0171125J141307R59154O36394J18040m84177j027334j569192j875688k036833
6176H6032796j983293j868838j722553j691141j566978j459373j692123j634407
6168G2414090j681680j699390j591795j606851j485629j461313j459179j426748
6160F0001505j384024j429483j569076j635497j564651j566588j456917j359502
6152D8035767j291817j365616j267088j346826j431605j382300j393126j382121
$$ plain form
6211 61699577 64085062 66685913 69458090 72211259 74930497 77585550 79996930 82059985
6203 82059985 83712050 84799398 85530980 85742612 85524532 85185357 84746865 84404036 84254962
6194 84254962 84363477 84656813 85119779 85754831 86458531 87242781 88088965 89049597 90171125
6185 90171125 91312432 92271586 92907980 93026020 92541843 91514509 89945317 88069629 86032796
6176 86032796 84049503 82180665 80458112 78766971 77199993 75740620 74048497 72414090
6168 72414090 70732410 69033020 67441225 65834374 64348745 62887432 61428253 60001505
6160 60001505 58617481 57187998 55618922 53983425 52418774 50852186 49395269 48035767
6152 48035767 46743950 45378334 44111246 42764420 41332815 39950515 38557389 37175268
6144C7175268j266956j095413j199526j084416r97829r91326j014752q95067p77691
6135B7852292p80584o98410p23501n91651n36585n28735m88886l56755j56734
6126B2990451k82654j52270j38562p8796o4552m5562k8823M2860k9283k21271
6116B1991538k08838k67909l69082l93835n62682n46808n93797n34312n80267
6107A7934008o00199n87086n85565n51702n08269m43057m99046m67564m61700
6098A3229820m85244l90518m18581l80907l45509l68412l12828l49565l74917
6089I803339k83728k33351l27625k19929k35174j58117k58296j32110j57886k37941
6079G559182r1497n4378k22688j29961j26081j36036j20369j12695r6766q7278
$$ plain form
6144 37175268 35908312 34812899 33613373 32528957 31531128 30539802 29525050 28629983 27852292
6135 27852292 27071708 26373298 25649797 25058146 24521561 23992826 23503940 23147185 22990451
6126 22990451 22707797 22555527 22416965 22338169 22273617 22228055 22199232 22242092 22212809 21991538
6116 21991538 21782700 21514791 21145709 20751874 20189192 19642384 19048587 18514275 17934008
6107 17934008 17333809 16746723 16161158 15609456 15101187 14658130 14159084 13691520 13229820
6098 13229820 12744576 12354058 11935477 11554570 11209061 10840649 10527821 10178256 9803339
6089 9803339 9519611 9286260 8958635 8738706 8503532 8345415 8087119 7955009 7797123 7559182
6079 7559182 7467685 7413307 7190619 7060658 6934577 6798541 6678172 6565477 6468711 6381433
6069F381433j30969r7690j55077q8098j14617r2809K169j7204n7637j19615r7819
6058E412067j16236o9820l6827k2181q5735l6732j05371o3474k9540j202m7873
6047D797076o4322M1754r2056n2506o5380o9733P0379n9638m9315k6693m8118
6036D381448o76p448n5677N9683l6930m8305n0620k3514J1440n353j2518n5137
6024D156393m9555k673l4179n7019K8384L3184n0224m6264L9930J5642r1861j032
6012C940726K5878o183O5639N3992n912J13592r0296r7540p63K5941P0914O2731
6000D158719N2347N285M9211j1099k3103L8196N0962j4522k6755k5997J9408l4608
5988D238044R6644K0755M470j3692P9818J10686l6925L0265l2030P3765L7927
$$ plain form
6069 6381433 6250464 6152774 5997697 5909599 5794982 5702173 5704342 5687138 5629501 5509886 5412067
6058 5412067 5295831 5226011 5189184 5167003 5081268 5044536 4939165 4875691 4846151 4844949 4797076
6047 4797076 4732754 4774508 4682452 4629946 4564566 4494833 4565212 4505574 4456259 4429566 4381448
6036 4381448 4380772 4373324 4317647 4377330 4340400 4292095 4241475 4217961 4229401 4224048 4211530 4156393
6024 4156393 4106838 4104165 4069986 4012967 4041351 4074535 4024311 3978047 4017977 4033619 3941758 3940726
6012 3940726 3966604 3960421 4026060 4080052 4074140 4187732 4097436 3999896 3999133 4025074 4095988 4158719
6000 4158719 4211066 4216351 4265562 4254463 4231360 4269556 4320518 4305996 4279241 4253244 4272652 4238044
5988 4238044 4334688 4355443 4359913 4346221 4426039 4536725 4499800 4530065 4498035 4571800 4609727
5977D609727K7940L3726J02680M1612K821O0294m9251R1960J28696K8773J939
5966E080917P8575P5049J24255J15117P6053O9674J08686J36269N5813J70475
5956F090883J65260J84290J40945J33276K38116K71919K67927K60897L43891L02439
5946H399843K95898L03135L13440L48495L28451J53095J60831N5838J2375q2963
5936A0288438j46594j40558j33725k01629k51516j98049j49398j50448j16443
5927H800078q2945j29708j81203j52212j18397k7508j34033p1429p2914j06307
5917G723422l5275o0569r4444j0626m411j07156k6305l6251K2164k5396r062J1600
5905G347691r6109j3617l32n1077L2820q5473p5817J6908L8471l3112l5080n7424
$$ plain form
5977 4609727 4637667 4671393 4774073 4815685 4818506 4878800 4829549 4921509 5050205 5078978 5080917
5966 5080917 5159492 5234541 5358796 5473913 5549966 5619640 5728326 5864595 5920408 6090883
5956 6090883 6256143 6440433 6581378 6714654 6952770 7224689 7492616 7753513 8097404 8399843
5946 8399843 8695741 8998876 9312316 9660811 9989262 10142357 10303188 10359026 10371401 10288438
5936 10288438 10141844 10001286 9867561 9665932 9414416 9216367 9066969 8916521 8800078
5927 8800078 8717133 8587425 8406222 8254010 8135613 8108105 7974072 7902643 7829729 7723422
5917 7723422 7688147 7627578 7533134 7522508 7518097 7410941 7384636 7348385 7370549 7345153 7336091 7347691
5905 7347691 7251582 7237965 7237633 7186556 7219376 7133903 7058086 7074994 7113465 7080353 7045273 6987849
5893F987849l7024k8146k3333j1795M640q099j1297M4475j477p6200L088m2730
5881F799951O305L474p230k8146q5438P8107l3898J6362j7534o004k6951m989
5869F694009j1702q5174N735j02425j7077k8478j47299o0498m554m7347m2873
5858F152317q1071j460j02809n4897m852r824k2345n9675j6088m8420m9238k6089
5846E675549m48k7515k1920L1633J6574O6435j2690K91k1002n1268N7152J3059
5834E725850l8704J1975L6702M0516J5856N2769K7523n1945O2586N3710J0650
5823E947488j2566K1349K7835l0005O6383Q4326P3089L4442l5240L3912L3118
5812F244131K4209K0702k2375L7468L1144K8120M254L6706J00920L4792l0755
$$ plain form
5893 6987849 6950825 6922679 6899346 6887551 6892191 6884092 6872795 6917270 6915793 6839593 6842681 6799951
5881 6799951 6806256 6809730 6802500 6774354 6688916 6767023 6733125 6749487 6731953 6725949 6698998 6694009
5869 6694009 6682307 6597133 6602868 6500443 6483366 6454888 6307589 6247091 6242537 6195190 6152317
5858 6152317 6071246 6069786 5966977 5912080 5907228 5897404 5875059 5815384 5799296 5750876 5701638 5675549
5846 5675549 5675101 5647586 5625666 5657299 5673873 5740308 5727618 5727909 5706907 5655639 5712791 5725850
5834 5725850 5687146 5699121 5735823 5776339 5792195 5844964 5872487 5820542 5883128 5936838 5947488
5823 5947488 5934922 5956271 5984106 5954101 6020484 6104810 6177899 6212341 6177101 6211013 6244131
5812 6244131 6268340 6289042 6266667 6304135 6335279 6363399 6367653 6404359 6505279 6540071 6509316
5801F509316J4904O6037O9691L0782J0481J3698l1228K3562J4048O7087K5793
5790F814171O815n723m9774L2703l1919l0780J2908l2902m6348M539j6839j277
5778F655574j9615r0558L0356k703n9292o4637J0375N899L1392k3632n713j9773
5766F447673J3492l3819l0038P7579l4484m710N3952M9517L9328j6853m5932R645
5754F525350P3563R499L6341P9509l1110M1034O8966K8054l1769k2655N3020O1679
5742F891481L0541M30k0902Q010j2677M0905L52L6475j6524j1458o420L9672J2594
5729F992479n4158j6504m4680Q2979M7481J8735l2218J19037r411k5651M9018
5718G127107K6715N1356J15272L6673P5698r7065k5716M8868o0839J06001R23
$$ plain form
5801 6509316 6524220 6590257 6659948 6690730 6701211 6714909 6683681 6707243 6721291 6788378 6814171
5790 6814171 6820986 6815263 6765489 6798192 6766273 6735493 6748401 6715499 6669151 6673690 6656851 6655574
5778 6655574 6635959 6545401 6575757 6573054 6513762 6449125 6459500 6465399 6496791 6473159 6467446 6447673
5766 6447673 6461165 6427346 6397308 6474887 6440403 6435693 6489645 6539162 6578490 6561637 6515705 6525350
5754 6525350 6598913 6608412 6644753 6724262 6693152 6734186 6803152 6831206 6799437 6776782 6829802 6891481
5742 6891481 6922022 6922452 6901550 6909560 6896883 6937788 6938140 6974615 6958091 6946633 6940213 6979885 6992479
5729 6992479 6938321 6921817 6877137 6960116 7007597 7026332 6994114 7113151 7103740 7078089 7127107
5718 7127107 7153822 7205178 7320450 7357123 7432821 7335756 7310040 7358908 7298069 7404070 7404993
5707G404993M7184J082L084P5964K3076l6474j0601J8684J26075J4839O750Q0510
5695G755166Q7277Q815j2464R4449K9177L3402O8605J09664M0861P5555j1677
5684H278830K4739K5025n4035N8126k946l8986N0084J8958K71J3381m4889l2637
5672H295921L7979P8782M4365Q872N9341J24592N2509J6133K2836R0970J12421
5661H944721Q4885O1205O4450R2299J30068R3995O5545J18779J24492J17260K07429
5650A0105128R2264J50882J99515J79060J35845J94834K11139K36285K47521J78132
5640A1930605J58066K44892K90910K07685L32568J83384K73665L54561K68088
5631A4244424K77685K95588K69224L70679L44966K97888L54374L82847L90119
$$ plain form
5707 7404993 7452177 7453259 7456343 7532307 7555383 7518909 7508308 7526992 7653067 7667906 7674656 7755166
5695 7755166 7842443 7851258 7838794 7933243 7962420 7995822 8064427 8174091 8214952 8290507 8278830
5684 8278830 8303569 8328594 8274559 8332685 8329739 8290753 8340837 8359795 8360066 8373447 8328558 8295921
5672 8295921 8333900 8412682 8457047 8465919 8525260 8649852 8702361 8718494 8741330 8832300 8944721
5661 8944721 9029606 9090811 9155261 9247560 9377628 9471623 9537168 9655947 9780439 9897699 10105128
5650 10105128 10197392 10348274 10547789 10726849 10862694 11057528 11268667 11504952 11752473 11930605
5640 11930605 12088671 12333563 12624473 12832158 13164726 13348110 13621775 13976336 14244424
5631 14244424 14522109 14817697 15086921 15457600 15802566 16100454 16454828 16837675 17227794
5622A7227794L97596L82773L94731N08535M91584O04052N08459N15099N68392
5613B1599015O63495P08873P64167P94384Q19747Q56487R18505J095104J111010
5604B9330787J168184J262027J405120J599957J619404J693340J867403K054845
5596D2001067K204623K344624K495658K710938K870692L179875L467038L752709
5588F5027224M106147M473619M938089N340492N940635O498518P031110P675228
5580A11031062Q379850Q979806R484834R942482J0117819J0000357R487861Q841200
5572A86265271P779292O541141N037188L224343J323994n67075k142781l499644
5564B03961729m407850n074805n472855n608919n523884n450044n369496n275971
$$ plain form
5622 17227794 17625390 18008163 18402894 18911429 19403013 20007065 20515524 21030623 21599015
5613 21599015 22262510 22971383 23735550 24529934 25349681 26206168 27124673 28219777 29330787
5604 29330787 30498971 31760998 33166118 34766075 36385479 38078819 39946222 42001067
5596 42001067 44205690 46550314 49045972 51756910 54627602 57807477 61274515 65027224
5588 65027224 69133371 73606990 78545079 83885571 89826206 96324724 103355834 111031062
5580 111031062 119410912 128390718 137875552 147818034 157935853 167936210 177424071 186265271
5572 186265271 194044563 200585704 205622892 208847235 210171229 209604154 207461373 203961729
5564 203961729 199553879 194479074 189006219 183397300 177873416 172423372 167053876 161777905
5556A61777905n289403n367906n212887n112876n086759n125214n148482n258551
5548A20175827n207994n273951n226822n028660m932619m669815m430833m267215
5540H1137918l996476l821904l600814l425784l113700k949354k794187k580846
5532E4854853k466892k391034k198745k010412j943749j754157j678012j505612
5524C8906240j361472j255089j189765r97547r62480q41600p40693o89965n98188
5515C0269441n97035n55441l98197l59801l47544k33555k18177j28944r0835p1724
5505B7268188m7788M1064R7045n1097l7001l6689q2220n1688j97716k24244k86856
5494B6390998l20354l85528l84240l74266n36811l89607n37415o31693m91126
$$ plain form
5556 161777905 156488502 151120596 145907709 140794833 135708074 130582860 125434378 120175827
5548 120175827 114967833 109693882 104467060 99438400 94505781 89835966 85405133 81137918
5540 81137918 77141442 73319538 69718724 66292940 63179240 60229886 57435699 54854853
5532 54854853 52387961 49996927 47798182 45787770 43844021 42089864 40411852 38906240
5524 38906240 37544768 36289679 35099914 34102367 33139887 32298287 31557594 30867629 30269441
5515 30269441 29672406 29116965 28718768 28358967 28011423 27777868 27559691 27430747 27339912 27268188
5505 27268188 27220400 27261464 27358509 27307412 27270411 27233722 27151502 27099814 26902098 26677854 26390998
5494 26390998 26070644 25685116 25300876 24926610 24389799 24000192 23462777 22831084 22339958
5485B2339958n60645o02692n13891m90706n19479n90674n41237m37389m54354
5476A7628891m68912m62043m33242l05735l69474l88901l32103k23956l23310
5467A4321215k70219k48476l04259k30245k59695k47527k77099k32868j98647
5458A2052180k35524k43984j21672k16440k10507k45941k30145j40514j24211
5449A0283242j75339k00338j97114j80919j59353j06116k08896j40273j20175
5440H794719j48384j19807j31586n9108q9633p5671j25196q3994j08766j0917
5430G841657r4868o6576j5361r0439m0441m8166p5766r0477n2496J0719n3897
5419G223889j27759r9428m5206J4399o4998p7354r6293l1125n3748n8146K2079
$$ plain form
5485 22339958 21779313 21176621 20662730 20172024 19652545 19061871 18520634 18083245 17628891
5476 17628891 17159979 16697936 16264694 15958959 15589485 15200584 14868481 14644525 14321215
5467 14321215 14050996 13802520 13498261 13268016 13008321 12760794 12483695 12250827 12052180
5458 12052180 11816656 11572672 11451000 11234560 11024053 10778112 10547967 10407453 10283242
5449 10283242 10107903 9907565 9710451 9529532 9370179 9264063 9055167 8914894 8794719
5440 8794719 8646335 8526528 8394942 8335834 8246201 8170530 8045334 7961340 7852574 7841657
5430 7841657 7746789 7680213 7664852 7574413 7533972 7485806 7410040 7319563 7267067 7277786 7223889
5419 7223889 7096130 6996702 6951496 6965895 6900897 6823543 6727250 6696125 6642377 6584231 6606310
5408F606310K964p6127l7439m8689p7803k0805K9129m8077l3020M6060m2066M8867
5396F349304J4185m1453m144n2589N022R25p9687j554j2560r2271o8537p91K2178
5383F038028r2337j78939j2033q160o5272l5677J4412L246k2921r6742j8704N063
5371E529964J448l8640j41135k628m6540j4310J7811K926K9160q720M2343p8967
5359E292712n4239M2381j13282O8938R2854k7281K1024l7464L4296k828n2304
5348E264807r868R0665p044K8768j051l2188M5817l9315N9782O0298L7274J3047
5336E510992P5133j3843L0703J44258J27271J38659J67268J40288K22192K00224
5326F743145K33929L02732K33009K63047J74833L57846M59649L29334L28240K31193
$$ plain form
5408 6606310 6609274 6533147 6495708 6447019 6369216 6348411 6377540 6329463 6296443 6342503 6300437 6349304
5396 6349304 6363489 6322036 6317892 6265303 6270325 6271250 6191563 6190009 6177449 6085178 6016641 6015850 6038028
5383 6038028 5945691 5766752 5754719 5746559 5681287 5645610 5660022 5663268 5640347 5543605 5524901 5529964
5371 5529964 5531412 5492772 5351637 5349009 5302469 5288159 5305970 5308896 5338056 5329336 5371679 5292712
5359 5292712 5238473 5280854 5167572 5236510 5329364 5302083 5323107 5285643 5319939 5317111 5264807
5348 5264807 5254939 5345604 5338560 5367328 5366277 5334089 5379906 5340591 5400373 5460671 5497945 5510992
5336 5510992 5586125 5572282 5602985 5747243 5874514 6013173 6180441 6320729 6542921 6743145
5326 6743145 6977074 7279806 7512815 7775862 7950695 8308541 8768190 9097524 9425764 9656957
5316I656957Q6381q3519j91027k45928l04267l36003k24287j35758j80129k83975
5306G758445k89931k49260k26804m9401j05139j90593j23941k08565k36790j28678
5296E949343j31466j64999j54732o2884o8548j25664p7960k2889m8129j13777
5286D978295l9535o4704j1736k9193j2581J3827M6412p586o5269l1175r165j1792
5274D755798n1131l3937J7568N7646j9216p8597j6839L8472J7249P7427q614K3437
5262D779263L5902l3981N224O9675l5932n7616k7603n0266p4626r084m8074k8014
5250D524868k1465n2680r96p8211r1016o7711m8811M1546j6275l4261q5283q0344
5238C989361J8931K8841k1460p8473m2705j8470l5955L9337K3123Q996n0867j6807
$$ plain form
5316 9656957 9743338 9659819 9468792 9222864 8918597 8582594 8358307 8222549 8042420 7758445
5306 7758445 7468514 7219254 6992450 6943049 6837910 6647317 6523376 6314811 6078021 5949343
5296 5949343 5817877 5652878 5498146 5435262 5366714 5241050 5163090 5140201 5092072 4978295
5286 4978295 4938760 4874056 4862320 4833127 4820546 4834373 4880785 4873199 4807930 4776755 4767590 4755798
5274 4755798 4704667 4670730 4688298 4745944 4726728 4648131 4631292 4669764 4687013 4764440 4755826 4779263
5262 4779263 4815165 4781184 4786408 4856083 4820151 4762535 4734932 4684666 4610040 4600956 4552882 4524868
5250 4524868 4503403 4450723 4449727 4371516 4280500 4212789 4163978 4205524 4189249 4154988 4069705 3989361
5238 3989361 4008292 4037133 4015673 3937200 3894495 3876025 3840070 3879407 3902530 3911526 3860659 3843852
5226C843852J2812P399k5640k4928j5822m261J40636n1323j9031M6973M2822O687
5214C960176k6328K4664N8534k4902J22913L3876J9715Q4354N1072k3465r004
5203D271605L8700L0130Q0885J4284L8129N7493M1811P6768J61020P0211J2292
5192D893328N7726J186K0040O8223J02195o599j1909L0137p182O0361k7728L7162
5180E216940L3484j2888M8201l2144K4807J9501J8575N5159l2060N5519k6388
5169E368706j4658Q2612q6083M0214J29590M4053J1062P5924J5638J2978M4383
5158E724419Q2286N6515J0812P8617L1308P4208R4540R9473J37431J25478J03354
5147F618441J25621L5774J9962K1498J3860M6504J12316L7737Q6570K8142N655
$$ plain form
5226 3843852 3856664 3864063 3838423 3813495 3797673 3793412 3934048 3882725 3863694 3910667 3953489 3960176
5214 3960176 3933848 3958512 4017046 3992144 4115057 4148933 4168648 4253002 4304074 4280609 4271605
5203 4271605 4310305 4340435 4421320 4435604 4473733 4531226 4573037 4649805 4810825 4881036 4893328
5192 4893328 4951054 4952240 4972280 5040503 5142698 5136099 5124190 5154327 5147145 5207506 5179778 5216940
5180 5216940 5250424 5237536 5285737 5253593 5278400 5297901 5316476 5371635 5339575 5395094 5368706
5169 5368706 5354048 5436660 5350577 5390791 5520381 5564434 5575496 5651420 5667058 5680036 5724419
5158 5724419 5806705 5863220 5874032 5952649 5983957 6058165 6152705 6252178 6389609 6515087 6618441
5147 6618441 6744062 6779836 6799798 6821296 6835156 6881660 6993976 7031713 7118283 7146425 7152080
5136G152080J01099P8502k3108N1589J09450O9638J10457K9450M7581R1654K9342
5125G847734N0265J39917Q9336J18511J40804J95308J61620J14940J70669K22182
5115I251286K24421K58247K02604L00308K25444J68414K44043J86686J88623J62811
5105A1412887J66233J68511J79716R1735O0902J38894J52031J40925J79650J52106
5095A2843590J22093P8783K7937N118N0971J2085l5758j3742J07357N8758P5753
5084A3332945P9175J64286L8410J47003J48723J53067K8080o2293j4061o9757
5074A3945578J8607J16965k3745j23759j55877j58553J820K5267p5256j25456
5064A3445591n4033p7915n6441m4015j09427j90305j70855j68492k21085j43215
$$ plain form
5136 7152080 7253179 7331681 7308573 7360162 7469612 7539250 7649707 7679157 7726738 7818392 7847734
5125 7847734 7897999 8037916 8127252 8245763 8386567 8581875 8743495 8858435 9029104 9251286
5115 9251286 9475707 9733954 9936558 10236866 10462310 10630724 10874767 11061453 11250076 11412887
5105 11412887 11579120 11747631 11927347 12019082 12079984 12218878 12370909 12511834 12691484 12843590
5095 12843590 12965683 13044466 13072403 13077521 13128492 13140577 13104819 13091077 13198434 13257192 13332945
5084 13332945 13412120 13576406 13614816 13761819 13910542 14063609 14091689 14029396 14015335 13945578
5074 13945578 13964185 14081150 14057405 13933646 13777769 13619216 13621036 13646303 13571047 13445591
5064 13445591 13391558 13313643 13257202 13213187 13103760 12913455 12742600 12574108 12353023 12209808
5054A2209808j59536k35422j62587j74450j01517j16447j08478j29969j00102
5045A0921300j21688j77226j58672j11680j5216r1439p7120k5491q6452n6706
5035I999610r3504j23m2412N0140Q922K5909J9320P104j0098L8196P780R6320
5023A0107164M6544Q7519J21447J1941P3965O4333P2306k2772J80380J55844m442
5012A0894229Q0178J76229J17143J70485J72829J89848K34374J68177K54291K95110
5002A2752893L59178K78949L10299L87275M13048L88104L70173L52931M52276
4993A6065126L87142L76579M80784M36133M09451N06712L61599L71697M24737
4984A9819960M65541L68365M22617M73198M49640N55147N87924O17799O29147
$$ plain form
5054 12209808 12050272 11814850 11652263 11477813 11376296 11259849 11151371 11021402 10921300
5045 10921300 10799612 10622386 10463714 10352034 10336818 10245379 10168259 10142768 10056316 9999610
5035 9999610 9906106 9905983 9863571 9913711 9922633 9948542 9967862 9974966 9964868 10003064 10010844 10107164
5023 10107164 10153708 10241227 10362674 10374615 10448580 10512913 10585219 10562447 10742827 10898671 10894229
5012 10894229 10974407 11150636 11267779 11438264 11611093 11800941 12035315 12203492 12457783 12752893
5002 12752893 13112071 13391020 13701319 14088594 14501642 14889746 15259919 15612850 16065126
4993 16065126 16452268 16828847 17309631 17745764 18155215 18661927 19023526 19395223 19819960
4984 19819960 20285501 20653866 21076483 21549681 21999321 22554468 23142392 23760191 24389338
4975B4389338O38392O97918P97946P31584P80331P75257Q01609P39152P11166
4966C1062693O91801O84469O32218P16644N84211N83265N65053M77438M89449
4957C6487241L57015L70057L31622K50882K40625J47145K25916K23438K73635
4948C8907576K72801L11977M06115M18698L55125M61561M87530M67769N50020
4939D2639172O33473O49740N82712O07806N30873M94565N08744M93592M69387
4930D7610064L35446K92590K32469J71756J86372K16171K38403K78338L04740
4921D9866349M18940N60811O41863Q06705J001034J081520J380615J425491J666251
4912E8849579J886692J996149K215873K429730K666751K838893L105488L419045
$$ plain form
4975 24389338 25027730 25725648 26523594 27255178 28035509 28810766 29612375 30351527 31062693
4966 31062693 31754494 32438963 33071181 33787825 34372036 34955301 35520354 35997792 36487241
4957 36487241 36844256 37214313 37545935 37796817 38037442 38184587 38410503 38633941 38907576
4948 38907576 39180377 39492354 39898469 40317167 40672292 41133853 41621383 42089152 42639172
4939 42639172 43272645 43922385 44505097 45112903 45643776 46138341 46647085 47140677 47610064
4930 47610064 47945510 48238100 48470569 48642325 48828697 49044868 49283271 49561609 49866349
4921 49866349 50285289 50846100 51487963 52294668 53295702 54377222 55757837 57183328 58849579
4912 58849579 60736271 62732420 64948293 67378023 70044774 72883667 75989155 79408200
4904G9408200L770281M154170M625515N004585N415521O198795O759447P376954
4896A22713468Q046730Q781134R777615J0840991J2111254J3380803J4696471
4889B00348466J5896781J6928573J7507801J7420211J6802890J5446310J3384192
4882C13735224J0854527P629598L961421j4990l785660p019184r527550j1350300
4874C04483086j2459910j3093622j3220009j2687864j1882890j1039007j0524977
4867B19574807j0132445r708169r340586r046701q731339q400205q278225q001591
4859A47935546p761379p422690o965416o401799n916196n456702m967355m367823
4851I8676186l976886l650175l253098k997716k703264k497344k373352k138807
$$ plain form
4904 79408200 83178481 87332651 91958166 96962751 102378272 108577067 115336514 122713468
4896 122713468 130760198 139541332 149318947 160159938 172271192 185651995 200348466
4889 200348466 216245247 233173820 250681621 268101832 284904722 300351032 313735224
4882 313735224 324589751 332219349 336180770 336165780 332380120 325360936 315833386 304483086
4874 304483086 292023176 278929554 265709545 253021681 241138791 230099784 219574807
4867 219574807 209442362 199734193 190393607 181346906 172615567 164215362 155937137 147935546
4859 147935546 140174167 132751477 125786061 119384262 113468066 108011364 103044009 98676186
4851 98676186 94699300 91049125 87796027 84798311 82095047 79597703 77224351 75085544
4843G5085544j991975j930268j854670j619207j590115j567620j421616j319791
4835F1790282j334071j268497j134731j074149j027166r20127r06862q49403o56725
4826E2618551p04615n87116m17861m60904n78648m58514l22778k93219l45973
4817D8448923l37076k68412k31756j95696j26791o4800j34284q4658M3622M9348
4807D7098420P8757K13256Q2543R4772P8962J21876J80381J0792J3377L7148l887
4796D8006397N9731o33J35467J60364J69189K99275L00927L32900L99263L63122
4786E0226002L56257J77537J10230M1590j56642j89739k92982k64971k59490k45528
4776D9502264j83751N6867j964K01370L00477L12557M82266N01517L72247L46521
$$ plain form
4843 75085544 73093569 71163301 69308631 67689424 66099309 64531689 63110073 61790282
4835 61790282 60456211 59187714 58052983 56978834 55951668 55031541 54124679 53275276 52618551
4826 52618551 51913936 51326820 50908959 50448055 49869407 49410893 49088115 48794896 48448923
4817 48448923 48111847 47843435 47611679 47415983 47289192 47224392 47090108 47005450 47049072 47098420
4807 47098420 47177177 47390433 47472976 47567748 47646710 47768586 47948967 47959759 47973136 48010284 48006397
4796 48006397 48066128 48065495 48200962 48361326 48530515 48829790 49130717 49463617 49862880 50226002
4786 50226002 50582259 50759796 50870026 50911616 50754974 50565235 50272253 50007282 49747792 49502264
4776 49502264 49318513 49375380 49373416 49574786 49875263 50187820 50670086 51171603 51543850 51890371
4766E1890371K14451J13862k7849q9225j94897l50901l76408m48183l73879m30883
4756D9926459m31707l07225k15636r7541p2452p1098N1044P6811J70028J75460
4746D9204143R5018J07102J28151K33762J23418N9827N9805P6438k1057l7641
4736E0028966M98p8139j30288m0150q8479m3107p698r227m801k6189r7229m2393
4724D9461764J0168L2225m3692k2311j05141j26246r7694k02674j16409j30706
4714D8659284j77266k42487j90854j50601q2965j76995j56323j26208n1932m9549
4704D7254104p1822j04535j28N9576O0648J04213J83139K91109L42592M14239
4694D8533135N18631O57852P11608Q00356Q98344J098730J185361J309295J398407
$$ plain form
4766 51890371 52104822 52218684 52190835 52101610 51906713 51555812 51179404 50731221 50357342 49926459
4756 49926459 49494752 49187527 48971891 48874350 48801898 48730800 48781844 48858655 49028683 49204143
4746 49204143 49299161 49406263 49534414 49768176 49891594 49951421 50011226 50087664 50066607 50028966
4736 50028966 50029464 49951325 49821037 49780887 49692408 49649301 49641603 49632376 49627575 49601386 49504157 49461764
4724 49461764 49471932 49504157 49460465 49438154 49333013 49206767 49109073 48906399 48789990 48659284
4714 48659284 48482018 48239531 48048677 47898076 47815111 47638116 47481793 47355585 47303653 47254104
4704 47254104 47182282 47077747 47077619 47137195 47197843 47302056 47485195 47776304 48118896 48533135
4694 48533135 49051766 49709618 50421226 51221582 52119926 53218656 54404017 55713312 57111719
4685E7111719J545593J806112J796687J973946K102891K388853K625745K870174
4677G4221720L120703L523616M100378M692071N488731O484938O793507O498226
4669A14923890O952067P585012Q862114J1298142J4604112J8506794K0062794
4662B02794925J8448835J8735487K1337985K0514993J9351377J7820131J3096141
4655C32099874L251980o583283r564087j0877895r847124p266483q608721j1550106
4647B71054155j0925310p532681l730632j76024J62208j563120k377863j989249
4639B42921484m82828J222434L057686N328349P711897J0056628J3181754J6254131
4631B99251535J8596254J9383648J8471800J5825974J2289971Q528103M138316
$$ plain form
4685 57111719 58657312 60463424 62260111 64234057 66336948 68725801 71351546 74221720
4677 74221720 77342423 80866039 84966417 89658488 95147219 101632157 108425664 114923890
4669 114923890 121875957 129460969 138323083 149621225 164225337 182732131 202794925
4662 202794925 221243760 239979247 261317232 281832225 301183602 319003733 332099874
4655 332099874 335351854 328768571 319204484 308326589 298479465 291212982 282604261 271054155
4647 271054155 260128845 252596164 248865532 248689508 248851716 247288596 244910733 242921484
4639 242921484 242438656 243661090 246718776 252047125 259759022 269815650 282997404 299251535
4631 299251535 317847789 337231437 355703237 371529211 383819182 392347285 396485601
4624C96485601j875602q194591j2921266j5448721j6807816j7222554j6789596
4617C07225455j5471367j3440463j1318987r896349r103512q593081q014678o957295
4609B24429723n842560m747972m083847l588038l342516l101963l041036l347784
4601A93334007m377654n455373o373280o977095p352335p531552p331589o905040
4593A41030089o116325n385820m782947m369473m240147m089270m027036l862532
4585A04156539l820847l872351l774023l753730l775083l529381l366179l175757
4577G5089188k871724k557999k398477k226614j914323j724354j612262j447484
4569E8335951j353975j236490j160176j150328r56219r84570r31140r63131q54737
$$ plain form
4624 396485601 394609999 386415408 373494142 358045421 341237605 324015051 307225455
4617 307225455 291754088 278313625 266994638 257098289 247994777 239401696 231387018 224429723
4609 224429723 218587163 213839191 209755344 206167306 202824790 199722827 196681791 193334007
4601 193334007 188956353 183500980 177127700 170150605 162798270 155266718 147935129 141030089
4593 141030089 134913764 129527944 124744997 120375524 116135377 112046107 108019071 104156539
4585 104156539 100335692 96463341 92689318 88935588 85160505 81631124 78264945 75089188
4577 75089188 72217464 69659465 67260988 65034374 63120051 61395697 59783435 58335951
4569 58335951 56981976 55745486 54585310 53434982 52478763 51494193 50563053 49599922 48745185
4560D8745185p91510p14649n17664m88962m20542l43550k47851k52314k01876
4551D4766267k21265j67412j25722k64577k80339k09060k41401k68253l06291
4542D2681947l33452k58506k03758k61463p6824j32130k05055j28097L6985L65
4532D1120012Q0470K19806L46339N71117O59725Q35475R99001R71769R62138Q97680
4522D7663532Q48362O41146M39991K12683j98735k81963l51564m84202n16280
4513D7972970m86734m55079m14368k87778l54040m06368k65669m07530m32252
4504D4463152l70517m70049n54477o21084p07525p42124q54104q86982q25405
4495C8430885r00412q66223p79160o44162m87262m53028l51885l11543j36349
$$ plain form
4560 48745185 47953675 47239026 46721362 46232400 45811858 45468308 45220457 44968143 44766267
4551 44766267 44545002 44377590 44251868 43987291 43706952 43497892 43256491 42988238 42681947
4542 42681947 42348495 42089989 41886231 41624768 41547944 41415814 41210759 41082662 41119647 41120012
4532 41120012 41200482 41420288 41766627 42337744 42997469 43832944 44831945 45803714 46765852 47663532
4522 47663532 48511894 49153040 49593031 49805714 49606979 49325016 48973452 48489250 47972970
4513 47972970 47486236 47031157 46616789 46329011 45974971 45568603 45302934 44895404 44463152
4504 44463152 44092635 43622586 43068109 42447025 41739500 40997376 40143272 39256290 38430885
4495 38430885 37530473 36664250 35885090 35240928 34753666 34300638 33948753 33637210 33500861
4486C3500861J2662J38528K15433M15114M81172N37719O48853Q66994J079514
4477C7896850J344431J642240J835133J742982J586273J518803J418966J188032
4469E0173710Q44779L13086o63202j285792j610503j855982j898673k115209k152016
4460C9750198k074964j894714j531405j278862j253938j309724j342759j337140
4452B7726692j227747j130364j204964j121993j056187j020053q60436p04622
4444A9400326o83151o55057n47639m82380m31733l11568k67667k67082k60427
4435A5493622k16434j09016j25173j01121j54398p879J8197p5383o1480o494p4733
4424A4579708m2103o4775m0647r3106j61795o5642j00849j11697p7060p7132m6608
$$ plain form
4486 33500861 33513523 33652051 33867484 34282598 34763770 35301489 35950342 36817336 37896850
4477 37896850 39241281 40883521 42718654 44461636 46047909 47566712 48985678 50173710
4469 50173710 51018489 51331575 50668373 49382581 47772078 45916096 44017423 41902214 39750198
4460 39750198 37675234 35780520 34249115 32970253 31716315 30406591 29063832 27726692
4452 27726692 26498945 25368581 24163617 23041624 21985437 20965384 20104948 19400326
4444 19400326 18717175 18062118 17514479 17032099 16600366 16288798 16021131 15754049 15493622
4435 15493622 15277188 15168172 15042999 14941878 14787480 14779601 14797798 14722415 14660935 14654441 14579708
4424 14579708 14537605 14472830 14432183 14339077 14177282 14111640 14010791 13899094 13822034 13744902 13698294
4413A3698294o7453j26018j06091j00452j43192j84413j03150k40947k38320j97596
4403A2190662k14471j90546k17023k27114j59175j15332o0390p8539j24161o1747
4393A0742164l4825j32293j77463p5670l1090j9436l4076L2545l7786k2028k7092
4382A0182950j15806r9658m0327l7751j5454l5843p585n6365Q601m315L6543M3030
4370I858020L1091L7296l1412J2513k8063j25033j59230j52514j11609j93221
4360I137838k28312j81268j13306j27604q0954p6138j27325o4528j13441q3858
4350G941104q3367o9714o5636O2505M9781K9309O1746j2651Q0630O9808L2114
4339H095629M9578M1461P18o059o8718r1028j17803L68Q310j02696N70K2125M1594
$$ plain form
4413 13698294 13630841 13504823 13398732 13298280 13155088 12970675 12867525 12626578 12388258 12190662
4403 12190662 11976191 11785645 11568622 11341508 11182333 11067001 11006611 10928072 10803911 10742164
4393 10742164 10707339 10575046 10397583 10321913 10290823 10271387 10237311 10269856 10232070 10210042 10182950
4382 10182950 10067144 9967486 9927159 9889408 9873954 9838111 9830526 9774161 9782762 9778447 9814990 9858020
4370 9858020 9889111 9926407 9894995 9907508 9879445 9754412 9595182 9442668 9331059 9137838
4360 9137838 8909526 8728258 8614952 8487348 8406394 8330256 8202931 8138403 8024962 7941104
4350 7941104 7857737 7788023 7722387 7784892 7834673 7863982 7925728 7913077 7993707 8063515 8095629
4339 8095629 8145207 8186668 8187386 8181327 8112609 8021581 7903778 7904146 7912456 7809760 7810330 7832455 7874049
4326G874049M0774O5084K3844m2917o0091j7358p3208p5896r1715j74685j52381
4315G315500j22090j14950j92917j03851k5433r0594r6166j33166n2032j01722
4305F282579q1624n8326o1528M7762q2781r1265o165o7015j33440k2625m6137
4294E679435j67254r8281j373q093l0697q3500j18305m6403k8318j27892N5360
4283E024679j9908j14703k6020p0537m5942j3634k9564r471K2038q0531K612J7844
4271D656863r028m7321k1176P951n893j9681k6497o720N0615N9244K0484j0607
4259D648234l8715o4834o0996o208p7125n8207L2122L4066n3206l1530J4694l1352
4247D306943M9484k5737J6706l8511m2093M3469j9394n3584n1767J777n530k6262
$$ plain form
4326 7874049 7914823 7979907 8003751 7960834 7900743 7883385 7810177 7734281 7642566 7467881 7315500
4315 7315500 7193410 7078460 6885543 6781692 6756259 6665665 6569499 6436333 6384301 6282579
4305 6282579 6200955 6142629 6081101 6128863 6046082 5954817 5948652 5881637 5748197 5725572 5679435
4294 5679435 5512181 5413900 5412527 5404434 5373737 5290237 5171932 5125529 5097211 4969319 5024679
4283 5024679 5004771 4890068 4864048 4793511 4747569 4733935 4704371 4694900 4716938 4636407 4639019 4656863
4271 4656863 4647835 4600514 4579338 4587289 4581396 4561715 4535218 4528498 4579113 4638357 4658841 4648234
4259 4648234 4609519 4544685 4483689 4477481 4400356 4342149 4374271 4408337 4355131 4323601 4338295 4306943
4247 4306943 4356427 4330690 4347396 4308885 4266792 4310261 4290867 4237283 4185516 4187293 4181763 4155501
4235D155501P355n6160k1510j24115l9308q629M7245Q563o7462k545o68m4698
4223C853569L1827k8553r0648k1490N9874N6893k6890m4554m9144P2307k4346
4212C788845N1454L0268j6572L0262K522K2239N6443n890J3761Q4666l3395M1966
4200D066569j7075N6418Q7002L7765J0639Q3067M9427j9640N9205J17639n734
4189D525282P869R2525k008Q9148K6395P3671K7443L9666j6567j3829k5995m2776
4177D780824n6415l4094p1855o1872p3713L2365o304K6895l2256o8223m3398K0676
4165D412630J0272O559k5168n7190m8767J9202R0867k4990J3172K5512l329M8733
4153D467503P6467R6210O0987j4521O3956J98449J10991J08892Q2139J43787M0424
$$ plain form
4235 4155501 4162856 4106696 4085186 3961071 3921763 3913134 3960379 3968942 3901480 3898935 3898267 3853569
4223 3853569 3885396 3856843 3766195 3744705 3804579 3861472 3834582 3790028 3740884 3813191 3788845
4212 3788845 3840299 3870567 3853995 3884257 3886779 3909018 3965461 3959571 3973332 4057998 4024603 4066569
4200 4066569 4049494 4105912 4192914 4230679 4241318 4324385 4373812 4354172 4413377 4531016 4525282
4189 4525282 4533151 4625676 4623668 4712816 4739211 4812882 4840325 4879991 4863424 4849595 4823600 4780824
4177 4780824 4724409 4690315 4618460 4556588 4482875 4515240 4508936 4535831 4503575 4435352 4391954 4412630
4165 4412630 4422902 4429461 4404293 4347103 4298336 4317538 4408405 4383415 4396587 4422099 4418770 4467503
4153 4467503 4543970 4640180 4701167 4686646 4750602 4949051 5060042 5168934 5251073 5394860 5435284
4142E435284M9202j7691j3556O6024n206j5715J0970J8082l566p6956k0861P8230
4130E504241K9861J0311K6277J17258J46352J28177O9951J11529J67821K37299
4120F549077J48343K17278K14555K15188J86803K57852K42222K02686J50156J76234
4110H560394Q2088P5378L4552L3566j0270j1457p9672k2418O7824M4918M2248
4099H817151L8791P0678O6053R4126P7575P4353O7496R0328O7777J42557J90703
4088I797588J61950J68648Q8054J06769O6849J72222J25028P6674M9393O5814
4078A0878989N5459j8386J0622n7601p392l3568r8441q9832j53426p9256l9613
4067A0367555l2593o6970m0543k9230p7560m9409l8270O881o3873j07452j45790
$$ plain form
4142 5435284 5484486 5466795 5453239 5519263 5514057 5498342 5509312 5527394 5523828 5446872 5426011 5504241
4130 5504241 5534102 5544413 5570690 5687948 5834300 5962477 6032428 6143957 6311778 6549077
4120 6549077 6697420 6914698 7129253 7344441 7531244 7789096 8031318 8234004 8384160 8560394
4110 8560394 8642482 8717860 8752412 8785978 8775708 8764251 8684579 8662161 8729985 8774903 8817151
4099 8817151 8855942 8926620 8992673 9086799 9164374 9238727 9306223 9396551 9464328 9606885 9797588
4088 9797588 9959538 10128186 10216240 10323009 10389858 10562080 10687108 10763782 10813175 10878989
4078 10878989 10934448 10916062 10926684 10869083 10861691 10828123 10729682 10639850 10486424 10407168 10367555
4067 10367555 10334962 10267992 10227449 10198219 10120659 10071250 10032980 10039861 9975988 9868536 9722746
4056I722746k2798o1355j51057j46766o3983j98733j27133j67090j39906j44727
4046H499198k55047j85989j42425j45697j46315j39810j43672j11587j62253j05541
4036F960862o7848o4825j35473p1606j1567m7533l5914r3253J9888K3932m3639
4025F433024r2203m5002J4148M8801M9518p3649l3387l5947q3709n6551p399q107
4013F109537q4406j19247n0917n7263p0006o1494J4863k1868j29622o1071k1837
4002E446669K3552k6840k1888l9590r918Q2716k3988n3649J5938K798O3295k5503
3990E433592k93K1628k7991r2491l3050P924k1144j7427R442N1654J7640K4129
3978E373613p822M0770r250J2279K0190k2101p3623N5563R2365K7080L393L8791
$$ plain form
4056 9722746 9699948 9638593 9487536 9340770 9276787 9078054 8950921 8783831 8643925 8499198
4046 8499198 8244151 8058162 7915737 7770040 7623725 7483915 7340243 7228656 7066403 6960862
4036 6960862 6893014 6828189 6692716 6621110 6609543 6562010 6526096 6432843 6452731 6476663 6433024
4025 6433024 6340821 6295819 6309967 6358768 6408286 6334637 6301250 6265303 6181594 6125043 6117644 6109537
4013 6109537 6025131 5905884 5854967 5797704 5727698 5666204 5681067 5659199 5529577 5468506 5446669
4002 5446669 5470221 5443381 5421493 5381903 5371985 5454701 5430713 5377064 5393002 5395800 5459095 5433592
3990 5433592 5433299 5454927 5426936 5334445 5301395 5309319 5288175 5270748 5280190 5331844 5349484 5373613
3978 5373613 5365791 5406561 5397311 5409590 5429780 5407679 5334056 5389619 5481984 5509064 5512457 5551248
3966E551248M2022K1188l0405J8022j2235O3393j0109n6726K5603P7480j1821
3955E677660m3301L1680J0556J8253Q9490J00342Q0257j0577J6216m9339l8138
3944E883099J39103m155R5009J04120q3209N6782N0837j7656O9290L3830O5138
3933F392188J211N9695p200l3407K3862J38717Q2935M8109K2233M1282j2420M7495
3921F804700J2978M1010J25832LP3092K8822M2178J9520N3031R4521J32816N1417
3909G479920j6120L6158J23220J35419p412j7105L0226Q7336L0225J02077j7251
3898G966693J7383K3749R5538M6304K1225N5532n722N6808P7641O8536N0075l206
3886H470556p0157O4864Q9988Q2451J2333J3393L7565M4218m9637k4669k7641
$$ plain form
3966 5551248 5593270 5614458 5584053 5602075 5589840 5653233 5643124 5586398 5612001 5689481 5677660
3955 5677660 5634359 5666039 5676595 5694848 5784338 5884680 5964937 5954360 5970576 5921237 5883099
3944 5883099 6022202 6018047 6113056 6217176 6133967 6190749 6241586 6223930 6293220 6327050 6392188
3933 6392188 6393399 6453094 6445894 6412487 6436349 6575066 6658001 6706110 6728343 6769625 6757205 6804700
3921 6804700 6817678 6858688 6984520 6984523 7057615 7086437 7128615 7148135 7201166 7295687 7428503 7479920
3909 7479920 7463800 7499958 7623178 7758597 7751185 7734080 7764306 7851642 7881867 7983944 7966693
3898 7966693 7984076 8007825 8103363 8149667 8170892 8226424 8220702 8277510 8355151 8423687 8473762 8470556
3886 8470556 8400399 8465263 8555251 8637702 8650035 8663428 8700993 8745211 8695574 8670905 8643264
3875H643264j2360M4026O604J1856L0133K6047K3672k3305l0699q0792M9383J22999
3863H810828O8517k4838K475J4571q532K8795K0578J4303R952R0559R3078o477
3851I113809P98k1171J678K0858J0560k5551K964L1325P6288J7440J3810J983
3839I244791l8503P9479r384K0376l8745M9755K0125q0935Q404O406J242k7930
3827I235081j3739P271j34959j9957O2672m7487l831q2249l6182p3494m8261J1033
3815H855898J7466K583l3670j6661j9995l2186j3831r130j7701q529l2897n3215
3803H638132k6533J5514L4806J7349p7519L1097l692J8503j0925j5899J256j4371
3791H607718L9401O5659o4677N1797O4342m4516J5509O252p616M0705l393J4446
$$ plain form
3875 8643264 8630904 8674930 8681534 8693390 8723523 8749570 8773242 8749937 8719238 8638446 8687829 8810828
3863 8810828 8879345 8854507 8856982 8871553 8863021 8891816 8912394 8926697 8936649 9027208 9120286 9113809
3851 9113809 9114607 9093436 9095114 9115972 9126532 9100981 9103945 9135270 9211558 9228998 9242808 9244791
3839 9244791 9206288 9285767 9276383 9296759 9258014 9307769 9327894 9246959 9255363 9261769 9263011 9235081
3827 9235081 9221342 9228613 9093654 9073697 9136369 9088882 9085051 9002802 8966620 8893126 8844865 8855898
3815 8855898 8873364 8875947 8842277 8825616 8805621 8773435 8759604 8750474 8732773 8724244 8691347 8638132
3803 8638132 8611599 8627113 8661919 8679268 8601749 8632846 8629154 8647657 8636732 8620833 8622089 8607718
3791 8607718 8647119 8712778 8648101 8699898 8764240 8719724 8735233 8741485 8733869 8774574 8771181 8785627
3779H785627Q2248M4907j5648K9247m091j2928N9988K5380N9935J6497O0208L133
3767I134503L2770M3515N836J7003J7476m2474J7005N8053J12392M6597N3658
3756I496334P2698k6271K3342R2300J07523N8208P9927O7476P706M6844P5636
3745A0101723l0157O8714K1326O5195P6068L771L1368N8712O2191k597K2720J2227
3733A0491261l6699J8614N8283k5762q681O0693N6868M0991J25341L8578M1076
3722A0860563k583M8579J3098L8151J23860J8640k9641O0185M1755R4088Q0752
3711A1347447K3072L2616Q0637J00856j8149j9760Q4959O2712K9839o8154J134
3700A1657209N843J22670J70576j9920N3010Q5648R6027J39131J61092J27650
$$ plain form
3779 8785627 8867875 8912782 8897134 8926381 8922290 8909362 8969350 8994730 9054665 9071162 9131370 9134503
3767 9134503 9167273 9210788 9216624 9233627 9251103 9208629 9225634 9283687 9396079 9442676 9496334
3756 9496334 9569032 9542761 9566103 9658403 9765926 9824134 9904061 9971537 9979243 10026087 10101723
3745 10101723 10071566 10140280 10161606 10226801 10302869 10306640 10338008 10396720 10458911 10456314 10479034 10491261
3733 10491261 10454562 10473176 10531459 10505697 10497016 10557709 10614577 10655568 10780909 10819487 10860563
3722 10860563 10857980 10906559 10919657 10957808 11081668 11100308 11070667 11130852 11172607 11266695 11347447
3711 11347447 11370519 11403135 11483772 11584628 11566479 11546719 11631678 11694390 11724229 11656075 11657209
3700 11657209 11663052 11785722 11956298 11936378 11989388 12075036 12171063 12310194 12471286 12598936
3690A2598936K02256J54773J69382J03407J42277K23408K07695J32760J64928
3681A4099822J12861J7575J19062J34551M8504N4507m7170p6287o8954j3040o2828
3670A4318603m3880L1877K4091p750p1671J9536L7537K5911N977M4963M040N9535
3658A4448769J82222L7070J17558Q6455J4647J48308J14345Q0524K9671J11333
3648A5370902J12161J3152L9934k7471l4568n7171k4883r3229p7475l0850n0104
3637A5140398o3220j37818o1939o9147j9637n370n3005p1018M6970j03973l1800
3626A4570441J1357m9824j1243J1970M6230R174k727j1138N4754Q2500R840L785
3614A4725119J11075P7476J20145P7779L1332N7867J04236P8970N8584Q7064J26864
$$ plain form
3690 12598936 12801192 12955965 13125347 13228754 13371031 13594439 13802134 13934894 14099822
3681 14099822 14212683 14230258 14349320 14483871 14532375 14586882 14539712 14463425 14394471 14381431 14318603
3670 14318603 14274723 14306600 14330691 14322941 14251270 14270806 14308343 14334254 14340231 14385194 14389234 14448769
3658 14448769 14630991 14668061 14785619 14872074 14886721 15035029 15149374 15229898 15259569 15370902
3648 15370902 15483063 15496215 15536149 15508678 15474110 15416939 15392056 15298827 15221352 15190502 15140398
3637 15140398 15077178 14939360 14877421 14808274 14788637 14783267 14730262 14659244 14706214 14602241 14570441
3626 14570441 14581798 14531974 14520731 14532701 14578931 14588105 14585378 14574240 14628994 14711494 14721334 14725119
3614 14725119 14836194 14913670 15033815 15111594 15142926 15200793 15305029 15383999 15442583 15529647 15656511
3603A5656511M1935Q8034J82249J00151J07724J93846O4644J32218J81291O7561
3593A6816164Q3666J30947J31271P0848J28135K01977K27754P7711Q4516R7023
3583A8050012J75345J79691J49553J53049J48814J84568J75956J06303J44984
3574A9468275K78560J68977K50050K43032K01977K43392J90927K13466K58346
3565B1517002K53489K46809K39007L70649K89375K32812K63410L28915L21773
3556B4063241L04482M22349K94220L59804L89580L67182L49875L82052M19500
3547B7352285M23423M22926M26075M12599M13925N10024M66260M76200N37777
3538C1441494O00183N14789N90501O32952N86190P22329O84040O82100P32357
$$ plain form
3603 15656511 15698446 15786480 15968729 16068880 16176604 16370450 16435094 16567312 16748603 16816164
3593 16816164 16899830 17030777 17162048 17232896 17361031 17563008 17790762 17868473 17952989 18050012
3583 18050012 18225357 18405048 18554601 18707650 18856464 19041032 19216988 19323291 19468275
3574 19468275 19746835 19915812 20165862 20408894 20610871 20854263 21045190 21258656 21517002
3565 21517002 21770491 22017300 22256307 22626956 22916331 23149143 23412553 23741468 24063241
3556 24063241 24367723 24790072 25084292 25444096 25833676 26200858 26550733 26932785 27352285
3547 27352285 27775708 28198634 28624709 29037308 29451233 29961257 30427517 30903717 31441494
3538 31441494 32041677 32556466 33146967 33779919 34366109 35088438 35772478 36454578 37186935
3529C7186935P00825P10624P51998P73162Q03419P47955P79882P34612Q43665
3520D4033077Q44489Q87573R11688R07168R92735R97642J123933J134868J145328
3511E2978501J289288J283698J328354J366512J516207J545232J605796J734520
3503F4648108J749821J863244J908525K038944K061044K174454K302224K436510
3495H1182874K576836K757330L017199L330013L568757L896694M179784M555050
3487A09064537M953818N253223N596261N864839O128475O246741O294190N936304
3479A55338388N434939M606801L610326K325987Q99865m75673j763468k806342
3471A67170823l558520l973923m074578l976945l931363l834213l767058l749112
$$ plain form
3529 37186935 37887760 38598384 39350382 40123544 40926963 41674918 42454800 43189412 44033077
3520 44033077 44877566 45765139 46676827 47583995 48576730 49574372 50698305 51833173 52978501
3511 52978501 54267789 55551487 56879841 58246353 59762560 61307792 62913588 64648108
3503 64648108 66397929 68261173 70169698 72208642 74269686 76444140 78746364 81182874
3495 81182874 83759710 86517040 89534239 92864252 96433009 100329703 104509487 109064537
3487 109064537 114018355 119271578 124867839 130732678 136861153 143107894 149402084 155338388
3479 155338388 160773327 165380128 168990454 171316441 172216306 171740633 169977165 167170823
3471 167170823 163612303 159638380 155563802 151586857 147655494 143821281 140054223 136305111
3463A36305111l644561l581976l571697l530303l300544l131194l062997k929597
3455A09552242k809103k641846k484109k409743k254203k163030k116248k006946
3447I0667014k058044j859619j822852j881443j767654j757828j791723j649003
3439G6078848j699740j696677j647347j574669j521331j528983j441734j425664
3431F3542703j391369j367351j339794j285368j190634j114479j095798j019314
3423E3738596r63739r02524r41365q08944q17866o80082p21784p24034p04990
3414D6473268o78186o15549o91376n75568n00657n65519n15913n06574m73591
3405D1350335l84107l98001m19436k88384l89399m02842k88061l66064k92185
$$ plain form
3463 136305111 132660550 129078574 125506877 121976574 118676030 115544836 112481839 109552242
3455 109552242 106743139 104101293 101617184 99207441 96953238 94790208 92673960 90667014
3447 90667014 88608970 86749351 84926499 83045056 81277402 79519574 77727851 76078848
3439 76078848 74379108 72682431 71035084 69460415 67939084 66410101 64968367 63542703
3431 63542703 62151334 60783983 59444189 58158821 56968187 55853708 54757910 53738596
3423 53738596 52774857 51872333 50930968 50122024 49304158 48624076 47902292 47178258 46473268
3414 46473268 45795082 45179533 44488157 43912589 43411932 42846413 42330500 41823926 41350335
3405 41350335 40966228 40568227 40148791 39860407 39471008 39068166 38780105 38414041 38121856
3396C8121856k43782k21672k52343j81426j18288j01264j73495j24315k57551
3387C6447720k97375k16422l21494l79170l36881l31567l32983l89774k69802
3378C3572252k01684k78873k98894k44107j84128k22522k06258k74882k71085
3369C1389819k28339k19770k01739j35915j5737k1325p367j5510L0751K1833L6050
3358C0632751P145L2369j44089k97708l48793k85889l06878l51365m45965l46103
3348B8145475m35786l76495j65804l00758k74447j89593k31615k47859k32817
3339B5690301l00597j64542k10514k04459j77248p3417p1222q5888l7245J7652
3329B4382821o7721j20985P2537j0473o8351j23789k05814j60937k42289j96271
$$ plain form
3396 38121856 37878074 37656402 37404059 37222633 37104345 37003081 36829586 36705271 36447720
3387 36447720 36150345 35933923 35612429 35233259 34896378 34564811 34231828 33842054 33572252
3378 33572252 33370568 33091695 32792801 32548694 32364566 32142044 31935786 31660904 31389819
3369 31389819 31161480 30941710 30739971 30604056 30588319 30566994 30559627 30544117 30574868 30596701 30632751
3358 30632751 30639896 30672265 30528176 30230468 29881675 29595786 29288908 28937543 28491578 28145475
3348 28145475 27709689 27333194 27167390 26866632 26592185 26402592 26170977 25923118 25690301
3339 25690301 25389704 25225162 25014648 24810189 24632941 24559524 24488302 24402414 24365169 24382821
3329 24382821 24315100 24194115 24266652 24256179 24187828 24064039 23858225 23697288 23454999 23258728
3319B3258728j93723j77136k57286k47548j18301j58286j66661j88574j51544
3310B1599669r9395k60601k66939j67753k03494k39369j37355j78829j60295k08627
3300A9677012j70955j85848j87884j77659j39754q1493j24663j11935j35630o5743
3290A8295448j00042j75324j53719n4577j19005j21011j22880j65441r5214j21666
3280A7066569l9962j62024j70130l0006j35810j59245j89964j28632j09724j67038
3270A5774034j25556q6514j81227j21725j80086p8695j49253j25414m7484r7298
3260A4580782q6726k7993j02333n4361m710Q392r2043j29844p6695J8971l4513
3249A3998927p2577l5725k5303j8087o615K7643l8032k1249k3204j5760m0309
$$ plain form
3319 23258728 23065005 22887869 22630583 22383035 22264734 22106448 21939787 21751213 21599669
3310 21599669 21500274 21239673 20972734 20804981 20601487 20362118 20224763 20045934 19885639 19677012
3300 19677012 19506057 19320209 19132325 18954666 18814912 18733419 18608756 18496821 18361191 18295448
3290 18295448 18195406 18020082 17866363 17811786 17692781 17571770 17448890 17283449 17188235 17066569
3280 17066569 17026607 16864583 16694453 16664447 16528637 16369392 16179428 16050796 15941072 15774034
3270 15774034 15648478 15561964 15380737 15259012 15078926 15000231 14850978 14725564 14678080 14580782
3260 14580782 14494056 14466063 14363730 14309369 14304659 14313051 14221008 14091164 14014469 14033440 13998927
3249 13998927 13926350 13890625 13865322 13847235 13840620 13868263 13830231 13808982 13785778 13770018 13729709
3238A3729709j6119m941M8444n6569K3363P4014R3199M2721R166L4704N4291O2441
3226A4094423R80J20126J76593J07555J37011M9710O4620R2667J07339P0027J05289
3215A5126340K05182J46819K15658J52035J47671P2365J87322K35109N9351J55405
3205A6703257J45681J29166J70356R1467Q7960J13643K59651J68527J33331K35250
3195A8238289K24307K17159J77556K24832J86602K55294K55722K81229L17507
3186B0378497K65799K57027L73778L91503M45233M09016M36490M62822M76938
3177B3897103N88885N66085N23330N58557P14805P28808O65234P92862Q48024
3168B9883693R35840Q12059R00496R46232Q71212Q92526Q74781Q32383Q28559
$$ plain form
3238 13729709 13713590 13708649 13757093 13700524 13723887 13797901 13891100 13933821 13942987 13977691 14031982 14094423
3226 14094423 14095403 14215529 14392122 14499677 14636688 14686398 14751018 14843685 14951024 15021051 15126340
3215 15126340 15331522 15478341 15693999 15846034 15993705 16066070 16253392 16488501 16547852 16703257
3205 16703257 16848938 16978104 17148460 17239927 17327887 17441530 17701181 17869708 18003039 18238289
3195 18238289 18462596 18679755 18857311 19082143 19268745 19524039 19779761 20060990 20378497
3186 20378497 20644296 20901323 21275101 21666604 22111837 22520853 22957343 23420165 23897103
3177 23897103 24485988 25052073 25575403 26133960 26848765 27577573 28242807 29035669 29883693
3168 29883693 30819533 31631592 32532088 33478320 34349532 35242058 36116839 36949222 37777781
3159C7777781P69610P29132P34816O79554O74913O74238O89900P82715P94726
3150D4307385Q71357Q96400J058219J163259J274793J401476J439237J630472
3142E4042598J817594J874930J973096K095603K160613K070879K049477J872578
3134F9957368J556361J214208Q12242M77605K9772l86469o87456o19766m69951
3125G1883914l22068k15096J20376K33447K34103M53409N92950N98407O91866
3116G4271308Q24275P43669P51692Q24421P90815Q73318N89825L66286K98932
3107H0334541P0271k78709m34613o70806q97788j100439j120145j187551j384798
3098G3329963j437280j423667j284791j167752r86894r10461p71843p23195o62255
$$ plain form
3159 37777781 38547391 39276523 40011339 40690893 41365806 42040044 42729944 43512659 44307385
3150 44307385 45178742 46075142 47133361 48296620 49571413 50972889 52412126 54042598
3142 54042598 55860192 57735122 59708218 61803821 63964434 66035313 68084790 69957368
3134 69957368 71513729 72727937 73540179 74017784 74047556 73661087 72973631 72353865 71883914
3125 71883914 71561846 71346750 71467126 71700573 71934676 72388085 72981035 73579442 74271308
3116 74271308 75095583 75839252 76590944 77415365 78206180 79079498 79669323 80035609 80334541
3107 80334541 80404812 80126103 79691490 79020684 78122896 77022457 75902312 74714761 73329963
3098 73329963 71892683 70469016 69184225 68016473 67029579 66119118 65347275 64624080 63961825
3089F3961825o17903o36431o36384p42121q17105r77661j028434j201694j271708
3080E6032384j401630j495621j617619j591541j619150j666091j579457j568361
3072D3492914j548057j365159j260094j325156j284921j130338j075416j058661
3064C3445112r95396j002264q68032q43928p98641p48182p35889o59916p02998
3055B6089866p14614o25978o13975o51602o23637n05933o28799n55771m99715
3046B0669842n01982n20971n04954m89311m96588l95298m49388l70845m32015
3037A6508490m13401l25589l69281l54498k99228l43711k58780k14906k34802
3028A3694294j89010k57656k00818j52739j88850j82244j63265k34065k05160
$$ plain form
3089 63961825 63343922 62707491 62071107 61328986 60511881 59534220 58505786 57304092 56032384
3080 56032384 54630754 53135133 51517514 49925973 48306823 46640732 45061275 43492914
3072 43492914 41944857 40579698 39319604 37994448 36709527 35579189 34503773 33445112
3064 33445112 32449716 31447452 30579420 29735492 28936851 28188669 27452780 26792864 26089866
3055 26089866 25375252 24749274 24135299 23483697 22860060 22354127 21725328 21169557 20669842
3046 20669842 20167860 19646889 19141935 18652624 18156036 17760738 17311350 16940505 16508490
3037 16508490 16095089 15769500 15400219 15045721 14746493 14402782 14144002 13929096 13694294
3028 13694294 13505284 13247628 13046810 12894071 12705221 12522977 12359712 12125647 11920487
3019A1920487r0592j75718j84886k00223j62100j80752k21331j69428j74124j45828
3009A0215505k15070j95915j74565k23256j40317k22655r2350m1266j90464j43948
2999H575699j08067j0870j22173j30946j01714l0661r6893j04645j06363j02968
2989G660399j03745r8517j21633j22088r8542j35517j09457r8607r6333j03774
2979F572186j48031l3332q4100l1461q6899k61172j64831k6406o5708n7500n5044
2968E557702n1065r4041j84388q7079k8481m9326j15124o9636l9942j02977q9357
2957D646286o0488N3494l3135q2047j65072j2647l8532j1806k2990o6607q3797
2946D122659n8513k2452o1852p552p221k3519q1919p298r3537Q429M9891r1015
$$ plain form
3019 11920487 11829895 11654177 11469291 11269068 11106968 10926216 10704885 10535457 10361333 10215505
3009 10215505 10000435 9804520 9629955 9406699 9266382 9043727 8951377 8910111 8719647 8575699
2999 8575699 8467632 8456762 8334589 8203643 8101929 8071268 7974375 7869730 7763367 7660399
2989 7660399 7556654 7458137 7336504 7214416 7115874 6980357 6870900 6772293 6675960 6572186
2979 6572186 6424155 6390823 6306723 6275262 6188363 5927191 5762360 5735954 5670246 5612746 5557702
2968 5557702 5506637 5412596 5228208 5141129 5112648 5063322 4948198 4878562 4838620 4735643 4646286
2957 4646286 4585798 4639292 4606157 4524110 4359038 4346391 4307859 4296053 4273063 4206456 4122659
2946 4122659 4064146 4041694 3979842 3972290 3965069 3941550 3859631 3852333 3758796 3767225 3817116 3726101
2934C726101n7347o2902j9731O5866j09951m4126k3509l9963J8010r932k1124
2923C421392l2337n4180J3833K5565n0350q0947K5238K3927m0312m7155k4630
2912C180044o6142M7709n3895K455m3179l9948L6690M307L3870M0646o0558p2831
2900C009168J961K1723N6486r9778m6322K2837l2629m9353R536L8736p9401K278
2888B855242O8176q2464o1150K812O3806o2333o3415R216J7481k4856N5050j1015
2876B766550k8972K196k5460P862k7357P988J8886j9963n6115J8586m7216k5974
2864B591011L6200O420m3159k1240Q091r867k2801O6636k6775k6765m2225O6856
2852B582382O3425l4199j14287j9280n447K894J6799n0590L5047l9988o8990K7382
$$ plain form
2934 3726101 3668754 3605852 3586121 3651987 3542036 3497910 3474401 3434438 3452448 3442516 3421392
2923 3421392 3389055 3334875 3348708 3374273 3323923 3242976 3268214 3292141 3251829 3204674 3180044
2912 3180044 3113902 3161611 3107716 3110171 3066992 3027044 3063734 3068041 3101911 3142557 3081999 3009168
2900 3009168 3011129 3032852 3089338 2989560 2943238 2966075 2933446 2884093 2893629 2932365 2852964 2855242
2888 2855242 2923418 2840954 2779804 2782616 2846422 2784089 2720674 2729890 2747371 2722515 2777565 2766550
2876 2766550 2737578 2739774 2714314 2722176 2694819 2702807 2721693 2701730 2645615 2664201 2616985 2591011
2864 2591011 2627211 2633631 2590472 2569232 2577323 2567456 2544655 2611291 2584516 2557751 2515526 2582382
2852 2582382 2645807 2611608 2497321 2478041 2472594 2475488 2492287 2441697 2476744 2436756 2367766 2395148
2840B395148M843m2654n3904m870J1763N295L7710M4371p1034k0679n986l5730
2828B264273o0319J3418j5184Q902Q3875j6954m9699k4152M3714L4011n6799l2908
2816B192178J9993r556l0415j24953l5315M7759L115q0914J3296N8568n0604m1168
2804A961984N0000o3568K9672L1651l3806l9800K2293m3272j4247k4017O303j7100
2792A866093k3152o7938j4608m0152l0691O5125l5279p750R417m3319J732n2064
2780A627414p0755M4906J4515P814o1064l0028R508l1670M8389n607j2223R903
2768A551102l3969R092j5756n7411r888l0939J0279k2349J1021l167m2300K7838
2756A393553o052K0926p7507K8455J49n8469K5648N1055l3325p482N950q3581
$$ plain form
2840 2395148 2399991 2357337 2303433 2298563 2310326 2315621 2353331 2397702 2326668 2305989 2300003 2264273
2828 2264273 2203954 2217372 2202188 2211090 2294965 2278011 2228312 2204160 2247874 2281885 2225086 2192178
2816 2192178 2212171 2202615 2172200 2047247 2011932 2059691 2062806 1981892 1995188 2053756 2003152 1961984
2804 1961984 2011984 1948416 1978088 2009739 1975933 1936133 1958426 1915154 1900907 1876890 1883193 1866093
2792 1866093 1842941 1775003 1760395 1720243 1689552 1754677 1719398 1711648 1721065 1677746 1679478 1627414
2780 1627414 1556659 1601565 1616080 1623894 1562830 1532802 1542310 1510640 1559029 1553422 1541199 1551102
2768 1551102 1517133 1526225 1510469 1453058 1443170 1412231 1422510 1400161 1411182 1408015 1365715 1393553
2756 1393553 1387501 1408427 1330920 1359375 1359524 1301055 1326703 1377758 1344433 1336951 1342901 1259320
2744A259320K7439P6488N2838m2684n5836j11663J2005k214k8886K4492K7676
2733A238975k1483k9304l3860j8037p935P1084j2065n7627Q323M7267r3048p7205
2721A015085N3370N314k223L930P6211k0664l3285k5292k1921n514k2083J9995
2709A042923K1261K0510P1141n7147j11046p197m9085r234O7635k133m9553M3315
2697I81390M9176n9118l467o3423j2648K1507l1484n2024N2895N6493L4851n4212
2685I19936q358q5849n497L1502L7351m2859l2924l0806k551m477k4605j2660
2673G38203J3355J161r1380M1873P1475O282p1241m8805K8988M123J7088O2097
2661G73219n5487p3668K7099O140m8845j9809K0431J1798l0091N4052k0275l0953
$$ plain form
2744 1259320 1286759 1363247 1416085 1373401 1317565 1205902 1217907 1215693 1186807 1211299 1238975
2733 1238975 1217492 1188188 1154328 1136291 1128356 1199440 1187375 1129748 1138071 1185338 1092290 1015085
2721 1015085 1068455 1073769 1071546 1075476 1151687 1131023 1097738 1072446 1050525 1045011 1022928 1042923
2709 1042923 1064184 1084694 1155835 1098688 987642 980445 931360 922126 989761 987628 938075 981390
2697 981390 1030566 971448 967981 904558 891910 913417 881933 829909 882804 939297 974148 919936
2685 919936 911578 825729 820232 851734 889085 846226 813302 782496 779945 775468 750863 738203
2673 738203 751558 752719 661339 703212 774687 780969 709728 660923 689911 694034 711122 773219
2661 773219 717732 644064 671163 677303 628458 608649 629080 640878 610787 664839 644564 613611
2649F13611o944J09253j9365q7916M3359R185m0346j4706J0729l0065K759J6026
2637F05580Q757M2225n5234m4345M556j5331J4442l7971k9411K5233J8241J7840
2625E54582P0476p5994n053m4367l9643Q4894k0814r3566j7684N8214M4962k8887
2613D87120J0112k5511M7835L0567m4977l9017K5233k4795o5754J29574j9678
2602E10709m9681l9675l1237P3071K4962j9035q0690n827N2473j17933j2523N378
2590C09992r574K3231m730k5314L2773J12l8512J05347n1596K7982Q413l7859
2578C40265M2163j6756l9217l1103K5903j8768R139k354k6042J028L1431k6649
2566B89040N5385N9146j25300n0912j9194J6446R8327j1968O128M9002j4850q0695
$$ plain form
2649 613611 606667 715920 696555 608639 651998 661183 620837 606131 616860 586795 589554 605580
2637 605580 614337 656562 601328 556983 561539 546208 560650 522679 493268 518501 536742 554582
2625 554582 625058 549064 544011 499644 460001 544895 524081 430515 412831 471045 516007 487120
2613 487120 497232 471721 519556 550123 505146 466129 491362 466567 400813 530387 510709
2602 510709 461028 421353 390116 463187 488149 469114 388424 382597 435070 317137 304614 309992
2590 309992 300418 323649 318919 293605 326378 326490 287978 393325 341729 369711 378124 340265
2578 340265 382428 365672 326455 295352 321255 302487 311626 309272 283230 284258 315689 289040
2566 289040 344425 403571 278271 227359 208165 224611 322938 310970 317098 366100 351250 270555
2554B70555P684M2905m12j7880k6481k8402m7648K5327J2107L2760O9361k9947
2542C09929N387r051R454o5083O4637K0352j8643n2240m98R554l2440j402L8199
2529B78155l7726K0248K3853J4824k4186n7338P911o847O8230K1264l500M6541
2517C51429M7318m5800r1982j1411k1709l0342P9472L7650l5008j0382j3495J5384
2505B71124m3584k4645K8484K1628K4045n7590K8113l0494k6640l3666K5902K6570
2493B09247M8115J5598L4053m7449K0845J8784n7985k6275l1677o5275J2787J09324
2481B40092N5961o4519m1126j765k8727N0818N9411o0637n3484R762L7345J300
2469B04431O830l4567j3328L8449m6946K1669k7236L232M0832m9549N6564j441
$$ plain form
2554 270555 278239 321144 320732 302852 276371 247969 200321 225648 237755 270515 339876 309929
2542 309929 315316 306265 315719 250636 315273 335625 316982 264742 264244 273798 241358 239956 278155
2529 278155 240429 260677 284530 299354 275168 217830 225741 218894 287124 308388 304888 351429
2517 351429 398747 352947 260965 249554 227845 197503 276975 314625 279617 269235 255740 271124
2505 271124 227540 202895 231379 253007 277052 219462 247575 217081 190441 156775 182677 209247
2493 209247 257362 272960 307013 259564 280409 299193 241208 214933 183256 117981 130768 240092
2481 240092 296053 231534 190408 188643 159916 210734 270145 209508 156024 165786 203131 204431
2469 204431 211261 176694 163366 201815 154869 176538 149302 152534 193366 143817 200381 198940
2457A98940m4878K9976j3738M1861M2851l5277j00725M4800K6566q0310k5347
2446H4719p937K2289O4581J1573O730o1191j633O0844J4974O06J2402r267K9217
2433B27907l0218k7785Q915m7190R309P1873K802k7018k4784l1546L1165l7076
2421A26354M3217M9255k0745o1990M7080M742J5389N3993j1918k4503k0956L3399
2409B33317J535o4647l3181p524M6602O6520p864N2807p94m2061l949J5109J6937
2396B72807l3754j5113j8123J4600Q088J04139j5230k1754j0773N6819K1290m8073
2384C14923q271O2590j5793j9241Q7147m1316j2527L4949Q373J4160M1054o062
2372D59986N2487P6447j5648N2386R3487L0136M9125M5025N4159P1302J45881
$$ plain form
2457 198940 154062 184038 170300 212161 255012 219735 119010 163810 190376 110066 84719
2446 84719 76782 99071 163652 175225 181955 120764 119131 179975 194949 195555 207957 198690 227907
2433 227907 197689 169904 178819 131629 140938 212811 215613 188595 163811 132265 163430 126354
2421 126354 169571 218826 198081 136091 183171 187913 203302 257295 245377 220874 199918 233317
2409 233317 234852 170205 137024 129500 176102 242622 234758 287565 286771 244710 240761 255870 272807
2396 272807 239053 223940 205817 220417 228505 332644 317414 295660 284887 341706 362996 314923
2384 314923 306652 369242 353449 334208 421355 380039 367512 402461 410834 424994 466048 459986
2372 459986 512473 588920 573272 625658 719145 749281 798406 843431 897590 968892 1114773
2361A114773O4920N3140R3463K4570Q0031J21662r173J10973P8050J44210J75197
2350B051816R2593J13640K06100K52439K91420L22271M43589N98893P37716R44552
2340F055029J188123J130169P82884P35096Q33215K55003q89787j157060j045265
2331G887407j055782p73446m42153k50800l11695l84188k97154k87607j99132
2322C885450k71407k44815k56147l39184k50217k12538k14652k12981o6143j29803
2312A687563j25202j15828p0330n3190j08615q9010j39107J1874O3865j27763
2302I34257n1335n2000l8469L1917l8362n9929j4691l3177l9815n0033k1655K7253
2290E93961J4527r5234q9331L3049O5667m2363l1650L099L2239k1894M4695l2593
$$ plain form
2361 1114773 1179693 1232833 1326296 1350866 1430897 1552559 1543386 1654359 1732409 1876619 2051816
2350 2051816 2144409 2258049 2464149 2716588 3008008 3330279 3773868 4372761 5110477 6055029
2340 6055029 7243152 8373321 9156205 9891301 10724516 10979519 10089732 8932672 7887407
2331 7887407 6831625 6058179 5616026 5365226 5053531 4669343 4372189 4084582 3885450
2322 3885450 3614043 3369228 3113081 2773897 2523680 2311142 2096490 1883509 1817366 1687563
2312 1687563 1562361 1446533 1376203 1323013 1214398 1125388 986281 998155 1062020 934257
2302 934257 882922 830922 792453 824370 786008 726079 711388 678211 638396 588363 566708 593961
2290 593961 608488 513254 423923 456972 522639 480276 448626 451725 483964 462070 506765 474172
2278D74172k9915j6992m1767N59o5154L0074J8800k213k9703k6988o131j5171
2266B89571j9018L2451k7634J5009p7145J4418M4447K7487j1621j8522j0981m4824
2254B13638k3417L047j4710N616L6587n5599q121J2869N6141L9926j7560j7438
2242B30979J6888q362k9124N943O857N4919m9372m513k968o718N3053k165J730
2229B67147o4222L3614L4589o1861o1275r838J7286m1522Q6209l5542J2138J6224
2217A92947p8914N2489L7689J3636j8896L0143j00078M31N0879j0591R482k4203
2205A55014p401J3367k9988J7020J3565l3624r826J4394M7955L7263m6453l5118
2193A36168n225r7158P3283K0992p10J1584J5576m245p3259q627K5590r9204N3784
$$ plain form
2278 474172 444257 427265 385498 386057 320903 350977 369777 367564 337861 310873 304742 289571
2266 289571 270553 303004 275370 290379 213234 227652 272099 299586 287965 269443 258462 213638
2254 213638 190221 193268 178558 184174 220761 165162 157041 169910 226051 265977 248417 230979
2242 230979 247867 239505 210381 216324 223181 278100 228728 224215 221247 214529 267582 265417 267147
2229 267147 202925 236539 271128 209267 147992 138154 155440 113918 200127 164585 176723 192947
2217 192947 114033 166522 204211 217847 198951 229094 129016 129447 180326 169735 179217 155014
2205 155014 147613 160980 130992 148012 161577 127953 118127 132521 180476 217739 171286 136168
2193 136168 130943 33785 107068 128060 127350 138934 154510 150265 77006 68379 93969 -5235 48549
2180D8549M1983K5258k7828K9479p2463M021L3202k3998O9262K0513O171o5615
2168H8534j6937j5956k6288L0054l2867n4041N0508P0455K7737m523L8886K506
2156A58068r7166k6356L7377j4249J3580j9751J976l283j0235M0109K5453P359
2144A12882K613o4344J7450N4702j7430J143j877l3697j123j3356L722o5136L2872
2131B8421k8626K7980j3917J1365K7106J6830j7150K1245P426p908j4056J0444
2119F9160L7933k3949J1497k8529o2289K7770K4627q644n5525j7937Q8724J3810
2107G6648j1644M0902k7838J3801l8561l627O6642J8541n2388K6946m0836r965
2095E8621j930m3280P9425M7892o6266j8435J8692m6309O3028R630j6568j2883
$$ plain form
2180 48549 90532 115790 87962 117441 44978 48999 82201 58203 127465 147978 154149 88534
2168 88534 71597 55641 29353 59407 26540 -27501 23007 93462 121199 116676 155562 158068
2156 158068 60902 34546 71923 57674 71254 51503 53479 50196 39961 80070 105523 112882
2144 112882 115495 51151 68601 123303 105873 107016 105139 71442 70319 56963 60685 -4451 28421
2131 28421 -205 27775 13858 25223 52329 69159 52009 73254 80680 72772 58716 69160
2119 69160 107093 83144 94641 66112 3823 31593 56220 47576 -7949 -25886 62838 76648
2107 76648 65004 105906 78068 91869 53308 49681 116323 134864 82476 109422 68586 58621
2095 58621 56691 13411 92836 140728 74462 56027 74719 28410 91438 101068 84500 71617
2083G1617M2219n8381j7879J05195k4416n7050L3521j6469j0202O702M5124l1713
2071H8268n665P2942j6448K3196M406o0476j0786Q271K1077J5041j9736l2276
2059H7814j7550J9560m539m8549L9119J312m1746j9601L1722m2898m6288O0738
2047A9094K2807n5300J5866j5270k8438M2752J7806L7249l3524Q197J31221n5432
2035A07028p0085J2931K6110k9784K0973j885l6666J7320K6250r9619O4155N6189
2023I2917j5841R103n5762L6171M4478n3257k2891j7268K0794k9896L9095J8022
2011F5665r489k7464l7871N0503P8844k1019j105j4226n9873n0052J8542P8906
1999G1361m1160M0579N0572J0645q7065J5557j9210N9271M3618k3110m6803O9942
$$ plain form
2083 71617 113836 55455 37576 142771 118355 61305 94826 78357 68155 74857 119981 88268
2071 88268 82603 155545 139097 162293 166699 106223 95437 103708 124785 139826 120090 87814
2059 87814 70264 89824 85285 36736 75855 77167 35421 15820 47542 4644 -41644 19094
2047 19094 41901 -13399 2467 -12803 -41241 1511 19317 56566 23042 31239 162460 107028
2035 107028 36943 49874 75984 46200 67173 65288 28622 45942 72192 -27427 36728 92917
2023 92917 77076 86179 30417 66588 111066 57809 34918 17650 38444 8548 47643 65665
2011 65665 56176 28712 -9159 41344 120188 99169 98064 83838 23965 -26087 -7545 71361
1999 71361 30201 70780 121352 131997 44932 60489 41279 100550 144168 121058 74255 144197
1987A44197N340r7032m6130J9520O2649q5311P6844j768p8883K7093q278L6483
1975E4724o877L2009o5978j4473K8798l6688L8285N1912k6461K9102j2532r17
1963G0904k8089L0992l7227k749j5129j4085M803l5455L1182R9114k9683k8878
1951D5700k6534K6515k2119k0476N2975n215K4502q6557j3734O0272p1222L1707
1939d186P4865m6066j9342J1669M7925R629J5145J6328j3327k6728j6333J101
1927E0680J0745o1444M558J6423r1749j535J01700j0411L3433J1210n688m8258
1915I664P49o1245O204R0305k2472o104J8506k8479J6071L2371j4143l2398l5381
1902b6352O3468k0831j2272L8099J2357L1073k3031n8199n5322k6152O078Q1207
$$ plain form
1987 144197 149537 52505 6375 25895 88544 3233 80077 78309 -574 26519 18241 54724
1975 54724 47847 79856 13878 -595 28203 -8485 29800 81712 55251 84353 71821 70904
1963 70904 42815 73807 36580 33831 18702 4617 9420 -26035 5147 104261 74578 45700
1951 45700 19166 45681 23562 3086 56061 50846 75348 -11209 -24943 35329 -35893 -4186
1939 -4186 70679 24613 5271 16940 64865 74494 89639 105967 92640 65912 49579 50680
1927 50680 61425 -19 4539 20962 -70787 -72322 29378 18967 52400 63610 57922 9664
1915 9664 10413 -50832 -44628 45677 23205 17101 35607 7128 23199 55570 41427 9029 -26352
1902 -26352 37116 16285 4013 42112 54469 85542 62511 4312 -51010 -77162 -71084 10123
1890A0123L3511O42j2855l224n5287j1619O2662M9521n5247l62M153j5867m0594
1877c4443l2724J4134M0859J4413J9237O349r393j2384k5581N5577r640p0660
1865d4256M4549J3854K0122m3250r076M2015j1135N6396K8458l9878k1044J962
1853C8717k9882O5987L2202l1217k2103l3061M8000k5742l1J2189o7218J4958
1841B799k2833p136K6357K8382K1383j7042m1787K2873P8877R710j33L1711k3966
1828A09195m1220l9109R442j4347J9858m0718K830j6498m8800l4311N5872L3254
1816d552q6265k6114M9573J1416L5036Q163k4290J7954j2942P437R456K2375L3044
1803D0291l8395l461J5933J3883O2409J412k3669r046K1589j6807o9710n395j6013
$$ plain form
1890 10123 43634 44276 31421 28197 -27090 -38709 23953 73474 18227 17865 22018 6151 -34443
1877 -34443 -67167 -53033 -12174 2239 21476 27825 18432 6048 -19533 36044 26404 -44256
1865 -44256 293 14147 34269 -8981 -18057 23958 12823 69219 97677 57799 36755 38717
1853 38717 8835 74822 107024 75807 53704 20643 68643 42901 42870 55059 -12159 2799
1841 2799 -20034 -27170 -813 27569 48952 31910 -9877 12996 91873 101583 101450 133161 109195
1828 109195 67975 28866 38308 23961 43819 3101 5931 -10567 -59367 -93678 -37806 -4552
1816 -4552 -90817 -116931 -67358 -55942 -20906 -12743 -37033 -19079 -32021 -24584 -15128 7247 40291
1803 40291 1896 -1565 14368 28251 90660 92072 68403 59357 80946 64139 -5571 -10966 -26979
1790b6979l3735r510N318N4159K7274m1935L6715j8395P6919m6536L6195j4023
1778D5467m6541l710k9392M249K308k2833R976j7858J6415J2986j6510k39J7170
1765b8512q70M095J6345m381L7015m0712J3565m4381o674K8848m297n9345M9680
1752c9624K3538K1533m7092k9337K0424K9454l241j519J9648r472n4466j238K0769
1739e0623L3535J3428r271J541J19969j8420K377o1410q653K0799p7892R998J8987
1726e635O936R786L5959r4257k0188L4347L9042j4217J3773L5773l9034J8420
1714B0705N905j2677M7119k2129p3977M6841q367m0498N6415J5523m914J7004
1702D6950j8716m1404N9319K6706o8766l450K7666l1509L8994L2937q9905l1534
$$ plain form
1790 -26979 -60714 -70224 -64906 -10747 16527 -25408 11307 -7088 69831 23295 59490 45467
1778 45467 -1074 -4784 -34176 -29927 -27619 -50452 -40476 -58334 -41919 -28933 -45443 -45682 -28512
1765 -28512 -29382 -25287 -8942 -13323 23692 -17020 -3455 -47836 -54510 -25662 -29959 -89304 -39624
1752 -39624 -16086 5447 -41645 -70982 -50558 -21104 -24345 -25864 -6216 -15688 -70154 -71392 -50623
1739 -50623 -17088 -3660 -12931 -11390 108579 90159 92536 31126 22473 43272 -34620 -24622 -5635
1726 -5635 1301 11087 47046 -47211 -67399 -33052 5990 -8227 5546 41319 2285 20705
1714 20705 26610 13933 61052 38923 -35054 11787 3420 -37078 19337 34860 29946 46950
1702 46950 28234 -13170 46149 72855 4089 639 28305 -3204 35790 68727 -21178 -52712
1690e2712J1065L2882J7231M3973K6289l3210q6292l0245O434J9056n175J3756
1678c6948p905k0943L2241O582P130K2448J9791j2875O987K1260l0856K0472P0819
1665I8203j17495m5782K9215l0048L6597Q8228l5981o034J4876J4853j6747q6361
1653e6476J8317J5867k3943R203K3250L4882j3249Q05K2803Q9266Q617j01219
1641B8123l9248k1785m668N3413j0208k9356K4423n4675p937O5526q009n8585
1629f2986q049N1006m7427j518K8482l6202K9149L3599P7765K0022j1438r5060
1617b2657K1693N1419j1872m8279r841K4512m1622J4962m7905L5162n6118j2305
1605a02851N6805l4638J1996j5560M6293O4331k6271j4567K1107l1175l1711O7407
$$ plain form
1690 -52712 -41647 -8765 8466 52439 78728 45518 -40774 -71019 -64585 -45529 -50704 -36948
1678 -36948 -44853 -65796 -33555 -26973 -19843 2605 22396 9521 16508 37768 6912 27384 98203
1665 98203 -19292 -65074 -35859 -65907 -29310 58918 22937 16903 31779 46632 29885 -56476
1653 -56476 -38159 -22292 -46235 -37032 -13782 21100 7851 8656 31459 120725 129342 28123
1641 28123 -11125 -32910 -37578 15835 5627 -23729 694 -53981 -61918 3608 -4401 -62986
1629 -62986 -71035 -20029 -67456 -68974 -40492 -76694 -47545 -13946 63819 83841 72403 -22657
1617 -22657 -964 50455 38583 -9696 -19537 4975 -36647 -21685 -69590 -34428 -90546 -102851
1605 -102851 -46046 -80684 -68688 -84248 -37955 26376 105 -14462 6645 -24530 -56241 11166
1593A1166O0742j6226k9337q762J9696l1808j465J7948p941m1741N401L8291p779
$$ plain form
1593 11166 71908 55682 26345 17583 37279 5471 4006 21954 14013 -27728 -22327 15964 8185
$$ [...]
##END NTUPLES=NMR SPECTRUM
##END=
