##TITLE=1H_CG-1221
 200.13MHz, CDCl3,
 8 sc
 
 7.2.2025
##JCAMPDX= 6.0         $$ Bruker NMR JCAMP-DX V2.0
##DATA TYPE= NMR SPECTRUM
##DATA CLASS= NTUPLES
##ORIGIN= UXNMR, Bruker Analytische Messtechnik GmbH
##OWNER= pz
$$ XWIN-NMR		Version 3.5
$$ Fri Feb  7 13:42:55 2025 Russian Standard Time (UT+4h)  she@DPX200
##.OBSERVE FREQUENCY= 200.1313
##.OBSERVE NUCLEUS= ^1H
##.ACQUISITION MODE= SIMULTANEOUS
##.ACQUISITION SCHEME= undefined
##.AVERAGES= 8
##.DIGITISER RES= 18
##SPECTROMETER/DATA SYSTEM= spect
##.PULSE SEQUENCE= zg30
##.SOLVENT NAME= D2O
##.SHIFT REFERENCE= (INTERNAL, D2O, 0, 15.6125)
##AUDIT TRAIL= $$ (NUMBER, WHEN, WHO, WHERE, WHAT)
$$ ##TITLE= Audit trail, XWIN-NMR		Version 3.5
$$ ##JCAMPDX= 5.01
$$ ##ORIGIN= Bruker BioSpin GmbH
$$ ##OWNER= she
$$ F:/spectra/data/she/nmr/H-C/1/pdata/1/auditp.txt
$$ ##AUDIT TRAIL=  $$ (NUMBER, WHEN, WHO, WHERE, WHAT)
(   1,<2025-02-07 13:41:33.04 +0400>,<she>,<DPX200>,
      <created by zg, POWCHK disabled, PULCHK disabled
       configuration hash MD5:
       00 E9 B6 7A A2 85 ED C7 34 08 36 98 17 FE 4E 26
       data hash MD5: 16K
       1D 1C 92 DE 1C 65 D5 33 2D E9 CA 86 E2 B8 B2 D8>)
(   2,<2025-02-07 13:41:36.26 +0400>,<she>,<DPX200>,
      <Start of raw data processing
       efp BC_mod = 2 LB = 0.25 FT_mod = 6 PKNL = 1 PHC0 = -110.7363 PHC1 = 14.79221 SI = 16K 
       data hash MD5: 16K
       57 8C 51 46 2F 95 88 92 D5 CB 79 B0 7D 46 BA A5>)
(   3,<2025-02-07 13:42:00.15 +0400>,<she>,<DPX200>,
      <pk PHC0 = -159.9193 PHC1 = 0 
       data hash MD5: 16K
       0B 07 F0 A8 C7 9E FF 66 FD 4F 8A 96 8A B5 C5 5D>)
(   4,<2025-02-07 13:42:04.31 +0400>,<she>,<DPX200>,
      <abs ABSG = 5 
       data hash MD5: 16K
       E2 39 D7 EE 07 BF 8B 0C 2D 18 2C 63 94 52 14 25>)
(   5,<2025-02-07 13:42:27.26 +0400>,<she>,<DPX200>,
      <abs ABSG = 5 
       data hash MD5: 16K
       6E 66 FC 1B 14 78 89 37 4B BD 85 22 2E EF 76 62>)
$$ ##END=
$$ 
$$ hash MD5
$$ B7 E8 58 B7 63 27 34 90 06 C9 C6 26 52 13 F7 75
##$RELAX= 
##$RELAX= 
##$RELAX= 
##$RELAX= 
##$RELAX= 
##$RELAX= 
$$ Bruker specific parameters
$$ --------------------------
##$DU= <F:/spectra>
##$EXPNO= 1
##$NAME= <H-C>
##$PROCNO= 1
##$TYPE= <nmr>
##$USER= <she>
##$AMP= (0..31)
100 100 100 100 100 100 100 100 100 100 100 100 100 100 100 100 100 100 
100 100 100 100 100 100 100 100 100 100 100 100 100 100 
##$AQSEQ= 0
##$AQ_mod= 1
##$AUNM= <au_zg>
##$AUTOPOS= <>
##$BF1= 200.13
##$BF2= 200.13
##$BF3= 200.13
##$BF4= 200.13
##$BF5= 200.13
##$BF6= 200.13
##$BF7= 200.13
##$BF8= 200.13
##$BYTORDA= 1
##$CFDGTYP= 0
##$CFRGTYP= 5
##$CHEMSTR= <none>
##$CNST= (0..31)
1 1 145 1 1 1 1 1 1 1 1 1 1 1 1 1 1 1 1 1 1 1 1 1 1 1 1 1 1 1 1 1 
##$CPDPRG= <>
##$CPDPRG1= <>
##$CPDPRG2= <>
##$CPDPRG3= <>
##$CPDPRG4= <mlev>
##$CPDPRG5= <mlev>
##$CPDPRG6= <mlev>
##$CPDPRG7= <mlev>
##$CPDPRG8= <mlev>
##$CPDPRGB= <>
##$CPDPRGT= <>
##$D= (0..31)
0 0.7 0 0 0 0 0 0 0 0 0 0.03 0 0 0 0 0 0 0 0 0 0 0 0 0 0 0 0 0 0 0 0 
##$DATE= 1738921292
##$DBL= (0..7)
$$ [...]
##$SUBNAM3= <"">
##$SUBNAM4= <"">
##$SUBNAM5= <"">
##$SUBNAM6= <"">
##$SUBNAM7= <"">
##$SUBNAM8= <"">
##$SUBNAM9= <"">
##$SW= 18.0517328524113
##$SWIBOX= (0..15)
0 0 2 0 0 0 0 0 0 0 0 0 0 0 0 0 
##$SW_h= 3612.71676300578
##$TD= 16384
##$TD0= 1
##$TE= 0
##$TE2= 300
##$TE3= 300
##$TEG= 300
##$TL= (0..7)
0 120 120 120 120 120 120 120 
##$TP= (0..7)
150 150 150 150 150 150 150 150 
##$TP07= 0
##$TPNAME0= <>
##$TPNAME1= <>
##$TPNAME2= <>
##$TPNAME3= <>
##$TPNAME4= <>
##$TPNAME5= <>
##$TPNAME6= <>
##$TPNAME7= <>
##$TPOAL= (0..7)
0.5 0.5 0.5 0.5 0.5 0.5 0.5 0.5 
##$TPOFFS= (0..7)
0 0 0 0 0 0 0 0 
##$TUNHIN= 0
##$TUNHOUT= 0
##$TUNXOUT= 0
##$USERA1= <user>
##$USERA2= <user>
##$USERA3= <user>
##$USERA4= <user>
##$USERA5= <user>
##$V9= 5
##$VALIST= <valist>
##$VCLIST= <CCCCCCCCCCCCCCC>
##$VD= 0
##$VDLIST= <DDDDDDDDDDDDDDD>
##$VPLIST= <PPPPPPPPPPPPPPP>
##$VTLIST= <TTTTTTTTTTTTTTT>
##$WBST= 1024
##$WBSW= 4
##$XGAIN= (0..3)
0 0 0 0 
##$XL= 0
##$YL= 0
##$YMAX_a= 466423
##$YMIN_a= -519261
##$ZGOPTNS= <>
##$ZL1= 120
##$ZL2= 120
##$ZL3= 120
##$ZL4= 120
##$ABSF1= 15.61247
##$ABSF2= -2.439382
##$ABSG= 5
##$ABSL= 3
##$ALPHA= 0
##$AQORDER= 0
##$ASSFAC= 0
##$ASSFACI= 0
##$ASSFACX= 0
##$ASSWID= 0
##$AUNMP= <proc_1d>
##$AZFE= 0.1
##$AZFW= 0.1
##$BCFW= 0
##$BC_mod= 2
##$BYTORDP= 0
##$COROFFS= 0
##$CY= -3
##$DATMOD= 1
##$DC= 0
##$DFILT= <>
##$DTYPP= 0
##$F1P= 0
##$F2P= 0
##$FCOR= 1
##$FTSIZE= 16384
##$FT_mod= 6
##$GAMMA= 0
##$GB= 0
##$INTBC= 1
##$INTSCL= 3.241238e-09
##$ISEN= 128
##$LB= 0.25
##$LEV0= 0
##$LPBIN= 0
##$MAXI= 10000
##$MC2= 0
##$MEAN= 0
##$ME_mod= 0
##$MI= 1.114404
##$NCOEF= 0
##$NC_proc= -5
##$NLEV= 6
##$NOISF1= 3.799351
##$NOISF2= 2.8
##$NSP= 0
##$NTH_PI= 0
##$NZP= 0
##$OFFSET= 15.61247
##$PC= 1
##$PHC0= -270.6556
##$PHC1= 14.79221
##$PH_mod= 1
##$PKNL= yes
##$PPARMOD= 0
##$PSCAL= 0
##$PSIGN= 0
##$REVERSE= no
##$SF= 200.129981834597
##$SI= 16384
##$SIGF1= 3
##$SIGF2= 2
##$SINO= 0.751879
##$SIOLD= 32768
##$SREGLST= <19F.Aceton>
##$SSB= 0
##$STSI= 16384
##$STSR= 0
##$SW_p= 3612.71676300578
##$SYMM= 0
##$S_DEV= 0
##$TDeff= 16384
##$TDoff= 0
##$TI= <>
##$TILT= no
##$TM1= 0
##$TM2= 0
##$TOPLEV= 0
##$USERP1= <user>
##$USERP2= <user>
##$USERP3= <user>
##$USERP4= <user>
##$USERP5= <user>
##$WDW= 1
##$XDIM= 16384
##$YMAX_p= 410709204
##$YMIN_p= -245693
$$ End of Bruker specific parameters
$$ ---------------------------------
##NTUPLES= NMR SPECTRUM
##VAR_NAME=  FREQUENCY,     SPECTRUM/REAL,   SPECTRUM/IMAG
##SYMBOL=    X,             R,               I
##VAR_TYPE=  INDEPENDENT,   DEPENDENT,       DEPENDENT
##VAR_FORM=  AFFN,          ASDF,            ASDF
##VAR_DIM=   16384,         16384,           16384
##UNITS=     HZ,            ARBITRARY UNITS, ARBITRARY UNITS
##FACTOR=    0.220516191357247, 1,           1
##FIRST=     3124.52327208205, 0,            0
##LAST=      -488.193490923726, 0,           0
##MIN=       -488.193490923726, -245693,     0
##MAX=       3124.52327208205, 410709204,    0
$$ Real data points
##PAGE= N=1
##DATA TABLE= (X++(R..R)), XYDATA
$$ [...]
8282C598q363n949k823j4168Q47L6545k4619k0493l122N559Q975r561j1691K906
8268d2359l336n912p420Q782J2648K8043o592Q395J2905m0273K3838o598K7146
8255I267j8696n4661k1337L3370K2572K0918J3029l1603l4860K8565n54N46J9852
8242a3592k2540q236K0011j307j8981K2161M3976j1625n9457P18K3879j39j501
8229b6633L4828j4831l1155J306k78j342J8285q14K502j893N857k2296j5794L0724
8215b1534K1764K0645j0653o316k722k6359K2146j7639P160j7990L768K2182M1974
8202C6426m7174K855P941K4917j2036O6066k6805L8381L424L18954o7744n90898
8190b45693R5088l1537O5337J1174N910K9196K5117k4248L3239L1377m2552P26
$$ y = [3598, -4765, -10714, -13537, -27705, -26858, 9687, -14932, -35425, -38547, -32988, -24013, -33574, -45265, -42359, -45695, -51607, -59027, -50245, -37597, -9554, -16146, -7751, 5154, -35119, -11281, -17879, 9267, -9429, -64090, -85427, -52057, -29485, -8567, 4462, -27141, -62001, -33436, -33990, -33444, -13592, -36132, -44368, -24357, -25664, -44645, -22484, 21492, 9867, -49590, -48872, -24993, -25132, -26633, 8195, -6636, -37791, -36485, -36763, -38105, -19820, -20634, -18132, -20025, -14168, -36464, -52258, -21534, 230, 20875, 10222, 3906, 1184, -25175, -3029, -20668, -13508, -31498, -27730, -5548, 36426, -10748, -7893, 48, 24965, 12929, 78995, 52190, 90571, 93995, 412949, 345205, -245693, -150605, -182142, -116805, -105631, -99721, -70525, -45408, -69656, -36417, -5040, -47592, -46866]
8178d6866j2062J8235J6868l6173l8123K0459r808K6670M6055m4610r794K5710
8166d3439O661K660j3169o045L3996j9061p805j7496J0765K2211n984k452L2695
8153f463K6590n3789N231N110J5518j5594K757k7869J9599L3834p598R575k2778
8140a5877r413o185L7786J9275j4485l7557o915J8752j6277o913K756L1232l0865
8127c4686M91k1148J4257N10J4865J9863l1411j6018L1386K355M1929n748J0108
8114B6753p959j1159j1262k960J1354j2250N8334k2185k3510O310J6749J1122
8102C9337M999m7129j9576m0611N0331L9498k5035j0210j461R121M348k4715m537
8089b5640J690L8658l9220O473K2905k2535m584p835L2889k4016m4472R14K6882
$$ y = [-46866, -58928, -40693, -23825, -59998, -98121, -77662, -87470, -60800, -14745, -59355, -69149, -43439, -36778, -34118, -47287, -53332, -19336, -38397, -46202, -63698, -52933, -30722, -36706, -39158, -6463, 20127, -33662, -28431, -23321, -7803, -23397, -20640, -48509, -28910, 4924, -2674, 6901, -15877, -25290, -31475, 6311, 25586, 11101, -26456, -33371, -14619, -30896, -37809, -35053, -3821, -34686, -34195, -55343, -41086, -40576, -25711, -5848, -37259, -53277, -21891, -19536, 22393, 16645, 26753, 18794, 7635, -3627, -6587, 4767, -7483, 50851, 28666, 5156, 11466, 28215, 39337, 44336, -2793, -22369, -62980, -12649, 26849, 1814, -8396, -9857, -736, 3612, -21103, -25640, -23950, 14708, -24512, -18039, 4866, -17669, -22253, -30088, 2801, -21215, -65687, -64773, -37891]
8076c7891J9242N025k8444N777n478K8009k0655M447K116n757L8576j2425j355
8063h813k1792k795L2130J004j2682j6935L7309J4945k3297j2836k066l399k7221
8050d6448J3689N974k205J5182m2346K9827J8643j3481k5096k8819J4551L9181
8038b1348K2756m5840J0555J063O043O919o555J0173p17k363L160J5083k008j2733
8024a5812j2850p917M871j8329L069K1951Q310R172J057K6075l4700l0093L1244
8011a3952K0268j4488k5649J2068K9954j7556j8855L5386M719j8228K1522k169
7999A3020j2402Q540R652l6853R23j6710j36M3517l4597L722Q540k8239Q290N607
7985b7126j6170j1519K3102J0709J2586m719N523J1657j1241P061k2364J8756
$$ y = [-37891, -18649, -13624, -42068, -36291, -41769, -13760, -34415, -29968, -27852, -33609, 4967, -7458, -8813, -30605, -33400, -1270, -266, -12948, -29883, 7426, 22371, -926, -13762, -15828, -19227, -46448, -32759, -26785, -28990, -13808, -56154, -26327, -7684, -21165, -46261, -75080, -60529, -21348, 1408, -44432, -33877, -32814, -26771, -19852, -26407, -16234, -16951, -19314, -16154, -1071, -3079, -15812, -28662, -36579, -31708, -50037, -46968, -25017, -16707, -7535, -6478, 19597, -15103, -45196, -13952, 6316, -8172, -33821, -21753, 8201, -9355, -28210, 7176, 11895, -6333, 15189, 13020, 618, 9158, 18810, -18043, -17120, -33830, -33966, 9551, -25046, -21324, -12784, -41023, -32733, -27126, -43296, -54815, -31713, -21004, -8418, -13137, -7614, 4043, -7198, -137, -22501, -3745]
7973c745J3731J1378o729m219j3669j5626J2294Q992K360Q903j8975q954M993
7960i266K671l1078k1937K8860K4954q866M612k852r29k8270K4381k5184N620
7947c7284M0470p768k4941j1198J9716R302k3706O947M492j2838l270J5532J0967
7934a3579j7528K3714l683Q658j4038j49m9218J5854J4654k8321J792N5372m4518
7921e0990J593L6012k46j0569m502N2501P263j7988k6797k631J02k898p784K2093
7907d841K0697q779j7079k4143J7004n3j3059k2437K5166j315Q015L9705l2146
7894a3265J8040q466J3821J1464k7372j8123l323j396R035j356k8712J2307n932
7881d3278J9008J4622M099j3550p688K8039j0182m7558J0899J464k9721K8957
$$ y = [-3745, 9986, 21364, 14635, 10416, -3253, -18879, -6585, 2407, 4767, 13670, -5305, -14259, -9266, -6595, -37673, -59610, -30750, -5796, -14662, -10050, -12902, -13831, -42101, -17720, -42904, -37284, 3186, -4582, -29523, -40721, -21005, -11703, -35409, -28462, -23970, -36808, -40078, -24546, -13579, -31107, -7393, -11076, -2418, -16456, -16605, -65823, -49969, -35315, -63636, -61844, -6472, -50990, -49397, -13385, -13631, -24200, -28702, 23799, 31062, 13074, -13723, -16354, -16252, -19150, -26934, -4841, 15856, 7077, -10002, -34145, -17141, -17194, -30253, -52690, -27524, -28839, -20824, 18881, -13265, 4775, -3691, 10130, 21594, -5778, -23901, -27224, -28620, -19585, -20941, -49653, -37346, -43278, -24270, -9648, -5549, -19099, -26787, 1252, -8930, -56488, -45589, -44125, -73846, -44889]
7869d4889J0168K0056R500K3314k7584o245j2007j1816M988K2906K4042l6970
7857b4537J9453j22j5971O316N2015k026N577l2456j6334j0099r549k1321J4568
7844c4486n86o805J9594l6795J1098L4483M077j8039L0361J5733K5486k4734k0661
7831a274k044J6850k6404N460m6278K2193J7200j9145J8467k5612K7863j354j7763
7818c1841j0867Q410K6111l159k5620P295l81r385k7303L7729J845O3075J20082
7805A55991j47034l0963N340j571O956n907k0278p679L8947J4731j7372l4047
7793d2886J0136J1979J4283n0512J5023K268O740J2459J4K8372j0045j7492J0650
7780i011K4002j9711O536K9716j0952k2928Q814q469j4322J6589J334k3157q102
$$ y = [-44889, -34721, -14665, -5165, 18149, -9435, -15680, -27687, -39503, -34515, -11609, 12433, -24537, -5084, -5206, -21177, -14861, 37154, 35128, 40705, 8249, -8085, -18184, -27733, -49054, -34486, -35072, -41877, -22283, -59078, -47980, -13497, -9420, -27459, 2902, 18635, 44121, 19387, -1274, -3318, 13532, -12872, -7412, -53690, -31497, -14297, -33442, -14975, -40587, -12724, -14078, -31841, -42708, -34298, -8187, -11346, -36966, -29671, -30052, -39437, -66740, -29011, -27166, 35909, 155991, 8957, -22006, -16666, -18237, -11281, -17188, -37466, -45145, -6198, 8533, -8839, -42886, -32750, -20771, -6488, -57000, -41977, -39709, -32969, -20510, -20496, 7876, -2169, -19661, -9011, 14991, -4720, 1816, 31532, 20580, -2348, 6466, -2003, -16325, 264, 1598, -21559, -29661]
7767b9661K2130O877j2402J3120J8552j960k4527k8471K2064k9082K2438L4453
7755A3531j4923Q126M192j0431l976r8n567k939n18l3929J1217M471J7746j0642
7741b3740J1245j4607m5791N289J5902M1518j4196M088J5497N937o412R404m5923
7728d1789n62p24k0885L7495j9049n68j252M992l1148L0072M3111k0916l0493
7715e1716L1529J2583k9676M87k44O747K3182k0193J24J0499K0499K1335J2804
7702C7960k6001k8105M2049k3332k445Q70j4725j5222Q03M2171k2103j1811M148
7689a5743k2305N061l519r162n43Q541J6978j2767K136n607J4823L439j3908J5813
7675a6763j5344o481J0944l166O88J0677m875k8682l655M0921K4197p420j7582
$$ y = [-29661, -7531, -654, -13056, 64, 18616, 16656, -7871, -36342, -14278, -43360, -20922, 13531, -1392, 6734, 10926, 495, -3481, -3579, -9146, -12085, -12603, -46532, -35315, -30844, -13098, -23740, -12495, -27102, -72893, -67604, -51702, -10184, -24380, -20292, -4795, 1142, -5270, 4134, -41789, -42351, -43075, -63960, -26465, -45514, -46082, -47334, -42342, -73490, -43418, -307, -21223, -51716, -20187, -7604, -37280, -36793, -37037, -30290, -7108, -27301, -27177, -16678, 3821, 25156, 37960, 11959, -16146, 25903, 2571, 126, 996, -13729, -28951, -28148, 14023, -8080, -19891, -15743, -38048, -32987, -36506, -45668, -46211, -37670, -20692, -33459, -31323, -36930, -22107, -18668, -32576, -16763, -32107, -38588, -27644, -30810, -30122, -19445, -24320, -53002, -56657, -15736, 8461, 1041, -16541]
7662a6541j4282k6964K3010M296n606q692K9693K3351q935l4759J8245M208m710
7649a7686p871l216J4204L9307K27O841K763n010K315J1085j7122k8839M091J3360
7635A4449l721k6410J436j486O28J6272N104J3045K220m6008J624L0351j8282
7622a0778j9017j6748K0316O350J1547Q851j652j2876K325Q69O489J5348j4982
7609c958r578K717J2638O796K687j62p7k4019J2814l1529J5789k162n75k771J5315
7594f075o66k1265J4840O07K2482q56J5805N405l6912l215l1683K605K2761K8218
7580A2051j2994k4768J7713J4366M784j4896l3066N091L3857J1571o470j4633
7568g394J9470J8121k6103J2157q988L334J2265l2593k1977K6917j0307r111K7831
$$ y = [-16541, -30823, -57787, -34777, -30481, -36087, -44779, -15086, 8265, -670, -35429, -17184, -12976, -17686, -25557, -28773, -14569, 24738, 24965, 31806, 34569, 29559, 31874, 42959, 25837, -3002, 1089, 14449, 10728, -15682, -14246, -15732, -15104, 1168, 6272, 19317, 21537, -24471, -22847, 7504, -10778, -29795, -46543, -26227, -19877, -8330, 521, -1131, -14007, -11682, -10813, -4324, 11024, -3958, -13536, -10819, 1819, 8615, 11302, 11140, 11063, -12956, -142, -31671, -15882, -18044, -18619, -21390, -6075, -6741, -28006, -13166, -12559, 9923, 9067, 24872, 30277, -6635, -9850, -41533, -38928, -16167, 12051, -943, -25711, -7998, 6368, 11152, -3744, -36810, -31719, 2138, 13709, 7239, -7394, 12076, 30197, 4094, 16251, 7263, 10597, 22862, -9731, -31708, -4791, -15098, -24209, 3622]
7555C622K7425l7436k3424K2131r637j776J0727O832J985Q026J4294o120j7036
7542c87k610K237J1500j0485J7413k2148J860k340K04J5824k9637J3255k1153
7529b6467l7748K622J0483K8852k0998K5344J8157m0943m780L3760J9987K1775
7517C0044j0415j7846K3330K2011P096j8264k9393k3977K0675J1142L018m134
7505A3287l0848j2558L0478J3076L173J0201k9927r704r521K908L9110K120J1383
7492C3178k2068j2157N671J8896J7755j2131j0133j2002l792k3252K4924J5593
7480B0482j4633r342O469j140m2076j9427L920N2250L3094j4690K036j7922j5003
7467a5982P678m803k09J0859j2230J6075R844K9862k4700N604m494j9768K995
$$ y = [3622, 31047, -6389, -29813, -7682, -17319, -19095, -8368, -1536, 449, 8475, 22769, 16649, -387, -2997, -760, 10740, 255, 17668, -4480, -2620, -4960, -4756, 11068, -18569, -5314, -26467, -64215, -61593, -51110, -22258, -43256, -17912, 245, -40698, -45478, -11718, 8269, 30044, 19629, 1783, 25113, 47124, 54220, 35956, 6563, -17414, 3261, 14403, 17421, 13287, -17561, -30119, 359, 13435, 16608, 26809, -3118, -12822, -22343, -19435, 19675, 21795, 33178, 11110, -1047, 4624, 23520, 41275, 29144, 19011, 7009, 3217, -20035, 4889, 20482, 5849, -3493, 2976, 1836, -40240, -59667, -55747, -3497, 29597, 14907, 16943, -979, -15982, -8304, -13107, -13316, -2457, -14687, 1388, 11232, 41094, 16394, 21998, 17504, -2264, 731]
7454G31l8034J3490L5778K2178k7451k6569M1713L5341n733j9997k0643k2835
7442a2031J2809K8172j5892j8733l1628k385L699P874K8757q500l461P576K979
7429g64j4396N736J5531k0678K386M370r929J2001j508K813J4386l657l0495P59
7415b3445N3467j2764J0766m545j5433q46M120L2028j2749m0636p796m218k0760
7402d2811K0418M0669j2142O752j9017l1819J8622J517K551k3266m094N957l265
7389c9928N214P775J3317J9873J2690l2957J3484J7077j2815j5704j4225j7442
7377d3641K4679K2331k9938K9537J6106j0522o583R448N682K798j9854k9340m0241
7364f9538Q718K3765J5753m732L408J2273r827j5597M1489L578n2029K1402j5174
$$ y = [731, -37303, -23813, 11965, 34143, 6692, -19877, 21836, 57177, 51444, 31447, 10804, -12031, 778, 28950, 13058, -5675, -37303, -39688, -35989, -28115, 642, -7858, -11319, -3743, -764, -15160, -9424, 6107, -14571, -12185, -7815, -17744, -5743, -7251, -4438, 9948, 6291, -24204, -23445, 30022, 17258, 28024, 23479, 8046, 7200, 11320, 43348, 30599, -10037, -17833, -22051, -42811, -22393, 18276, 6134, 12886, -6131, -37950, -19328, -17811, -15260, -38526, -42620, -36663, -39928, -34714, -26939, -13622, 6251, 18941, -14016, -532, 16545, 3730, -11974, -26199, -43641, -18962, 3369, -26569, 2968, 19074, 8552, 1969, 11417, 17099, 19897, 43, -29297, -69538, -60820, -37055, -21302, -26034, -22626, -10353, -20180, -35777, 5712, 9290, -42739, -21337, -36511]
7351c6511j0004N909J6192L3125J1051k9945J1435M3702k1608o490K8417q450
7339C6823k2923J0246j137j3595j0958l573r608K0941J0564j6033J5762k74l9916
7326b3681J2371K5213M157K4256l0772k7251P678K2711J8818l1002q78J6107k0060
7313b333L2321Q035R3k7959k7951K6076k7822O846Q749k4670j0955k537O2724
7300B0617J6517j3846j0502k7370j4818K4138K9853r333k6054l706J8697l1154
7288b6961N216K8269J3354R954m8524p447j0951K0751K9139k031J1161K5116N384
7275E2430k8634j2775j0281K9549k6632r970P320l1507L1563J2524j2586k2489
7263b1488J6758L415J4110q066k2955O212L0307j2626m953J4551J2320J7064m642
$$ y = [-36511, -46515, -40606, -24414, 8711, 19762, -10183, 1252, 44954, 23346, 16856, 45273, 36823, 13900, 24146, 23009, 9414, -1544, -5117, -14725, 6216, 16780, 747, 16509, 16235, -23681, -11310, 13903, 18060, 42316, 11544, -15707, -8029, 14682, 33500, 2498, 1620, 17727, -2333, 29988, 38023, 38116, 10157, -17794, 8282, -19540, -12694, -3945, -28615, -39570, -42107, 20617, 37134, 23288, 12786, -14584, -29402, -5264, 24589, 15256, -10798, -14504, 4193, -26961, -21745, 6524, 19878, 29832, -18692, -26139, -37090, -16339, 12800, 10769, 21930, 47046, 52430, 23796, 11021, 740, 30289, 3657, -6313, 1007, -30500, 1063, 13587, 1001, -21488, -4730, -1315, 12795, 4729, -18226, -12014, 18293, 5667, 714, 15265, 27585, 44649, 40007]
7250D0007l2952J814j5219j2828J2567Q079p492K1064L5472R081j3726j0572K742
7237C8037k9561L549j8184k7847K5852K2724k4338p877L7964P562k4587k1404
7225a8110k430J7470R060J9637j4426q651N472K646p865K4731j623J0768k7990
7212H689n021J6691K266p32k8064L551K1710r929P842j978K1785k8248j7968O296
7198c110J1573j4082j9295M138L0143m350K75L751J7098l0433M901J8606J087
7185B0302j3346p445R176R143k3860k9181M750K6770L3207P347j7114j4779K0457
7172B5427p271j8728J0474P666k4294J8681O038j7520j7415L505K6829j4516j9215
7159b0339J4240J5226K439k7402L0504J2613l9325K9571K1799j4031J5853j3901
$$ y = [40007, 7055, 8869, -6350, -19178, -6611, 1468, -6024, 15040, 50512, 59593, 45867, 35295, 38037, 8476, 12025, -6159, -34006, -8154, 14570, -9768, -17645, 20319, 27881, 3294, -18110, -20540, -3070, 5990, 25627, 11201, 2550, 8022, 10668, 2803, 27534, 25911, 36679, 8689, 3668, 20359, 22625, 21893, -6171, -2620, 19090, 9161, 17003, 15025, 36810, 8562, -9406, -3110, 8463, -5619, -24914, -20776, 9367, 5017, 5292, 9043, 26141, -4292, 609, 19215, 20302, 6956, -489, 8687, 17830, -6030, -35211, -30461, -3691, 29516, 36863, 19749, 4970, 25427, 18156, -572, 9902, 17568, -6726, 11955, 17993, 473, -16942, -13437, 13392, -1124, -20339, -6099, 9127, 11566, -15836, 14668, 27281, -12044, 17527, 39326, 25295, 41148, 27247]
7147B7247J6814M775m273R586j1739n2723J1963n81J1936J588J5413k7842k4371
7134b2207L935j7506J0060K5259r323J5371j1506j4917J9016m990j299M16k054
7121i745J3489J425K7295k9658O423k2765j1479K6621j5244j697J0015j9943n812
7108c1075Q484m406r074K6734L3295J5912K0398m0082M298j501J0786Q445j2242
7095B9972J485j1607k8059M344j6240k3569M3131R76o691K3738j0167K754j2222
7082b155J3757M027j7991K4075L937J9573j4808m8433M272J9089n31n601N031
7069D242J1552K4419k8727M0749k5926l1969K121K1905j4520j5007R203j6889
7057a8847J5075k6612P642L0462M179j8764q519K0219K8308p125o663K0302p330
$$ y = [27247, 44061, 48836, 44563, 54149, 42410, -10313, 1650, 1069, 13005, 14593, 30006, 2164, -22207, -18272, -35778, -25718, -459, -9782, 5589, -5917, -20834, -1818, -6808, -8107, -7691, -9745, 3744, 5169, 32464, 2806, 9229, -13536, -25015, 1606, -13638, -15335, -5320, -25263, -31075, -22591, -26997, -36071, -9337, 23958, 39870, 60268, 20186, 24484, 22983, 33769, 42214, 29972, 31457, 19850, -8209, -3865, -20105, -43674, -543, 433, -6258, 17480, 7313, 10067, -2155, 11602, 15629, -2362, 21713, 25650, 45223, 30415, -18018, -13746, 5343, 4812, -789, 4242, 15794, 40213, 11486, 52235, 26309, -5660, -3539, 18366, 3846, -11161, -1958, -18847, -3772, -30384, -22742, 7720, 11899, -6865, -15384, 4835, 33143, 26018, 19355, 39657, 32327]
7044C2327k4088l622K1220L2238j3233l4368O901k7705O39J3969j213L7067k6333
7031A3799l905J8398l88j513K860J4835j0865R623r098m6173J9837L280L26l446
7017G570j4644J430j1330j5814n323Q314K842N035J0215K2515J1464Q070k7062
7004C282P999j6157O161k2821L0437J0961J0966q224j9348M3129L2145m9729q188
6991B0613K9097O677r405J6042N999q40n865k4046p48m4636M348J4391J7300j4792
6977A4135R660k963j4515l000K5897q812j0514m080j1178j5649J5806J2099J0125
6964A7011Q423k7087j8904J134K7184o519K069n376J5549P205k2096j4601J5489
6951e19R075k0143L5077J3038j3081j674j1117r99K7426K8833k0143m6181r451
$$ y = [32327, 8239, 4617, 25837, 58075, 44842, 10474, 17375, -10330, -9691, 4278, 3065, 40132, 13799, 9894, 28292, 27904, 26391, 29251, 44086, 33221, 42844, 33746, -12427, 7410, 10690, 11016, 7570, -7074, -5644, -16974, -32788, -38111, -29797, -26955, -21920, -11705, 10810, 22274, 30344, 3282, 11281, -4876, 1285, -21536, 8901, 19862, 30828, 22604, 3256, 46385, 78530, 28801, 20613, 49710, 56387, 46982, 63024, 69023, 68183, 62318, 38272, 37524, -7112, -2764, 11627, 28927, 14135, 23795, 20832, 6317, 3317, 29214, 20402, 9888, 5808, -5370, -21019, -5213, 6886, 17011, 25434, -1653, -20557, -19423, 7761, 1242, 3311, -2065, 13484, 20689, -1407, -16008, -519, 8556, -11587, 23490, 36528, 23447, 21773, 10656, 9657, 37083, 65916, 45773, -408, -9859]
6938i859J4479K8053J235J0709n995j2231n6k5230l454K1684m374Q642j7920j0314
6924d631L4578P213j4731L160M271J0275J3884j228q533R965m45n346l243K636
6910D7825J9168l2328j8489L0968l099k3889m184Q550J957O15k9985J2416k2843
6897a3318K8540K3969J5231l0843j041J6018n120k0238k9674K4996q446N88J0491
6884A1153K0799o384J7379j0881l998J6404j6233j3913k7240J7400Q817K200k119
6871A3384p847l986j0700L1753K2237P377m7527J0958m4984M957M3449K0588K781
6858D2440p944n045J6341Q378q063j7094j6476L554k1222J0322K7334j3228l0454
6845a1157K1788R882n289J7307j3404j9397J0444k6617K6774j0837k2446K5214
$$ y = [-9859, 4620, 32673, 33908, 44617, 38622, 26391, 26335, 1105, -2349, 19335, 14961, 23603, 5683, -4631, 29947, 37160, 22429, 25589, 29860, 40135, 54019, 52791, 44258, 54223, 53778, 48432, 45189, 47825, 66993, 34665, 16176, 47144, 44045, 20156, 15972, 24522, 26479, 27094, -2891, 9525, -13318, 15222, 39191, 54422, 23579, 22538, 38556, 33436, 13198, -16476, 8520, 74, 662, 11153, 31952, 25568, 42947, 32066, 28068, 44472, 28239, 14326, -12914, 4486, 13303, 15503, 13384, 5537, 1551, -9149, 22604, 44841, 52218, 4691, 15649, -29335, -24378, 19071, 39659, 42440, 34496, 29451, 45792, 54170, 46107, 29013, 12537, 16091, -5131, 5191, 32525, 19297, -11157, 10631, 20513, 15224, 32531, 19127, -270, 10174, -16443, 10331, -506, -22952, 2262]
6833B262K0908J2248j8281K4786J9139k2833n339j7965k0643j360l154O579N5666
6820E2013R813o793r274j4665k5233m088K5841j5105M8528k3244k4858k0823M7462
6807C9574l601j5189j2322K607k5886r314M1480k6522k1442O1192J5241l2520
6795A3298K2585l2398j1033Q79L6609R039m0165L7336J0832n683k6313l8273R003
6782a4284M8585k41r334L4738m5775J3843r183k9763O064J2223o06r26J4366j132
6768A8575k590L4672J804j6568j2021j1896O190j5738n729J4909J6564k614m3182
6755a7624J2622L8960j1914j7533p371K148k5416L4307J4367L929J8620l5844
6743I251k1186L2657L379j3496l1568L5210J3257j6079m867k149j3619J3652L4858
$$ y = [2262, 23170, 35418, 17137, 41923, 61062, 38229, 32890, 14925, -5718, -7078, -10232, -3653, 52013, 61826, 55033, 45759, 31094, 5861, 1773, 27614, 12509, 61037, 37793, 12935, -7888, 39574, 35973, 20784, 8462, 11069, -14817, -24131, 17349, -9173, -30615, 30577, 45818, 13298, 35883, 3485, -7548, -6669, 29940, 38979, -1186, 36150, 46982, 41299, 14986, -23287, -14284, 34301, 34060, 24726, 59464, 13689, 27532, 18349, -11414, -5350, 6873, 6267, 5341, 19707, 18575, 15985, 50657, 52461, 35893, 23872, 11976, 18166, 2428, -3301, 11608, 28172, 25558, -17624, -5002, 33958, 22044, 4511, -2860, -712, -26128, 8179, 22546, 26475, 45095, 9251, -11935, 20722, 24101, 10605, -20963, 14247, 27504, 11425, 6558, 4409, -9210, 4442, 39300]
6730C9300j6402N0448l8289n846O15m0178L57K5521K138k593k1348J0062j2254
6717h469k8091P33K8287K1035K6148m812K5429l802l4744J1458J1794l7732l7201
6704b9967L3050K4641p16M083l1768J7762J8569N485Q368j2984l795J805K610
6691C7143J4406k0202M812K4201k9167M965n333k1403J6429N83L2820j732R817
6678F7339j1060j2947j530M141J8429k7365j7648J2441J3122P320J4740j7331
6666D9651M858l249L0425l444j9452j756q664J4938L3325j4683M116J8952o474
6653I8543j8348j6762M616L999m403j5062k2201M0342K2577K984k6273j7606K2137
6640G4543M3297m3595o638j276k1785J0281J3354k278L6075N698j4389j4702J5098
$$ y = [39300, 22898, 73346, 35057, 29211, 29826, -10352, -9995, 15526, 17664, 15071, -6277, 3785, -8469, -36560, -35827, -7540, 13495, 39643, 34831, 60260, 56458, 21714, 33172, 44966, 7234, -29967, 3083, 27724, 27008, 31091, -677, 17085, 35654, 41139, 49507, 36523, 32728, 34533, 37143, 51549, 31347, 36159, 60360, 31193, 36158, 30825, 9422, 25851, 26434, 59254, 57522, 67339, 56279, 43332, 41802, 45943, 64372, 37007, 19359, 31800, 44922, 52242, 66982, 49651, 54509, 51260, 81685, 78241, 58789, 57033, 48369, 63307, 96632, 81949, 86065, 105017, 98543, 80195, 63433, 68049, 72048, 67645, 52583, 30382, 70724, 93301, 96285, 70012, 52406, 74543, 117840, 74245, 67607, 66331, 44546, 54827, 68181, 65903, 101978, 107676, 93287, 78585, 93683]
6627I3683n528n697j8150l360k3047j712M4014K2386m1410l0318J7830L1665j5366
6614F4990q401j7359j4143L2268L973L0828l0000J4199J8300l9447j6225K4944
6602F3927j1928O655K1241J0464K1668k5359j5404J3935q226K6270P948l6341
6590G4850m245K1252J856J2417R769k005q954J37J1055o03k2421j927k6970k420
6576F1791J2963j9771j0510J9975K6514M6693k3787l653J1696R128l7483l7324
6564E6232J0073K595M0657K6339j4668j8152k05m358K4244K226k0071n943q315
6551I0654k5761K0699J9694M118J4030j3328K187p689j0197J0542L4148J8196
6539A57293J7171O312j0475K5462j049m0685j7494j2307J1460M68p38L560R010
$$ y = [93683, 88155, 82458, 64308, 60948, 37901, 36189, 80203, 102589, 61179, 30861, 48691, 80356, 64990, 56589, 39230, 25087, 57355, 61328, 92156, 62156, 76355, 94655, 55208, 38983, 63927, 51999, 58654, 79895, 90359, 112027, 86668, 71264, 85199, 76973, 103243, 111191, 74850, 70605, 91857, 93713, 106130, 115899, 113894, 104940, 105077, 116132, 115529, 93108, 91181, 64211, 61791, 74754, 54983, 44473, 64448, 90962, 137655, 113868, 110215, 121911, 131039, 93556, 56232, 66305, 68900, 109557, 135896, 121228, 103076, 102871, 98513, 122757, 124983, 104912, 98969, 90654, 64893, 85592, 105286, 109404, 123434, 110106, 112293, 104604, 94407, 104949, 139097, 157293, 174464, 180776, 170301, 195763, 194714, 154029, 136535, 124228, 135688, 136156, 135418, 138978, 147988]
6526A47988k5789p688P104l925j3404l2487j5458J728K0733J8620k2705m808l3759
6513C6150J6238K5795m250j9875r448J9894J4622M724J9632L848k8031K4521J0611
6500A14431j0167j590J1876J2174k1675q277J7990k1020K337p740J3221j5903
6488H5657Q523J1034j4729j8713p918M3372K5322r433j0222r195j3590J1770k3568
6475G8310J0317J3140l7418K6545J0019J5199j3552k3248L0946l604J0369l5277
6463H1746l5951Q179J1834K6924L3879j0134q97o359j7592K2762k3037J6666J2346
6450A20366l7660o034P66m327M364k1875K4039M1388J8311R575k122k7696K5884
6437A44979o121J1044K5719j2568j3129M3932J4665K2879l1968m467n862L925
$$ y = [147988, 122199, 114511, 121615, 117690, 104286, 71799, 56341, 58069, 78802, 97422, 74717, 69909, 36150, 52388, 78183, 73933, 54058, 44610, 64504, 79126, 83850, 103482, 107330, 79299, 103820, 114431, 104264, 102674, 114550, 126724, 105049, 96772, 114762, 93742, 96079, 88339, 101560, 85657, 94180, 105214, 90485, 71772, 63854, 107226, 132548, 123115, 112893, 103698, 90108, 101878, 78310, 88627, 101767, 64349, 90894, 100913, 116112, 102560, 79312, 110258, 106654, 117023, 81746, 45795, 53974, 65808, 92732, 126611, 116477, 115580, 109221, 91629, 114391, 91354, 108020, 120366, 82706, 76672, 77438, 73111, 77475, 55600, 79639, 121027, 139338, 148913, 146791, 119095, 144979, 138858, 149902, 175621, 163053, 149924, 193856, 208521, 231400, 199432, 194965, 189103, 193028]
6425A93028J514J9545M5302j5006o431q219n18J353o577K4235J8986P908K8342
6412C03462k8164j020J9744K6762k6304k1413K1135N096k8096j1385q392j3796
6400B37629k7952P001j0714M016K970l4877l2907N267q692J7039j2223k8686Q024
6387A25895K116m040o043L780r036n366o178M363R616K515L529j188l391O415
6373A22987j1458J0565J1414k6061k1925K7465R740k9154k977P333N179P686L8286
6360A49080K782k1026O23P631k890l775L605k2991l6153J0835N3623j1504j3839
6347A16001J9764O367J4769j4823P499k2702j7869K3137K4092l232L700k0478
6335A36225k3078R595l3130j4273J2851P245K4941j15m238R388m861M576m73j8298
$$ y = [193028, 194542, 214087, 259389, 244383, 237952, 229733, 229215, 230568, 223991, 248226, 267212, 275120, 303462, 275298, 274278, 294022, 320784, 294480, 273067, 294202, 299298, 271202, 259817, 251425, 237629, 209677, 216678, 205964, 209980, 212950, 178073, 145166, 150433, 141741, 158780, 146557, 117871, 125895, 128011, 123971, 117928, 121708, 112672, 107306, 101128, 105491, 115107, 117622, 121151, 119963, 116572, 122987, 111529, 122094, 133508, 107447, 85522, 112987, 122727, 93573, 90596, 97929, 103108, 110794, 149080, 151862, 130836, 131459, 139090, 136200, 132425, 136030, 113039, 76886, 87721, 141344, 129840, 116001, 135765, 142132, 156901, 142078, 149577, 126875, 109006, 132143, 156235, 153003, 156703, 136225, 113147, 122742, 89612, 75339, 88190, 95435, 120376, 120261, 116023, 125411, 120550, 125126, 124653, 106355]
6321A06355L2287j3994l6737L1680M5637m7019l8117K5875j5561K4157O591j3755
6309A07399j6559J3760J9039J3673j9639r925j5191M204j2824J8818K1309l3474
6297I0590M2282j520m116R2L2845j8869l7673K45K5014n49k7952n078j4989J7425
6283I7747J8572k1779l698L1507N467o710m664k2207L2139n390j8477K022k6408
6270G8121L3086K1264l065j0484j1602J8456L1187R68k965k3277j3164J0564L4214
6257A63303R207p011k9344j5024J012j6142P260K7766L385j7510j9720L3141O074
6244A46397K9460O810k7024n845j8144J5559J0179M269K8876k624k0264p619J864
6231A61894K1245K1115O011m798K558J9206K3483q482j358M364K984L4766N0195
$$ y = [106355, 138642, 124648, 87911, 119591, 165228, 118209, 80092, 105967, 90406, 114563, 121154, 107399, 90840, 104600, 123639, 137312, 117673, 107748, 92557, 96761, 83937, 102755, 124064, 90590, 132872, 131352, 127236, 127328, 160173, 141304, 103631, 103876, 128890, 128341, 100389, 95311, 80322, 97747, 116319, 94540, 90842, 122349, 127816, 121106, 116442, 94235, 126374, 120984, 102507, 104529, 78121, 111207, 132471, 129406, 118922, 107320, 125776, 156963, 157931, 154966, 131689, 118525, 129089, 163303, 172510, 165499, 136155, 121131, 122143, 106001, 113261, 141027, 144412, 126902, 107182, 140323, 146397, 175857, 182667, 155643, 149798, 131654, 147213, 157392, 161661, 190537, 187913, 167649, 160030, 161894, 183139, 204254, 210265, 205467, 208025, 227231, 250714, 242232, 240874, 245238, 248222, 282988, 333183]
6218C33183J3752k0965Q892N7125L8244l123L0430m979L628J5519m7469j2119
6206D12118P494n332K830K0422L8997J8002J7991Q320K1986J6542n803K2175J7061
6193E92803Q231K5626M5632m582j1768K6112J1952K2474M9423J3077J0422M1487
6181H30889M3191Q4452Q5039Q1766M6536M9531L3499M0179L4548k8909l1218n8715
6169A210788p6665o6034l7545j6270P375J9113K6840K1273L3768N5933M4365N8053
6157A280994O5903K7144r154J3255R312q0741n9106l5811Q169m7791k9197n5900
6145A087077l6514m295m3109k0591l5498j0816J948j9107J3416L0535N2774N0953
6133A066773P3525K251o7009n4253r9177j01954n8760j02437n9926k0496n9734
$$ y = [333183, 346935, 325970, 334862, 391987, 430231, 427108, 457538, 452559, 456187, 471706, 424237, 412118, 419612, 414280, 417110, 437532, 476529, 494531, 512522, 520842, 542828, 559370, 553567, 575742, 592803, 601034, 626660, 672292, 667710, 655942, 682054, 694006, 716480, 765903, 778980, 789402, 830889, 874080, 958532, 1043571, 1125337, 1171873, 1221404, 1254903, 1295082, 1329630, 1300721, 1269503, 1210788, 1134123, 1068089, 1030544, 1014274, 1021649, 1040762, 1067602, 1088875, 1122643, 1178576, 1222941, 1280994, 1346897, 1374041, 1364887, 1378142, 1387454, 1306713, 1247607, 1211796, 1219965, 1172174, 1142977, 1087077, 1050563, 1046268, 1003159, 982568, 947070, 936254, 938202, 919095, 932511, 963046, 1015820, 1066773, 1140298, 1142549, 1075540, 1021287, 922110, 820156, 761396, 658959, 599033, 578537, 518803]
6122E18803n6904j5025n534l1220p6784j0466K3961j2459k6754j7348L3358j6656
6110C06972j745k7210k1219k2135O905K2642j390M722p53O154J673l5319k3227
6097B16070K4374m126q169j5866J6739L6967m717k1760j1159K4301q331J4340
6085B58663L4385J8156n687l2159j4299Q261K6412p21j1905K0969k9607K3922
6073B96390L5878L0083J620k1711p481K528k6405k5332K8419l931m562J6437k0605
6060C01328L882q466L3262q884j2388l2396J8563L7818r176p142m299M2232R198
6047C63532j6025J16K2040j0824l0263l0330J418o718o485R769O75P773P303l955
6033C08026k9479J0848L4200l8016K0423l79o177j8467l6010L4954K9248j4007
$$ y = [518803, 461899, 446874, 441340, 410120, 333336, 322870, 346831, 334372, 307618, 290270, 323628, 306972, 305227, 278017, 256798, 234663, 241568, 264210, 262820, 267542, 266789, 272943, 274616, 239297, 216070, 240444, 236318, 228149, 212283, 229022, 265989, 261272, 239512, 228353, 252654, 244323, 258663, 293048, 311204, 305517, 273358, 259059, 267320, 293732, 293011, 281106, 302075, 272468, 296390, 332268, 362351, 363971, 342260, 334779, 337307, 310902, 285570, 313989, 310058, 305496, 321933, 301328, 305210, 296744, 330006, 321122, 308734, 276338, 294901, 332719, 323543, 316401, 312102, 354334, 363532, 347507, 347623, 369663, 358839, 328576, 298246, 299664, 292946, 286461, 296230, 296905, 304678, 311981, 308026, 278547, 289395, 323595, 285579, 306002, 305623, 299446, 280979, 244969, 279923, 309171, 295164]
6021B95164l2730n312j2995m3881J6082K9766j1927Q229K4656k7623P398K4910
6009B71737o171j985j5526j5477J2093J5189N084k4494K0796M7388k0101m061
5997B84472K9193k7605J074n286M977M272J2408Q233m25M159J6170j3030m291
5984C14321K803j5043J3771J2232l899J2503L904j6099K7625N0252J0819n4742
5972C58447J8275J2874j404L325J3260P625K5858p91j2193L2314j0769k9740K7563
5959D44644J8577j2333j7434K2277j9293J0131K9749R187J8096K8095J2999j6203
5947E28492J9945K798J6374O988j711m49L5470K1293O163O693J9714k538n044
5934F54188L6014m19K0762J3331N569J1714j7903Q493K9962M5929L9444P783l734
$$ y = [295164, 262434, 257122, 244127, 200246, 216328, 246094, 234167, 242396, 267052, 239429, 246827, 271737, 265566, 263581, 248055, 232578, 244671, 259860, 264944, 240450, 261246, 308634, 288533, 284472, 313665, 286060, 287134, 281848, 286825, 291097, 303505, 311738, 311313, 315472, 331642, 318612, 314321, 317124, 302081, 315852, 328084, 324185, 336688, 340592, 324493, 352118, 402370, 413189, 358447, 376722, 389596, 388192, 391517, 404777, 412402, 438260, 437469, 425276, 457590, 446821, 417081, 444644, 463221, 450888, 433454, 455731, 436438, 446569, 476318, 485505, 503601, 531696, 544695, 528492, 548437, 551235, 567609, 574597, 572886, 572437, 607907, 629200, 635363, 642056, 661770, 659232, 654188, 690202, 689783, 710545, 723876, 729445, 741159, 723256, 731749, 761711, 807640, 847084, 854867, 851133]
5921H51133k5217L5063O5625K9067K4640M3545O8540O0509P9567L3736J8926O2006
5909A347140j9308m8371l4973j3676J5852l4692l8741l6721Q720K3910K3792L0510
5897A223442L1870L3622K9500R7592R3081Q5666R3856M8320n947q624p0570k3992
5885A627816m1013r7685o4899r8438n8313k7191J0351p1747l6875L6879l099j0822
5873A164964K1835K6086M7025N1688P0161P5905J6576L7405M5265m9642j04244
5862A403024p8242p7994q0233o4807l6543k4058q184l0273l0595k1809M2565m8140
5850I44711m8135M1963J1320j4854J9032J3209n485K4442J7219K8839L6635l3671
5838A035225k4783k6308n875M147k8125J0604o420K0532N18l6111l200M349R77
$$ y = [851133, 825916, 860979, 926604, 955671, 980311, 1023856, 1092396, 1152905, 1232472, 1266208, 1285134, 1347140, 1327832, 1279461, 1244488, 1230812, 1246664, 1211972, 1173231, 1136510, 1145230, 1169140, 1192932, 1223442, 1255312, 1288934, 1318434, 1416026, 1509107, 1594773, 1688629, 1736949, 1731002, 1722378, 1651808, 1627816, 1586803, 1489118, 1424219, 1325781, 1267468, 1240277, 1250628, 1178881, 1142006, 1178885, 1175786, 1164964, 1186799, 1212885, 1259910, 1311598, 1381759, 1457664, 1474240, 1511645, 1556910, 1507268, 1403024, 1324782, 1246788, 1166555, 1101748, 1065205, 1041147, 1032963, 1002690, 972095, 950286, 992851, 944711, 896576, 938539, 949859, 935005, 954037, 967246, 961761, 986203, 1003422, 1032261, 1068896, 1035225, 1010442, 984134, 978259, 982406, 954281, 964885, 958465, 978997, 979515, 943404, 940204, 944553, 945530]
5825I45530J297k3552N3449M8174L765j6927J3930J4861L4165J9748R420j4245
5813A089615J8565J2593k0585K0233L1321k0998j6462K7025J5769k678k2333n281
5801A126784l061J5973m689K6330p460L2997M1370L0732k0534L9145r63o392j8940
5788A251292k3579K2059p050j0706J5792J3266k7315Q206J1481J6755N75J4889
5776A285665j4513k5487J1542M1028n45J5488j3601K2083K4451N155o418L0897
5764A375745J0330L3099R497o069J2399K5083K1638K2370j3935P939L5154J7787
5752A551037J9833M381K8244L0690L3590j8053O132L7807L6068k7714M728k9921
5740A676822n715L1657P843J6613K4494K3291M3735O2219K3780r914N3175L1616
$$ y = [945530, 946827, 923275, 976724, 1024898, 1028663, 1011736, 1025666, 1040527, 1074692, 1094440, 1103860, 1089615, 1108180, 1120773, 1100188, 1120421, 1151742, 1130744, 1114282, 1141307, 1157076, 1154398, 1132065, 1126784, 1123723, 1139696, 1135007, 1161337, 1153877, 1186874, 1228244, 1258976, 1238442, 1277587, 1276624, 1270232, 1251292, 1227713, 1249772, 1242722, 1232016, 1247808, 1261074, 1233759, 1241965, 1253446, 1270201, 1270776, 1285665, 1271152, 1245665, 1257207, 1298235, 1297690, 1313178, 1299577, 1321660, 1346111, 1351266, 1344848, 1375745, 1386075, 1419174, 1428671, 1422602, 1435001, 1460084, 1481722, 1504092, 1490157, 1498096, 1533250, 1551037, 1570870, 1575251, 1603495, 1634185, 1667775, 1649722, 1655854, 1693661, 1729729, 1702015, 1706743, 1676822, 1671107, 1702764, 1710607, 1727220, 1751714, 1775005, 1818740, 1880959, 1904739, 1894825, 1948000, 1979616]
5728A979616o428J6417L0002J8402K2290L9442L0146K7883P847M2315N3194J2124
5716B273250M4421N9318N1116L6886L5147K6673K5212N1591L6300L5481K0095
5705B695490K9360L8108N1785N6385O6698O4615L4460P0909P8271O5017Q4305
5694C335403R6627P4883N1152O4886P4472J27980R5852J24938J05285J50123J50755
5683D452356J85790J65921J44784J83446J76409K97573K79326K75753L22097L31501
5673F814956K74368J76377L2244P2471J41072K13175K12246J71727J59057N7850
5663H325543J5634J02938J65152J56819J77328K53784L10449L19145L46592M44934
5653A0618318N05672N62035N68547N46325N05002M51540N11036O78841P23224
$$ y = [1979616, 1973188, 1989605, 2019607, 2038009, 2060299, 2099741, 2129887, 2157770, 2165617, 2207932, 2261126, 2273250, 2317671, 2376989, 2428105, 2464991, 2500138, 2526811, 2552023, 2603614, 2639914, 2675395, 2695490, 2724850, 2762958, 2814743, 2871128, 2937826, 3002441, 3036901, 3107810, 3186081, 3251098, 3335403, 3432030, 3506913, 3558065, 3622951, 3697423, 3825403, 3921255, 4046193, 4151478, 4301601, 4452356, 4638146, 4804067, 4948851, 5132297, 5308706, 5606279, 5885605, 6161358, 6483455, 6814956, 7089324, 7265701, 7297945, 7370416, 7511488, 7724663, 7936909, 8108636, 8267693, 8325543, 8341177, 8444115, 8609267, 8766086, 8943414, 9197198, 9507647, 9826792, 10173384, 10618318, 11123990, 11686025, 12254572, 12800897, 13305899, 13757439, 14268475, 14947316, 15670540]
5644A5670540O98199M85228K64126J19676K4943k8826j32397j48841p7516K1421
5634A6896553R4676J95112L32128M54517N71941O31503O36001O29640O15074O97027
5624B1754172R29920J167707J225076J099221R18274P76240O57483N87567L73344
5615B9489004J53784K08503M35397O95140J064361J422844J811319K128042K344277
5606C9752671K434872K440809K394326K438428K556097K743838L043920L547331
5598F1352292M211811N105257O308374Q025594R887284J1040023J0109817O541594
5590A22582046J022915l833698o380316o252724m227961k301649j138520q26524
5582I8643569p24181k23116P28727J839067L157302M491090O163326Q159361J0966279
$$ y = [15670540, 16368739, 16853967, 17118093, 17237769, 17262712, 17233886, 17101489, 16952648, 16875132, 16896553, 16991229, 17186341, 17518469, 17972986, 18544927, 19176430, 19812431, 20442071, 21057145, 21754172, 22684092, 23851799, 25076875, 26176096, 27094370, 27870610, 28528093, 29115660, 29489004, 29642788, 29851291, 30286688, 30981828, 32046189, 33469033, 35280352, 37408394, 39752671, 42187543, 44628352, 47022678, 49461106, 52017203, 54761041, 57804961, 61352292, 65564103, 70669360, 76977734, 85003328, 94890612, 105930635, 116040452, 122582046, 123604961, 119771263, 113390947, 107138223, 102910262, 100608613, 99470093, 98643569, 97919388, 97696272, 98424999, 100264066, 103421368, 107912458, 114075784, 122235145, 133201424]
5573A33201424J4455285J7159985J6438651J1117379K510837n581913r353524
5566A79948124r496064q387661q542699r767057j0781220r856030p784383o030922
5558A09302088m631562l330268j959412p66094O16653K223694L936263N389164
5550A10780526P052925R283355J1403574J0743865N302355l660064j2150335j6482990
5542A22273211j6275454j3913898j1406443r207749p542744o225840n125635m199390
5534D8376058l515742l012536k688317k494614k271705k057308j717781j476129
5526B9141926j363128j311530j216778j219948j080275r96588r69079r91326r66641
5517A9026633q50715p14202o27726n25904m01561l12034k95546k74910l44187
$$ y = [133201424, 147656709, 164816694, 181255345, 192372724, 194883561, 189301648, 179948124, 170452060, 162064399, 153521700, 143754643, 132973423, 123117393, 115333010, 109302088, 104670526, 101340258, 99380846, 98614752, 99231405, 101455099, 105391362, 110780526, 117833451, 127116806, 138520380, 149264245, 154566600, 150906536, 138756201, 122273211, 105997757, 92083859, 80677416, 71469667, 63926923, 57701083, 52575448, 48376058, 44860316, 41847780, 39159463, 36664849, 34393144, 32335836, 30618055, 29141926, 27778798, 26467268, 25250490, 24030542, 22950267, 21953679, 20984600, 19993274, 19026633, 18175918, 17461716, 16833990, 16308086, 15906525, 15594491, 15298945, 15024035, 14679848]
5508A4679848l62561l04780k00634j56618j71987k65620k86201l82210l38118
5499A2211119l25585m32204m51145m68945m63451m79290l71718l35231k67968
5490H615582k37137j91396k02680k06652j22878r0396p6318o1997n5855q3859
5480G286414j04413r2363j22826j29947j26527j72047j94890j48968j10518r1999
5470E991916p2524m5094j7939K7139n1510J5635L0149M4036J9705n9623j97674
5459E684216j94508j76946j11959j09559j22444o4296l4227n5976q3763j9256
5449D711282j3063o1802n1325m7872l2083j3927o2764J4858L3897n819K9756J3904
5437D515042K3999L3975L2703L9429J4750N4750N8171K6047J3297O8995M9109
$$ y = [14679848, 14317287, 14012507, 13811873, 13655255, 13483268, 13217648, 12931447, 12549237, 12211119, 11885534, 11453330, 11002185, 10533240, 10069789, 9590499, 9218781, 8883550, 8615582, 8378445, 8187049, 7984369, 7777717, 7654839, 7564443, 7488125, 7426128, 7370273, 7286414, 7182001, 7089638, 6966812, 6836865, 6710338, 6538291, 6343401, 6194433, 6083915, 5991916, 5919392, 5874298, 5856359, 5883498, 5831988, 5847623, 5877772, 5921808, 5941513, 5881890, 5684216, 5489708, 5312762, 5200803, 5091244, 4968800, 4904504, 4870277, 4814301, 4730538, 4711282, 4698219, 4636417, 4585092, 4537220, 4505137, 4491210, 4428446, 4443304, 4477201, 4471382, 4501138, 4515042, 4539041, 4573016, 4605719, 4645148, 4659898, 4714648, 4772819, 4798866, 4812163, 4881158, 4930267]
5426D930267P2702M2527J9034K7226J1782J4650J7175r780K6506J4424M6290N7825
5414E270628L6559O7815O7863P8180J10351R6012Q7148Q5074R5077J07648J14860
5403F217215J54450J08306J33712J76167J52210J35800J75751J55409J95003J77143
5393G781166J99535K09395K20261K61489L03312L09102L63145L76916M31016M44268
5383A0899605N59004N92796N82585O47311P13931P67429P09283P13578P10431
5374A6895953O95339P28745P38237P35003P52844P57649P79719P41090Q06281
5365B3630860Q99528R59418J143375J311009J437123J695861J908338K056423
5357C5041935K305526K552253K731070L051371L237634L466756L801726M101793
$$ y = [4930267, 5002969, 5045496, 5064530, 5091756, 5103538, 5118188, 5135363, 5125583, 5152089, 5166513, 5212803, 5270628, 5307187, 5375002, 5442865, 5521045, 5631396, 5727408, 5814556, 5899630, 5994707, 6102355, 6217215, 6371665, 6479971, 6613683, 6789850, 6942060, 7077860, 7253611, 7409020, 7604023, 7781166, 7980701, 8190096, 8410357, 8671846, 8975158, 9284260, 9647405, 10024321, 10455337, 10899605, 11458609, 12051405, 12633990, 13281301, 13995232, 14762661, 15471944, 16185522, 16895953, 17591292, 18320037, 19058274, 19793277, 20546121, 21303770, 22083489, 22824579, 23630860, 24530388, 25489806, 26633181, 27944190, 29381313, 31077174, 32985512, 35041935, 37347461, 39899714, 42630784, 45682155, 48919789, 52386545, 56188271, 60290064]
5349F0290064M474803M950209N538118O188776O972341P751003Q396570Q597067
5341A13158951P930393O203938L580546N25206k218595l913592m637942m606254
5333A16022651m088694l323371k364795j368377k79212Q95200K063243L200798
5325A10757443M313683N411657O197730O611290O604099O176351N511839M666483
5317A56250575L263742J126250j757852m852953p470809r064470r511143r084612
5309A18898728q120029o864057n610752m373685l247407k252141j338329n19135
5301H6573193K18210R19258J511675K033194K180597J800385O93024j040248l043883
5292I1845405m871627o057697o630693o584557o173458n596478n054047m425927
$$ y = [60290064, 64764867, 69715076, 75253194, 81441970, 88414311, 96165314, 104561884, 113158951, 121089344, 127293282, 130873828, 131399034, 129180439, 125266847, 120628905, 116022651, 111933957, 108610586, 106245791, 104877414, 104598202, 105493402, 107556645, 110757443, 115071126, 120482783, 126680513, 133291803, 139895902, 146072253, 151584092, 156250575, 159514317, 160640567, 158882715, 154029762, 146558953, 137494483, 127983340, 118898728, 110778699, 103914642, 98303890, 93930205, 90682798, 88430657, 87092328, 86573193, 86791403, 87710661, 89222336, 91255530, 93436127, 95236512, 95929536, 94889288, 91845405, 86973778, 80916081, 74285388, 67700831, 61527373, 55930895, 50876848, 46450921]
5284D6450921l912271l444601l019554k650185k300017k049820j795536j518026
5276B5760911j320449j167731j080587r65929q59641q22513p30802o78852o64256
5267A7470151m93949m24474l72013l18214l49378l90034m16999l64953l40440
5258A3999697l16753l34553k67856k57252k34913j58312j67163j35353r4110o2111
5248A1971321L5400O5974J53364K21062K80022L51805M56850N31757O13064O56087
5238A5336706P52347Q40445Q47676Q53331R46907J249573J711965K064224K720953
5229B7324127L845481M983458M477647J632321j991887m947910m860450l925995
5221B6536792k998795k345811j993679j674992j556578j337388j081647r04747
$$ y = [46450921, 42538650, 39094049, 36074495, 33424310, 31124293, 29074473, 27278937, 25760911, 24440462, 23272731, 22192144, 21226215, 20366574, 19544061, 18813259, 18134407, 17470151, 16976202, 16551728, 16179715, 15861501, 15512123, 15122089, 14705090, 14340137, 13999697, 13682944, 13348391, 13080535, 12823283, 12588370, 12430058, 12262895, 12127542, 12033432, 11971321, 12006721, 12072695, 12226059, 12447121, 12727143, 13078948, 13535798, 14067555, 14680619, 15336706, 16089053, 16929498, 17777174, 18630505, 19577412, 20826985, 22538950, 24603174, 27324127, 31169608, 36153066, 40630713, 42263034, 40271147, 35323237, 30462787, 26536792, 23537997, 21192186, 19198507, 17523515, 15966937, 14629549, 13547902, 12643155]
5213A2643155o85430n19595m33022k54954j50218K546J14563J85398J12006j22727
5203A0891722l55921n00138n95636n42116n64380m89936m69876m08038l59590
5194F606091k84593k69132k03036j56751j34461j19124p0572o8523j8340q482
5184E273077L6939O5580Q6863J11246R0426J34940J72406K00403K71780L96117
5174F839777M15221L39415J68952r9723k99714m35552m41008l37666l37093l50284
5164E462325l01792l01133k27546k03744j42628n8541q7723j00931j1518n0728
5154C976041K3124K9786N3221j5700P0010J56955P2584P2264J31868J79074K50476
5143D999703L08949L63118L21228K38706L2297j91236k89746l83026l24941l53941
$$ y = [12643155, 11957725, 11438130, 11005108, 10750154, 10599936, 10602482, 10717045, 10902443, 11014449, 10891722, 10535801, 10035663, 9440027, 8897911, 8333531, 7843595, 7373719, 6965681, 6606091, 6321498, 6052366, 5849330, 5692579, 5558118, 5438994, 5368422, 5299899, 5281559, 5273077, 5310016, 5375596, 5462459, 5573705, 5664131, 5799071, 5971477, 6171880, 6443660, 6839777, 7254998, 7594413, 7763365, 7663642, 7363928, 6928376, 6487368, 6149702, 5812609, 5462325, 5160533, 4859400, 4631854, 4428110, 4285482, 4226941, 4139218, 4038287, 4026769, 3976041, 3999165, 4028951, 4082172, 4066472, 4136482, 4293437, 4366021, 4438285, 4570153, 4749227, 4999703, 5308652, 5671770, 5992998, 6231704, 6264001, 6072765, 5783019, 5399993, 5075052, 4721111]
5133D721111k92301k11326j63233j53711j71789j72861j49161m7523j4698r6624
5123C247884l2300p5970p9108m6347l9640n7338j04431q2371k7553m4183j1212
5112B647431l7598j7743K6924M4404J0532J1193j4900J7197K3429M8528K767N5173
5100B817337N4415O5661J09377K0123M2537N1562L9810M2307K3031P0433R532
5089C346125m7143k9010n7592m6180m5835n6629k5974n5710j6388j589M7965K4659
5077C036699J7871J8397m5533k7641m3159j1981k5730L4546R959j1473J0541L071
5065B965567j3086j2837L5052L9896L2228L4437M6451M8758K9103N3748L8531
5054C297848j5613Q043j8273m3850l3520k5991l9887k9571m7424j04999j4652
$$ y = [4721111, 4428810, 4217484, 4054251, 3900540, 3728751, 3555890, 3406729, 3359206, 3344508, 3247884, 3215584, 3139614, 3060506, 3014159, 2974519, 2917181, 2812750, 2730379, 2702826, 2658643, 2647431, 2609833, 2592090, 2619014, 2663418, 2673950, 2685143, 2670243, 2687440, 2710869, 2759397, 2762164, 2817337, 2871752, 2937413, 3046790, 3066913, 3109450, 3161012, 3200822, 3243129, 3266160, 3336593, 3346125, 3298982, 3269972, 3212380, 3166200, 3120365, 3063736, 3037762, 2982052, 2965664, 2964075, 3012040, 3036699, 3054570, 3072967, 3027434, 2999793, 2956634, 2944653, 2918923, 2953469, 2963428, 2951955, 2962496, 2965567, 2952481, 2939644, 2974696, 3014592, 3046820, 3081257, 3127708, 3176466, 3205569, 3259317, 3297848, 3282235, 3290278, 3272005, 3228155, 3194635, 3168644, 3128757, 3099186, 3051762, 2946763, 2932111]
5043B932111J8937J6364j8734O5753Q9428J40196J35030P2308P7008N8136N4340
5032C640877M7828K3523N1629L2739M0417M2466J08117J45213J31128J52382J39649
5021D555968J30145J20559J16698J11420L6649O4544N077k1630P5546J73602J30630
5010E499208M3102n1022j29174j67670j52624l6343J4922K5621K6359Q708L1766
4999E112853L1725M6115Q6320J02705P9862J16720J28756J03757P9244R8609Q3491
4988F070157R5815Q9217J21525J15951J29614J42950J68722J85130J92492J80359
4978G491932J77623J34290J41256J44101K21332K76418K50604K84839L04903K82793
4968I710091K51770K82749K58824K62728K70607K58761L22070L93768M22338N46574
$$ y = [2932111, 2951048, 2967412, 2948678, 3014431, 3103859, 3244055, 3379085, 3451393, 3528401, 3586537, 3640877, 3688705, 3712228, 3763857, 3796596, 3837013, 3879479, 3987596, 4132809, 4263937, 4416319, 4555968, 4686113, 4806672, 4923370, 5034790, 5071439, 5135983, 5141060, 5119430, 5194976, 5368578, 5499208, 5542310, 5491288, 5362114, 5194444, 5041820, 5005477, 5020399, 5046020, 5072379, 5081087, 5112853, 5144578, 5190693, 5277013, 5379718, 5459580, 5576300, 5705056, 5808813, 5888057, 5986666, 6070157, 6165972, 6255189, 6376714, 6492665, 6622279, 6765229, 6933951, 7119081, 7311573, 7491932, 7669555, 7803845, 7945101, 8089202, 8310534, 8586952, 8837556, 9122395, 9427298, 9710091, 9961861, 10244610, 10503434, 10766162, 11036769, 11295530, 11617600, 12011368, 12433706, 12980280]
4958A2980280N14721O05491O60248P96141Q90344J035891J183384J344287J623463
4949B1634250J917688K060394K033574J727523J196198P49291N23370M38438O53415
4940C2934141Q20363R24541J000722J068839J151611J214955J368368J687619
4932D2171159J941561K338305K741933L294913L795952M406745N088270N831676
4924G1610514O563900P213811Q109781R244503J0440986J1559422J2735686J4523102
4916A52001705J6857369K0344939K5541824L3567085M2929740M8770736M3814292
4909C83827690K6881514j152605k8131820m5354934n1916422m6154540l7738846
4902B00260037l0054094k4156480j9503386j5736316j2898664j0649195q786502
$$ y = [12980280, 13495001, 14100492, 14760740, 15556881, 16447225, 17483116, 18666500, 20010787, 21634250, 23551938, 25612332, 27645906, 29373429, 30569627, 31318918, 31842288, 32280726, 32934141, 33754504, 34679045, 35679767, 36748606, 37900217, 39115172, 40483540, 42171159, 44112720, 46451025, 49192958, 52487871, 56283823, 60690568, 65778838, 71610514, 78174414, 85388225, 93498006, 102742509, 113183495, 124742917, 137478603, 152001705, 168859074, 189204013, 214745837, 248312922, 291242662, 340013398, 383827690, 410709204, 409556599, 381424779, 336069845, 284153423, 237998883, 200260037, 170205943, 146049463, 126546077, 110809761, 97911097, 87261902, 78475400]
4895G8475400p264368n970314m962092m030009l284338k701717k367554k197105
4887D5697903k140532j985752j843550j769098j637032j484284j322309j140368
4879C2374978r54405p81509p07924n63646m45445k57209m5545J61670M70451P73700
4869C0025116J078750J433252J568534J480210J276838R08553N17835K39033P0244
4860C8598365J14329K53860L62945M96821N56687O72588Q36872J008749J228827
4851D4130043J582123J972123K432744K940463L472630M097127M735477N405365
4843G0768095O067437O722628P726281Q799842R813780J0836293J2621154J4835436
4835A48190946J7013955K0301795K6010944L4325316M2113712M2885192L4408010
$$ y = [78475400, 71211032, 65240718, 60278626, 56248617, 52964279, 50262562, 47895008, 45697903, 43557371, 41571619, 39728069, 37958971, 36321939, 34837655, 33515346, 32374978, 31420573, 30639064, 29931140, 29367494, 28922049, 28664840, 28619295, 28780965, 29251416, 30025116, 31103866, 32537118, 34105652, 35585862, 36862700, 37771253, 38289088, 38528121, 38598365, 38712694, 38966554, 39329499, 39826320, 40383007, 41055595, 41892467, 42901216, 44130043, 45712166, 47684289, 50117033, 53057496, 56530126, 60627253, 65362730, 70768095, 76835532, 83558160, 91284441, 100084283, 109898063, 120734356, 133355510, 148190946, 165204901, 185506696, 211517640, 245842956, 287956668, 330841860, 365249870]
4828C65249870J9716944o95969j9797442l5163044m6345620m5522642l7889310
4821A99552787l0532339k4609167k0023487j6222424j3295617j0864067q885077
4814G5120609p273081n952909n014356m207880l484521k991546k536736k230357
4806D1429223k068031k025508j978539j866555j759953j547948j387590j222217
4798B7572882j038400r11125q02661p00240n63598m81490k27851m3398L11408
4789B3115527P05960Q46379N77465r5827q66022j342542j406229j488323j505942
4780A8540446j481538j252057j098533r77465q65885p31292o66162o37057n69224
4771A0261233n17386m63684l82616k76904k46035k11062j74568k14777k09794
$$ y = [365249870, 384966814, 384270845, 364473403, 329310359, 282964739, 237442097, 199552787, 169020448, 144411281, 124387794, 108165370, 94869753, 84005686, 75120609, 67847528, 61894619, 56880263, 52672383, 49187862, 46196316, 43659580, 41429223, 39361192, 37335684, 35357145, 33490590, 31730637, 30182689, 28795099, 27572882, 26534482, 25623357, 24820696, 24120456, 23556858, 23075368, 22847517, 22804119, 23115527, 23821487, 24667866, 25245331, 25149504, 24283482, 22940940, 21534711, 20046388, 18540446, 17058908, 15806851, 14708318, 13730853, 12864968, 12133676, 11467514, 10830457, 10261233, 9743847, 9280163, 8897547, 8620643, 8374608, 8163546, 7988978, 7774201, 7564407]
4762G564407j38742j67071k02479j48538j93707j39843j04878j04809r0737j13579
4752F160024p4522l3698q2378p8678m1374k1694j10289r9181o2500j15857p0164
4741E369689n3616j62531j73827j66397j63166j52466j08423r6512o2224j24119
4731D106408o1232m7500j01220p5203j02201o5712r7074m9326m7298j18479j24166
4720C216997j11245q1622p3748p9425m2093n9230j9056n299k5016m8879l5877
4709B635507o6667p5341o8285m1392n9204q5230o1802m2315m4252j599j589L2779
4697B120610L4284N8747J9617k1559L0719m0370m5841q6378j10260n8265o5206
4686A836098m1223l2180j7805o055K232l2102J762j507M264k3051m3983j0899
$$ y = [7564407, 7425665, 7258594, 7056115, 6907577, 6713870, 6574027, 6469149, 6364340, 6273603, 6160024, 6085502, 6051804, 5969426, 5890748, 5849374, 5827680, 5717391, 5618210, 5555710, 5439853, 5369689, 5316073, 5153542, 4979715, 4813318, 4650152, 4497686, 4389263, 4292751, 4230527, 4106408, 4045176, 3997676, 3896456, 3821253, 3719052, 3653340, 3556266, 3506940, 3459642, 3341163, 3216997, 3105752, 3024130, 2950382, 2870957, 2828864, 2769634, 2750578, 2745279, 2720263, 2671384, 2635507, 2568840, 2493499, 2425214, 2383822, 2324618, 2239388, 2177586, 2135271, 2091019, 2089420, 2087831, 2120610, 2154894, 2213641, 2233258, 2211699, 2242418, 2202048, 2156207, 2069829, 1959569, 1901304, 1836098, 1794875, 1762695, 1744890, 1738835, 1741067, 1708965, 1710727, 1709220, 1713484, 1690433, 1646450, 1635551]
4674A635551m7526n824k7418m7590n1684k9871Q375o099k9524j5760j1328j7390
4662A353912j6534R718N720q642M0390k043l2078j382l6906j1011k9374l3441
4650A238329o598l3556j64k0874j1338o71J5663l9005Q57K5523k4814l3062k4061
4637A086229m6307L1030j6500m950L5033L662r72J772J1742J1376J0259j4737
4625A107637k714O549J7398N684m272k6619m00M1583r169J2686K7694K0203J6816
4612A213076m048N458p652Q767L4231K3683J7579L0014Q8868L0580J11724J47753
4600A700033J45038K19585K13596K26993K62774J70823n427j81595k84380k88163
4590B179277k54011k10591j99275j65486j14135o4067o3595l9584n1837l2516
$$ y = [1635551, 1588025, 1582201, 1554783, 1507193, 1455509, 1425638, 1434013, 1427914, 1398390, 1382630, 1371302, 1353912, 1337378, 1347096, 1352816, 1344174, 1384564, 1382521, 1350443, 1349061, 1312155, 1301144, 1271770, 1238329, 1231731, 1198175, 1198011, 1177137, 1165799, 1165128, 1180791, 1141786, 1142643, 1168166, 1143352, 1110290, 1086229, 1039922, 1070952, 1054452, 1049502, 1084535, 1088197, 1087225, 1088997, 1100739, 1112115, 1122374, 1107637, 1104923, 1111472, 1128870, 1134554, 1130282, 1103663, 1103263, 1144846, 1135677, 1148363, 1176057, 1196260, 1213076, 1209028, 1214486, 1206834, 1215601, 1249832, 1273515, 1291094, 1321108, 1409976, 1440556, 1552280, 1700033, 1845071, 2064656, 2278252, 2505245, 2768019, 2938842, 2933415, 2751820, 2467440, 2179277, 1925266, 1714675, 1515400, 1349914, 1235779, 1171712, 1108117, 1068533, 1016696, 984180]
4580I84180j1866J1799j2814L121P673j208j6699k4971j2638k1339j8366N52k3583
4567H63841o4352j156j0650k7013j7376l2100L7462J9494l5665L4580J5852Q240
4555G91157K2543k3615N7929M9313L8122j5650K0995L4270j2865m7319L5125L5178
4543I85183l537o501N9396K540L4708J450K8635M3288M2664M4778K1373J2729
4531A266706M8060L7111K5191M2808M3372R6084R1077P5454R1422J09688J10770
4520B037743J00364J50618J67456J77092K27209L05251L13414K04641J22169J3022
4510C818979p6477j48391j77243j27260j04582k9392r549M0930Q5944J40066J49549
4499C562574J36329J88281K17656K12963J83467K37144J96672K54811J63404J44529
$$ y = [984180, 972314, 984113, 971299, 974420, 982093, 980885, 964186, 939215, 926577, 905238, 886872, 887424, 863841, 799489, 798333, 787683, 760670, 743294, 711194, 748656, 768150, 732485, 767065, 782917, 791157, 813700, 790085, 848014, 897327, 935449, 919799, 940794, 975064, 962199, 914880, 950005, 985183, 981646, 975145, 1034541, 1037081, 1071789, 1073239, 1101874, 1145162, 1187826, 1232604, 1253977, 1266706, 1314766, 1351877, 1377068, 1419876, 1463248, 1559332, 1650409, 1725863, 1817285, 1926973, 2037743, 2138107, 2288725, 2456181, 2633273, 2860482, 3165733, 3479147, 3683788, 3805957, 3818979, 3742502, 3594111, 3416868, 3289608, 3185026, 3155634, 3146085, 3187015, 3272959, 3413025, 3562574, 3698903, 3887184, 4104840, 4317803, 4501270, 4738414, 4935086, 5189897, 5353301, 5497830]
4489E497830J15888L7286j3573j02080j70510j62426j82442k57445l14261k60306
4479D187961k63064k41276k62607k50903k04307j42189j47035j52761j53278j71676
4469B198865j51459j37107j20394p9100j05617r3089o1044o3451k0809m0514n6078
4458A270203m1945l8886l6872n4148l5755p0504l6346n5336j3436l2070j3213
4447H41692j9701J0386J2142k0821j2623k7935n5611j9820o654p435k108o1460
4435F30052j0700K4068j2650k5659q963K3213j637k5186k9777j5806K356J9081
4423E68392m0036O882N984j3735m403l2678q842r212k903j2280j1016J6532L7227
4410D99912l792l963m4423K1327k4372p48N081n403k1791M2058k848m1737k4576
$$ y = [5497830, 5613718, 5651004, 5637431, 5535351, 5364841, 5202415, 5019973, 4762528, 4448267, 4187961, 3924897, 3683621, 3421014, 3170111, 2965804, 2823615, 2676580, 2523819, 2370541, 2198865, 2047406, 1910299, 1789905, 1710805, 1605188, 1512099, 1451055, 1387604, 1366795, 1326281, 1270203, 1228258, 1189372, 1152500, 1098352, 1062597, 992093, 955747, 900411, 886975, 854905, 841692, 821991, 832377, 844519, 823698, 811075, 783140, 727529, 707709, 701055, 693620, 691512, 630052, 619352, 643420, 630770, 605111, 596148, 619361, 617724, 592538, 562761, 546955, 549311, 568392, 528356, 535238, 541222, 527487, 523084, 490406, 481564, 472352, 469449, 457169, 446153, 462685, 499912, 496120, 492157, 447734, 469061, 444689, 443941, 449022, 443619, 421828, 463886, 461038, 419301, 394725]
4397C94725L0037P254J6180Q820P585K1462p585k5209j1136J6446j7898p239R434
4384D42876j9735p327j338j3724L358M6219k2522j9678m3541l6044L4752K2575
4372C85871q05j6418M59L114r150Q834J3237l7494J060J1088j7554J79J4017j7909
4358C38529J7072n0060k7732J6181p392k3770N691L1258j3015j1039J3966k50
4346B89439m135J6805J5548k727o445M808j9255k2359p864j4850J1179R579Q08
4333B70531k2026R898L3085k9770l7464P476L3775j6844P369Q48k9594k1M1936
4320B69199l2104J7231K8356m402K0369K7939k2291r803o43J5955M416k3007J7765
4307C08980l0234l2901l511M7463r96l5076J4289n283o140j0178q524L684l2998
$$ y = [394725, 424762, 432016, 448196, 457016, 464601, 486063, 478478, 453269, 442133, 458579, 440681, 433442, 442876, 423141, 415814, 414476, 400752, 404110, 450329, 427807, 408129, 364588, 328544, 363296, 385871, 385066, 368648, 369107, 372221, 363071, 371905, 385142, 347648, 348708, 359796, 342242, 342421, 356438, 338529, 355601, 305541, 277809, 293990, 286598, 262828, 268519, 299777, 286762, 275723, 289689, 289439, 285304, 302109, 317657, 314930, 308485, 313293, 294038, 271679, 263815, 248965, 260144, 269723, 270531, 248505, 258403, 291488, 261718, 224254, 231730, 265505, 248661, 256030, 256878, 227284, 227263, 269199, 237095, 254326, 282682, 278280, 298649, 326588, 304297, 294494, 293851, 309806, 314222, 291215, 308980, 278746, 245845, 242334, 289797, 288801, 253725, 268014, 262731, 256591, 246413, 237889, 241573, 208575]
4294B08575o688J932L2703n031K533k1757J3673k291j3688M0870L23l289O24l5951
4280B12538m958k248K3434P793j8813P065L0186J3055j5076k678M1227M7528j4801
4267C24252j4654k8219k4265j8197Q482J4020l03n4976P556J9140P501q520k6854
4254B04963L0426k0339J73l343L931k3856j1411n893J152P352j4306l362j725
4241A63762K8820j3095j8154J7202j0241j8547k4498K4120N264n9597P518J1743
4229A14297L298M0441J9217M271k9987j6405p0J1854j7298K4344L244M191J3972
4216A75369m2425l2727K924M3340P901j3379l5744k8989k329L1918R765M0165
4204A55789j3112j1568N317k5304k3018J6830J4500j21J2164K0152J6972O860
$$ y = [208575, 201887, 203819, 236522, 231491, 234024, 212267, 225940, 223649, 209961, 250831, 251154, 247865, 248489, 212538, 207580, 205332, 228766, 236559, 217746, 224811, 254997, 268052, 252976, 250298, 291525, 339053, 324252, 309598, 281379, 257114, 238917, 247399, 261419, 261116, 206140, 213696, 232836, 240337, 231817, 204963, 235389, 215050, 215223, 211880, 215811, 191955, 180544, 174651, 175803, 183155, 168849, 165487, 163762, 192582, 179487, 161333, 178535, 168294, 149747, 125249, 149369, 154633, 95036, 102554, 114297, 117595, 158036, 177253, 181524, 151537, 135132, 135062, 146916, 129618, 153962, 157206, 161397, 175369, 132944, 100217, 103141, 146481, 154382, 141003, 105259, 76270, 73941, 105859, 115624, 155789, 142677, 131109, 136426, 111122, 88104, 104934, 119434, 119313, 131477, 151629, 168601, 175461]
4192A75461J3158k0455k3264J7099J6680L3292K3438l8133m4340k4496k1609J3606
4180A20437K1666J1558l156J850j5564j544k8334j3962K5398p001L3539j615m468
4167A38804k8771j3985L7020K8062j6042m8033j6454J8458L7902p259L812j3709
4155A19805P937j0856o351j3920J3529M3948J258J3708l0364r671n604j1712j7682
4142I4025N616L2973j7370l584N243p94l744J0940m944K3150p969j9790L979k3346
4128I4385M9998j6531l954K9188K7674l2646J2224j1344j8849P781k354o267J1678
4115A40983J4942k17M9818q987K7839L0226l125J6937K7988L5087J2568k0086
4103C23973k4409J0462q360l976m8528m931j3231l006r467r552P681j7028n7822
$$ y = [175461, 188619, 168164, 144900, 161999, 178679, 211971, 235409, 197276, 152936, 128440, 106831, 120437, 142103, 153661, 150505, 152355, 136791, 135247, 106913, 92951, 118349, 111348, 144887, 143272, 138804, 110033, 96048, 133068, 161130, 145088, 97055, 80601, 99059, 136961, 129702, 133514, 119805, 127742, 116886, 110535, 96615, 110144, 154092, 155350, 169058, 138694, 129023, 123419, 111707, 94025, 99641, 132614, 115244, 111660, 116903, 116109, 112365, 123305, 118361, 141511, 133542, 113752, 117731, 94385, 144383, 127852, 123898, 153086, 180760, 148114, 160338, 148994, 130145, 137926, 135572, 129305, 140983, 155925, 155708, 205526, 196539, 224378, 254604, 251479, 268416, 296404, 331491, 344059, 323973, 299564, 310026, 301666, 297690, 249162, 244231, 231000, 227994, 218527, 208975, 216656, 199628, 141806]
4090A41806j550J1358r771o328k0121j7506M9728K5613m6358M824r469j1973m0641
4077F9612o541K9822M4999K7539O637l7205r660j1359J5215j9293J4569R218m7423
4064H6130K2508R358m8750L4555j1024j3142J0219R768j9115M064L3393nj2268
4051A05691O168J598j6160P822k3049J1649N2936L917j4445j5619n65j3609M2077
4038A48411k549j9259j104j0213K8050p12J372j6997j4691k042j1592K278J0004
4025A10956j66J2737K9747j4553k5479J5383j072j0037M410K4832j8022j0866
4013A17870N711J5229j006K0224p348k6176J4495n1435P552K4559M891K6693k0409
4000A30850L110P372m5662N520L2713N160K3068J834l4353q437J7993l3492K9188
$$ y = [141806, 140256, 151614, 141843, 135515, 115394, 97888, 147616, 173229, 126871, 131695, 122226, 110253, 69612, 63071, 92893, 137892, 165431, 172068, 134863, 125203, 113844, 129059, 109766, 124335, 133553, 86130, 108638, 117996, 69246, 103801, 92777, 79635, 89854, 99622, 80507, 84571, 117964, 117959, 105691, 111859, 113457, 97297, 105119, 82070, 93719, 146655, 150572, 136127, 120508, 119943, 106334, 148411, 145862, 126603, 125499, 115286, 143336, 142624, 143996, 126999, 112308, 110266, 98674, 100952, 110956, 110790, 123527, 153274, 138721, 113242, 128625, 127553, 117516, 121926, 146758, 128736, 117870, 123581, 138810, 137804, 158028, 150680, 124504, 138999, 87564, 95116, 119675, 124566, 151259, 130850, 133960, 141332, 95670, 101190, 133903, 139063, 162131, 163965, 129612, 121175, 139168, 105676, 134864]
3987A34864k962k0669j2042M687j5865o460J8779J6781r994J6204J2400j361L20
3974A34682j5644k3984J7164J5642k3377J3247j0817l825K8781k7664l314K6611
3962A27502K6255J4535j9823p885k8466K686L593j4046j141p668k728J8920k1340
3949I0394L771J839r016P199j5342j2227O195j5506R615J005L0452M1361k4363
3936A15377L4285j5934j2522k7147K6582K1365l1502j978j6963o746J5580j3602
3924H6795p158K3772O375m0301M605J2982j3821K4243n975K3790k5315j0537J1426
3911I0881L3705k2032k9289q042M6004l1338k7070K8130j0364j5060K6882P434
3899H9841R742L3623l1487k1750m416j201K5785J2608o205P05j1378j3137M665
$$ y = [134864, 131902, 111233, 99191, 103878, 88013, 81553, 100332, 117113, 107119, 123323, 135723, 134362, 134682, 119038, 95054, 112218, 127860, 104483, 117730, 106913, 103088, 131869, 104205, 100891, 127502, 153757, 168292, 148469, 140584, 112118, 114804, 118397, 104351, 103210, 95542, 92814, 111734, 90394, 94165, 96004, 86988, 94187, 78845, 66618, 72813, 57307, 66922, 67927, 98379, 139740, 115377, 149662, 133728, 121206, 94059, 120641, 142006, 110504, 108526, 91563, 84817, 100397, 86795, 79637, 103409, 109784, 69483, 74088, 87070, 73249, 97492, 91517, 115307, 89992, 79455, 90881, 124586, 102554, 73265, 65223, 111227, 79889, 52819, 80949, 70585, 55525, 82407, 89841, 99583, 133206, 101719, 79969, 75553, 74352, 100137, 112745, 106540, 107245, 95867, 82730, 87395]
3886H7395J5372J2651K5374l2968K6433k3854l7980J1335o677L1830j797J3524
3874A20638J1120M36m950j4270k5874k2566L007K799L1305k3727J5042K1917k580
3861A12297O67K4085k9147N90l6988k9246J8309O878K011Q511J4659k8423L2958
3848I7161R194K1625q776k2751j5232K8188R447O534J4856j9379l744K183J8114
3835A37420k4908J1107p341l0492J1194J4148j960k0461M514L449l917Kp927J10
3821H4938J9899L6852n707o96L0118k181j6606j71j1313q717j0858o080J5179
3808A24657P866K1723j3556l2169k733K3860M1650J8862n7981R589m330r846K8799
3795A56391l27m4798O623J2082J1023m579J8168K6266j5088J8268n112J0030j3324
$$ y = [87395, 102767, 115418, 140792, 107824, 134257, 110403, 72423, 83758, 77081, 108911, 107114, 120638, 131758, 132194, 127244, 112974, 87100, 64534, 67541, 70340, 101645, 77918, 92960, 114877, 112297, 112964, 137049, 107902, 108492, 71504, 42258, 60567, 67445, 69456, 77967, 92626, 64203, 97161, 106355, 127980, 119204, 96453, 81221, 109409, 118856, 125390, 140246, 120867, 117123, 119306, 137420, 112512, 123619, 116278, 85786, 96980, 111128, 109168, 88707, 93221, 96670, 92753, 92755, 84828, 84938, 104837, 141689, 135982, 135286, 165404, 163223, 146617, 146446, 135133, 126416, 115558, 109478, 124657, 132523, 154246, 140690, 108521, 105788, 129648, 171298, 190160, 132179, 141768, 137438, 127592, 156391, 156064, 111266, 117889, 129971, 140994, 136415, 154583, 180849, 165761, 184029, 178917, 188947, 175623]
3782A75623j6629o712K0923K5971R211R224o3127M9755J6044k0405L2254j8017
3770B14115q969k841J0250o223m198N78O70J4702J3559j4017l5888J5763k699
3757A94802K4600j6877r66N8423M424l7043K0827j852k2806J7959J7248l089L358
3744B59008n614j1809L9743K260L8101k1806Q902K3493n5121n156J1336p812l2033
3731B43492J016J9207k5094M3221J108j013Q981K3532k0254R426K01J2250M4421
3718C60494K8710J0298M647L4696L0319r333j2770j3937o650j3671L1989J1666
3706D56458k4021j0671K4177k6220k4168M745R400j7980Q272M524J3963o797M7824
3693D59506K3110J4523l946j1721K3897K771K0928J0243P0200O374j8745r936
$$ y = [175623, 158994, 152282, 173205, 199176, 208387, 217611, 154484, 204239, 220283, 199878, 232132, 214115, 205146, 202305, 212555, 206332, 202134, 202712, 203382, 218084, 231643, 217626, 181738, 197501, 194802, 219402, 202525, 201559, 259982, 264406, 227363, 248190, 246338, 223532, 241491, 258739, 255650, 259008, 253394, 241585, 281328, 283588, 321689, 299883, 308785, 332278, 277157, 272001, 283337, 275525, 243492, 244508, 263715, 238621, 281842, 282950, 281937, 290918, 314450, 294196, 303622, 303823, 316073, 360494, 389204, 399502, 404149, 438845, 469164, 459831, 447061, 433124, 426474, 412803, 444792, 456458, 432437, 421766, 445943, 419723, 395555, 400300, 409700, 391720, 399992, 404516, 418479, 411682, 459506, 482616, 497139, 493193, 481472, 505369, 508140, 529068, 539311, 609511, 615885, 597140, 587204]
3681E87204N5470j3181l6985K151k013N359N1605K6729j5652O658l6251p802K4750
3668F48042l6841n8907j363J6992j0580K1047K8350J3556K1j0856m0555K0952
3656E89858L6462J1687K2371M0239n066M329J3072J4323J8463O413m5423J607
3644G08335j4960p736k5963o257J5420j6693k0378j4546J2029p141Q653k7409
3632F03354j6639l1296J8917K5224l7822m0982N7200Q079J880J8078J3281n071
3620F14203j7513M2772l6997m9408k1538O2909J7536l2021m5773j1158j9373K4410
3608E28049j1667K8157K888l6947J467o687K8028J2199k3476l7076j7719k1446
3596D45770k4536N668k7888K03K62j7496l1633J6667L5758m4163J9910K3406L6995
$$ y = [587204, 642674, 629493, 592508, 594659, 592646, 598005, 649610, 676339, 660687, 667345, 631094, 623292, 648042, 611201, 552294, 550931, 567923, 557343, 578390, 606740, 620296, 620317, 609461, 568906, 589858, 626320, 638007, 660378, 700617, 695551, 699880, 712952, 727275, 745738, 752151, 706728, 708335, 693375, 685639, 659676, 653419, 668839, 652146, 631768, 617222, 629251, 622110, 630763, 603354, 586715, 555419, 574336, 599560, 561738, 520756, 577956, 586035, 587915, 605993, 619274, 614203, 596690, 639462, 602465, 553057, 531519, 594428, 611964, 579943, 534170, 523012, 503639, 528049, 516382, 544539, 547427, 510480, 511947, 505260, 533288, 545487, 522011, 484935, 467216, 445770, 421234, 426902, 399014, 399217, 399479, 381983, 350350, 367017, 402775, 358612, 378522, 401928, 438923]
3583D38923j0968k0071K7879j722k8350n632j0981j4389k6107j4261p16J7100
3571C50705M7685m2436m1033M1098J7387k7031k5634M395k3327k1222L9704J2032
3559C32323m3094k8670j044K6199K549q424m288k9j6591j764o822J0517K344o969
3545B56237M538O721L6891k9095l1154J6360L3038J3543j3129q048J2699m6247
3533B52354k8918N8448M3635o913J0020J1531r927J5640N935K563P949J7242k229
3520C77330L1482k7000m995J0744j123K8k2885J588m587j3465O656p489k1049
3507C25235j5312J2744L2069L1782j7277M1393J828k1653J5222J3655j1376K4592
3495D32902k38N3243N686K5611n19l304N5642P001J2642k9754m2620n5512K3544
$$ y = [438923, 427955, 407884, 435763, 434041, 405691, 400059, 389078, 374689, 348582, 334321, 333605, 350705, 398390, 355954, 314921, 356019, 373406, 346375, 320741, 325136, 301809, 280587, 320291, 332323, 289229, 260559, 259515, 285714, 288263, 279839, 275551, 275522, 258931, 257167, 250345, 260862, 263206, 256237, 260775, 267496, 304387, 275292, 244138, 260498, 293536, 307079, 293950, 285902, 298601, 252354, 223436, 281884, 325519, 318606, 328626, 340157, 330230, 345870, 351805, 354368, 362317, 379559, 377330, 408812, 381812, 376817, 387561, 386438, 386466, 363581, 365169, 360582, 347117, 353773, 346284, 325235, 309923, 322667, 354736, 386518, 369241, 410634, 412462, 390809, 406031, 419686, 408310, 432902, 432664, 485907, 491593, 517204, 516685, 513381, 569023, 576024, 588666, 558912, 516292, 460780, 484324]
3482D84324K8163j9984j6546Q155N4798j5432n049K735l3281p045K5572L8963
3470E45373N530J2568K801K6180J1874J0344O1519M2929M928L3748J9204L1035
3458H08033R892O364O651j4180k3303j1499p403L6133j2358l9587q801p452l9750
3445G02740R492K993k901k3189j9700K0143L5936K9661j1051l3957N747J1613
3433G27527O6175L2505N345J6277N95J6643O0998M5753j5638J6924M12J4090K8620
3420A016226K5619r764Q809L3674k798J4758j138p105n869K085n21J0903K1261
3407A106140P0966N7555l107l6863j0783j1264Q677l023K1257P850n354O3329
3395A265380K3826j2124L3746O0827M1431M4037N7291J01640R5309M6057P0176
$$ y = [484324, 512487, 492503, 475957, 484112, 538910, 523478, 518429, 521164, 487883, 480838, 506410, 545373, 550903, 563471, 566272, 592452, 604326, 614670, 676189, 719118, 724046, 757794, 776998, 808033, 817925, 824289, 830940, 816760, 793457, 781958, 774555, 810688, 798330, 758743, 749942, 742490, 702740, 712232, 715225, 712324, 689135, 669435, 689578, 725514, 755175, 744124, 710167, 715914, 727527, 793702, 826207, 831552, 847829, 848424, 865067, 926065, 971818, 956180, 973104, 973516, 987606, 1016226, 1041845, 1032081, 1040890, 1074564, 1071766, 1086524, 1085386, 1078281, 1072412, 1074497, 1073976, 1084879, 1106140, 1177106, 1234661, 1231554, 1194691, 1183908, 1172644, 1181321, 1178298, 1199555, 1207405, 1202051, 1265380, 1289206, 1277082, 1310828, 1371655, 1413086, 1457123, 1514414, 1616054, 1711363, 1757420, 1827596]
3384A827596N4085k3758K0718K0670m994L0603Q4174L8623P7749J02365J00803
3373B328634P7312Q0237M8728O526K3674j1619L8507Q9202Q9630J09537R3478
3362B973846J44068J73802J62011K20685K40810K66409K87745L40309M05410L54852
3352E569947M29394M52778M48696L47785J14744r9747k75154l27764l68728m00585
3342E891366m24011l59470l28918k69884k48279k28407j39664j09755o3309l3373
3332C686296k1741M6409P0712J47145J70985K34689K31119K65941L02305L98776
3322E532636M73622N71988P18858Q96466J031834R20122N18465m0m98145p47614
3312I418192p55613q20097p48203p61967o21902m74605m36168l77659k84896k93628
$$ y = [1827596, 1881681, 1857923, 1878641, 1899311, 1894317, 1924920, 2009094, 2047717, 2125466, 2227831, 2328634, 2405946, 2486183, 2534911, 2541437, 2565111, 2553492, 2591999, 2681201, 2770831, 2880368, 2973846, 3117914, 3291716, 3453727, 3674412, 3915222, 4181631, 4469376, 4809685, 5215095, 5569947, 5999341, 6452119, 6900815, 7248600, 7363344, 7263597, 6988443, 6660679, 6291951, 5891366, 5467355, 5107885, 4778967, 4509083, 4260804, 4032397, 3892733, 3782978, 3719669, 3686296, 3664555, 3710964, 3781676, 3928821, 4099806, 4334495, 4565614, 4831555, 5133860, 5532636, 6006258, 6578246, 7297104, 8193570, 9225404, 10145526, 10663991, 10663951, 10165806, 9418192, 8662579, 7842482, 7094279, 6332312, 5710410, 5235805, 4799637, 4421978, 4137082, 3843454]
3302C843454k55472j84204j67044j13845l4607j2061j2148k0794J1195P5304L4750
3291C164528J11560J37851J83768K75012L42261M27060L94437K73771K7652j96486
3281E141414l36930l63589l81689l69593l70835k98440l05782k04402k01326j56830
3271B151998j52123j54406j47737q5703p8574r9847q4960q9080o1720n2751o1524
3260A083573n1246k2900K1593m3827n8813j7231k7296r053j5935k4882n5044k424
3248G76515k4943M368m7427r649J4428J1827n2438k7158m5141N197N621j2239
3236E98961R524r356m848l7939j5636J4740N488q297p562m7656Q59K5248l780
3223E19746k9656o211n24q458q037k4649k8046k6522Q978K2936M5259l165P69
$$ y = [3843454, 3587982, 3403778, 3236734, 3122889, 3088282, 3076221, 3064073, 3043279, 3054474, 3129778, 3164528, 3276088, 3413939, 3597707, 3872719, 4214980, 4642040, 5036477, 5310248, 5337900, 5141414, 4804484, 4440895, 4059206, 3689613, 3318778, 3020338, 2714556, 2510154, 2308828, 2151998, 1999875, 1845469, 1697732, 1612029, 1533455, 1433608, 1348648, 1259568, 1197848, 1145097, 1083573, 1032327, 1009427, 1031020, 987193, 928380, 911149, 883853, 874800, 858865, 833983, 778939, 776515, 751572, 755940, 708513, 698864, 713292, 725119, 672681, 645523, 600382, 605579, 611200, 598961, 608485, 599129, 594281, 556342, 540706, 555446, 560934, 552637, 545075, 497419, 498278, 523526, 519746, 490090, 483879, 483355, 474897, 466860, 442211, 414165, 387643, 396621, 419557, 464816, 461651, 462420]
3210D62420k9202k227J49n4566j0424L0066k8641J5169K9948l9885l2365M016
3198C44458L4626J1499k0048k4539J2607k1834K097k1600p240J3292j2227k0106
3186B90985J1377K8901P932k1391l1121n636J5135o106r880k2357J4585k1421
3174B51003l2258K0680K5817Q078m052J3983j3397K170q403J3266n2485k828J9588
3161B41162j0673J1536k0192n974K7785j2826K6123j87L256r528K1453j7759k37
3148B53939J4773L6025j4622J9060M044q582J526j6235q506K5417K8693J017K4527
3135C61076O868k4680J3337K1051l8228L164j158Q057N349O544R148M3048L2589
3122D46165M72J7242J3819m640K5780K7335M0685M1089M407L6222M3601L9503
$$ y = [462420, 433218, 430991, 431140, 376574, 366150, 396216, 367575, 382744, 412692, 372807, 340442, 344458, 379084, 390583, 370535, 345996, 358603, 336769, 338866, 317266, 310026, 323318, 311091, 290985, 302362, 331263, 339195, 317804, 286683, 281047, 296182, 290076, 280196, 257839, 272424, 251003, 218745, 239425, 265242, 273320, 269268, 283251, 269854, 272024, 263621, 276887, 224402, 221574, 241162, 230489, 242025, 221833, 215859, 243644, 230818, 256941, 256754, 260010, 250482, 271935, 254176, 253939, 268712, 304737, 290115, 309175, 313219, 304637, 306163, 289928, 281422, 306839, 335532, 336549, 361076, 367944, 343264, 356601, 377652, 339424, 342588, 341430, 349487, 354836, 361380, 370528, 413576, 446165, 446637, 463879, 477698, 473058, 498838, 526173, 566858, 607947, 612354, 648576, 692177, 731680]
3110G31680L9941M4774P4543O7969N3587P0816R5294L9389K8254K1457l0583l0009
3098A207112l2839m7015L5988j0481p361j5083j9546n905M3456l4008l0837n8335
3086A025146j6356j8177o189J1182M5682O8105M4263k7523N2345L6852N5360P6111
3074A346801Q3208J24197J39372J04209Q2746L9000l5041n7186p0254o4948m0735
3063A651369k9407K577K4797l097j5204l8751p6360j14323j13383o1411p5557
3052A151250m2804k0371l6433l4786m6144K0208N6030J2220j5163j567J6610L3594
3040A092644K0356O2134K6355K571j5911l5623j6116K5574l5716k7739l1936J2734
3028A079327K5582O202o126J5077p4530m6999o1313n3442j834k3719p913J8485
$$ y = [731680, 771621, 816395, 890938, 958907, 1012494, 1083310, 1178604, 1217993, 1246247, 1267704, 1237121, 1207112, 1174273, 1127258, 1163246, 1152765, 1145404, 1130321, 1110775, 1104870, 1148326, 1114318, 1083481, 1025146, 1008790, 990613, 984424, 995606, 1041288, 1109393, 1153656, 1126133, 1178478, 1215330, 1270690, 1346801, 1430009, 1554206, 1693578, 1797787, 1880533, 1919533, 1884492, 1827306, 1757052, 1692104, 1651369, 1621962, 1624539, 1649336, 1646239, 1631035, 1592284, 1515924, 1401601, 1288218, 1226807, 1151250, 1108446, 1088075, 1051642, 1016856, 970712, 990920, 1046950, 1059170, 1044007, 1042440, 1059050, 1092644, 1113000, 1175134, 1201489, 1204060, 1188149, 1152526, 1136410, 1161984, 1126268, 1098529, 1066593, 1079327, 1104909, 1111111, 1104985, 1120062, 1045532, 998533, 937220, 883778, 881944, 858225, 850312, 868797]
3016H68797l480j3021j2999k669q2607m1940o452n8144l8946j126j1021k2744
3004E73648l1686L4769M791k0966l9722k269J6804J4820J1597l423k6081j464
2992E30818p490k214O196k920k5031q395M1391K4825k2343l8728l6582J251M834
2979D65612l484m2751k4498j9084O169M926m7108n979J6960P086j0699J916n0307
2966B98759L0723J4933q382m807m0108l2927L2369k1707l898j7574J2331O537
2954B66249o178l9083k4603J3360j0269j1471K358k2774K3483J4675j3296k7846
2942A64605K1489O27j0940O644o032j5217P236L7811j0247k8765L720J0549J456
2929A82936k4610j7338j5805J4514r564j4474M255m285L1107j6879j9398p982
$$ y = [868797, 865317, 852296, 839297, 836628, 754021, 712081, 705629, 647485, 608539, 607413, 596392, 573648, 541962, 576731, 581522, 560556, 520834, 518565, 535369, 550189, 561786, 558363, 532282, 530818, 523328, 521114, 527310, 524390, 499359, 490964, 532355, 557180, 534837, 496109, 459527, 460778, 465612, 462128, 419377, 394879, 375795, 381964, 386890, 339782, 333803, 350763, 357849, 347150, 349066, 298759, 329482, 344415, 336033, 331226, 291118, 258191, 290560, 268853, 264955, 247381, 259712, 266249, 260071, 220988, 196385, 209745, 199476, 188005, 190363, 167589, 191072, 205747, 192451, 164605, 186094, 186721, 175781, 182425, 176393, 161176, 168412, 206223, 195976, 167211, 170931, 181480, 182936, 158326, 140988, 125183, 139697, 130133, 115659, 119914, 115629, 146736, 129857, 110459, 102477]
2917A02477J085j3035K9736l307j1300K2142k457J5465P542k0909j6797m6529
2905F4113J0004J599R832K7168J4421K0271k3641j4892J3160k3777J9336J4052
2893A31646l3271K1298Q195m0763k8327J5775L1673l7563O104J7977Q73j6200
2881G7417j9160J1200j9945p789K1342J5933J7122o827l330j0527j8834r175M6656
2868I4083P848m6419j799m156L2957K48K8k5360r115k860J8070l102l177J4984
2854G2230o567m5098M3686j4381l565K9754l1527J13J6051k0274l6480K6798L4956
2841F5696L4046k4377l419K2460k373k3840J4868j7363q300L5933J8765l9147
2829G2949k0543K997m994l9517K9283K8803j497p588j7026j3992k565m5L5180
$$ y = [102477, 103562, 90527, 120263, 116956, 105656, 127798, 125341, 140806, 148348, 127439, 110642, 64113, 74117, 75716, 85548, 112716, 127137, 147408, 123767, 108875, 122035, 98258, 117594, 131646, 98375, 119673, 127868, 87105, 58778, 74553, 106226, 68663, 74767, 92744, 93617, 77417, 58257, 69457, 49512, 41723, 63065, 78998, 96120, 89293, 85963, 75436, 56602, 47427, 94083, 101931, 55512, 53713, 49557, 82514, 82762, 82790, 57430, 48315, 45455, 63525, 60423, 57246, 72230, 65663, 20565, 64251, 49870, 46305, 76059, 44532, 44645, 60696, 40422, 3942, 30740, 65696, 99742, 75365, 71946, 94406, 92033, 68193, 83061, 65698, 57398, 93331, 112096, 72949, 52406, 55403, 50409, 10892, 40175, 68978, 67481, 59893, 42867, 28875, 26310, 26265, 61445]
2816F1445L8352l2480p700k4369J4679j3312k3169L3855j2375J6585J1687J748
2804F4946j6737m1867j090j5678J1942J0690J3283m497J3722M53L8076L42m9250
2791B4335j4027K0532q318Q253o448j1898m1468k249N4542n693K6593K8068j247
2778G0975l9028j7878j5175k3632M6977K3442R011o906j8105M6q528K083j8090
2765E192K0346J8127K244P560q314j9598O688j4352n763J996J5170k5943J6739
2752B0092M8938k5739j7449k409l135m120k6957K4202K4223l8856L1811K0255
2740E0856l0326p774J7111q628m878N551j8160J4384p55J6310j4011N700K2064
2727D7444k7849N182l4164p277K2426K185p638j916n271L305K6113j60k1715Q29
$$ y = [61445, 99797, 67317, 59617, 35248, 49927, 36615, 13446, 47301, 34926, 51511, 63198, 64946, 48209, 6342, 5252, -10426, 1516, 12206, 25489, 20992, 34714, 35167, 73243, 73585, 24335, 10308, 30840, 22522, 30775, 24327, 12429, -29039, -31288, 23254, 17561, 44154, 72222, 70975, 31947, 14069, -1106, -24738, 22239, 45681, 54692, 47786, 29681, 29727, 21199, 23282, 5192, 25538, 43665, 45909, 53469, 45155, 25557, 32245, 17893, 12130, 14126, 29296, 3353, 20092, 69030, 43291, 25842, 23433, 20298, 16178, -10779, 13423, 37646, -1210, 30601, 50856, 20530, 12756, 29867, 21239, 16361, 21912, 3752, 18136, 17381, 33691, 19680, 25380, 47444, 19595, 24777, -9387, -16664, 5762, 7947, 309, -1607, -6878, -3573, 22540, 22380, 665, 1494]
2713A494M2656M875k7716l8482K1587J8411n157o786K9158j6184k6081J8374k5703
2700i554j0959J0785K5424L601l856j6648P718K5272k2106Q27J5972K0367p612
2687C9231o890j232l3235o953N445L3308j5842K541R712k3992k237o78k4065J2139
2673a2748K6357n397J4431j1438J2721j1178l0566K172J7921M127J2738J6931
2661C6071K4590j3215P092m2417J3466K3733j6860K5400k2696k158P54j0638j0409
2648A2713j2237j5968K6654J6787l9594k8929M4519J634J5884K4139k3778m1685
2636a9861K5918J0148L1886K692j4350j5757J813K6108l6007K860O927J0249k5082
2623G544J1554m545k3055j4778K9038J1316Q026J5427k8694k0422K6223K1757
$$ y = [1494, 44150, 49025, 21309, -17173, 4414, 22825, 17668, 10882, 40040, 23856, -2225, 16149, -9554, -20513, -9728, 15696, 19297, 15441, -1207, 6511, 31783, 9677, 10504, 26476, 46843, 39231, 32341, 31109, -2126, -9079, -3634, 29674, 13832, 16373, 26085, 2093, -144, -822, -24887, -12748, 13609, 8212, 22643, 11205, 23926, 12748, -17818, -15646, 2275, 6402, 19140, 36071, 60661, 47446, 54538, 12121, 25587, 49320, 32460, 57860, 35164, 33006, 33760, 23122, 12713, 476, -15492, 11162, 27949, -11645, -40574, 3945, 5579, 21463, 45602, 21824, -19861, 6057, 16205, 48091, 50783, 36433, 20676, 22489, 48597, 12590, 15450, 22377, 32626, 7544, 19098, 14553, -8502, -23280, 5758, 17074, 25100, 40527, 11833, -8589, 17634, 39391]
2611C9391n009k2967j104j0243j7605K4564n373J785j0626J4155j0287L1110k6680
2598A111j5026K3400j9548J7178K5204r937J1200k4776o069J7776l9862Q087j6611
2585b7873J0180J8627j7422Q196J7994l2500J2065K3556o283J4357K8631R10m1098
2572I340K3988j3520j7722J6740L2537j6399j787J0047L554O285K1497j8061q61
2559E5638k3532j8946J1450m752K7382k2673l1433J7964R903l0233L0015J2548
2547C3331p144n628k5588L0924J5099k9429k1739O86M3488n944j892K9063J5347
2534G0574k1984o5142j4027K5603K9189j6060k2856J3146o78k4935L0497j846
2522A481M0270l7335o307J2422k3399k9400P178L5051k7653K2616L5238k7336
$$ y = [39391, 34382, 11415, 10311, 68, -17537, 7027, 1654, 3439, -7187, 6968, -3319, 27791, 1111, -13915, 9485, -10063, 7115, 32319, 22382, 33582, 8806, 2737, 20513, -19349, -11262, -27873, -17693, 934, -16488, -8292, 9702, -22798, -10733, 12823, 6540, 20897, 49528, 50438, 9340, 33328, 19808, 2086, 18826, 51363, 34964, 33177, 43224, 46778, 53063, 74560, 56499, 55638, 32106, 13160, 24610, 19858, 47240, 24567, -6866, 11098, 21001, -9232, 20783, 33331, 26187, 20559, -5029, 25895, 40994, 11565, -10174, -9488, 34000, 28056, 26164, 55227, 70574, 48590, -16552, -30579, -4976, 24213, 8153, -14703, -1557, -2235, -27170, 3327, 1481, 41751, 4416, -1891, 10531, -12868, -42268, -35090, -39, -27692, -5076, 30162, 2826]
2510B826m656K2156k03j4249j8355K0733m233j5056l7844L0184m609L5492k5979
2497a3793Q758K9091r675n518K7021m399q148k1744J2293J2212J8471o0908l3840
2484e0179K9021J8280k1251K3972K4317o633j7615K5170J1430J2289q242m8910
2472h351j4650J6696J3309m744O278L5143K06r583L612l7191n879J9768M5597
2459F0211l6114p5577P785P7503J8518k3703j1274l0723J8900K973j3784Q299
2447C014j1473m249K1103N983o266P693L4785j4813k5709k8980k3439L1677j7769
2434b8443K0347n996L1177J5215l1898P217K098k9830o025j298M6819k1731J0942
2421H594J0474k6277n442L9205K89M019r623J9198K1553k8788j9415K488j0187
$$ y = [2826, -1830, 20326, 20123, 5874, -12481, 8252, 4019, -11037, -48881, -18697, -23306, 12186, -13793, -5035, 24056, 14381, 8863, 35884, 31485, 23337, 1593, 13886, 26098, 44569, -16339, -50179, -21158, -2878, -24129, -157, 24160, 17527, -88, 25082, 36512, 48801, 40559, -8351, -23001, -6305, 7004, 2260, 8538, 43681, 43887, 34304, 37916, 725, -5154, 14614, 60211, 24097, -51480, -43695, 33808, 52326, 28623, 17349, -13374, 5526, 8499, -5285, 3014, -8459, -12708, 8395, 14378, 8112, 15805, 50590, 35777, 10068, -18912, -42351, -10674, -28443, -8096, -14092, 17085, 32300, 402, 7619, 9717, -20113, -26138, -27436, 19383, -2348, 8594, 19068, -7209, -12651, 26554, 26843, 30862, 21239, 40437, 61990, 33202, 13787, 16275, 6088]
2408F088M7275p032k3114J0736l2387k480q797j2083j8189q937K8191M156k8513
2395d5086L3296k0393p939L0197J5279J2844L1867o843l7674o381k742o988j8682
2382b9245L7461j8350L909k2948J6334j2899L418L0902m1639j9915M4310L3063
2370B4401R428q739j0847L489J2982j4188O19J44J1496j7927J6958K024k4051
2357E789j6964j1234K9143N199j179J7778k3301P310K5200P86J9262l9422j1238
2344G129j9942K3757R157K490k9787K0232M4396l97O802J7238m1802k5656P708
2331B1325K9747l8026j827K0493K2571j9246L630r841j6403k9123R837R017j5786
2318a3632J8660K9637J1845j2236L491l2030J3639O223K5349L267O882J0375O53
$$ y = [6088, 53363, 46331, 23217, 33953, 1566, -914, -9711, -21794, -39983, -48920, -20729, -16573, -45086, -11790, -32183, -40122, -9925, 5354, 18198, 50065, 43222, 5548, -833, -3575, -10563, -29245, 8216, -10134, -6225, -29173, -12839, -25738, -22320, 8582, -33057, -52972, -8662, 24401, 33829, 25090, 14243, 17732, 30714, 16526, 17145, 17289, 28785, 10858, 27816, 29840, 5789, -11175, -22409, 6734, 11933, 10754, 28532, 5231, 12541, 37741, 38527, 57789, 18367, 7129, -12813, 10944, 20101, 22591, -7196, 13036, 57432, 57035, 63837, 81075, 39273, 13617, 21325, 51072, 13046, 11219, 31712, 54283, 35037, 38667, 28826, 12423, -16700, -6863, 2154, -13632, 5028, 34665, 46510, 34274, 37765, 5735, 19374, 25597, 50946, 54213, 61095, 71470, 72123]
2305G2123k236j9839k7528m0980K8647K4622K42k7696J0356j1216K1070j7506
2293A0059K4979L0789j0226P51l8779L8556j900K195L228j7633L2077J2715M035
2280I0846l1210m63N989m917L6544J4596k2681j4241O306M1066J103L504O599
2267A33041J3446j791R525p147k7783K4651L0139Q218O542N9087j8981N665M3897
2254B78509J002M6208O3375N598M365j6433j8151J5963k0649K9471L4266K1725
2242D45249K7901J2902l1774L6851O2429N9243O4236K1659O7953N9939P2515J04367
2230A003470J17943R7510O9935J04233J34528J20477J56208J62036K69325L10380
2220B546045L46683M49659O46503Q73996Q25578L84579k11871q27975r05996o97959
$$ y = [72123, 69887, 50048, 22520, -18460, 10187, 34809, 35051, 7355, 17711, 6495, 27565, 10059, 35038, 65827, 55601, 56352, 17573, 56129, 54229, 56424, 59652, 42019, 74096, 86811, 90846, 59636, 59173, 65162, 60245, 96789, 111385, 88704, 74463, 80769, 121835, 122938, 126442, 133041, 146487, 144696, 154221, 147074, 119291, 143942, 174081, 182299, 188841, 247928, 228947, 234612, 278509, 279511, 325719, 389094, 394692, 399057, 382624, 364473, 380436, 359787, 389258, 423524, 445249, 473150, 486052, 454278, 491129, 553558, 612801, 677037, 698696, 766649, 826588, 899103, 1003470, 1121413, 1218923, 1288858, 1393091, 1527619, 1648096, 1804304, 1966340, 2235665, 2546045, 2892728, 3342387, 3988890, 4862886, 5688464, 6073043, 5861172, 5033197, 4127201, 3429242]
2210C429242n56985m41270l76636k70990k46450j83426j51723j14255n4400o4095
2200I69012o2554r8737m6535q1004n7863n2407j5270q7008k2024j3091l2488j4395
2188C85636m7606q507n2178j110p37k9466k0555J8743j9492j026k0689l7648q44
2175A64521J3945n145p432L4566O150n6l9001k2551m531O393l2071l5185M5278
2162A24881n131J9514k4172j5227n759O971J6912j4565j8279L1045j4334m7799
2150E4057L60J6215j1812j4548K0103o620J8002J3948j0338l2919j7954K4941
2138E3435K6603J7331l6596J7183K5911k8628N254q513L784Q243r899l9251K9721
2125F4578j2903n1927K2258j917j3061J8894Q323K6993j9430k4639r39M8199n140
$$ y = [3429242, 2872257, 2430987, 2054351, 1783361, 1536911, 1353485, 1201762, 1087507, 1033107, 969012, 906458, 807721, 761186, 680182, 622319, 569912, 554642, 467634, 445610, 432519, 400031, 385636, 338030, 329523, 277345, 276235, 275498, 246032, 225477, 244220, 224728, 223702, 203013, 165365, 164521, 178466, 173321, 165889, 200455, 206605, 206549, 167548, 144997, 140466, 146859, 114788, 79603, 124881, 119750, 139264, 115092, 99865, 94106, 101077, 117989, 103424, 85145, 116190, 101856, 54057, 54417, 70632, 58820, 44272, 64375, 57755, 75757, 89705, 79367, 46448, 28494, 53435, 80038, 97369, 60773, 77956, 103867, 75239, 80493, 71980, 75764, 84007, 74108, 34857, 64578, 51675, -252, 22006, 20089, 7028, 25922, 34245, 61238, 41808, 17169, 16230, 64429, 59289]
2112E9289P027k4883k1365R333j0925K4306j2683J2356J4231o594J5518j3795
2100E1815k5169K377l938K5776r598q018j7610j080j0951L4101j0787J5904l0199
2087A2623k969J0080J4610p266l605j517K9973K0096l0981L261j803j6920J789
2074B7371r525r87j276J1573l0520L8501r158r358L6036k3453N702Q752O23j037
2060D3244m176m483k1019O764l410J5225K463k2070K671R635N254k2139j7772
2047i813N36K9162m1045j0461M0594K6704j4453k9642J2209M0347J8449o078j4075
2034D2434l0544j2485N1047J0002r974l5815N935j7873J7774j3922Q257O325O343
2021B7504J5595j3560l2165J671M476l8090P821R875J5831J8525j0952k587j986
$$ y = [59289, 66316, 41433, 20068, 29401, 18476, 42782, 30099, 42455, 56686, 50092, 65610, 51815, 26646, 29023, 25085, 50861, 41263, 33245, 15635, 14555, 3604, 37705, 26918, 42822, 12623, 9654, 19734, 34344, 27078, 23473, 21956, 51929, 72025, 41044, 44305, 42502, 25582, 27371, 17846, 16859, 15583, 27156, -3364, 35137, 25979, 16621, 52657, 29204, 34906, 43658, 44281, 43244, 39068, 34585, 13566, 20330, 16920, 32145, 34608, 12538, 15209, 24844, 30098, 7959, -9813, -9277, 19885, -21160, -31621, 8973, 35677, 21224, -8418, 3791, 44138, 62587, 56509, 42434, 11890, -595, 50452, 60454, 50480, 14665, 20600, 2727, 20501, 6579, 14836, 21161, 27504, 43099, 29539, -2626, -955, 3521, -34569, -26748, -16873, -1042, 17483, 6531, 3944, 1958]
2008A958L11n2825k656L4726j3705P099K3226L1848k6562l0499K1670R329R541
1995A3461J7829K3928k5699o219P627j9822R469p917r982J930P702J4344K1338
1982D7989j2185j9396r54P019R063L0741o003n2429j4579j5984J6985K0597j9778
1969h914P859R112J5941k1871j2265P390j1089P587K5911O097m9325J8603P033
1956B069l619k168L4454j558j0203J0223k7091K3310K9865r5k4245r236j1191
1943A0515Q61J5491j0802k1326j7925L5195J3971Q504L428m5133O928l195K5181
1930B1693K4333l2595j6948L393k8421K3570L252Q456j4004j0417M5210j6317
1918A1205l5950L9841K0244j6696L8082j2557j1656j1085n679l4665j757J9416
$$ y = [1958, 2269, -50556, -53212, -18486, -32191, -25092, -1866, 29982, 3420, -27079, -5409, 3920, 13461, 31290, 55218, 29519, 23300, 30927, 11105, 20574, 12657, 2675, 4605, 12307, 26651, 47989, 35804, 16408, 15454, 22473, 31536, 62277, 56274, 3845, -10734, -26718, -9733, 10864, -8914, -1055, 8057, 23998, 2127, -10138, -2748, -13837, -6250, 19661, 25758, -23567, -4964, 2069, -1550, -3718, 30736, 29178, 18975, 29198, 2107, 25417, 55282, 55187, 30942, 21706, 10515, 11376, 26867, 16065, -5261, -23186, 12009, 25980, 34484, 37912, -7221, -293, -3488, 21693, 46026, 13431, -3517, -124, -28545, -4975, -1723, 6733, -7271, -17688, 27522, 11205, -24745, 15096, 35340, 18644, 56726, 44169, 32513, 21428, 15749, -18916, -20673, -1257]
1906a257J2108K0041k2356l2879K0368n316r787J6321j3027J6257l8039k0596
1894e8162K4392J2414K2431K510K5821o296q160N393k2733K9134j1094m502J6001
1881B7149q979j6743L0644Q894k7441j3287K4533l4324k1851K185K1680l1455
1869c8995L540K3630J0677k1563l404R285N553n005k8451q615p731R160J0390
1856d1529q604J532L5703L1208n664k4449k0241R910J1090K0715J0146l1932K8247
1843A6132k15K0326j8176l0392J391n636l5061J0033J8759L8606j5432Q143L134
1830A1612k0695J5525l475K3084k0943n782J3422j4516J3926j5457j9498O470
1818a6327J9597K471l0889M523K6219o944J0235l0176o097J228J354J5625J6809
$$ y = [-1257, 10851, 30892, 8536, -24343, -3975, -9291, -19078, -2757, -15784, 473, -37566, -58162, -33770, -21356, 1075, 3585, 29406, 23110, 14950, 20343, -2390, 26744, 15650, 11148, 27149, 18170, 1427, 32071, 40965, 13524, 237, 24770, -9554, -31405, -29220, -7540, -38995, -35455, -11825, -1148, -22711, -26115, -16830, -11277, -16282, -44733, -53348, -61079, -51919, -41529, -50133, -48601, -12898, 18310, 12646, -11803, -32044, -22134, -11044, 9671, 19817, -12115, 16132, 15917, 36243, 18067, -12325, -10934, -16570, -51631, -41598, -22839, 15767, 335, 8478, 11612, -9083, 6442, 2967, 26051, 5108, -674, 12748, -1768, 12158, -3299, -22797, -16327, 3270, 5741, -25148, -20625, 5594, -1350, 8885, -21291, -27388, -26160, -24806, -9181, 7628]
1805G628M655j3131K6661m050j1612m2861K3720L3999j4730k8054L7010r183k8395
1792a8343j3006j4771P051L826J8848J9322j405J379O20Q319j1804Q518L0591
1779C9145k7702P495k5484k0846Q137N826N282P668k3882j38n498J5426j0504
1766b5075K817K4043j3811J8849o234N237O980n724P875k1435J1217j2193j7637
1753b5091K8766J4712k6940m2287M7504k0919k2762M3528K710j4372l965m644
1741b3760J6590J0374O084j1953j7130J9314L1870j479k2844k1889J1807J7203
1729A4187m6988j0728J1131M102q072J9866J9442k3845L4821K8342m8887m815
1717a1444K1254j7020J4655L0124J1985k1674l8194k0404K6423q055j3820r988
$$ y = [7628, 12283, -848, 25813, 21763, 10151, -32710, -8990, 25009, 10279, -17775, 19235, 10052, -18343, -31349, -46120, -39069, -35243, -16395, 2927, 1522, 2901, 3521, 11840, 36, 8554, 39145, 11443, 18938, -6546, -27392, -19255, -13429, -8147, -479, -24361, -24499, -29997, -14571, -25075, -22258, 1785, -12026, 6823, 589, 5826, 12806, 7082, 14957, -6478, 4739, -7454, -25091, 3675, 18387, -8553, -50840, -3336, -24255, -47017, -3489, -779, -15151, -19116, -23760, -7170, 3204, 9288, -2665, -19795, -481, 31389, 29910, 7066, -14823, -3016, 14187, -32801, -43529, -32398, -28296, -36368, -16502, 2940, -20905, 13916, 42258, -6629, -11444, 9810, -7210, 7445, 37569, 49554, 27880, -10314, -30718, -4295, -12350, -26170, -36158]
1705c6158k486K5773j2450j0316J116K6162p252l6283J8194J1445o562k1634N654
1692d4797M5917k0221q633p826L8166j5069N372L4833r837j5221j7208l063K7739
1679A0152K5985n439k7171O331L3244j5953k3219Q398N219l1638j1025O662l1262
1666d9716J3683N0863K193l4430K3609m681K097p78M37k0394J7138R212j4061
1653d828m758J070K3900j0072O453p285j7784K5060J0686k0914P967J836J147
1640A2478q170K0622p474n380j0316M771L535J1038n222L0592j5769j3473l3064
1627a5832K259j2283j4586J2531J6488N004N178k1510j3563J0587M1218l265k1225
1614h999l823l661J8398k3309j9361K7752j0618M1129J0227l6446P372k4240m407
$$ y = [-36158, -38644, -12871, -25321, -35637, -34521, -8359, -15611, -51894, -33700, -22255, -28817, -50451, -44797, 1120, -19101, -27734, -35560, 2606, -12463, -7091, 27742, 17905, 2684, -14524, -17587, 10152, 36137, 30698, 3527, 9858, 43102, 27149, 3930, 12328, 17547, -14091, -25116, -18454, -49716, -36033, 14830, 17023, -17407, 6202, 1521, 3618, 2840, 3277, -17117, 21, 9233, -4828, -9586, -8516, 15384, 5312, 11765, 4480, -13304, 11756, 22442, 1528, 9495, 11331, 12478, 4308, 24930, 17456, 12076, 1760, 6531, 10066, 21104, 15882, 46474, 30705, 17232, -15832, -13573, -25856, -40442, -27911, -11423, -6419, -1241, -22751, -36314, -25727, 15491, 12226, -8999, -12822, -16483, 1915, -21394, -40755, -13003, -23621, 17508, 27735, -8711, -1339, -25579, -29986]
1601b9986J5461L0570o614n108j1703P297P655N383k5336k0401j262P422Q500
1588a8122q443J4404L3198l248J6018P313k5822j3794l9616J3193p940K9179K8676
1575B4996j1143k9685L2585J0344l5104J0089m655k2790K4009J8889j7353j7162
1563a6980m385M068J9658J7177j4327J3284N532j3156K4261j2311l1605K738q546
1550a4592M4159J504k9677k2128P834j6633M2886l434l2558N658L776M287k3471
1537c2389O967k256k7278O6859r928k3232M0787k0490Q561M487j1700K3940j4923
1524I405K8049k2010k8361l240K6832l3582P760L2632k9526M44l821r473K4173
1511g18j6349j1653K823o416K6529K9317m1725L5335j1541j4082p448K517j3343
$$ y = [-29986, -14525, 16045, 9431, 4323, -7380, -83, 7572, 12955, -12381, -32782, -34044, -26622, -18122, -26565, -12161, 21037, 17789, 33807, 41120, 15298, 1504, -38112, -24919, -32859, -3680, 24996, 13853, -15832, 16753, 27097, -8007, 2082, -2573, -25363, -1354, 17535, 182, -16980, -21365, -17297, 2361, 19538, 5211, 18495, 24027, 10871, 35132, 22821, -8784, -6046, -14592, 29567, 31071, 1394, -20734, -12900, -29533, 13353, 9919, -22639, -16981, -13205, -8918, -32389, -25422, -27678, -54956, 11903, 1975, -21257, 19530, -960, 7601, 12088, 388, 24328, 9405, 37454, 15444, -12917, -16157, 10675, -22907, -15147, 17485, -12041, -11597, -15418, -24891, -718, -17067, -28720, -25897, -32313, -5784, 23533, -18192, 17143, 5602, -8480, -15928, -13411, -26754]
1498b6754M542R537j3090J2179P278R021k2677m649q689K4266N968j802n222L74
1484i718l51j4416K4338J9049l3876J4921J3134N108m923j3102k3199Q814l0448
1471d4669K4506L735P812J6087l5194j0508K9828j8083q088J4387j5495o584L4240
1458h026J9439L3146l9991J0453j1329j2342p480j325P622j1942K2072l3160J47
1445c2716K2783J0157k1938j8428K8645j6259J6573K0155j6703n243K3821n146
$$ y = [-26754, -22212, -12675, -25765, -13586, -6308, 2713, -19964, -24613, -33302, -9036, -3068, -4870, -10092, -9718, -10069, -24485, -147, 18902, -14974, -53, 13081, 18189, 13266, 164, -23035, -14221, -44669, -20163, -16428, -8616, 7471, -27723, -38231, -8403, -26486, -34574, -20187, -35682, -42266, -8026, 11413, 44559, 4568, 15021, 3692, -8650, -16130, -17455, -9833, -21775, 297, -32863, -32716, -9933, 224, -21714, -40142, -11497, -27756, -11183, 8972, -7731, -12974, 10847, 5701]
$$ [...]
##END NTUPLES=NMR SPECTRUM
##END=
