##TITLE=1H_CG-1221-F
 200.13MHz, CDCl3,
 8 sc
 
 11.8.2025
##JCAMPDX= 6.0         $$ Bruker NMR JCAMP-DX V2.0
##DATA TYPE= NMR SPECTRUM
##DATA CLASS= NTUPLES
##ORIGIN= UXNMR, Bruker Analytische Messtechnik GmbH
##OWNER= pz
$$ XWIN-NMR		Version 3.5
$$ Mon Aug 11 14:33:34 2025 Russian Standard Time (UT+4h)  she@DPX200
##.OBSERVE FREQUENCY= 200.1313
##.OBSERVE NUCLEUS= ^1H
##.ACQUISITION MODE= SIMULTANEOUS
##.ACQUISITION SCHEME= undefined
##.AVERAGES= 8
##.DIGITISER RES= 18
##SPECTROMETER/DATA SYSTEM= spect
##.PULSE SEQUENCE= zg30
##.SOLVENT NAME= CDCl3
##.SHIFT REFERENCE= (INTERNAL, CDCl3, 0, 15.5254)
##AUDIT TRAIL= $$ (NUMBER, WHEN, WHO, WHERE, WHAT)
$$ ##TITLE= Audit trail, XWIN-NMR		Version 3.5
$$ ##JCAMPDX= 5.01
$$ ##ORIGIN= Bruker BioSpin GmbH
$$ ##OWNER= she
$$ F:/spectra/data/she/nmr/H-C/1/pdata/1/auditp.txt
$$ ##AUDIT TRAIL=  $$ (NUMBER, WHEN, WHO, WHERE, WHAT)
(   1,<2025-08-11 14:32:17.75 +0400>,<she>,<DPX200>,
      <created by zg, POWCHK disabled, PULCHK disabled
       configuration hash MD5:
       00 E9 B6 7A A2 85 ED C7 34 08 36 98 17 FE 4E 26
       data hash MD5: 16K
       FF AC F8 D8 07 59 FB A1 50 C9 30 4E BA CB AF 8C>)
(   2,<2025-08-11 14:32:19.95 +0400>,<she>,<DPX200>,
      <Start of raw data processing
       efp BC_mod = 2 LB = 0.25 FT_mod = 6 PKNL = 1 PHC0 = -1560.462 PHC1 = 11.19229 SI = 16K 
       data hash MD5: 16K
       8B 40 DF 45 A8 6A DC D6 A3 5A 7F A3 D9 BB 2F 0C>)
(   3,<2025-08-11 14:32:37.35 +0400>,<she>,<DPX200>,
      <pk PHC0 = 6.673392 PHC1 = -10.4 
       data hash MD5: 16K
       4B AA F4 97 FD B1 26 08 68 CF D6 24 F6 EE 94 33>)
(   4,<2025-08-11 14:32:42.89 +0400>,<she>,<DPX200>,
      <abs ABSG = 5 
       data hash MD5: 16K
       87 C8 67 EA EE 45 EC 95 01 8F 01 C7 B8 20 4E 5F>)
$$ ##END=
$$ 
$$ hash MD5
$$ 37 95 CF 12 C5 97 A6 FE AC EF 23 54 AA FD 12 35
##$RELAX= 
##$RELAX= 
##$RELAX= 
##$RELAX= 
##$RELAX= 
##$RELAX= 
$$ Bruker specific parameters
$$ --------------------------
##$DU= <F:/spectra>
##$EXPNO= 1
##$NAME= <H-C>
##$PROCNO= 1
##$TYPE= <nmr>
##$USER= <she>
##$AMP= (0..31)
100 100 100 100 100 100 100 100 100 100 100 100 100 100 100 100 100 100 
100 100 100 100 100 100 100 100 100 100 100 100 100 100 
##$AQSEQ= 0
##$AQ_mod= 1
##$AUNM= <au_zg>
##$AUTOPOS= <>
##$BF1= 200.13
##$BF2= 200.13
##$BF3= 200.13
##$BF4= 200.13
##$BF5= 200.13
##$BF6= 200.13
##$BF7= 200.13
##$BF8= 200.13
##$BYTORDA= 1
##$CFDGTYP= 0
##$CFRGTYP= 5
##$CHEMSTR= <none>
##$CNST= (0..31)
1 1 145 1 1 1 1 1 1 1 1 1 1 1 1 1 1 1 1 1 1 1 1 1 1 1 1 1 1 1 1 1 
##$CPDPRG= <>
##$CPDPRG1= <>
##$CPDPRG2= <>
##$CPDPRG3= <>
##$CPDPRG4= <mlev>
##$CPDPRG5= <mlev>
##$CPDPRG6= <mlev>
##$CPDPRG7= <mlev>
##$CPDPRG8= <mlev>
##$CPDPRGB= <>
##$CPDPRGT= <>
##$D= (0..31)
0 0.7 0 0 0 0 0 0 0 0 0 0.03 0 0 0 0 0 0 0 0 0 0 0 0 0 0 0 0 0 0 0 0 
##$DATE= 1754908337
##$DBL= (0..7)
120 120 120 120 120 120 120 120 
##$DBP= (0..7)
150 150 150 150 150 150 150 150 
##$DBP07= 0
##$DBPNAM0= <>
##$DBPNAM1= <>
##$DBPNAM2= <>
##$DBPNAM3= <>
##$DBPNAM4= <>
$$ [...]
##$SUBNAM3= <"">
##$SUBNAM4= <"">
##$SUBNAM5= <"">
##$SUBNAM6= <"">
##$SUBNAM7= <"">
##$SUBNAM8= <"">
##$SUBNAM9= <"">
##$SW= 18.0517328524113
##$SWIBOX= (0..15)
0 0 2 0 0 0 0 0 0 0 0 0 0 0 0 0 
##$SW_h= 3612.71676300578
##$TD= 16384
##$TD0= 1
##$TE= 0
##$TE2= 300
##$TE3= 300
##$TEG= 300
##$TL= (0..7)
0 120 120 120 120 120 120 120 
##$TP= (0..7)
150 150 150 150 150 150 150 150 
##$TP07= 0
##$TPNAME0= <>
##$TPNAME1= <>
##$TPNAME2= <>
##$TPNAME3= <>
##$TPNAME4= <>
##$TPNAME5= <>
##$TPNAME6= <>
##$TPNAME7= <>
##$TPOAL= (0..7)
0.5 0.5 0.5 0.5 0.5 0.5 0.5 0.5 
##$TPOFFS= (0..7)
0 0 0 0 0 0 0 0 
##$TUNHIN= 0
##$TUNHOUT= 0
##$TUNXOUT= 0
##$USERA1= <user>
##$USERA2= <user>
##$USERA3= <user>
##$USERA4= <user>
##$USERA5= <user>
##$V9= 5
##$VALIST= <valist>
##$VCLIST= <CCCCCCCCCCCCCCC>
##$VD= 0
##$VDLIST= <DDDDDDDDDDDDDDD>
##$VPLIST= <PPPPPPPPPPPPPPP>
##$VTLIST= <TTTTTTTTTTTTTTT>
##$WBST= 1024
##$WBSW= 4
##$XGAIN= (0..3)
0 0 0 0 
##$XL= 0
##$YL= 0
##$YMAX_a= 1006641
##$YMIN_a= -1102336
##$ZGOPTNS= <>
##$ZL1= 120
##$ZL2= 120
##$ZL3= 120
##$ZL4= 120
##$ABSF1= 15.51331
##$ABSF2= -2.538539
##$ABSG= 5
##$ABSL= 3
##$ALPHA= 0
##$AQORDER= 0
##$ASSFAC= 0
##$ASSFACI= 0
##$ASSFACX= 0
##$ASSWID= 0
##$AUNMP= <proc_1d>
##$AZFE= 0.1
##$AZFW= 0.1
##$BCFW= 0
##$BC_mod= 2
##$BYTORDP= 0
##$COROFFS= 0
##$CY= -3
##$DATMOD= 1
##$DC= 0
##$DFILT= <>
##$DTYPP= 0
##$F1P= 0
##$F2P= 0
##$FCOR= 1
##$FTSIZE= 16384
##$FT_mod= 6
##$GAMMA= 0
##$GB= 0
##$INTBC= 1
##$INTSCL= 3.241238e-09
##$ISEN= 128
##$LB= 0.25
##$LEV0= 0
##$LPBIN= 0
##$MAXI= 10000
##$MC2= 0
##$MEAN= 0
##$ME_mod= 0
##$MI= 1.114404
##$NCOEF= 0
##$NC_proc= -4
##$NLEV= 6
##$NOISF1= 3.799351
##$NOISF2= 2.8
##$NSP= 0
##$NTH_PI= 0
##$NZP= 0
##$OFFSET= 15.52543
##$PC= 1
##$PHC0= -1553.789
##$PHC1= 0.7922907
##$PH_mod= 1
##$PKNL= yes
##$PPARMOD= 0
##$PSCAL= 0
##$PSIGN= 0
##$REVERSE= no
##$SF= 200.129999255288
##$SI= 16384
##$SIGF1= 3
##$SIGF2= 2
##$SINO= 0.751879
##$SIOLD= 32768
##$SREGLST= <19F.Aceton>
##$SSB= 0
##$STSI= 16384
##$STSR= 0
##$SW_p= 3612.71676300578
##$SYMM= 0
##$S_DEV= 0
##$TDeff= 16384
##$TDoff= 0
##$TI= <>
##$TILT= no
##$TM1= 0
##$TM2= 0
##$TOPLEV= 0
##$USERP1= <user>
##$USERP2= <user>
##$USERP3= <user>
##$USERP4= <user>
##$USERP5= <user>
##$WDW= 1
##$XDIM= 16384
##$YMAX_p= 280355341
##$YMIN_p= -111864
$$ End of Bruker specific parameters
$$ ---------------------------------
##NTUPLES= NMR SPECTRUM
##VAR_NAME=  FREQUENCY,     SPECTRUM/REAL,   SPECTRUM/IMAG
##SYMBOL=    X,             R,               I
##VAR_TYPE=  INDEPENDENT,   DEPENDENT,       DEPENDENT
##VAR_FORM=  AFFN,          ASDF,            ASDF
##VAR_DIM=   16384,         16384,           16384
##UNITS=     HZ,            ARBITRARY UNITS, ARBITRARY UNITS
##FACTOR=    0.220516191357247, 1,           1
##FIRST=     3107.10423943175, 0,            0
##LAST=      -505.612523574026, 0,           0
##MIN=       -505.612523574026, -111864,     0
##MAX=       3107.10423943175, 280355341,    0
$$ Real data points
##PAGE= N=1
##DATA TABLE= (X++(R..R)), XYDATA
$$ [...]
9112G1028j4937K8792M2299o055o7314L1697M2128j2634k8613j3124K2313j8649
9100G6931O91o126j2104N2659K159l3735J8104n6680P205J3742M985N42J1174
9087G9547L5349q168m5549q147N7416l845n035l723K5346k5146l4901K4598L2128
9074A19870K09J4308j3445m0177J5802J5539q937J8071k894j6608M4383k6913
9062A19208k2692L5500J1482J7210j8307k7051j5493k9782K7092j1422K0828L2761
9050A39334n540m4084j8249N732K078L6595J9145L8901k2524j6718J9588j2245
9038A42013J1763p431n287J4686K8501j469K9917j5910p7065j2691L3633L5373
9026A76033R737l79l570j949r467J5261j615o853k224k495K1863k0672L095l642
$$ plain form
9112 71028 56091 84883 127182 121127 53813 85510 127638 115004 86391 73267 95580 76931
9100 76931 77622 71496 59392 112051 114210 80475 98579 41899 49104 62846 67831 68373 79547
9087 79547 114896 106728 61179 53032 110448 106603 101568 97845 123191 98045 63144 87742 119870
9074 119870 120079 134387 120942 80765 96567 112106 103169 121240 118346 101738 146121 119208
9062 119208 96516 132016 143498 160708 142401 115350 99857 70075 97167 85745 106573 139334
9050 139334 133794 89710 71461 77193 79271 115866 135011 173912 151388 134670 154258 142013
9038 142013 153776 146345 141058 155744 184245 182776 212693 196783 119718 107027 140660 176033
9026 176033 185770 185391 181821 179872 170405 185666 184051 177198 174974 172479 194342 173670 176765 173123
9012A73123j3698N3778K0016K3349j0827J78N1598j1771j3908L682K6339K3004
9000C24863k5609k8352L1940n0436K3214M0310j6488J1831M2091M8144L423J5929
8988D20860r06L5952j2352M7051K6538o883L4366L0580J2537M0801L398k4218
8976F07724j3079o559K123j5481o395M8294M4552j9070L1847Q857J2136L1339
8964G26288J1416j5P1441N5092M1567M5877M4821P0005L1872L5781N0663M7520
8952A232328P0472J39509R3049J74795K07047K00637K18196J72227Q0464P1749
8942B660473Q3203J19782J08126J13139J31777K10840J98773K53235K25653L66239
8932D471240M98128O55741J057259J311827J330054J304328J510356J413764J080409
$$ plain form
9012 173123 159425 213203 233219 256568 245741 245919 297517 285746 271838 275520 301859 324863
9000 324863 299254 270902 302842 252406 275620 315930 299442 311273 353364 401508 404931 420860
8988 420860 419954 455906 443554 490605 517143 510260 544626 575206 587743 628544 631942 607724
8976 607724 594645 588086 590209 574728 568333 616627 661179 642109 673956 682813 694949 726288
8964 726288 737704 737689 809130 864222 905789 951666 996487 1066492 1098364 1134145 1184808 1232328
8952 1232328 1302800 1442309 1535358 1710153 1917200 2117837 2336033 2508260 2588724 2660473
8942 2660473 2743676 2863458 2971584 3084723 3216500 3427340 3626113 3879348 4105001 4471240
8932 4471240 4969368 5625109 6682368 7994195 9324249 10628577 12138933 13552697 14633106
8923A4633106R74476n48232j765949j679208j503317j015076q77627q44035p99982
8914F574156p42001o26380n88012n03249m08028l08024k28578k38098j87982k09516
8904B534288j81777j46842j41114j25627j04254j55257p1399o8302p6235m6193
8894A417288k2040q3840r1339n7603l1283n9148J160n6196k5270n4653o3864J6969
8882H90181j9263m0309l1672J1359r999p0516l5804r210l2829j7000k6058l4684
8870E74196N630J87m134Q882k4093l4291O538n1606p209k8466k4883o136M1802
8857D56417j679n7397j5538o270M4256j1654k0177J59l6057K1100J793J760j6587
8844C60126m4824j2059j2169j755K3966R575p525Q325l6447L09m414k898j4900
$$ plain form
8923 14633106 15607582 15059350 13293401 11614193 10110876 9095800 8218173 7374138 6574156
8914 6574156 5832155 5205775 4617763 4114514 3706486 3398462 3169884 2931786 2743804 2534288
8904 2534288 2352511 2205669 2064555 1938928 1834674 1679417 1608018 1539716 1463481 1417288
8894 1417288 1395248 1311408 1220069 1162466 1131183 1072035 1073195 1016999 991729 937076 873212 890181
8882 890181 870918 830609 798937 810296 800297 729781 693977 684767 651938 634938 608880 574196
8870 574196 579826 580013 575879 584761 560668 526377 532915 481309 474100 445634 420751 414615 456417
8857 456417 454738 397341 381803 375533 419789 408135 387958 388117 352060 373160 374953 376713 360126
8844 360126 315302 303243 291074 289319 313285 322860 315335 323660 287213 287522 283108 280210 265310
8831B65310R571l71j3063m706m4598N629L5489m2084o495Q778L7357P948o987
8818B51778l6077J7780J8112r042p4181L5217j8390J7214L860J3237r166m8928
8806A61414k0234L0832n141k8978O4216k4966K1383J0628n5247j1488K5272Q476
8794A76167L8219R080L0810o2929k3834J1881k1651r573l479l0217K0031M7896
8782A82401K9168l5702j0490l6061J2236Q810j6319j5717j006P047r743J9433
8770A34057k0104Q488j4332j4341k2135o254k16M5444L473L1847L4610P785m3370
8757A44952J1485l087J019J7082J83j4547K2664K6641J0234p474l3231J8020p006
8744A86935k5146r799j5361j2984K4842m507J1543k7402l0189l5264L2081J2212
$$ plain form
8831 265310 274881 274510 261447 256741 212143 217772 253261 211177 204682 213460 250817 258765 251778
8818 251778 215701 233481 251593 242551 168370 203587 185197 202411 206271 219508 210342 161414
8806 161414 141180 172012 166871 137893 202109 177143 198526 209154 153907 142419 167691 176167
8794 176167 214386 223466 254276 191347 167513 179394 157743 148170 144691 114474 134505 182401
8782 182401 211569 175867 165377 129316 141552 150362 134043 118326 117320 124367 114624 134057
8770 134057 113953 122441 108109 93768 71633 65379 65163 110607 114080 145927 180537 188322 144952
8757 144952 156437 153350 154369 171451 171634 157087 179751 206392 216626 209152 175921 193941 186935
8744 186935 161789 151990 136629 123645 148487 143980 155523 128121 97932 62668 94749 106961
8732A06961J7584J4608j6923o970N914j258J1131K327j3809k1619q987J7469J0201
8719A16629L0047m407l0521j5280n644K8227l9693M7100J0774m2036J8028l4849
8707G8375j5919J3677M791Q304k1366J8813N212p8161K9577K6394j2084k1928
8695C5685K565L2057j6642O623J4588J3891k6630l7784M6827M3737p640m7105
8683F0172j7410n709J128j0809J9419L3857R01j8955J1304n513k1021K0311K2429
8670I0104m6017M918q484m9591K7008K2693J8770K5046l3422J0911j6611p820
8658C7505k580J2709q400l6177J6555K0717J2230K1354k5519k5505N0576K9l8002
8645C5492j6367J4785k9929l800M3383M3871n7605k0830L9824j3758J9819k7055
$$ plain form
8732 106961 124545 139153 122230 115260 121174 119916 131047 133374 119565 97946 88959 106428 116629
8719 116629 146676 142269 111748 96468 90824 119051 79358 126458 137232 95196 113224 78375
8707 78375 62456 76133 80924 89228 67862 86675 91887 13726 43303 69697 57613 35685
8695 35685 38250 70307 53665 60288 74876 88767 62137 24353 71180 114917 107277 60172
8683 60172 42762 37053 38181 27372 46791 80648 81549 62594 73898 68385 47364 67675 90104
8670 90104 44087 49005 40521 -9070 17938 40631 59401 84447 51025 61936 45325 37505
8658 37505 34925 47634 39234 3057 19612 40329 52559 73913 48394 22889 73465 73494 35492
8645 35492 19125 33910 3981 181 43564 87435 29830 9000 48824 35066 54885 27830
8633B7830l7570J3979N8342K434m9560k8363J6589K3992Q654N413N200M401l5733
8620A5608Q402k3539J1580M258M123J4011k9000L1933k086J3892j9544n327R817
8607C4128o659k682K486J7413m7759K2597K6185q840l0060J1164j8113K1635o118
8594A5377J2977L514l034k091O788J9822K7088n2576Q073p737N311r889N77L9931
8580F4131j6808j1041k8489K2051m1347K9002K0591k7906l9019M1942k700j838
8568H569K345Q85J1784r439M034m281l2061l309P430N096L0746M335n667L4321
8554E4788j2468m2646j1940J0758N584J5150J3767K150l8567m978K9185k8012
8542g229l440L3364j208Q909m3858j3651K0089j8119l2609L1637K2465j6286J0912
$$ plain form
8633 27830 -9740 4239 62581 65015 15455 -12908 3681 27673 36327 41740 46940 51341 15608
8620 15608 24010 471 12051 16309 20432 34443 5443 37376 35290 49182 29638 24311 34128
8607 34128 27469 24787 27273 44686 -3073 19524 45709 36869 6809 17973 -140 21495 15377
8594 15377 28354 31868 28834 26743 33531 53353 80441 27865 35938 28201 33512 23623 24200 64131
8580 64131 47323 36282 7793 29844 -11503 17499 38090 10184 -28835 13107 10407 8569
8568 8569 10914 11799 23583 14144 18178 13897 -18164 -21473 -14043 -8947 21799 26134 20467 54788
8554 54788 42320 -326 -12266 -1508 4076 19226 32993 35143 -3424 -8402 20783 -7229
8542 -7229 -10669 22695 21487 30396 -13462 -27113 -7024 -25143 -57752 -26115 -3650 -19936 -9024
8529i024J0097R042j6552J34N298L1920n9796j4600J478K4419m070K7393J5775
8516B1514k2963l3727R562J1028K4605L3815l6692K894q856l3388K3199K5294
8504A6285m5829J8624Q552J5119m274j2245P16q940J9365q576o184K599k4117
8491b8905J3317J4086m2393j4604N6551j0483J6104m009J9634J5211j0570m5309
8479b1370K1431m0796l0023M8901L6010K5513k2988n743j2331j2267L1003o166
8467A1174k2311K7626K4362j9077n48q38k0562K2065Q384m7853j5984K5557L9407
8454C1402N976m1346K3191M2019j8999J6064M0230m0605q198J6599J0748k7422
8442D9659j5228K0438L4115m0052p660M071J3180l3252l039J4639O499n659J203
$$ plain form
8529 -9024 1073 10115 -6437 -6303 -1005 30915 -28881 -43481 -42003 -17584 -21654 5739 21514
8516 21514 -1449 -35176 -25614 -14586 10019 43834 7142 10036 1180 -32208 -9009 16285
8504 16285 -29544 -10920 -2368 12751 8477 -3768 -3052 -11992 7373 -1203 -7387 -4788 -28905
8491 -28905 -15588 -1502 -43895 -58499 -1948 -12431 3673 -336 19298 34509 23939 -21370
8479 -21370 61 -40735 -70758 -21857 14153 39666 16678 10935 -1396 -13663 17340 11174
8467 11174 -11137 16489 40851 21774 21226 20388 -174 21891 30275 -17578 -33562 -8005 31402
8454 31402 37378 -3968 19223 61242 42243 58307 98537 57932 49734 66333 77081 49659
8442 49659 34431 54869 88984 48932 41272 45343 58523 25271 22232 36871 43370 37711 38914
8429C8914j0638j6548l6187k2115J3966K7578o121o425k7107k6581L4057l816
8417d1023M927l5871K0709Q541n601L0413k3234m187o530O522R276K3365r767
8404b2460k139j8887j1504M4599K93k4047K4812k7107l794J4677j2963j0248O247
8391d2521K6722k3237M5604k7470N421K5218k6976o787J7096k6761O94K5808n081
8378a2270k7012N812j3909l2114L9166L2671n624l6961n121l034l0521J8538K5807
8365d4572j3476l549k1412K8047K5822J9035j9071K0641M6203j9017l1803k1942
8353c5094j6358k9159M2117J4242r255K5010j0931q222K0815J2494j7524n7417
8341f9282K2848J705j1017J1515j2465M3141r395k1422o812K900J9853J2797j552
$$ plain form
8429 38914 28276 11728 -24459 -46574 -32608 -5030 -11151 -17576 -44683 -71264 -37207 -41023
8417 -41023 -36096 -71967 -51258 -42717 -48318 -17905 -41139 -45326 -51856 -45334 -36058 -12693 -22460
8404 -22460 -24599 -43486 -54990 -10391 -10098 -34145 -9333 -36440 -40234 -25557 -38520 -48768 -42521
8391 -42521 -15799 -39036 6568 -20902 -15481 9737 -17239 -24026 -6930 -33691 -32997 -7189 -12270
8378 -12270 -39282 -33470 -47379 -79493 -40327 -7656 -13280 -50241 -55362 -58396 -88917 -70379 -44572
8365 -44572 -58048 -61597 -83009 -54962 -29140 -10105 -29176 -8535 37668 18651 -13152 -35094
8353 -35094 -51452 -80611 -38494 -24252 -33507 -8497 -19428 -27650 -6835 5659 -11865 -69282
8341 -69282 -46434 -44729 -55746 -44231 -56696 -13555 -22950 -44372 -51184 -48284 -28431 -15634 -17186
8328a7186J1155J4521m6029J0456J0019K6740p472j7846J1731j12K8592k7617
8316c048m175l2052j5505L0569j035N903K1269n539N489l508j6987P673J1516
8303E70K6572l5133l1741m601L7484l171q602p71k9784k979K2729j2066K6710
8290a4783J0371j5821Q814K8029J2904J2073k953o9451l4212M6379N010l3504
8278d7144J0655k57J4109j85j0116K8295J0369j3403j8819J0855r887k3260J425
8265d7363p475Q0606l1570m394l392J8910M598M32j6689j0555K4752m457l1233
8252b7830j1013J0930l2673K6843k1500K8104o668O747k1067K3206L5555k6727
8240a6093o565k1145L5671Q220k7586k3097m837J6096j0294P895K1876n2276J3918
$$ plain form
8328 -17186 -6031 8490 -37539 -27083 -17064 9676 2204 -15642 -3911 -4023 24569 -3048
8316 -3048 -7223 -39275 -54780 -24211 -25246 -19343 1926 -3613 1876 -1632 -18619 -10946 570
8303 570 27142 -7991 -39732 -44333 -6849 -10020 -18622 -19393 -49177 -52156 -29427 -41493 -14783
8290 -14783 -4412 -20233 -11419 16610 29514 41587 38634 -30817 -65029 -18650 -13640 -47144
8278 -47144 -36489 -36746 -22637 -22822 -32938 -4643 5726 -7677 -26496 -15641 -25528 -48788 -47363
8265 -47363 -54838 25768 -5802 -10196 -13588 5322 9920 10352 -6337 -16892 7860 3403 -27830
8252 -27830 -38843 -27913 -60586 -33743 -55243 -27139 -33807 -27060 -48127 -24921 10634 -16093
8240 -16093 -22658 -43803 -8132 88 -27498 -50595 -55432 -39336 -49630 -41735 -19859 -72135 -58217
8227e8217K2095k0358M0237J2657j5717l42M594j4896J8112o512n8840J2824K6870
8214c7493K3K1067r299l947k3061K8033K337m772J943l0446N231J8504j937J8634
8200a5183n163L0251j3917j3929L9240J5551k4958J23263L6399k19169J844l0444
8188g6215l54q03M5877L0800m9543n4416K2205L9864j5482K8464p631l5615J1559
8175f1290q727J7596J5689J8276j8049K965j4249n493n243p789K1282l2762L2763
8162d5031j7920N657M0036j908l7165Q847J8357j4986K3850k608j3420N5162l0933
8149a2062m8988J1625n385J5113J4098j475m0121J1324j1877k8589P2302j317
8137b5352k6259j8650J0976o69p325J6636p294k9153o933L6149M3204L7673j1178
$$ plain form
8227 -58217 -36122 -56480 -16243 -3586 -19303 -19645 -15051 -29947 -11835 -18347 -77187 -64363 -37493
8214 -37493 -37470 -16403 -25702 -29649 -52710 -24677 -22340 -27112 -25169 -55615 -50384 -31880 -33817 -15183
8200 -15183 -20346 9905 -4012 -17941 21299 36850 11892 135155 171554 -47615 -45771 -76215
8188 -76215 -76569 -77372 -31495 -695 -50238 -104654 -82449 -42585 -58067 -29603 -37234 -72849 -61290
8175 -61290 -70017 -52421 -36732 -18456 -36505 -33540 -47789 -53282 -58525 -66314 -45032 -77794 -45031
8162 -45031 -62951 -57294 -17258 -19166 -56331 -47484 -29127 -44113 -20263 -22871 -36291 18871 -12062
8149 -12062 -61050 -49425 -54810 -39697 -25599 -27074 -67195 -55871 -67748 -96337 -24035 -25352
8137 -25352 -51611 -70261 -59285 -59954 -67279 -50643 -57937 -87090 -94023 -57874 -14670 23003 11825
8124A1825k264k5013l7610J0450j4272l565L603j557o57M475O436R376l0703j6422
8110h5898L3340L137N481K4770J3821j7068j6059K4953Q508J313m1703k2577J9706
8097d8276J8407j9108K2111r264j4512J431K0399J3426k3917j8j992j00m94L7309
8083d598M079k706J4355K0800o6605J0040N16j4120q80J8459J6242r638k6601
8070d0657k8790L533K8090J915j1204Q502K1167P495k1097m2265Q024R419Q549
8057d7319M8116p870k0849n295m2735k9339K5832M2542L7041k8080o768j781J4885
8044b1620p119K3350l4059J751O87q347m0321k6186M3498N568P038N5722q011
8031h049K8611j0853m227l4719p803K1997K5785k632l6859J849o196L6098k7992
$$ plain form
8124 11825 9561 -15452 -53062 -42612 -56884 -60449 -56846 -58403 -59060 -54585 -48149 -38773 -69476 -85898
8110 -85898 -52558 -49421 -43940 -19170 -5349 -22417 -38476 -13523 -5015 -3702 -45405 -67982 -48276
8097 -48276 -29869 -48977 -26866 -36130 -50642 -49211 -28812 -15386 -39303 -39321 -41313 -41413 -41907 -4598
8083 -4598 -519 -3225 11130 31930 -34675 -24635 -24119 -38239 -39119 -20660 -4418 -14056 -40657
8070 -40657 -69447 -65914 -37824 -35909 -47113 -38611 -17444 -9949 -31046 -73311 -65287 -55868 -47319
8057 -47319 797 -7073 -27922 -33217 -75952 -105291 -79459 -36917 124 -27956 -34724 -36505 -21620
8044 -21620 -28739 -5389 -39448 -37697 -37010 -45357 -85678 -111864 -68366 -62798 -55760 -38 -8049
8031 -8049 20562 9709 5482 -29237 -37040 -15043 10742 8110 -28749 -26900 -33096 3002 -24990
8018b4990k4781p045M3055K7652j4612k9989k6881K9151K4112l3251J4104J6908
8006f567k0362k6466m004K8234m566J3690j4797m9203M5569K0905r411K595J4439
7993i944j558L050n337J0789m5474j0154J4043L795j675J3995J3020j0617j0923
7980c6990M2859l5872j7121l6478j4592M1148K3978L522k2668p825K5076J1719
7968b3244Q010k4426n837p739j9963J9672j6265L8435M801Q953K270j0500j0805
7955c6638m341L648L7206N020n2443J7037j2622m1009m61K8208O1505j838k6175
7942b2903j7674j3186k9695K5235k0631j8199L6563l471L6734J9026k2986Q16
7930c0371J4034J507l4640K9841L86m4894J757J791L3522j0986j5691M270O480
$$ plain form
8018 -24990 -49771 -56816 -13761 13891 -721 -30710 -57591 -28440 -4328 -37579 -23475 -6567
8006 -6567 -26929 -53395 -57399 -29165 -33731 -20041 -34838 -84041 -38472 -17567 -26978 -24383 -9944
7993 -9944 -11502 -8452 -13789 -3000 -48474 -58628 -44585 -40790 -42465 -28470 -15450 -26067 -36990
7980 -36990 5869 -30003 -47124 -83602 -98194 -57046 -33068 -29546 -52214 -60039 -34963 -23244
7968 -23244 -15234 -39660 -45497 -53236 -73199 -53527 -69792 -31357 -26556 -17603 -15333 -25833 -36638
7955 -36638 -40979 -37331 -125 4895 -47548 -30511 -43133 -84142 -84603 -56395 5110 3272 -22903
7942 -22903 -40577 -53763 -83458 -58223 -78854 -97053 -60490 -63961 -27227 -8201 -31187 -30371
7930 -30371 -16337 -14830 -49470 -19629 -19243 -64137 -62380 -60589 -27067 -38053 -53744 -49474 -42994
7917d2994P9659J0251m9080j6808j222j8874k9172J0835j1111K3108K3035k0714
7905d3087P730L732l673L0780r197m4991m694N2618L2301p1412j8892j9713J4149
7892g4349K2974K2298R654L713K868o963L431j6701j63K4158k469l7464j4795
7879f3808J1335K5433Q453J6851p80p0060K8157L3744n7033j9820M25M3882N0943
7866G722l5418j1108J9086q221k254N358j3375J3359N277k9687o567R791K1711
7853b4326k5785L3960J4513l9391L0459k932k6014k2569p559K9740N95K7050K3260
7840A1001j8483l3363k876J006Q829o708J809L7048k372k389J8348m0286K352
7827b6084n899o419j132j3581P868q455k0099J9873P583l1281j4283J5039N0071
$$ plain form
7917 -42994 36665 46916 -2164 -18972 -20194 -39068 -68240 -57405 -68516 -45408 -22373 -43087
7905 -43087 -35357 -31625 -35298 -4518 -13715 -58706 -63400 -10782 21519 -49893 -68785 -88498 -74349
7892 -74349 -51375 -29077 -19423 -15710 -12842 -19805 -16374 -33075 -33238 -9080 -11549 -49013 -63808
7879 -63808 -52473 -27040 -18587 -1736 -2516 -72576 -44419 -10675 -67708 -87528 -87103 -43221 7722
7866 7722 -27696 -38804 -19718 -27939 -30193 -24835 -38210 -24851 -19574 -49261 -55828 -46037 -24326
7853 -24326 -50111 -16151 -1638 -41029 -10570 -13502 -39516 -62085 -69644 -39904 -39309 -12259 11001
7840 11001 -7482 -40845 -43721 -42715 -33886 -40594 -38785 -1737 -4109 -6498 11850 -28436 -26084
7827 -26084 -31983 -38402 -39534 -53115 -45247 -53702 -73801 -53928 -46345 -77626 -91909 -76870 -26799
7814b6799Q57m8074p800J0308j1298J0604L8604L1543l5440k0535M5228J8328
7802E526L456k0429n3996J4722j8572K5898L902l7324M6777l5423J1620K9209
7790b4634j2810l024K8971j0633l6194L8071p05l2584p891L656J1208M57K8951
7777a7161j6359l3641K1158j719Q257m9776L0708K3684J8434k926l8168L2142
7765b5367n2723j6629L5526K7354J2267n8268J8361J6832J3071J9723j3438j3586
7753c6877J0483n768j3878j5173j9748M3786k2283K312L978k7613J7314J3576
7741d9891j8508J2452K951M716k1976l0322L5014L5482k0868m57o700o88O564
7728e2231M3915J4779m8147j3373R03J2276K589Q3j8147p036J7961j0199j6909
$$ plain form
7814 -26799 -25942 -74016 -81816 -71508 -82806 -72202 -33598 -2055 -37495 -58030 -12802 5526
7802 5526 8982 -11447 -65443 -50721 -69293 -43395 -39493 -76817 -30040 -65463 -53843 -24634
7790 -24634 -37444 -40468 -11497 -22130 -58324 -20253 -20958 -53542 -61433 -57777 -46569 -46112 -17161
7777 -17161 -33520 -67161 -46003 -47722 -39465 -89241 -58533 -34849 -16415 -19341 -57509 -25367
7765 -25367 -78090 -94719 -59193 -31839 -19572 -77840 -59479 -42647 -29576 -9853 -23291 -36877
7753 -36877 -26394 -32162 -46040 -61213 -80961 -37175 -59458 -57146 -53168 -80781 -63467 -49891
7741 -49891 -68399 -55947 -52996 -48280 -70256 -100578 -65564 -30082 -50950 -51407 -58107 -58795 -52231
7728 -52231 -8316 6463 -41684 -55057 -54154 -41878 -39289 -39206 -57353 -64389 -46428 -56627 -73536
7715g3536j874J4552K3784j1607P185P763K3532Q651l6653j0183J8105J5822k909
7702a7368k4104k0568L260M603J791Q164m421j2781L1458n875k9840P276k092
7689f0497J6542j137j7757k664L555J8980R175m6684L7791J3820J6203N449l1763
7676c8987l8757K2689M057l7268M0226K0923J4965J703k0374k5414j0645K65O539
7663f0078M377L228K5372J5397N396J6255l1715l6956P205L0920j4641J8846j389
7650a7783q962j0419O865j5933J2944j1512J4338k0111n4039M0757K6793q599
7638d5661k0294J5629p930J6794K8125o3601N3628L8064m2538Q834j3102j7423
7626d9475j3342O6125k1282l1430J178K4076j3172j8434j4376j598J6158J9439
$$ plain form
7715 -73536 -75410 -60858 -37074 -48681 -41496 -33733 -10201 -1550 -38203 -48386 -30281 -14459 -17368
7702 -17368 -41472 -62040 -58780 -54177 -52386 -44222 -48643 -61424 -29966 -35841 -65681 -58405 -60497
7689 -60497 -43955 -45092 -62849 -65513 -61958 -42978 -33803 -80487 -42696 -28876 -12673 -7224 -38987
7676 -38987 -77744 -55055 -50998 -88266 -48040 -27117 -12152 -10449 -30823 -56237 -66882 -66617 -60078
7663 -60078 -55701 -52473 -27101 -11704 -6308 9947 -21768 -58724 -51519 -20599 -35240 -16394 -17783
7650 -17783 -26745 -37164 -30299 -46232 -33288 -44800 -30462 -50573 -104612 -63855 -37062 -45661
7638 -45661 -65955 -50326 -58256 -41462 -13337 -76938 -23310 14754 -27784 -18950 -32052 -49475
7626 -49475 -62817 3308 -17974 -49404 -48226 -24150 -37322 -55756 -70132 -71730 -55572 -36133
7614c6133j7430q148J3230K0036j0197m250Q756J74J8028l8455o120N140L0990
7601b4379k6906j9969L2115j9556K463O439K3954l1549K7490Q722o479Q632J5353
7588c670M834k1308m917k8236q211j9718J4679l431k4514J7070N4657O29k1592
7575d3728K1027k0331L2246L6977n0610l4604l3805Q7824K3327j9867N56j7074
7563a8062j3785k099K305j4851k5680j592J3058K4027L9886L3510L0162l3139
7551C3740l8166M498l7071J1374J9382O123j3551j5548j4025Q242L0412m982K0251
7538A0679q566k4271o843L9890k7511j7846M444j9195k0569N904M1014n092K3949
7525d013l3117J028j0056l0704j4763O927M1434J3625r649l179K1478J0637Q488
$$ plain form
7614 -36133 -53563 -61711 -48481 -28445 -38642 -42892 -34136 -33962 -15934 -54389 -60509 -55369 -24379
7601 -24379 -51285 -71254 -39139 -58695 -56232 -49793 -25839 -57388 -29898 -21176 -27655 -19023 -3670
7588 -3670 1164 -20144 -25061 -53297 -61508 -81226 -66547 -69978 -94492 -77422 -22765 -22136 -43728
7575 -43728 -22701 -43032 -10786 26191 -24419 -59023 -92828 -5004 18323 -1544 -988 -18062
7563 -18062 -31847 -33946 -31641 -46492 -72172 -73764 -60706 -36679 3207 36717 66879 33740
7551 33740 -4426 72 -36999 -25625 -6243 -120 -13671 -29219 -43244 -35002 -4590 -9572 10679
7538 10679 2113 -22158 -29001 10889 -16622 -34468 -30024 -49219 -69788 -63884 -22870 -27962 -4013
7525 -4013 -37130 -36102 -46158 -76862 -91625 -84698 -43264 -29639 -39288 -42467 -20989 -10352 -1864
7512a864j6473j2861R151J8083J5504j9506K9802m614l9962n3546j09J6619m7311
7499a07087K4139L8775J5925j7748j2161L560j1282n506N0786j296p496K7603
7487a788l5468p908K4828j5625j0371j1001K7252J6147K6311J4377m0446j9242
7475c2934R535k5117j3498J9165L3911l250k7469K1m171J2577K0137j5999l3046
7462f0138P1687R871o5310k6918L892L1490k3376P830j005L9118K369K6721n4596
7449c8365k8094L1590m1038j0368K0278J2871J388j7617J5932O386l275Q543k6390
7436f8159m092r670M8772K2733j2966o94J37o947m0057R831J7250j2557J3802
7423d2617j9108j3024K937M960K2726J095m361N7705J774k842j4292l8922K5622
$$ plain form
7512 -1864 -18337 -31198 -22047 -3964 11540 -7966 21836 17222 -22740 -76286 -76395 -59776 -107087
7499 -107087 -82948 -44173 -28248 -45996 -58157 -54597 -65879 -71385 -20599 -21895 -29391 -1788
7487 -1788 -37256 -45164 -20336 -35961 -46332 -57333 -30081 -13934 12377 26754 -13692 -32934
7475 -32934 -23399 -48516 -62014 -42849 -8938 -12188 -39657 -39636 -43807 -31230 -11093 -27092 -60138
7462 -60138 11549 21420 -43890 -70808 -66916 -35426 -58802 -50972 -51977 -12859 -10490 16231 -38365
7449 -38365 -66459 -34869 -75907 -86275 -65997 -53126 -51738 -69355 -53423 -47037 -50312 -41769 -68159
7436 -68159 -72251 -81921 -33149 -10416 -23382 -24076 -23939 -30886 -70943 -61112 -43862 -56419 -42617
7423 -42617 -61725 -74749 -71812 -66852 -44126 -43031 -47392 10313 12087 9245 -5047 -43969 -18347
7410a8347r571q484k9256J1663K1556J4746Q677p657l6264J8440k7888K560K0168
7397c9657K1861j1875j8159M0511j9977Q455k9689J3714O55J3642j5402p959Q179
7384c5701J5812k5663J0037k2934L7958N119r356j5721J0828K0953m719J805O486
7371e096L34l430O99j3776l7152j6710N2162L112j5518n1585K2193M4155r271
7358b9883k2781J6604K0783r019R611k3258l2592m518j4675O708K7243K8522J5354
7345a1901Q177J090k7816j2063N493r011K9256m2010m312l05j3952M3120K5832
7332h402l2840j6445L2728K8318k530n1536J9176J1045n3394o658K7867K2927
7320b9744J5856k6433k5953J0883K5923j4324K8556L5599j7133m6626q023J875
$$ plain form
7410 -18347 -27918 -36402 -65658 -53995 -32439 -17693 -9016 -16673 -52937 -34497 -62385 -59825 -39657
7397 -39657 -17796 -29671 -47830 -7319 -27296 -18841 -48530 -34816 -34161 -20519 -35921 -43880 -35701
7384 -35701 -19889 -45552 -35515 -58449 -20491 -15372 -24728 -40449 -29621 -8668 -13387 -11582 -5096
7371 -5096 -4762 -8192 -7493 -21269 -58421 -75131 -22969 -19857 -35375 -86960 -64767 -20612 -29883
7358 -29883 -52664 -36060 -15277 -24296 -14685 -37943 -70535 -75053 -89728 -83020 -55777 -27255 -11901
7345 -11901 -3724 -2634 -30450 -42513 -37020 -46031 -16775 -58785 -63097 -63402 -77354 -34234 -8402
7332 -8402 -41242 -57687 -24959 3359 829 -50707 -31531 -20486 -73880 -80538 -52671 -29744
7320 -29744 -13888 -40321 -66274 -55391 -29468 -43792 -15236 20363 3230 -43396 -51419 -49544
7308d9544K8108P391p234k8100j2745J5365k4776R108L5031P970k5496k2167K4925
7295d2164J7765O94j3222K047L10N4806k8814k8276O5662m0382k6059K2479L7659
7282B2505j9233L577J4477q415k3794j8380l0300O300r200P388J45l1312j2262
7269i8504J4756O5943Q60l7076J2574j8875n573K4612K3673j9116M5431p693l6327
7256c5315m7578Q386n287M2815J9436j2604J0605m050O182p451k865l8947K6204
7243d0469K185J045J9125j4520L940R863k4551k8466J2077K6166R807j6932L2948
7230g782L4641m574k6299J1608j980l6887J1484m073J5729N7J3246K926l766n9901
7216e5571j5636M9791J8250j5639J719q912j8960N3692K3523o025p605j4477k8895
$$ plain form
7308 -49544 -21436 -14045 -21279 -49379 -62124 -46759 -71535 -62427 -27396 -19426 -44922 -67089 -42164
7295 -42164 -24399 -23705 -36927 -34880 -34570 20236 -8578 -36854 28808 -11574 -37633 -15154 22505
7282 22505 3272 6849 21326 12911 -10883 -29263 -59563 -53263 -62463 -55075 -54930 -86242 -98504
7269 -98504 -83748 -17805 -16945 -54021 -41447 -60322 -65895 -41283 -17610 -36726 8705 1012 -35315
7256 -35315 -82893 -74507 -79794 -36979 -17543 -30147 -19542 -23592 -17410 -24861 -27726 -66673 -40469
7243 -40469 -38284 -37239 -18114 -32634 -28694 -18831 -43382 -71848 -59771 -33605 -23798 -40730 -7782
7230 -7782 26859 22285 -4014 7594 5614 -31273 -19789 -23862 -8133 -8076 5170 8096 4330 -55571
7216 -55571 -71207 -21416 -3166 -18805 -17086 -25998 -44958 8734 32257 26232 18627 4150 -24745
7203b4745k514K1422J3753N238j9725l8802j9567K9034m6j1152L2760J126q119
7190b1337k6930J5764K7239j3025J0235l7695j4056l753M571J3945K8605l1303
7178d7740K9881J1822P328j6265K7004n707k1395K1133l824l5625m4506M3944
7166c3950K96N940L080j4435K6921J7034k633l0949k2181m2O1872K9076J2223
7153E2252l3034m5889j2980N280J0890j1358M3980K0363n3555l5960K5802M649
7141b9560O756j2658J5481J1101L933j4849n4813J1400N239K1064k6372K3685
7129c9593L7331j1128K870j218j8284K5990J9353J9511j5627j6472K4565m8922
7117b1624j2563P162j4407L5353K3129j8632j913K0663l3849j0173k3391M288
$$ plain form
7203 -24745 -27259 -5837 7916 13154 -6571 -45373 -64940 -35906 -35952 -47104 -14344 -13218 -21337
7190 -21337 -48267 -32503 -5264 -18289 -8054 -45749 -59805 -63558 -58987 -45042 -16437 -47740
7178 -47740 -17859 -6037 1291 -14974 12030 6323 -15072 6061 2237 -33388 -77894 -33950
7166 -33950 -33654 -27714 -24634 -39069 -12148 4886 2253 -28696 -50877 -50919 10953 40029 52252
7153 52252 19218 -26671 -39651 -34371 -23481 -34839 9141 29504 -24051 -60011 -34209 -29560
7141 -29560 -22804 -35462 -19981 -8880 -4947 -19796 -74609 -63209 -57970 -36906 -63278 -39593
7129 -39593 -2262 -13390 -10520 -11738 -30022 -4032 15321 34832 19205 2733 27298 -21624
7117 -21624 -34187 -27025 -41432 -6079 17050 -1582 -3495 17168 -16681 -26854 -50245 -45957
7105d5957k639L7125K8407o305J344k1521q077m8497M6565k5528K310j8535L5406
7092b5902L2959q607k9413O0281o374l2925j7399K3907k1226k62r082L6773Q009
7079A0739n2396L0382L0781m9496m08J5655l419R922j0820K0569m1960N353L5187
7066H9j9314j7475j7401K5839L350j0716K5640j5939m211R85l1110K3921P24J1773
7052b3845K8799R999k0500l0645O82n861M6595K6815n282j8483K889j8n917j9734
7038a4506R329r553M8630n818l1291J0089j3152l0785K9265k5386J0996J4657
7026g525N51R761j5483l7293L5255K0376R72N4227l0798n439k8799j2811K6066
7013I060j3431J2615j3841j2206O750J8224k2121J670l8178K0485K0816L858J4105
$$ plain form
7105 -45957 -48596 -11471 16936 10631 11975 -9546 -17623 -66120 -19555 -45083 -42773 -61308 -25902
7092 -25902 7057 -1550 -30963 29318 22944 -9981 -27380 -3473 -24699 -24961 -34043 2730 10739
7079 10739 -41657 -11275 19506 -29990 -30398 -14743 -18162 -8240 -19060 1509 -40451 -35098 89
7066 89 -19225 -36700 -54101 -28262 -24912 -35628 -9988 -25927 -30138 -29153 -60263 -36342 -35618 -23845
7052 -23845 4954 14953 -5547 -36192 -35510 -41371 5224 32039 26757 8274 11163 11145 5228 -14506
7038 -14506 -5177 -14730 33900 28082 -3209 6880 -6272 -37057 -7792 -33178 -22182 -7525
7026 -7525 -6974 2787 -12696 -49989 -14734 5642 6614 60841 30043 24604 -4195 -17006 9060
7013 9060 -4371 8244 -5597 -17803 -11053 7171 -14950 -13280 -51458 -30973 -10157 -6299 7806
7000G806j7388o691N760J04K8438K0618l2073K8090k9094k9648k4142N9485L6658
6987D7923j2122M45k2140K183k0306j5112j3591M9137L7050o9738k5449M1037
6975f83L718m4124K4542N6430k8701j4236J3532n1378J0120M6571Q385j3240n5871
6962d4935j0083L7589J9915k5420J3337J648j0358j0188j7127L4132j1567J5746
6950g311p223K6243O587N216n199J8216j3389j5433M685k2128m153J6649J1670
6937A4430o590j1306M0286r440n3879L8951L1136k0778j2914j6748j4732J1965
6925i619m0145L7074L144J6608j0840j4309L2890m369L7044K8577l3718k2784
6913A9553k4768K9059k4377k4775k921P85L0988J4594n711J72l3091m5279L1696
$$ plain form
7000 7806 -9582 -16273 -10513 -10409 18029 38647 6574 34664 5570 -24078 -48220 11265 47923
6987 47923 35801 36246 14106 16289 -4017 -19129 -32720 16417 53467 -16271 -41720 -683
6975 -683 3035 -41089 -16547 39883 11182 -3054 10478 -40900 -30780 15791 24176 10936 -44935
6962 -44935 -55018 -17429 2486 -22934 -9597 -7949 -18307 -28495 -45622 -11490 -23057 -7311
6950 -7311 -14534 11709 18296 23512 18313 36529 23140 7707 12392 -9736 -13889 2760 14430
6937 14430 7840 -3466 36820 27380 -26499 12452 43588 22810 9896 -6852 -21584 -9619
6925 -9619 -49764 -12690 -9546 7062 -3778 -18087 14803 10434 47478 76055 42337 19553
6913 19553 -5215 23844 -533 -25308 -28229 -27444 3544 18138 12427 12599 -20492 -65771 -34075
6900c4075J2569K4486j424k2113L3714j0225J0072k285L2678J798k5285J4526
6888C4436L176j1000j5704K3641j4337j9706j1819K1291L233L883K3020J2514
6876E2628j5460o2888Qp032k901K8573K2631k324l3675K0121K7313j6010L31L7459
6862D8774q346l1853m998K7199j0840O144k3422L0860l2082k1307p578J6494L5956
6849B5001K3448k8004k4628M667N098K9907j0093j8443Q020l0667J7703L6991
6837C9000P71l833m4886J5027K5679l5496L6998L0259o4406L0681l311l6039K2508
6824A2952K3932j8586p391L230j4395O624J2677J3030J104p773O955l3208J5937
6811A5088R585J2247J1082Q156k0174k7868K4553J7685L320n6793L4463Q192k1361
$$ plain form
6900 -34075 -21506 2980 1556 -20557 13157 2932 13004 10719 43397 45195 19910 34436
6888 34436 37612 26612 10908 34549 20212 506 -11313 9978 13211 17094 40114 52628
6876 52628 37168 -25720 -25712 -32744 -35645 -7072 15559 13235 -20440 -319 26994 10984 11315 48774
6862 48774 40428 8575 3577 30776 19936 26080 2658 33518 1436 -19871 -27449 -10955 25001
6849 25001 48449 20445 -4183 484 5582 35489 25396 6953 14973 -15694 2009 39000
6837 39000 39771 35938 -8948 6079 31758 -3738 33260 63519 -887 29794 26483 -9556 12952
6824 12952 36884 18298 10907 14137 -258 6366 19043 32073 33177 25404 32359 -849 15088
6811 15088 24673 36920 48002 56158 35984 8116 32669 50354 53674 -3119 31344 39536 18175
6798A8175j1306M3085L5489J1560m5534N137L3787q576k0061k2061J9948j3712
6786D5931j2087R526R793l4516K0623J8109J6887K0490j5162j4781m2752l4468
6774a2407J9422K5139K8624j0695k1639q019J451J9412J5849L5569n546j1984
6762G5176n8477m9709J00295m071o485l7784n022K8255J2022J6767R64k7058K6691
6749G1564k3975K186J1985m1914k6270N274J0511r972M1267J8039r069M432j3806
6736D0252j2476J0884M643r30M1951j3747N595l7918j4417O24M2557q579j3961
6723D4478K1586n5927j5322K1734M2985k6190j649J2999l2232L6629N677k1212
6711C3556K8068k9885j0449J9442J3120o967J7096r016J6924k3320O812k5360
$$ plain form
6798 18175 6869 49954 85443 97003 51469 56606 90393 81817 61756 39695 59643 45931
6786 45931 33844 43370 53163 18647 39270 57379 74266 94756 79594 64813 22061 -12407
6774 -12407 7015 32154 60778 50083 28444 20425 21876 41288 57137 92706 87160 75176
6762 75176 16699 -33010 67285 63214 56729 18945 13923 42178 54200 70967 71931 44873 71564
6749 71564 47589 49775 61760 19846 -6424 -1150 9361 -611 40656 58695 49626 54058 40252
6736 40252 27776 38660 43303 42373 84324 70577 76172 38254 23837 24461 67018 58439 44478
6723 44478 66064 10137 -5185 16549 59534 33344 31695 44694 12462 49091 54768 33556
6711 33556 61624 31739 21290 40732 53852 46885 63981 54965 71889 48569 55381 30021
6699C0021L3472l3415l6764K8708m722q89K6408J1961J6017R167l0842Q773K2704
6686H0599L4302j6086k1609K940k563j3147j7178L364J7152j5290K1931j1271
6674F3144j2712M6710j5415j2124k092p095k5090M2384K3912m19O540k0113k8765
6661E8865k2403R937M3661m247J6783M757k8284l1221L4810p57r822R012k6542
6648E4549o616K9252j3414J0800K3776k3635k13J2167K5799p835R272J5402r51
6635A28353L439M773j5902j2030J3826j38J433j1001o650p259k909J680O791N000
6621A09406l2733J806K5930M3471m4574j3277n457r75P089L0727L960k6691K5231
6608A23913R494q929J151k1736P036k5662K6430L686j7896k016J7262R608L145
$$ plain form
6699 30021 63493 30078 -6686 22022 17300 16411 42819 54780 70797 79964 49122 57895 80599
6686 80599 114901 98815 77206 80146 77583 64436 47258 50622 67774 52484 74415 63144
6674 63144 50432 97142 81727 69603 67511 60416 35326 77710 101622 101203 107743 87630 58865
6661 58865 36462 46399 90060 85813 102596 107353 79069 47848 82658 81901 72079 81091 54549
6648 54549 47933 77185 63771 74571 98347 74712 74499 86666 112465 104630 113902 129304 128353
6635 128353 131792 136565 120663 108633 122459 122321 123754 112753 106103 98844 95935 97615 104406 109406
6621 109406 76673 78479 104409 147880 103306 90029 84572 83597 90686 121413 125373 98682 123913
6608 123913 133407 124478 125629 103893 110929 85267 111697 115383 97487 95471 112733 122341 125486
6595A25486k4549l2319O4169J7970k8981j3001o262K3941J3902J4288J8410j2925
6583A60129J3768k7389n631k065l1161j8850l2742j4724L1112N9438J9953j249
6571A50589R06l4201j9243J1929K0877l3201j835J8356J4047J0802R509n634K0219
6558A63120p763j8650J3129J9785k303j982l3118j5157K9579N49K7604l7488J4524
6545A51829O197J3007J5203j448m4653J7027j3564K008K2592k7733K3992m0259
6533A24198J5290L8902j5314k6951r518K7630J412k0288K7757J2928o562J912
6521A71396j2582J6277P222J5964j5550k2674K4032j7379J0701K7103j7103r686
6509A77721j4592j5252J1041L3405K8058j97m8100r502j4133K5612L614m520L0999
$$ plain form
6595 125486 100937 68618 132787 150757 121776 108775 102513 126454 140356 154644 173054 160129
6583 160129 173897 146508 140877 138812 107651 88801 56059 41335 72447 131885 151838 150589
6571 150589 151495 117294 98051 109980 130857 97656 95821 114177 128224 139026 148535 142901 163120
6558 163120 155357 136707 149836 169621 167318 165336 132218 117061 146640 147189 174793 137305 151829
6545 151829 158026 171033 186236 184788 140135 157162 143598 145606 168198 140465 164457 124198
6533 124198 139488 178390 163076 136125 126607 154237 155649 135361 163118 176046 169484 171396
6521 171396 158814 175091 182313 198277 182727 160053 184085 166706 177407 204510 187407 177721
6509 177721 163129 147877 158918 192323 220381 220184 172084 162582 148449 174061 177675 173155 204154
6496B04154J5360L1016L1414k1885l1428K1067J4572K6294k8061J9580J7352R278
6484C08713P696l0557j7359J6641n224P526k7113J4102r736M17k0823p263O6030
6471C03050L4327j3375K153J4626l4593j7177j1604O2963K0690l4758L8935J4727
6459C79964j0739j2713K0904j0950J9906K7440L171k3093J3053M9669l340N912
6447D59184k1314Q741O942K8948J3592j3518j2808K3625Q2097K2866j7737K0325
6435F00943J3542J3331J6235M1308K6708O091J8526O6787L4470J3003J3328K7044
6423H91316P1436N8055N4114M3637J310L8402Q2897N1609L6974M6461Q7513J00067
6411A563791N4446M590L1229O9225N9414O3316L3158J5342O9601j1820J236M3727
$$ plain form
6496 204154 219514 250530 281944 260059 228631 249698 264270 290564 262503 282083 299435 308713
6484 308713 316409 285852 268493 285134 279910 287436 260323 274425 264689 265106 244283 237020 303050
6471 303050 337377 324002 326155 340781 306188 289011 277407 340370 361060 326302 365237 379964
6459 379964 369225 356512 377416 366466 386372 413812 416983 393890 406943 456612 453272 459184
6447 459184 437870 446611 453553 482501 496093 482575 469767 493392 575489 598355 580618 600943
6435 600943 614485 627816 644051 685359 712067 718158 736684 803471 837941 850944 864272 891316
6423 891316 962752 1020807 1074921 1118558 1119868 1158270 1241167 1292776 1329750 1376211 1463724 1563791
6411 1563791 1618237 1622827 1654056 1723281 1782695 1846011 1879169 1894511 1964112 1952292 1953528 1997255
6399A997255m5164l3414j8102m2688j9734n3714k5765n3550j00333o5710n2711
6388A486370p2379o2444j3730q0116q9979l9004n5168l9769m7413k3515J2060
6377I74913m3771o9018j1257j6332m5336k6347p888k5830k3079k0990l8800j6690
6365F29575j8196m2395L5387r021k7278J4603j3081k0317j6651j0278m3323m6466
6353D32559j0815M3143l1917P692J1582L75j2654k7768L2729N990o2366K5705
6341D14255J5298L880L267j2093q492N848l6102q943R437K6241o493j1109P928
6328D02922l8594r3M4245j254o266m715j8170J0174L294o760k4764l4722R864
6315C35161N0334r327k9702R910K1327j2766L7958J6195k0164m097j7376Q402
$$ plain form
6399 1997255 1952091 1918677 1900575 1857887 1838153 1784439 1758674 1705124 1604791 1539081 1486370
6388 1486370 1413991 1351547 1337817 1257701 1167722 1128718 1073550 1033781 986368 962853 974913
6377 974913 931142 862124 850867 834535 789199 762852 754964 729134 706055 685065 646265 629575
6365 629575 611379 568984 604371 595350 568072 582675 569594 549277 532626 522348 479025 432559
6353 432559 421744 464887 432970 440662 452244 452619 439965 412197 444926 450916 388550 414255
6341 414255 429553 433433 436700 424607 416115 421963 385861 376918 386355 412596 406103 394994 402922
6328 402922 364328 364235 408480 407226 400960 396245 378075 388249 391543 384783 360019 325297 335161
6315 335161 385495 376168 346466 356376 377703 364937 402895 419090 398926 394829 377453 385855
6303C85855J9203K9644N266j1985l7395k342L1175n1800J8187K7508r949j8085
6291C85282J5169K1612K0103J2307J5261k1308J6996k7297J2973J3729M932k2375
6279D47384k806M35J6734K4035L0264N144m2715M837J7533R816j7480N6603k6280
6266E23504L3405j827J170K7227J4836K2671L1237L0018N175L5636N2936M2558
6254H18546k8836L5187K3927N078J631l1197k321p991l626r451K8362K3733K7603
6241H80645j476M08P9885P738k7901O7142J2922j7124k1839k2109K3426K785o288
6228I78214j8802n1017K3039L9363n4204j4543k0345K8817j8077l5451p283k8423
6216H21288M3339N2332J707p560O860J7589m3938j7986k5405o9095m79m5658k5962
$$ plain form
6303 385855 405058 434702 439968 427983 390588 388246 419421 367621 385808 413316 403367 385282
6291 385282 400451 422063 442166 454473 469734 448426 465422 438125 451098 464827 469759 447384
6279 447384 444578 445013 461747 485782 516046 521190 478475 483312 500845 510661 493181 549784 523504
6266 523504 556909 555082 556252 583479 598315 620986 652223 682241 687416 723052 775988 818546
6254 818546 789710 824897 848824 853902 855533 824336 822015 814024 810398 800947 829309 853042 880645
6241 880645 879169 879577 959462 967200 939299 1006441 1019363 1002239 980400 958291 981717 984502 978214
6228 978214 959412 908395 931434 970797 916593 902050 881705 910522 892445 856994 849711 821288
6216 821288 864627 916959 918666 911106 917966 935555 891617 873631 848226 779131 778652 732994 707032
6203G07032K7564o060n9325l6162J6129m14k1700j3382k5539L8553J5286l757
6191F38225r437k1262q609n343J3884k5289m8242M6550N3556n6881j2158L947
6179E68941J0201J6365K0480k0040L0889m989j2633K1396j6832m3985J0833K1268
6167F01894L0716k5044l3074j470k1359M2426K9079M185n2399k715J3255K3349
6155F08843K9597J7923k8874L9389J1755j5724N743j4889N854L5013J9281m4625
6143F69286j3203K0714K87j657J8148N922k6573r021j585J6220J4899K4870P402
6130G25709j9438j3668K1015J9586q059j5978J4438j7995m274O6591k241l3936
6118G31750J7601J5000j9570Q942q285l0825o088M1173J0081j0111L1538M9510
$$ plain form
6203 707032 734596 728536 669211 633049 649178 648764 627064 613682 588143 626696 641982 638225
6191 638225 628788 607526 598917 593574 607458 582169 533927 580477 634033 577152 564994 568941
6179 568941 579142 595507 615987 595947 626836 621847 609214 630610 613778 569793 580626 601894
6167 601894 632610 607566 574492 573022 551663 594089 623168 627353 574954 572239 585494 608843
6155 608843 638440 656363 627489 666878 678633 662909 668652 653763 659617 694630 713911 669286
6143 669286 656083 676797 677084 675427 693575 699497 672924 663903 662318 678538 693437 718307 725709
6130 725709 706271 692603 713618 733204 725145 709167 723605 705610 701336 767927 765686 731750
6118 731750 749351 764351 744781 753723 745438 714613 708525 749698 759779 749668 781206 830716
6106H30716Q48r523m3550J7080J4735k6406j4092J078L8951P474M9426J0842l336
6093H74243L869k8459l3563L0836M3196L8843l008j6339j546j6043k2600j6881
6081H52548J4295o444m638j0272M0499N467N5068r750o13K43r634k996j4434j0166
6067H99173L7723J4853k3515Q342k4319K8590j1218L8382K9107k1463j0074J2093
6055I77674q89j3693m608K2844k78K5380L8347l283j8796j4037R819M26l6580
6042I82326J0432M2879J1712j7482j549M5538M3261j5225P398j0127J151k1371
6030A078943K4214J1991n974K9123P924K7908K6073J6776p037R77q448J2640j0370
6017A204740J0459M1335K7472J0234K592Q599j6384M6492P693J0760J5177J1861
$$ plain form
6106 830716 831564 822041 778491 795571 810306 783900 769808 770886 809837 817311 866737 877579 874243
6093 874243 878112 849653 816090 846926 890122 928965 925957 909618 908072 892029 869429 852548
6081 852548 866843 860399 855761 845489 885988 891455 946523 936773 936160 936403 926769 923773 909339 899173
6067 899173 936896 951749 928234 936576 912257 940847 929629 968011 997118 975655 965581 977674
6055 977674 976785 963092 958484 981328 981050 1006430 1044777 1041494 1022698 1008661 1018480 1018906 982326
6042 982326 992758 1035637 1047349 1029867 1028318 1073856 1117117 1101892 1109290 1099163 1100314 1078943
6030 1078943 1103157 1115148 1109174 1138297 1146221 1174129 1200202 1216978 1209941 1210918 1202470 1215110 1204740
6017 1204740 1215199 1256534 1284006 1294240 1296832 1305431 1289047 1335539 1343232 1353992 1369169 1381030
6005A381030L6927J0517J5414N464N5863j232J6287J7424K4507O293K5950O7690
5993A662134L5116K6295L6665J2695J00487N6991O1763R6601Q9882M1483R5398
5982B315510K3583k3535J3794j562m4055l4890K315n576K3083P765j269l825J5958
5969B287296L9994L6463P3786J37611J08954N9628J13451J00243J0260L5518P040
5958C010244m0223m9333o0424p8967r1490o1326j0195j05781j9720k2815k7384
5947B442586m9387K5983J0405M786L6678L6072Q2439R2019L1405P688j2545k9861
5935B678268l5845r8100m4524o0434q5726m3120k6997K61r185m1375o4318m7601
5923B121304m01k3494k7091k4385L0495j7288j776J2931P648J0903j9254k4709
$$ plain form
6005 1381030 1417957 1428474 1443888 1449352 1505215 1503983 1520270 1537694 1562201 1568494 1594444 1662134
5993 1662134 1697250 1723545 1760210 1772905 1873392 1930383 1992146 2088747 2178629 2220112 2315510
5982 2315510 2339093 2315558 2329352 2327790 2283735 2248845 2251160 2245584 2268667 2276432 2275163 2271338 2287296
5969 2287296 2327290 2363753 2437539 2575150 2684104 2743732 2857183 2957426 2967686 3003204 3010244
5958 3010244 2970021 2920688 2860264 2781297 2689807 2628481 2618286 2512505 2492785 2469970 2442586
5947 2442586 2393199 2419182 2429587 2434373 2471051 2507123 2589562 2681581 2712986 2720674 2708129 2678268
5935 2678268 2642423 2544323 2499799 2439365 2353639 2310519 2283522 2283783 2274598 2233223 2168905 2121304
5923 2121304 2120903 2097409 2070318 2045933 2076428 2059140 2057364 2070295 2077943 2088846 2069592 2044883
5911B044883M1340M7303l2462m2786K742r282q17N645N6975J4511l4436K7246
5899B120862M830K5414N388m887L881N3804r024N063N8849J6249k47L8364j0043
5886B308503o19J6850N685L3335l5609J563M1825m8645L2769L5535K6358J0739
5874B428289L2143L6717J795J3046m990L6828K8476J7692L6841K7509J5793j0686
5862B659453j7985L1770L9435J7484p429L1844j041J7166J838L8776R001L8027
5850B858339L9188j5327K522J1278M5738P6405K1438O5991N2512Q3073l2091l1018
5838C178048L4727R869K9051M2496K2814j4973M2923M5216L9027n831r522k3914
5826C389931K9771P8945P4591L4127J5285L5937O5936M0883M0808o074N4663O1526
$$ plain form
5911 2044883 2086223 2133526 2101064 2058278 2061020 2051738 2050921 2056566 2113541 2128052 2093616 2120862
5899 2120862 2125692 2151106 2156494 2151607 2155488 2209292 2200268 2205331 2264180 2280429 2280182 2318546 2308503
5886 2308503 2307884 2324734 2330419 2363754 2328145 2329708 2371533 2322888 2355657 2391192 2417550 2428289
5874 2428289 2460432 2497149 2498944 2511990 2507000 2543828 2572304 2589996 2626837 2654346 2670139 2659453
5862 2659453 2641468 2673238 2712673 2730157 2722728 2754572 2753531 2770697 2772535 2811311 2820312 2858339
5850 2858339 2897527 2882200 2884722 2896000 2941738 3018143 3039581 3105572 3158084 3241157 3209066 3178048
5838 3178048 3212775 3222644 3251695 3294191 3317005 3302032 3344955 3390171 3429198 3423367 3413845 3389931
5826 3389931 3419702 3498647 3573238 3607365 3622650 3658587 3724523 3765406 3806214 3800140 3854803 3916329
5814C916329Q563J696L3280M1180M7112l097N4540K7138K0244N3791M2145R5629
5802D338550L6152K6985M9993M6001J1516K8673J12790M353Q1462M7580L1238
5791D815293N5884J2619J8961Q135O2782L0419R2013J6926M2439O8769Q8623J05895
5779E418758Q1861Q1826P8315N2085L4390R7553J12797N3106N7252Q8747O7301
5768F223991P4077Q6378R3254O9573P9303J12078J05109J28347J24496Q4101R2433
5757G273140J57644J45492J47167J29847J01436J32031J96900J45324J57023K06726
5747H792730J41089J18069J59346J31875K16946J77407J85203J81808J58074K49883
5737A0512430J98551K06877K00727J88719K41417K08735L02258K58556K79277
$$ plain form
5814 3916329 3924892 3926588 3959868 4001048 4048160 4045063 4099603 4126741 4146985 4200776 4242921 4338550
5802 4338550 4374702 4401687 4451680 4497681 4509197 4537870 4650660 4655013 4736475 4784055 4815293
5791 4815293 4871177 4883796 4902757 4910892 4973674 5004093 5096106 5113032 5155471 5224240 5312863 5418758
5779 5418758 5500619 5582445 5660760 5712845 5747235 5844788 5957585 6010691 6067943 6156690 6223991
5768 6223991 6298068 6384446 6477700 6547273 6626576 6738654 6843763 6972110 7096606 7180707 7273140
5757 7273140 7430784 7576276 7723443 7853290 7954726 8086757 8283657 8428981 8586004 8792730
5747 8792730 8933819 9051888 9211234 9343109 9560055 9737462 9922665 10104473 10262547 10512430
5737 10512430 10710981 10917858 11118585 11307304 11548721 11757456 12059714 12318270 12597547
5728A2597547K83819K89093L14448L55666L85453M22459M53089M67729N25406
5719A6094709M59979M38375M51527L81584L28076L11801L23732L30438L32485
5710A9452706L31973L55549L38883L94812M57710M85320O04474O50303P18735
5701B3790465P14846Q65041J035589J024238R14060R36924Q34477Q19398Q88413
5692C1823451R82095J013715J059307J145604J293438J487877J747061J951761
5684D2504309K204212K181752K136145K116893K155527K295301K537643K789076
5676F0920858L060099L361993L724975M224681M978635O193871P895463R645619
5668A04006194J1223408J1947642J1808512J1472292J0721312R132321N302617
$$ plain form
5728 12597547 12881366 13170459 13484907 13840573 14226026 14648485 15101574 15569303 16094709
5719 16094709 16554688 16993063 17444590 17826174 18154250 18466051 18789783 19120221 19452706
5710 19452706 19784679 20140228 20479111 20873923 21331633 21816953 22421427 23071730 23790465
5701 23790465 24505311 25370352 26405941 27430179 28344239 29281163 30115640 30935038 31823451
5692 31823451 32805546 33819261 34878568 36024172 37317610 38805487 40552548 42504309
5684 42504309 44708521 46890273 49026418 51143311 53298838 55594139 58131782 60920858
5676 60920858 63980957 67342950 71067925 75292606 80271241 86465112 94360575 104006194
5668 104006194 115229602 127177244 138985756 150458048 161179360 170311681 175614298
5661A75614298P81561l325153n829895n265376l602899j951997r71598r03816
5653A54545125r80367j64287J303931L742065O927051J0575294J3738152J5834972
5645B05521936J6130106J5844487J5685488J4860392J0241364K071568n036668
5638B75318673j0023981j1104589r679362r128699j1333931j2297423j1908256
5631A99842432j1161142r211935o701471m721313k959178o83753K149123N444463
5623A71997226Q259210R733666Q921391P283437O107208M767148N70660p068007
5615B10571939j4077501j7272115j6990809j4777491j1726863r510965q937698
5608A17278497r002903q775264q278403p655283o908917o008475n121145m448522
$$ plain form
5661 175614298 176395859 173070706 167240811 161975435 158372536 156420539 155448941 154545125
5653 154545125 153564758 153400471 154704402 158446467 165373518 175948812 189686964 205521936
5645 205521936 221652042 237496529 253182017 268042409 278283773 280355341 275318673
5638 275318673 265294692 254190103 244510741 235382042 224048111 211750688 199842432
5631 199842432 188681290 179469355 172767884 168046571 165087393 164403640 166552763 171997226
5623 171997226 180256436 189990102 198911493 206194930 212302138 217069286 217639946 210571939
5615 210571939 196494438 179222323 162231514 147454023 135727160 126216195 117278497
5608 117278497 108275594 99500330 91221927 83566644 76657727 70649252 65528107 61079585
5600F1079585l894019l414306l064548k746286k462667k282362k085753j847230
5592C9282414j764016j558759j403728j356098j249173j138061j084615j066443
5584B8661521r58098q30327p73354p49015o73417o76418o10479n98063n31753
5575B2260597m85808m55500m75751m72654n11057m33645m28346m06872l74164
5566A8216800l68177l44315l95839k91619l17592k76639k76572k42517k24388
5557A5479142k03417j76842k00863j70661j69785j56759j28439j46019j25044
5548A4001313j84719p8650j16346j18440q9024r1156n9805k0223L908J2450M8011
5537A3307319q524o37L665q031k0363o2279j50608j26052k07015r6181p5496j00493
$$ plain form
5600 61079585 57185566 53771260 50706712 47960426 45497759 43215397 41129644 39282414
5592 39282414 37518398 35959639 34555911 33199813 31950640 30812579 29727964 28661521
5584 28661521 27703423 26873096 26099742 25350727 24677310 24000892 23390413 22792350 22260597
5575 22260597 21774789 21319289 20843538 20370884 19859827 19426182 18997836 18590964 18216800
5566 18216800 17848623 17504308 17108469 16816850 16499258 16222619 15946047 15703530 15479142
5557 15479142 15275725 15098883 14898020 14727359 14557574 14400815 14272376 14126357 14001313
5548 14001313 13816594 13737944 13621598 13503158 13414134 13322978 13263173 13242950 13246858 13259308 13307319
5537 13307319 13298795 13298158 13301823 13293792 13273429 13211150 13060542 12934490 12727475 12631294 12555798 12455305
5525A2455305q4534r2606o6478k1593k3114n393k2891n6497J9056J083q410M9616
5513A2143544Q638N104L3745K3153L2562R6553M3747P7957R0747J24953J02776
5502A2783479J24085J10602J58927J66124J13644M7928P1962Q1971N8051K5081
5492A3741854P0094N8534P9417J20813J35530J29747R0514J59582J66162J78046
5482A4930293K28654K27090K51775K79147K70447K78352K99120L65406L82875
5473A7513159L98471M14208M18641L97804M10252L58499L63941L58789L49215
5464B0982979L48627L97166M11331M08894M96616N42831N61399O42715O52976
5455B5445534P10376P43900Q25505Q94575R49109R80134J002533J092374J164186
$$ plain form
5525 12455305 12370771 12278165 12211687 12190094 12166980 12161587 12138696 12082199 12101255 12102338 12093928 12143544
5513 12143544 12152182 12157286 12191031 12214184 12246746 12343299 12387046 12465003 12555750 12680703 12783479
5502 12783479 12907564 13018166 13177093 13343217 13456861 13504789 13576751 13658722 13716773 13741854
5492 13741854 13811948 13870482 13949899 14070712 14206242 14335989 14426503 14586085 14752247 14930293
5482 14930293 15158947 15386037 15637812 15916959 16187406 16465758 16764878 17130284 17513159
5473 17513159 17911630 18325838 18744479 19142283 19552535 19911034 20274975 20633764 20982979
5464 20982979 21331606 21728772 22140103 22548997 23045613 23588444 24149843 24792558 25445534
5455 25445534 26155910 26899810 27725315 28619890 29568999 30549133 31551666 32644040 33808226
5446C3808226J222134J285279J305431J507852J528562J665369J872876J993269
5438D6188998K219900K430072K655751K773375K889431K957928L011388L172025
5430F8298868L401914L659670L943510M345974M779274N327324O048253O921669
5422A06726456P884245Q995790R988844J0754851J0998252J0738652R890025Q542077
5414A84519192O599521M046354J358016r99418k572922l292308l317372l038799
5406A83302264k366484j659647q14143R4337J235285K544395L890622N204589
5398A91431218O408734P452121Q042081Q082676P312847N948509M242810K244723
5390B41165719o0410k712026n435420p752684r253962r749775r456641q694836
$$ plain form
5446 33808226 35030360 36315639 37621070 39128922 40657484 42322853 44195729 46188998
5438 46188998 48408898 50838970 53494721 56268096 59157527 62115455 65126843 68298868
5430 68298868 71700782 75360452 79303962 83649936 88429210 93756534 99804787 106726456
5422 106726456 114610701 123606491 133595335 144350186 155348438 166087090 175977115 184519192
5414 184519192 191118713 195165067 196523083 195523665 192950743 189658435 186341063 183302264
5406 183302264 180935780 179276133 178461990 178556327 179791612 182336007 186226629 191431218
5398 191431218 197839952 205292073 213334154 221416830 228729677 234678186 238920996 241165719
5390 241165719 241105309 238393283 232957863 225205179 215951217 206201442 196744801 188049965
5382A88049965p770700o921483o061203n189407m257153l193151k051908r99280
5374A51605680k13171K64745L73714J47404m96662j601156l109315m665199o080978
5365A36225062p086300p584995p515844p164620o745662o399821o064734n670946
5357H1992140n341251n054712m699274m257270l889299l493026l203582k855675
5349D9198051k632159k367109k166410k010187j851797j665173j536267j432048
5341C3536901j306441j213805j121567j044171r57619q52712q17027p90213p36185
5332B4697161p74596p27420o67818o67085p02652o07863n99753o04465n36533
5323A8808976m64794m38269m73377m13561l92972m05901l33363k91319k76129
$$ plain form
5382 188049965 180279265 173357782 167296579 162107172 157850019 154656868 152604960 151605680
5374 151605680 151392509 151657254 152030968 152178372 151681710 150080554 146971239 142306040 136225062
5365 136225062 129138762 121553767 114037923 106873303 100127641 93727820 87663086 81992140
5357 81992140 76650889 71596177 66896903 62639633 58750334 55257308 52053726 49198051
5349 49198051 46565892 44198783 42032373 40022186 38170389 36505216 34968949 33536901
5341 33536901 32230460 31016655 29895088 28850917 27893298 27040586 26223559 25433346 24697161
5332 24697161 23922565 23195145 22527327 21860242 21157590 20549727 19949974 19345509 18808976
5323 18808976 18344182 17905913 17432536 17018975 16626003 16220102 15886739 15595420 15319291
5314A5319291k84424l08417l05927k80645k91224l02101k84286k84502l03907
5305A2673858k32292k65255k50137k07498k64313k45814k30666j90454j52687
5296A0634742j53176j31557j28682j37035r3032j32557r2365p0047q6636j18452
5286I491203p9019p4892j95371j52992j22914j55621j40144k10843r4971j68603
5276H095833j55350m1950j05860j03144j10504q3548r2741j91210j27802j82812
5266F900912j80944j17400j38861j04891j22884j20942q8509j25641j8610n8372
5256E823858p5454p5115q5853n7781o1395r458n2659o8787p6095o9150j04430
5245E087681j11759j13182r5157j12679n5992q9550j06823j10242j10142p1592
$$ plain form
5314 15319291 15034867 14726450 14420523 14139878 13848654 13546553 13262267 12977765 12673858
5305 12673858 12441566 12176311 11926174 11718676 11454363 11208549 10977883 10787429 10634742
5296 10634742 10481566 10350009 10221327 10084292 9991260 9858703 9766338 9696291 9609655 9491203
5286 9491203 9412184 9337292 9141921 8988929 8866015 8710394 8570250 8359407 8264436 8095833
5276 8095833 7940483 7898533 7792673 7689529 7579025 7495477 7402736 7211526 7083724 6900912
5266 6900912 6719968 6602568 6463707 6358816 6235932 6114990 6026481 5900840 5882230 5823858
5256 5823858 5748404 5673289 5587436 5529655 5468260 5458802 5406143 5337356 5261261 5192111 5087681
5245 5087681 4975922 4862740 4767583 4654904 4598912 4509362 4402539 4292297 4182155 4110563
5235D110563l7213l3283n2114n9211p8768o4446n4787k4453N389j3923l1328o5555
5223C600871j6328j3999J1078o6112n2763l7705o5122k8499m2299r0248p3281
5212C125593q1549k6828k0220r1036m8768l6201J6518N14n7307m7983J190l4009
5200B699914o7452k8944l5895k8383o8771m8166M222j2362o8449l0358P103K533
5188B324992J0292k4747o2986k4003l6274j3519m1121j7270j5874l678l253m6539
5176B046020K4124j0703l2270J7987k3848l1370J1872K1974k3910o018J4328j7676
5164A990510j8920j0157j4680l0964j5562m8985p6m0390k9159Q435O103l512m1364
5151A751279J6056K724N899m2123k6235j6477j5386K4692J6713J5268j423j628
$$ plain form
5235 4110563 4073350 4040067 3987953 3928742 3849974 3785528 3730741 3706288 3711677 3697754 3666426 3600871
5223 3600871 3584543 3570544 3581622 3515510 3462747 3425042 3359920 3331421 3289122 3198874 3125593
5212 3125593 3044044 3017216 2996996 2905960 2857192 2820991 2837509 2838023 2780716 2732733 2733923 2699914
5200 2699914 2632462 2603518 2567623 2539240 2470469 2422303 2426525 2414163 2345714 2315356 2322459 2324992
5188 2324992 2335284 2310537 2247551 2223548 2187274 2173755 2132634 2115364 2099490 2095812 2092559 2046020
5176 2046020 2070144 2059441 2027171 2045158 2021310 1989940 2001812 2023786 1999876 1993858 2008186 1990510
5164 1990510 1971590 1961433 1946753 1915789 1900227 1851242 1851166 1810776 1781617 1790052 1796155 1792643 1751279
5151 1751279 1767335 1770059 1775958 1733835 1707600 1691123 1675737 1700429 1717142 1732410 1730987 1729359
5139A729359p342J4832l1533O500l2992n543j2092j3731P970r80q099j3552m991
5126A627806l9620q828J819K525j6044l7512k1923K2825N7428J8404p466J3573
5114A612987J9813k2921J4968r939j3468K2194L1926N2030j8332O789O7162K6667
5102A789876Q5969K6424J9063M9700M1448M2193K6425P457P7670K7723O9582j6814
5090B246716M248O5631R5L0355L385l7947m8401K0291j7375n6278M3491J8535
5078B272746K6571O9291J8759K8654O5330K2735L2312M6381L1473Q5321L8855
5067B738428k6378k8225N699L998l4718n5435m3105n0294L9190l6322k0055j9220
5055B473563j5655J690l0797j6340K2141M5908J2134J7650M8122J6741M6795K9133
$$ plain form
5139 1729359 1722017 1736849 1705316 1711816 1678824 1673281 1661189 1647458 1655428 1654448 1646349 1632797 1627806
5126 1627806 1588186 1579358 1581177 1583702 1567658 1530146 1508223 1531048 1588476 1606880 1599414 1612987
5114 1612987 1632800 1609879 1624847 1614908 1601440 1623634 1655560 1707590 1689258 1696047 1763209 1789876
5102 1789876 1875845 1902269 1921332 1971032 2012480 2054673 2081098 2088555 2166225 2193948 2263530 2246716
5090 2246716 2250964 2316595 2316690 2347045 2350430 2312483 2264082 2284373 2266998 2210720 2254211 2272746
5078 2272746 2299317 2368608 2387367 2416021 2481351 2504086 2536398 2582779 2614252 2699573 2738428
5067 2738428 2712050 2683825 2689524 2693522 2658804 2603369 2560264 2509970 2549160 2512838 2492783 2473563
5055 2473563 2457908 2459598 2428801 2412461 2434602 2480510 2492644 2510294 2558416 2575157 2621952 2651085
5043B651085l0414l4252L0502l4153j8625M0395M0669O3764N4883N4722K4337
5032B842913k5248l7262N604Q051j9895m578J1439P6164j9288L1253O0064K5742
5020B954959L9732K4389M2329O6815R5232J03259O6231P5785R7441J11999J60633
5009C838804J20809J16504J92022K22217K74249K93280K76263L98657M26727M62193
4999F621725N76643N09694M08833M17585L83388M28404M90924N15037N64953O63560
4989A1580746P24966Q55209J131910J591144K085065K590547K984998L098115
4981B6642700K986791K705234K325659J458351n6984j321963k716935l377994
4973B8644859k919872k404884j975893j529245j440630j522739j461852j437874
$$ plain form
5043 2651085 2620671 2586419 2616921 2582768 2564143 2604538 2645207 2708971 2763854 2818576 2842913
5032 2842913 2817665 2780403 2786007 2794058 2774163 2769585 2781024 2857188 2837900 2869153 2929217 2954959
5020 2954959 2994691 3019080 3061409 3128224 3223456 3326715 3392946 3468731 3566172 3678171 3838804
5009 3838804 3959613 4076117 4268139 4490356 4764605 5057885 5334148 5732805 6159532 6621725
4999 6621725 7198368 7708062 8116895 8534480 8917868 9346272 9837196 10352233 10917186 11580746
4989 11580746 12305712 13160921 14292831 15883975 17969040 20559587 23544585 26642700
4981 26642700 29629491 32334725 34660384 36118735 36061751 34739788 32022853 28644859
4973 28644859 25724987 23320103 21344210 19814965 18374335 16851596 15389744 13951870
4965A3951870j228831j086393r51092p95230o76607n87310n18689m87510l92702
4956G227506l54819k76266k49997k42625k01812j75205j44557j18336j01097p0811
4946E291981r9961o8654r513o8681n6180K5988J4285M2571M5039P9771Q5600J49411
4934E431657J62298J71820K16527K78779L43262L75911L93003M32860M19995L55775
4924H581887L42248L63215M47137M28873N00411N13777O71631Q06034J010893
4915A3666106J416578J905408K349322K660911K720491K748191K710749K344416
4907C2522172J370656j17292q26851j622699k865251k964554k364764k132489
4899B0998928j891989j508563j426740j398925j405068j280891j169733j001746
$$ plain form
4965 13951870 12723039 11636646 10685554 9890324 9213717 8626407 8107718 7620208 7227506
4956 7227506 6872687 6596421 6346424 6103799 5901987 5726782 5582225 5463889 5362792 5291981
4946 5291981 5192020 5123366 5113853 5045172 4988992 5014980 5029265 5071836 5116875 5196646 5282246 5431657
4934 5431657 5593955 5765775 5982302 6261081 6604343 6980254 7373257 7806117 8226112 8581887
4924 8581887 8924135 9287350 9734487 10163360 10663771 11177548 11849179 12655213 13666106
4915 13666106 15082684 16988092 19337414 21998325 24718816 27467007 30177756 32522172
4907 32522172 33892828 33775536 32948685 31325986 28460735 25496181 23131417 20998928
4899 20998928 19106939 17598376 16171636 14772711 13367643 12086752 10917019 9915273
4891I915273q39668p14144n56299m39143m10374l84530k95752k47285k11538k44311
4881E572229k55869k20623k62021k70617k08978j49539j71759j62388j50562j13998
4871C605875j25405j36115n1728l9883o3933k6879R258J0745P5988P1319L4434
4860C363676O444K9737j8725q7107j04215r5919j65276j72314j62792j19158j30197
4849B344154r1959j18569r6987j01370j76264n0090j5546q4661o5962k8493p4745
4838A439508k2919p8545p8313q38r633k3093k2616k5058Q603m6647m8415m20l2961
4825A058653k4980n247L6679m2679k3789M169j0697j8864J6673N0318M0750K0700
4813A101686l400j29K1160m5991n0118n7223n9172j6512j6984m2419l6435l3375
$$ plain form
4891 9915273 9075605 8361461 7805162 7366019 6955645 6571115 6275363 6028078 5816540 5572229
4881 5572229 5316360 5095737 4833716 4563099 4354121 4204582 4032823 3870435 3719873 3605875
4871 3605875 3480470 3344355 3292627 3252744 3188811 3161932 3171190 3181935 3257923 3329242 3363676
4860 3363676 3370120 3399857 3381132 3294025 3189810 3093891 2928615 2756301 2593509 2474351 2344154
4849 2344154 2252195 2133626 2036639 1935269 1759005 1708915 1693369 1608708 1542746 1514253 1439508
4838 1439508 1416589 1338044 1259731 1258893 1249260 1226167 1203551 1178493 1187096 1140449 1092034 1091614 1058653
4825 1058653 1033673 1028426 1065105 1022426 998637 1002806 992109 973245 989918 1040236 1080986 1101686
4813 1101686 1098286 1098157 1119317 1073326 1023208 965985 906813 890301 873317 830898 794463 761088
4801G61088N993l9295j8372k0541k5625j5522j8298L0180j5395l3153n4962J0028
4789E66126k4636l0848M798o780J0399J2919k7768J450p889n142j5667k507j2077
4776D62378j0976l3363k6838J1285J6537j7926m774O858K4112j7346j0555k75
4764C99117j3790K7051m5963l4478M479R328n2887q530J8022o433n889K6669J3867
4751C30563j0238m3363J4858q418k3032L4221j4974m1643k963M1108K1649o2137
4739B35631o33K4379K0130p452m3760M711O995m1585n425K2268j669J2636J2286
4726B38512J9717n0622k7699J8175j505J0923M3216n1737J1579O158k5365j1940
4714A79412j6792q855p398K9329k4661j2709L3260R809j7623k1786n1162l144
$$ plain form
4801 761088 767081 727786 709414 688873 663248 647726 629428 659608 644213 611060 556098 566126
4789 566126 541490 510642 515440 508660 519059 531978 504210 505660 497771 492629 476962 474455 462378
4776 462378 451402 418039 391201 402486 419023 401097 396323 403181 427293 409947 399392 399117
4764 399117 385327 412378 366415 331937 336416 345744 292857 284327 302349 295916 290027 316696 330563
4751 330563 320325 276962 291820 283402 260370 294591 279617 237974 235011 276119 297768 235631
4739 235631 234998 259377 279507 272055 228295 233006 240001 198416 192991 215259 213590 226226 238512
4726 238512 258229 207607 179908 198083 196578 207501 250717 198980 210559 216717 191352 179412
4714 179412 162620 153765 146367 175696 151035 138326 171586 181395 163772 141986 90824 87680
4702H7680K1598J7019N645j7600k7822N557M2550j5820L3283k4016J8925J8093
4690A65092K5762l0857j8538j4763j2565M7635O763J5930k0247R088q055k2731
4678A42514J4069K7088J0062k61l581q126J6500j3718q540M0491K6720K0751J1185
4665B75154j8301J7843J7851k2729k6331j9211n206k0737J3096J141L0075j8841
4653B23804j1136n423N914m624j7177j0781n5281J6650J2113n3682M5236J1782
4641A57395m2778j3293K147K0837j2528m921Q374j7707J8315J5317K404J0962
4629A44524P032k1925J345J272j1764J6880n018j8348K5039j3614l909K9805J0887
4616A62206J9970k6450n0779j4020J0901r75J724K740q526j0987K8391L217Q203
$$ plain form
4702 87680 109278 126297 131942 114342 86520 92077 134627 118807 152090 128074 146999 165092
4690 165092 190854 159997 141459 126696 114131 161766 168529 184459 164212 173300 165245 142514
4678 142514 156583 183671 193733 193472 189891 181765 198265 184547 176007 216498 243218 263969 275154
4665 275154 256853 274696 292547 269818 243487 224276 219070 198333 211429 212570 242645 223804
4653 223804 212668 207245 213159 208535 191358 180577 125296 141946 154059 100377 145613 157395
4641 157395 114617 101324 103471 124308 111780 106859 115233 97526 115841 131158 133562 144524
4629 144524 151556 129631 130976 132248 120484 137364 132346 113998 139037 125423 121514 151319 162206
4616 162206 182176 155726 104947 90927 101828 100853 102577 105317 96791 85804 114195 117412 125615
4603A25615K2622J0988k2450J0695J8381k4751k4017M3409R06j0094J4836L3063
4591A99203L9993N5597m7993j6525K0458l1829k3772M506j9674k5087P088p2866
4579H9099K797J9333k554m9985J9706J1089j0692q253j676P178k1898k8073K0158
4566D6229K0805L007j3901j4856n692j2599j7620K6246R236L0978Q229o27k3194
4553E6241J0698R923k6121l5152J5671J6322k5505J6468R555l6315K940J4144
4541B8869j5753j0838j4252L018l946L1764l7607K1220K8044j2514j5460O383
4529H928m2798K9364L379L4535K1826k6465p1427J1216K4330J2698L14l035k8468
4516b5603R341n00R452m75j9327J5611L2492L137l2600p210Q726K8692L2679l5873
$$ plain form
4603 125615 148237 159225 136775 147470 165851 141100 117083 160492 161398 151304 166140 199203
4591 199203 239196 294793 246800 230275 250733 218904 195132 199638 179964 154877 161965 89099
4579 89099 91896 111229 108675 58690 78396 89485 78793 70540 68864 76042 54144 26071 46229
4566 46229 67034 70041 56140 41284 35592 22993 5373 31619 40855 71833 80062 79435 56241
4553 56241 66939 76862 50741 15589 31260 47582 22077 38545 48100 11785 14725 28869
4541 28869 13116 2278 -11974 -8956 -12902 18862 -18745 2475 30519 18005 2545 8928
4529 8928 -33870 -4506 -1127 33408 55234 28769 -42658 -31442 -7112 5586 5900 2865 -25603
4516 -25603 -16262 -16762 -7310 -7785 -27112 -11501 20991 24128 -8472 -15682 -6956 21736 54415 18542
4502A8542k7780L7204k3706K9532P288m1417M098M8186k4802l961p952q855k313
4489D064K6187k3013P430j0244k8379J4805J3220r321k7937J8826j1346J0383
4477a5325j125j2646j5497L044K1812R627P976J0168k4591L271Q6244l3927m6812
4464g781j3716P0545j8730J7889J4096k3165q816l0975K709j3350J321L3236q476
4451A4787j7300J6761n02J5068K0310j4481L883j6299j7802k901J6320k2564K6804
4438B2084K6907r614L6617O1292m631k7557j6717j6979j1448o969j1243L0090
4426G1832K1971o6037p191Q909j9280J977N3993l5036p136q015j9662o915N724
4413d866J4236K4924j6603j4733n003J5935J5758L7278J827j6720k316L873j927
$$ plain form
4502 18542 -9238 27966 4260 33792 41080 -337 3761 51947 27145 23184 15232 6377 4064
4489 4064 30251 7238 14668 4424 -23955 -9150 4070 -5251 -33188 -14362 -25708 -15325
4477 -15325 -16450 -29096 -44593 -41549 -19737 -10110 -2134 8034 -16557 -13286 72958 39031 -7781
4464 -7781 -21497 49048 30318 48207 62303 39138 30322 -653 2056 -11294 -9973 23263 14787
4451 14787 -2513 14248 13746 28814 49124 34643 38526 22227 4425 1524 17844 -4720 22084
4438 22084 48991 39377 75994 137286 132655 105098 88381 71402 59954 52985 41742 71832
4426 71832 93803 27766 20575 29484 10204 12181 66174 31138 24002 15987 -3675 -10590 -4866
4413 -4866 9370 34294 17691 2958 -2045 13890 29648 66926 68753 52033 49717 53590 51663
4400E1663k2497o002k0480K043L3541k684J6597j1340j03L9541J3263l6192m870
4387E2480K5215J6255k6303j5529K0959J366J6929k8769K4141O832l4515k0901
4375C8160O679Q895J2890J8091N797l3830k4386J9449M9378j6614o83M6388L4269
4362A64483J3309l6463m495K4972j3272j8514J3747L2628L1512k8820O424K5416
4350B10927K0693J7744p327K280L39k2885m863j4276q339l7160K0571k2800J4538
4337A69442L678m7764j6668M4738j9028k4084K3294L456J9175l0592j994k4399
4325I9254M734n551r623l8849K4448L410k6634r261O0911k303n0168k9410J5057
4312C6015Q926K375J028l712R581N455j7746o955J3093Q349M8647K139N2p3542
$$ plain form
4400 51663 29166 23164 2684 4727 38268 35584 52181 40841 40738 80279 93542 57350 52480
4387 52480 77695 93950 67647 52118 73077 74443 91372 62603 86744 93576 59061 38160
4375 38160 44839 53734 66624 84715 90512 56682 32296 51745 101123 84509 83826 130214 164483
4362 164483 177792 141329 136834 161806 148534 130020 143767 176395 207907 179087 185511 210927
4350 210927 231620 249364 242037 244317 244656 221771 216908 202632 194293 157133 177704 154904 169442
4337 169442 173120 125356 108688 153426 134398 110314 133608 137064 156239 125647 123653 99254
4325 99254 103988 98437 88814 49965 74413 77823 51189 41928 102839 100536 50368 20958 36015
4312 36015 44941 47316 48344 44632 54213 59668 41922 34967 48060 56409 105056 107195 107247 33705
4298C3705j2660L7770J999l0225J4704l742k3843P705L4852o933o005O468q065
4285D5730K2508j6707p0808Q652L6035l6612p32M0720n626j9743P027K64J8927
4272B9635J4173j9811j0700q354j6537M8069J3852j6726L4675m2923l1404N4402
4260D8351k8154k5256l2792K1923N3357k451k8644k900j03q544j6990K4058L164
4247E019K8460K2327m5074p587L88K2147N806j7434k3762l1154L1625J2584k3504
4234b0159J2808K3161k1769r185J3417r669j5036K2713L134K957K3376Q74N41
4221B7163P035k1215k3956O614K0642m138J0852l534j9015K4368o2321J4572P2749
4208D9816j5229O330m968q482k1084J2510K2348r174j3597j8598J8023K9583q787
$$ plain form
4298 33705 21045 58815 60814 30589 45293 41551 17708 25413 60265 53332 47327 53795 45730
4285 45730 68238 51531 -19277 -10625 25410 -11202 -11934 28786 23160 3417 10444 10708 29635
4272 29635 43808 23997 13297 4943 -11594 36475 50327 33601 68276 25353 -6051 48351
4260 48351 20197 -5059 -37851 -15928 37429 34978 6334 3434 3331 -5213 -22203 1855 5019
4247 5019 33479 55806 10732 3145 3533 25680 31486 14052 -9710 -40864 -9239 3345 -20159
4234 -20159 -7351 15810 -5959 -15144 -1727 -11396 -26432 -3719 -585 2372 25748 26622 27163
4221 27163 34198 12983 -10973 -4359 16283 12145 22997 19463 448 24816 -37505 -22933 49816
4208 49816 34587 40917 35949 27467 6383 18893 41241 32067 18470 -128 17895 47478 38691
4195C8691n015J799M4394l773l5617Q726r696J9119K8296J5319l9537m7383K6463
4182D1786J2097N0803R078K6575L0974m2020l8198j3187j7616j7308L3809n536
4170G1257J824L6799K0681k5336n754l5073J7420j0392j1580p353J4579l6484
4158C0588K8845J9935M6973R809K5799l529k7412o800j6200k3988J3992R731J477
4145A09220K1246k0375l068R565J660r772o05J0007K8154j0829j0589j3430L7687
4132A48871K5570n2958j9313J132l871M8444J5887P013m976n1028j4550K1559
4120A21780O1590J3177m434P796K1017m7348j487K7564k547j6885R686L7964j4364
4107B13509K47J7616L1516j7611L050P053K3785l9080r956J3277K5854j8292M3465
$$ plain form
4195 38691 33676 35475 79869 76096 40479 49205 39509 58628 86924 102243 62706 15323 41786
4182 41786 53883 104686 113764 140339 171313 129293 91095 77908 60292 42984 76793 71257
4170 71257 73081 109880 130561 105225 99471 64398 81818 71426 59846 52493 67072 30588
4158 30588 59433 79368 126341 136150 161949 158420 131008 124208 108008 84020 98012 107743 109220
4145 109220 130466 110091 107023 116588 118248 108476 107871 117878 146032 135203 124614 111184 148871
4132 148871 174441 121483 102170 103302 99431 147875 163762 170775 165799 114771 100221 121780
4120 121780 183370 196547 192113 199909 220926 173578 172091 199655 197108 180223 189909 227873 213509
4107 213509 213756 231372 262888 245277 248327 255380 279165 240085 230129 243406 269260 250968 294433
4094B94433M6935M711k4378m735M2615L2579M1672N0593J7966j4957N475r642
4082D83267l6305M2034J2205J1159r793l1186j9681K2566L2946M3650j282L9455
4070E89035K4574L784K4879K3361J6421L5383N622q723J4940M0133M1269N4577
4058H65255J0890J8806N9057O2382R1361Q1008J11931J40486J13889O5652R3405
4047A714122L5217L0941K4996j9997j1753K4129j5738j0500L1393M2382M3481
4036A888673K7093N0680O7736J01173J09566J06821J41220J49132K07291K65893
4026C115278L33539L91773N93617P56943Q63685R48514J116834J019861P07123
4017I847167Q8306l32004l11694l92284o69420r41955r79232p93671o47151n62113
$$ plain form
4094 294433 341368 346079 321701 316966 359581 392160 433832 484425 502391 487434 492909 483267
4082 483267 446962 488996 501201 512360 502567 471381 451700 474266 507212 550862 549580 589035
4070 589035 613609 617393 642272 665633 682054 717437 723059 714336 729276 769409 810678 865255
4058 865255 876145 894951 954008 1016390 1107751 1188759 1300690 1441176 1555065 1620717 1714122
4047 1714122 1749339 1780280 1805276 1785279 1773526 1797655 1781917 1771417 1802810 1845192 1888673
4036 1888673 1915766 1966446 2034182 2135355 2244921 2351742 2492962 2642094 2849385 3115278
4026 3115278 3448817 3840590 4434207 5191150 6054835 7003349 8120183 9140044 9847167
4017 9847167 9935473 9603469 9291775 8899491 8230071 7288116 6308884 5515213 4868062 4305949
4007D305949m47000l59276k99445k47098k38937k20673j65482j27371j55289j28138
3997A917240r4868q9881j19121r0850r1837o5129n9255p9340m9940j4564m8448
3986A114007o4430j2290m2083q358l5071p0491n6716j0330m2976j6236k0941l875
3974G30210k1987j4607p5848m0564j578N309j4454l8997L2770q603l5486k7512
3962D88653J6580m762k8323Q88m567j5096m158l2587l0147p692j5479j7422R062
3949C54950K5611q22O311k318L0556j5643j8393j7799m0295J194j877j2513J1257
3936C20219m530l7188L2099m129r690R95l093J8407k3217M045k2930L427j5305
3923B59110k9051L5749M18j0660p7M8294l800l3423L254K652k8678k547l8555
$$ plain form
4007 4305949 3858949 3499673 3200228 2953130 2714193 2493520 2328038 2200667 2045378 1917240
3997 1917240 1822372 1732491 1613370 1522520 1430683 1365554 1306299 1226959 1177019 1162455 1114007
3986 1114007 1049577 1037287 995204 986846 951775 881284 824568 814238 771262 755026 734085 730210
3974 730210 708223 693616 617768 577204 575626 580935 566481 527484 560254 551651 516165 488653
3962 488653 505233 500471 472148 473036 468469 453373 449215 416628 386481 378789 363310 345888 354950
3949 354950 380561 379739 386050 383732 414288 398645 380252 362453 322158 323352 321475 308962 320219
3936 320219 315689 278501 310600 306471 296781 297776 294683 313090 289873 293918 270988 274415 259110
3923 259110 230059 265808 266226 255566 255489 303783 299983 266560 269814 272466 243788 241241 202686
3910B02686j3704K6470L3395K8981l212j0623k1211l0402J2880k6562j9558J4143
3898A93283Q747L0151N125j7692j17K3218q736K057k5568m448R372j0012K4953
3885B30333j0495J2634L3683l4938N275q224l988k486P151Q020l0814J4854K3897
3872B44902J6693J4573m2434K0876k7090k7673J8398J8731j198J0777J2666j0111
3860B49110k5681R773L3536j2666p144K4954j1453j2593n811J5925O7011k4393
3848C00568m9677J5031J0136j2617K1075K9379l5128J404k0675J401J4244J8609
3836B93750k6639r198J1653k4392K350J1355R484l3561M6504P641J021J5812L73
3823C06153j162K335O142k1292k8564N2704K6145k7846j369J7764k4267j3021
$$ plain form
3910 202686 188982 215452 248847 277828 274616 263993 242782 212380 225260 198698 179140 193283
3898 193283 202030 232181 237306 219614 219497 242715 233979 236036 210468 206020 215392 205380 230333
3885 230333 219838 232472 266155 231217 236492 228268 224280 221794 228945 236965 206151 221005 244902
3872 244902 261595 276168 233734 254610 227520 199847 218245 236976 235778 246555 259221 249110
3860 249110 223429 233202 266738 254072 246928 271882 260429 247836 242025 257950 324961 300568
3848 300568 250891 265922 276058 263441 284516 313895 278767 280171 259496 260897 275141 293750
3836 293750 267111 257913 269566 245174 247524 258879 268363 234802 281306 288947 289968 305780 306153
3823 306153 304991 307326 313468 292176 263612 316316 342461 314615 313246 331010 306743 293722
3811B93722l859j377k7564J8232q949J0250J7127K3384n203l869l971L5248J0458
3798C53629k7848J3394m1909L6510N8261j4609p40k877k2149k8961L2759L6460
3786C91920K6019l0460j2514J5022j2409J203J1748j684J8952k7582r273K4142
3774C95084n3850p055k3277L794O636m457q608K6435j7659o351K6763J9913j7220
3761C40148r721J2005J8131j2613n051O005K6466m2637J1419K3319r19r084R856
3748C67324J886l4814J9549M1028l5312P917M5362J5507k6480k8775M610k2153
3736C55649K1674q047r857K122j9224J4081l3019K5757N4358l1060j3681o578
3724C52175R648M637J64k8971j8897n000M560r290M9293M0492k1097L127m968
$$ plain form
3811 293722 289863 288486 260922 279154 270205 280455 297582 320966 315763 311894 307923 343171 353629
3798 353629 325781 339175 297266 333776 392037 377428 376688 373811 351662 322701 355460 391920
3786 391920 417939 387479 374965 389987 377578 378781 390529 388845 407797 380215 370942 395084
3774 395084 341234 334179 310902 314696 321332 316875 308267 334702 317043 310692 337455 357368 340148
3761 340148 330427 342432 360563 347950 342899 348904 375370 332733 344152 367471 366552 357468 367324
3748 367324 369210 334396 353945 394973 359661 367578 412940 428447 401967 373192 377802 355649
3736 355649 377323 369276 359419 361541 342317 356398 323379 349136 403494 372434 358753 352175
3724 352175 361823 366460 366624 337653 318756 313756 318316 309026 358319 398811 377714 380841 375873
3711C75873M61k009J1624K3472m5419m2252M1270K5821j934O590o948K428J8729
3698D07706k3140j3733j8247K3412N1541l1552m4377K6301K3150K889M286k4207
3686C84029J4450L6894O253R621o455O33M402k633M7549J0052j3033J344k9727
3673D63379J7101N1596l0392l0995l9666j1934q654K8412r18K9615m319K738P713
3660D73676k7057k1179R349l3060r153L3063L7759n1309J2982K5516J297J1241
3648D63125J6212P940k482J8549l1545j3485j7274J7933j7064j0118K5938k9390
3636D28339K255o196l4279J6902o000L2909N464J1085j0669l1321m683N568j961
3623D07413o169l6864K2324J6220M171O223j285j6830J2265K0059m2025L6322
$$ plain form
3711 375873 376334 374325 385949 409421 364002 321750 363020 388841 386907 393497 386549 388977 407706
3698 407706 384566 370833 352586 375998 427539 395987 351610 377911 401061 403950 408236 384029
3686 384029 398479 435373 441626 451247 444792 445425 449827 447194 494743 504795 491762 493106 463379
3673 463379 480480 532076 501684 470689 431023 419089 410435 438847 437929 467544 463225 465963 473676
3660 473676 446619 425440 434789 401729 392576 425639 463398 412089 425071 450587 451884 463125
3648 463125 479337 487277 484795 503344 471799 458314 441040 458973 441909 431791 457729 428339
3636 428339 430594 424398 390119 407021 401021 433930 439394 450479 439810 408489 403806 409374 407413
3623 407413 401244 364380 386704 402924 407095 413318 412033 395203 407468 427527 385502 421824
3611D21824J5479k1015J3460k2060k3429k703J0934L50K1651K0046k3384k496
3599D08657L0342k9975j3664L3248P221J4453L3241k8930n579l402J0114R668
3587D65394j539k9415K5010j6464O868P975n160l205K5196K2330j8377J648k6976
3574D53285j3674N853L9789J3569L0201p383J8366q856m2530K4755L6173n284
3562E44264L684k8104j2937r551k818L9435K2706p370O140l6279m556K8921M73
3549E44008M3721q729J3468J5247j7270r430Q397K9524K7968k1166j3347M5266
3537F57657J450r837M4849m1214L6314J7257j8394K9911m253j0432M529L5441
3525G43278m036J9242k7913O687N4596q034m009j4500P906J8402o32K2630K0237
$$ plain form
3611 421824 437303 416288 429748 407688 384259 381556 392490 392840 414491 434537 411153 408657
3599 408657 438999 409024 395360 428608 435829 450282 483523 454593 449014 445612 455726 465394
3587 465394 463855 434440 459450 442986 449854 457829 452669 449464 474660 496990 478613 480261 453285
3574 453285 439611 445464 485253 498822 529023 521640 540006 531150 488620 513375 549548 544264
3562 544264 547948 519844 506907 497356 494538 533973 556679 549309 555449 519170 514614 543535 544008
3549 544008 587729 579000 592468 607715 590445 581015 589412 618936 646904 625738 612391 657657
3537 657657 659107 649270 694119 652905 689219 706476 688082 717993 713740 703308 707837 743278
3525 743278 739242 758484 730571 737258 791854 783820 779811 765311 773217 791619 790987 813617 833854
3512H33854J3471k3304K1478P64K6428J1844j4396M0717K1081l0430K7501M457
3500I33465K1372M7687j729L4090P08m3920J3534J9404k7454K9041O0692M988
3488A091878R444K8396R958J1476K9969K7491L3718L7645K8392r178l3734K2245
3476A287700O2217J789j9249j0546O3743K1886N7820N8536M9080K0592j8440N7938
3464A633066L3680N3676J5537L1601p619K8026O8144K8581L4377O2877M1418O0789
3452B084153Q4358Q1866M5687O3089L7852J00839R6324L7502J28191O6193N2673
3441B878727Q7850P9352O1684J03224R1651R2399P9386M2319N3319O5446K491
3430C637848O478k0056q561n8710m8678n1218j04363j02057q1245j22932r7010
$$ plain form
3512 833854 847325 824021 845499 846263 872691 884535 870139 910856 931937 901507 929008 933465
3500 933465 954837 1002524 1000795 1034885 1035593 991673 1005207 1024611 997157 1026198 1086890 1091878
3488 1091878 1101322 1129718 1139676 1151152 1181121 1208612 1242330 1279975 1308367 1299189 1265455 1287700
3476 1287700 1349917 1351706 1332457 1321911 1385654 1407540 1465360 1523896 1572976 1593568 1575128 1633066
3464 1633066 1666746 1720422 1735959 1767560 1759941 1787967 1856111 1884692 1919069 1981946 2023364 2084153
3452 2084153 2168511 2250377 2296064 2359153 2397005 2497844 2594168 2631670 2759861 2826054 2878727
3441 2878727 2966577 3045929 3107613 3210837 3302488 3394887 3474273 3516592 3569911 3635357 3637848
3430 3637848 3644326 3624270 3615709 3556999 3508321 3457103 3352740 3250683 3169438 3046506 2949496
3419B949496o1834n3471j02467q9595o0817q2138l9177o0852k0319n9822l8869
3408B280135l0313k4106j0726k2340Q549l461l2388K9818p947J8651K5328M6796
3396B277996L7763M0855M8411L0739J0512o7671k9443m1887k5221m2137m8460
3385B191457r1860o3094o9185n5693j0172o5715m8186k0355J2174n4045k8459
3374A696867r0889L579j6638j2199k0348k8579q724K326O154n917o41J645O217
3361A532853K6903L8504n3068m9445j7669q882N038n5890p5377m5875n0355l899
3349A242838j5018n653j7838m9979m0216k6129j496l2373n6152j781j0183k3681
3337I62339j2588l2941k0597k8949k9270j1166M0822j3128L7763K0880k7260J0734
$$ plain form
3419 2949496 2887662 2834191 2731724 2642129 2581312 2499174 2459997 2399145 2378826 2319004 2280135
3408 2280135 2249822 2225716 2214990 2192650 2201199 2197738 2165350 2195168 2187221 2205872 2231200 2277996
3396 2277996 2315759 2356614 2405025 2435764 2446276 2378605 2349162 2307275 2282054 2239917 2191457
3385 2191457 2099597 2036503 1967318 1911625 1901453 1835738 1787552 1767197 1779371 1725326 1696867
3374 1696867 1605978 1609557 1592919 1580720 1560372 1531793 1523069 1525395 1531549 1525632 1524991 1526636 1532853
3361 1532853 1559756 1598260 1545192 1495747 1478078 1469196 1474234 1418344 1342967 1297092 1246737 1242838
3349 1242838 1227820 1222167 1204329 1154350 1114134 1088005 1086509 1054136 997984 996203 986020 962339
3337 962339 949751 916810 896213 867264 837994 826828 867650 854522 892285 913165 885905 896639
3325H96639k0015P951k151J3654J4197m1481n1555q767m1054k3127M6109j7241
3313G73159n9140M044O967m7966J334r759J8294L042J9186K6466p9691l1819P203
3300F31320J229K514J8419j3547L295K3255K3360o24j2721P082K0043k0984l0322
3287F52319l3878J4397M882R566l900k4730m2891J097k0269l534k1782m175o854
3274E20248J8532l0023R988j16k0060j831P258J3783K0185L401j4363J2758L5948
3261E75708k3698n6848j8767L2922M1208k7044m8374l4355K1337P522r606K9704
3249D89709J9437k5059j7024M2692l744l1347J3378l0640J6549q138l2622J6903
3237D50094P534j4650J3219J4774p884o487j8492j3221K6092Q935j4463Q397M770
$$ plain form
3325 896639 876624 884575 882424 896078 910275 868794 817239 808472 767418 744291 790400 773159
3313 773159 714019 718063 725030 677064 678398 668639 686933 689975 709161 735627 655936 624117 631320
3300 631320 632549 635063 653482 639935 643230 666485 689845 689221 676500 683582 703625 682641 652319
3287 652319 618441 632838 637720 647286 643386 618656 575765 576862 556593 553059 531277 527102 520248
3274 520248 538780 508757 518745 518629 498569 496738 503996 517779 537964 541365 527002 539760 575708
3261 575708 552010 495162 476395 509317 550525 523481 475107 440752 462089 469611 460005 489709
3249 489709 509146 484087 467063 509755 506011 474664 488042 457402 473951 465813 433191 450094
3237 450094 457628 442978 456197 470971 463087 456600 438108 424887 450979 459914 445451 453848 458618
3224D58618k4439K9441K477Q697q17L1279j6902p859j7979k3451J1456J4358J2575
3211D77454j0633L3375J1688Q964J9163l7823j140R286J8665m092j8505m747M0983
3198E42638L032L4023J9859o783J6088J1527J0717L4142J0345J5924M601l445
3186F92668M8481k948O021M456Q95N4794J977J3418L1098Q694L6811r271L6459
3173I23553N9240N1981P2537O7307N3813j0377j0769J2070o6170m6596m503q16
3161A101270j1033j4187P715j5088l0526q851p202J5077l2838J9784M1009Q709
3149A073839l636K3596L6005M8958N655J9125J9642M7005N0569M2591O9039N2351
3137A484739J4571k8042j3189n2629j7471q0783k478k8028k3264k065M1060j6983
$$ plain form
3224 458618 434179 463620 466097 474794 473977 505256 488354 480495 462516 439065 450521 464879 477454
3211 477454 466821 500196 511884 520848 540011 502188 501048 510334 528999 524907 506402 501655 542638
3198 542638 545670 579693 599552 592769 608857 620384 631101 665243 675588 691512 696113 692668
3186 692668 741149 738201 744222 748678 749573 804367 806344 819762 850860 859554 896365 887094 923553
3173 923553 982793 1034774 1107311 1174618 1228431 1218054 1207285 1219355 1153185 1106589 1102086 1101270
3161 1101270 1090237 1076050 1083765 1068677 1038151 1029300 1022098 1037175 1004337 1024121 1065130 1073839
3149 1073839 1070203 1093799 1129804 1178762 1184417 1203542 1223184 1270189 1320758 1363349 1432388 1484739
3137 1484739 1499310 1471268 1458079 1405450 1387979 1307196 1304718 1276690 1253426 1251361 1292421 1275438
3125A275438j3637K0041j146l6740j430k493J3445K5850m0161q71J0765M1496
3113A290557J8399O642R948K1033R681K8185K2591K9685j9567q908O5594K5361
3101A499201Q753N7036K2377J2891O1875M8197j512N6978M111J3807j9841l1172
3089A732701l6319n0423j535m6353l3493j7848k3237j7895K4217j1181L150K9117
3077A550901j5362J7330j7267M556J1109K8965j2247K0870M0836j3844j6016O2177
3065A662008o905n3290J2154m444j9938J4081l7327o5552o9754j8376j7838l1322
3053A363497l1468m6416o2762L257m029j8737k3019j6419J4839o7309Q03j1073
3041A101164l9490j3154q205m2991k3019K6784n9357m3601l418k8941j5823l7235
$$ plain form
3125 1275438 1261801 1281842 1280696 1243956 1242526 1240033 1253478 1279328 1239167 1238296 1249061 1290557
3113 1290557 1308956 1315598 1325546 1346579 1356260 1384445 1407036 1436721 1417154 1408246 1473840 1499201
3101 1499201 1507954 1564990 1587367 1600258 1662133 1710330 1708818 1765796 1769907 1783714 1763873 1732701
3089 1732701 1696382 1645959 1644424 1598071 1564578 1546730 1523493 1505598 1529815 1518634 1521784 1550901
3077 1550901 1535539 1552869 1535602 1540158 1551267 1580232 1567985 1588855 1629691 1615847 1599831 1662008
3065 1662008 1655103 1601813 1613967 1609523 1589585 1603666 1566339 1500787 1431033 1412657 1394819 1363497
3053 1363497 1332029 1285613 1222851 1226108 1222079 1203342 1180323 1163904 1178743 1111434 1112237 1101164
3041 1101164 1061674 1048520 1040315 997324 974305 1001089 941732 898131 894713 865772 849949 812714
3029H12714L208k9844k9608j9666K4806o6353k8158k6585M216n049r170Q776j2451
3016F26836m7625J0097K4699o0868J8776k8024P519r370n2488J0677L6609m254
3004E32584o4539p172j0323n961l3215l685l675L745k5855k9727M499J9884k6561
2991C49999k2053K2304Q236P731l9708o018l4292L0373l6403K8201j6882m596
2979B86892k4762j9987Q851J1082j0934K6519q57k5279N36j6185J1004j9429m802
2966B22649J1006J7647n3382J9610n33M1728m208o5590L650K4667k4929k1964
2954A70351k4769k4927J2306j547J8256j7464k2550N6576j5802k2511M8389M2386
2942B18694l3127j1466k3499J5835k5147j8828P129m1132n460M8472p774r888
$$ plain form
3029 812714 815922 786078 756470 736804 761610 695257 667099 640514 644730 639681 630511 639287 626836
3016 626836 579211 589308 614007 553139 571915 543891 551410 542040 489552 500229 536838 532584
3004 532584 468045 460873 450550 444589 411374 407689 404014 407759 381904 352177 356676 376560 349999
2991 349999 327946 350250 358486 366217 326509 320491 286199 316572 280169 308370 291488 286892
2979 286892 262130 242143 250994 262076 251142 277661 276804 251525 252061 235876 246880 227451 222649
2966 222649 233655 251302 197920 217530 216997 258725 254517 188927 192577 217244 192315 170351
2954 170351 145582 120655 132961 131414 149670 132206 109656 166232 150430 127919 176308 218694
2942 218694 185567 174101 150602 166437 141290 122462 129591 88459 82999 131471 123697 113809
2930A13809J3610k7218n040k7364K4985K492j0926J107k9378Q54J3676k7963l9082
2917C562J9997J566J7840J0592K6639q283P534Q127j6298J5292M040n272J40j9227
2903F6249k9458J4618R560j5907j0472R372p253J3018J1730P6j7374m568k961
2890C6630K026j3330j2367M8320O655m2053k961p879L7307k6238L218o957l0786
2877h415J6203k3910J8781K9048k6280q891J597O0241K3787l0841p1706O767l3822
2864d7441j6569O0249n371N163K0179l805l829J4605k8707r428M2525k4174k8521
2851b5124K0548k2M9062K535n0126L9529L5947k2519k7294o25Q240o653l1260
2838g762R710R430k3214K7070L7053m0411l5627j0584L0828L648m8502j8705M3223
$$ plain form
2930 113809 127419 100201 95161 67797 92782 95274 84348 85455 56077 56931 70607 42644 3562
2917 3562 23559 25125 42965 53557 80196 71913 79447 87574 71276 86568 90608 85336 85476 66249
2903 66249 36791 51409 60969 45062 34590 43962 36709 49727 61457 61533 44159 39591 36630
2890 36630 38656 25326 12959 61279 67934 25881 22920 15041 52348 26110 29328 22371 -8415
2877 -8415 7788 -16122 2659 31707 5427 -3464 -1867 58374 82161 51320 -20386 -13619 -47441
2864 -47441 -64010 -3761 -9132 -3969 16210 12405 8576 23181 -5526 -14954 27571 3397 -25124
2851 -25124 -4576 -4598 44464 46999 -3127 36402 72349 49830 22536 21911 30151 23498 -7762
2838 -7762 1948 11378 -11836 15234 52287 11876 -23751 -34335 -3507 141 -48361 -67066 -23843
2825b3843O5340k1125n2465J287M945j4649o318J7795K9002R327l995l5082P284
2812b2497Q727j0659j785R806K1820J814p760K928l0373j8002L4499n676k815
2799a9973j4457N4499J6289m6077l029k1287O943K3439K3332n9466J6027P800
2787a5960j1764K8977R844l1336J51j1866j194k5083J9807n518J6850K8895l0415
2774b8612R365j8906J6619J1973o740J7247j3421j6039M7023K0026m978L303Q89
2761C7749o139m9094k6523K5651K4648j7026k1156k442L4024N037r973l5550k4255
2748f5049l0311R853K0422k6781L0236J5886l145K6115K8174j4904k5277k9963
2736f4744J1111L3534m0969j9238L0244K7224R176q030j0379j862J5979J5308
$$ plain form
2825 -23843 41497 20372 -32093 -30806 -25861 -40510 -46828 -29033 -31 9296 5301 -29781 -22497
2812 -22497 -13770 -24429 -26214 -16408 5412 7226 -534 2394 -27979 -45981 -11482 -17158 -19973
2799 -19973 -34430 20069 36358 -9719 -12748 -34035 -27092 -3653 19679 -39787 -23760 -15960
2787 -15960 -27724 1253 11097 -20239 -20088 -31954 -33148 -58231 -38424 -43942 -27092 1803 -28612
2774 -28612 -19247 -38153 -21534 -9561 -16301 946 -12475 -28514 18509 38535 33557 36860 37749
2761 37749 31610 -17484 -44007 -18356 6292 -10734 -31890 -34332 -308 4729 -5244 -40794 -65049
2748 -65049 -95360 -85507 -65085 -91866 -61630 -45744 -48889 -22774 5400 -9504 -34781 -64744
2736 -64744 -53633 -20099 -61068 -80306 -50062 -22838 -13662 -21692 -32071 -33933 -17954 -2646
2724b646k5534m0055J8201O439k7497P813K277K050L1672o036o171l0039K0041
2711d9485K0478k6491j9277m350J7120L416p666L6642m8802K2115l60l910J0980
2698d9590l367K2118J2697j0257j630J7843j470K2571k4538j6018J1258j7002
2686c7385J3598r863j413J5985L7330k8291j7688R283n5403K7754J6351K1722
2674h020l1657K628M994r444J3719l424k8965N2283L538j1024K2398K6628m1134
2661g480k8099l388N094M3701q167j7511q772m208j7458k6101L1905J2840j9611
2648d7255K9000j0782L886L070j8146K820j3864m825j2992k2023Q934l122P3739
2635a1560j1531l026j5949j6519k3722L3881K2198k9204J299Q2J5302k4255J4029
$$ plain form
2724 -2646 -28180 -68235 -50034 -43595 -71092 -63279 -61002 -58952 -27280 -33316 -39487 -69526 -49485
2711 -49485 -29007 -55498 -74775 -79125 -62005 -58589 -66255 -29613 -78415 -56300 -56660 -60570 -49590
2698 -49590 -52957 -30839 -18142 -28399 -30029 -12186 -13656 8915 -15623 -31641 -20383 -37385
2686 -37385 -23787 -33650 -35063 -19078 18252 -10039 -27727 -18444 -73847 -46093 -29742 -8020
2674 -8020 -39677 -37049 -32055 -41499 -27780 -31204 -60169 -7886 -4348 -15372 7026 33654 -7480
2661 -7480 -35579 -38967 -33873 9828 1661 -15850 -24622 -28830 -46288 -72389 -40484 -27644 -47255
2648 -47255 -18255 -29037 -25151 -22081 -40227 -37407 -51271 -56096 -69088 -91111 -82177 -85299 -11560
2635 -11560 -23091 -26117 -42066 -58585 -82307 -48426 -26228 -55432 -54133 -54051 -38749 -63004 -48975
2622d8975J01L299k70r049J8034K5417J1072j229l9867J7426K266k1613K5474
2609a7914K2749j3658m5143j4821o230M5415K609J087j8393O879Q506j4511M492
2596c8933J0838k534r010j4294J9689J0506O778K745k2065L9078j8236p383J205
2583b1616j4573j4347J9224O22n591j8767n351Q2606M967m2095K0193k4087R132
2570i683J1573l7099Q293m244j314q757J9696L8654K915k9294j6109J4172L2210
2557B1013K0854l6849j1301L5935O650l6254K6643R230p478j0342l3940J2424
2545c415R574J785K029n9961J4360J3085M2185k8217k1118j9224J1032J4463K297
2532b1125j2506K3742N7768l4852k4391m2182J483N224P019J5723K8821J7579
$$ plain form
2622 -48975 -48874 -45575 -45845 -54894 -36860 -11443 -371 -1600 -41467 -24041 -21775 -43388 -17914
2609 -17914 4835 -8823 -53966 -68787 -75017 -29602 -26993 -25906 -44299 -37420 -28914 -43425 -38933
2596 -38933 -28095 -30629 -39639 -53933 -34244 -23738 -16960 -14215 -36280 2798 -15438 -22821 -21616
2583 -21616 -36189 -50536 -31312 -30690 -36281 -55048 -60399 22207 27174 -14921 5272 -18815 -9683
2570 -9683 1890 -35209 -26916 -31160 -32474 -41231 -21535 17119 20034 -9260 -25369 -11197 21013
2557 21013 41867 5018 -6283 29652 36302 48 26691 35921 28443 18101 -15839 -3415
2545 -3415 6159 7944 9973 -49988 -35628 -22543 19642 -8575 -29693 -48917 -37885 -23422 -21125
2532 -21125 -33631 -9889 47879 13027 -11364 -53546 -52063 -46839 -39820 -24097 4724 22303
2520B2303o416j9071j4002J0643j1023r805J8918K7492k9458k2395j8845l2286
2508h3945O4515m13L5591j8984j5255K3958J5396j9963K760L6044k9126J1220
2496B1798k3538k306l5516J238J5171P806K3566J1752j7596j6550L4539k0892
2484e28j7632K961N2128l072J2797R824j6798k5155j4889L2634p081N766l1472
2471e17m054K3814L4641j3860o0082O505K7534J1011k409O506l7879K8385J1712
2458C1307k2416J808J8231m035o417l6124j2188k6362N5872k7644m47K4660K924
2445h31O925n233L3085k1532k5995L527l910k8398M6493R323Q335L369J0632k2884
2431A2906j1645J5551r163M790J5307q049n834L0456K0289j1704J6110J0603m752
$$ plain form
2520 22303 15887 -3184 -17186 -6543 -17566 -27371 -8453 19039 -10419 -32814 -51659 -83945
2508 -83945 -19430 -19843 15748 -3236 -18491 5467 20863 900 3660 39704 10578 21798
2496 21798 -1740 -4046 -39562 -38324 -23153 -15347 8219 19971 2375 -14175 20364 -528
2484 -528 -18160 -15199 36929 33857 46654 56478 39680 14525 -364 32270 25189 30955 -517
2471 -517 -4571 19243 53884 40024 -20058 -13553 13981 24992 22583 29089 -8790 19595 31307
2458 31307 8891 10699 28930 24895 18478 -17646 -29834 -56196 -324 -27968 -28415 -3755 -831
2445 -831 6094 861 33946 12414 -13581 -10054 -13964 -42362 4131 13454 21789 25158 35790 12906
2431 12906 1261 16812 7649 12439 27746 19697 13863 44319 64608 52904 69014 79617 74865
2418G4865l3976j2640k1171M2430l8339N7630P648k3513o741K5428N0896l8602
2406H3915l9228j9695k203J3783J8844L7497L0482k381M245n746l42N28N015m2022
2392H2692N800N660j325L9835J5312J0800j3919n7450k2606L0289K6505L2094
2380A53687k7186k9483N1739J4366n346n7210j5639j4798K9317K5180J0566M2680
2368A77873L5771J6919j7867j1486n101J5642K9902j9043j5722J0100L5805K9205
2356B81998j7529j7608R48M4414Q444P80O3342J8708j6637l5500j3528J5069K0024
2343C52925L456M3611J2532j6017K715J3403J8304Q371l2206N4969K1629q646
$$ plain form
2418 74865 40889 28249 7078 49508 11169 68799 76447 52934 46193 71621 122517 83915
2406 83915 44687 24992 22789 36572 55416 92913 123395 121014 125259 119513 119171 119699 124714 82692
2392 82692 88492 94152 92827 132662 147974 158774 144855 87405 64799 95088 121593 153687
2380 153687 126501 97018 148757 163123 157777 100567 84928 70130 99447 124627 135193 177873
2368 177873 213644 230563 212696 201210 196109 211751 241653 222610 206888 216988 252793 281998
2356 281998 264469 246861 247809 292223 300667 301447 364789 383497 366860 331360 317832 332901 352925
2343 352925 356381 399992 412524 396507 399222 412625 430929 439300 407094 462063 483692 475046
$$ [...]
##END NTUPLES=NMR SPECTRUM
##END=
