##TITLE=1H_CG-1221-E
 200.13MHz, CDCl3,
 8 sc
 
 7.8.2025
##JCAMPDX= 6.0         $$ Bruker NMR JCAMP-DX V2.0
##DATA TYPE= NMR SPECTRUM
##DATA CLASS= NTUPLES
##ORIGIN= UXNMR, Bruker Analytische Messtechnik GmbH
##OWNER= pz
$$ XWIN-NMR		Version 3.5
$$ Thu Aug  7 14:52:54 2025 Russian Standard Time (UT+4h)  she@DPX200
##.OBSERVE FREQUENCY= 200.1313
##.OBSERVE NUCLEUS= ^1H
##.ACQUISITION MODE= SIMULTANEOUS
##.ACQUISITION SCHEME= undefined
##.AVERAGES= 8
##.DIGITISER RES= 18
##SPECTROMETER/DATA SYSTEM= spect
##.PULSE SEQUENCE= zg30
##.SOLVENT NAME= CDCl3
##.SHIFT REFERENCE= (INTERNAL, CDCl3, 0, 15.5464)
##AUDIT TRAIL= $$ (NUMBER, WHEN, WHO, WHERE, WHAT)
$$ ##TITLE= Audit trail, XWIN-NMR		Version 3.5
$$ ##JCAMPDX= 5.01
$$ ##ORIGIN= Bruker BioSpin GmbH
$$ ##OWNER= she
$$ F:/spectra/data/she/nmr/H-C/1/pdata/1/auditp.txt
$$ ##AUDIT TRAIL=  $$ (NUMBER, WHEN, WHO, WHERE, WHAT)
(   1,<2025-08-07 14:51:15.57 +0400>,<she>,<DPX200>,
      <created by zg, POWCHK disabled, PULCHK disabled
       configuration hash MD5:
       00 E9 B6 7A A2 85 ED C7 34 08 36 98 17 FE 4E 26
       data hash MD5: 16K
       BD A6 22 6A 8F E0 DC 89 04 63 68 BF BD 75 A6 CB>)
(   2,<2025-08-07 14:51:33.87 +0400>,<she>,<DPX200>,
      <Start of raw data processing
       efp BC_mod = 2 LB = 0.25 FT_mod = 6 PKNL = 1 PHC0 = -1200.403 PHC1 = 13.1923 SI = 16K 
       data hash MD5: 16K
       42 DC D2 BB 60 5D 23 AE E7 B6 94 DC EF 81 F7 3F>)
(   3,<2025-08-07 14:51:53.39 +0400>,<she>,<DPX200>,
      <pk PHC0 = -155.5486 PHC1 = -4.4 
       data hash MD5: 16K
       F4 95 FA 07 C3 5F 39 98 26 D4 D8 FA 85 CB 4F C7>)
(   4,<2025-08-07 14:51:57.54 +0400>,<she>,<DPX200>,
      <abs ABSG = 5 
       data hash MD5: 16K
       10 97 78 05 AB 79 50 4E 8B 2F 64 CF 66 94 6A 10>)
(   5,<2025-08-07 14:52:25.00 +0400>,<she>,<DPX200>,
      <abs ABSG = 5 
       data hash MD5: 16K
       4E 56 7E B1 B2 A2 78 63 7B 82 71 30 2C 13 0C 31>)
$$ ##END=
$$ 
$$ hash MD5
$$ AE 55 B3 50 5F 4B E7 B1 5A 80 B5 90 6C 47 9F F7
##$RELAX= 
##$RELAX= 
##$RELAX= 
##$RELAX= 
##$RELAX= 
##$RELAX= 
$$ Bruker specific parameters
$$ --------------------------
##$DU= <F:/spectra>
##$EXPNO= 1
##$NAME= <H-C>
##$PROCNO= 1
##$TYPE= <nmr>
##$USER= <she>
##$AMP= (0..31)
100 100 100 100 100 100 100 100 100 100 100 100 100 100 100 100 100 100 
100 100 100 100 100 100 100 100 100 100 100 100 100 100 
##$AQSEQ= 0
##$AQ_mod= 1
##$AUNM= <au_zg>
##$AUTOPOS= <>
##$BF1= 200.13
##$BF2= 200.13
##$BF3= 200.13
##$BF4= 200.13
##$BF5= 200.13
##$BF6= 200.13
##$BF7= 200.13
##$BF8= 200.13
##$BYTORDA= 1
##$CFDGTYP= 0
##$CFRGTYP= 5
##$CHEMSTR= <none>
##$CNST= (0..31)
1 1 145 1 1 1 1 1 1 1 1 1 1 1 1 1 1 1 1 1 1 1 1 1 1 1 1 1 1 1 1 1 
##$CPDPRG= <>
##$CPDPRG1= <>
##$CPDPRG2= <>
##$CPDPRG3= <>
##$CPDPRG4= <mlev>
##$CPDPRG5= <mlev>
##$CPDPRG6= <mlev>
##$CPDPRG7= <mlev>
##$CPDPRG8= <mlev>
##$CPDPRGB= <>
##$CPDPRGT= <>
##$D= (0..31)
0 0.7 0 0 0 0 0 0 0 0 0 0.03 0 0 0 0 0 0 0 0 0 0 0 0 0 0 0 0 0 0 0 0 
##$DATE= 1754563874
##$DBL= (0..7)
$$ [...]
##$SUBNAM3= <"">
##$SUBNAM4= <"">
##$SUBNAM5= <"">
##$SUBNAM6= <"">
##$SUBNAM7= <"">
##$SUBNAM8= <"">
##$SUBNAM9= <"">
##$SW= 18.0517328524113
##$SWIBOX= (0..15)
0 0 2 0 0 0 0 0 0 0 0 0 0 0 0 0 
##$SW_h= 3612.71676300578
##$TD= 16384
##$TD0= 1
##$TE= 0
##$TE2= 300
##$TE3= 300
##$TEG= 300
##$TL= (0..7)
0 120 120 120 120 120 120 120 
##$TP= (0..7)
150 150 150 150 150 150 150 150 
##$TP07= 0
##$TPNAME0= <>
##$TPNAME1= <>
##$TPNAME2= <>
##$TPNAME3= <>
##$TPNAME4= <>
##$TPNAME5= <>
##$TPNAME6= <>
##$TPNAME7= <>
##$TPOAL= (0..7)
0.5 0.5 0.5 0.5 0.5 0.5 0.5 0.5 
##$TPOFFS= (0..7)
0 0 0 0 0 0 0 0 
##$TUNHIN= 0
##$TUNHOUT= 0
##$TUNXOUT= 0
##$USERA1= <user>
##$USERA2= <user>
##$USERA3= <user>
##$USERA4= <user>
##$USERA5= <user>
##$V9= 5
##$VALIST= <valist>
##$VCLIST= <CCCCCCCCCCCCCCC>
##$VD= 0
##$VDLIST= <DDDDDDDDDDDDDDD>
##$VPLIST= <PPPPPPPPPPPPPPP>
##$VTLIST= <TTTTTTTTTTTTTTT>
##$WBST= 1024
##$WBSW= 4
##$XGAIN= (0..3)
0 0 0 0 
##$XL= 0
##$YL= 0
##$YMAX_a= 259532
##$YMIN_a= -238517
##$ZGOPTNS= <>
##$ZL1= 120
##$ZL2= 120
##$ZL3= 120
##$ZL4= 120
##$ABSF1= 15.54636
##$ABSF2= -2.505491
##$ABSG= 5
##$ABSL= 3
##$ALPHA= 0
##$AQORDER= 0
##$ASSFAC= 0
##$ASSFACI= 0
##$ASSFACX= 0
##$ASSWID= 0
##$AUNMP= <proc_1d>
##$AZFE= 0.1
##$AZFW= 0.1
##$BCFW= 0
##$BC_mod= 2
##$BYTORDP= 0
##$COROFFS= 0
##$CY= -3
##$DATMOD= 1
##$DC= 0
##$DFILT= <>
##$DTYPP= 0
##$F1P= 0
##$F2P= 0
##$FCOR= 1
##$FTSIZE= 16384
##$FT_mod= 6
##$GAMMA= 0
##$GB= 0
##$INTBC= 1
##$INTSCL= 3.241238e-09
##$ISEN= 128
##$LB= 0.25
##$LEV0= 0
##$LPBIN= 0
##$MAXI= 10000
##$MC2= 0
##$MEAN= 0
##$ME_mod= 0
##$MI= 1.114404
##$NCOEF= 0
##$NC_proc= -6
##$NLEV= 6
##$NOISF1= 3.799351
##$NOISF2= 2.8
##$NSP= 0
##$NTH_PI= 0
##$NZP= 0
##$OFFSET= 15.54636
##$PC= 1
##$PHC0= -1355.952
##$PHC1= 8.792299
##$PH_mod= 1
##$PKNL= yes
##$PPARMOD= 0
##$PSCAL= 0
##$PSIGN= 0
##$REVERSE= no
##$SF= 200.129995065088
##$SI= 16384
##$SIGF1= 3
##$SIGF2= 2
##$SINO= 0.751879
##$SIOLD= 32768
##$SREGLST= <19F.Aceton>
##$SSB= 0
##$STSI= 16384
##$STSR= 0
##$SW_p= 3612.71676300578
##$SYMM= 0
##$S_DEV= 0
##$TDeff= 16384
##$TDoff= 0
##$TI= <>
##$TILT= no
##$TM1= 0
##$TM2= 0
##$TOPLEV= 0
##$USERP1= <user>
##$USERP2= <user>
##$USERP3= <user>
##$USERP4= <user>
##$USERP5= <user>
##$WDW= 1
##$XDIM= 16384
##$YMAX_p= 446403682
##$YMIN_p= -198085
$$ End of Bruker specific parameters
$$ ---------------------------------
##NTUPLES= NMR SPECTRUM
##VAR_NAME=  FREQUENCY,     SPECTRUM/REAL,   SPECTRUM/IMAG
##SYMBOL=    X,             R,               I
##VAR_TYPE=  INDEPENDENT,   DEPENDENT,       DEPENDENT
##VAR_FORM=  AFFN,          ASDF,            ASDF
##VAR_DIM=   16384,         16384,           16384
##UNITS=     HZ,            ARBITRARY UNITS, ARBITRARY UNITS
##FACTOR=    0.220516191357247, 1,           1
##FIRST=     3111.29295325597, 0,            0
##LAST=      -501.423809749808, 0,           0
##MIN=       -501.423809749808, -198085,     0
##MAX=       3111.29295325597, 446403682,    0
$$ Real data points
##PAGE= N=1
##DATA TABLE= (X++(R..R)), XYDATA
$$ [...]
10970 -3398 -19098 -31811 -11251 -14707 -19110 1304 -13448 -27460 -8853 -8889 4062 -7008 -3102
10957 -3102 33272 20137 19663 30739 -9885 -26102 -4293 21405 -7060 -9630 -3308 -8146 -17652
10944 -17652 2014 6723 4371 14987 22869 58217 17990 -1578 11435 8030 -21933 -12316 -13891
10931 -13891 412 15766 26592 36294 51507 24888 -1883 -21839 -6149 73 10116 17216
10919 17216 2777 -18421 -38456 -1413 1591 -4358 -22316 -31702 -10562 1432 -6545 8864
10907 8864 78 1352 -16788 -22248 -20380 -28450 7653 12205 24563 59979 46220 8744 -26075
10894 -26075 -925 -11224 -15020 -16 26367 29149 -7478 -19030 -7735 9587 9047 11646 21335
10881 21335 21761 13874 23281 15399 6950 20524 52378 47830 -7692 -3444 -21505 1187 -13159
10868 -13159 -1567 6970 -21461 -950 6947 -5375 22541 11256 14639 6327 -678 3312 6361
10855 6361 -6321 -20106 -38474 -31486 4438 -4899 -12861 -47720 -28163 -20618 -12601 779 -9692
10842 -9692 -38253 -8510 -2324 -40815 -27032 -13325 -13037 5552 -2365 3717 -1297 -4703 32451
10829 32451 12267 -13433 -56426 -37448 -4480 -9582 -29163 -4089 1946 -2938 -250 34604
10817 34604 20222 9620 58536 50408 41397 567 5059 -22412 -11132 -1294 5998 22970 27797
10804 27797 -2030 -15921 -44548 -22308 -1283 -8400 26715 -982 -40298 -14741 -34293 -42280
10792 -42280 -20833 -2666 -2591 -18396 -18452 -6215 -8509 -17834 -33961 -17620 -3159 -2020 -12261
10779 -12261 -28783 -41442 -17021 -2193 -9309 -14984 -13424 -17656 -22213 20414 2880 -6788 -28018
10766 -28018 -15851 -9506 -13423 -11836 -38230 -16755 -16873 -15680 -13201 -24568 -2607 -2629 1060 -2718
10752 -2718 -17122 -16905 -15405 1260 -25266 8597 -2118 9978 8318 15172 35699 18996 45318
10739 45318 18448 8666 2768 -2950 13064 -3371 -14414 -18768 4704 27469 30744 12677 -21163
10726 -21163 -7936 2856 -9705 -1768 29478 -14715 -26404 8829 955 -14015 -10234 17137
10714 17137 38050 26500 20792 1186 -19767 -620 37251 31623 18942 21581 13583 -24715
10702 -24715 -14301 3709 27751 3980 -31158 -43169 -35229 -4124 21394 -245 -51574 -43313
10690 -43313 -44287 -3352 -7131 -20183 -1371 9618 -13840 -40437 -13429 -9535 -6481 16382 24708
10677 24708 20047 35964 21907 21224 6958 31 -3095 14318 8106 8584 -423 -349 -55556 3431
10663 3431 1893 -23635 -16371 4189 41034 27842 -6700 -29955 -39132 -32943 -41561 -36009 -46092
10650 -46092 -58303 -55533 -51039 -12731 12673 7270 25840 2608 -35976 -11900 7784 13087
10638 13087 -26160 -25384 -23713 -18555 -44059 -30216 -644 5580 12357 -11798 -62237 -31976 -17097
10625 -17097 -26696 -26572 -3907 -6637 -21662 -21805 -11071 -23529 -3908 -41446 -31967 -38667 -3826
10612 -3826 -5220 15086 34325 31055 770 -15475 -7078 14777 27727 23819 54770 46617 34668
10599 34668 18376 13221 7 20356 38170 11921 -27207 -17511 -13993 3311 13109 -48533
10587 -48533 -24640 -29904 -24326 12471 5287 -11869 -35417 -10497 448 -22838 -24452 -6946
10575 -6946 -1156 -3869 -3945 -13740 -11198 3622 40961 37347 28355 21320 4774 7701 -23784 -11659
10561 -11659 20062 40150 42147 46952 11965 20089 16711 -29869 -17957 11931 -600 11928
10549 11928 1623 -34616 -29544 5538 5965 -16406 -31882 -16589 -11932 -22972 -7665 -11355 -1514
10536 -1514 -26692 -23217 -19232 -21463 -29974 -18004 21375 -5443 -7118 -18829 -10012 1928 -22222
10523 -22222 -1822 29495 5843 15594 26652 -3249 -6611 6658 28430 -2988 -20319 -2935
10511 -2935 -7410 -9456 -11741 -4138 -5782 -19719 -27227 -31058 -32213 -4480 8121 27707 26537 11411
10497 11411 4025 44425 20716 -9994 -9299 23328 -6164 -27005 -41819 -30508 -2708 14821
10485 14821 1220 -27906 -33287 -39521 -44579 -13789 -18740 -12956 -26470 -23128 -9548 4277 31365
10472 31365 50061 34388 17107 -30739 -44520 -7778 5718 -4201 11111 -11536 -43231 -37447
10460 -37447 -44852 -31283 -17400 -22535 7569 8516 -52845 -6990 22467 47380 35317 13894
10448 13894 -13886 -26918 -34063 12254 21436 -5059 -4591 16376 -4764 343 -36327 -28725 -17189
10435 -17189 6202 1235 -21931 -2138 8768 -9108 -16270 704 19206 -2049 -17132 15510
10423 15510 21064 -3673 18701 -15075 -492 -13331 -42297 -65674 -28261 -24963 -45823 -23634
10411 -23634 4961 11476 -16563 1340 -7146 -9669 16984 32752 10965 17224 13048 5559 -10533
10398 -10533 -4706 17505 4494 -9255 -3498 12545 -934 -13619 -46243 7205 -8577 -32450
10386 -32450 22998 29011 -13923 -12905 12144 23596 40542 19340 -5919 -9497 13739 8841
10374 8841 -22375 26688 24541 -4816 8452 6025 29139 9345 26759 2503 32080 37241
10362 37241 51942 11776 -15348 -21136 -11004 8789 -24356 -9903 453 -1167 -4767 -29
10350 -29 21067 2892 6888 8640 -12770 -22457 18246 -17873 -2802 15429 20190 3452 -23045
10337 -23045 -25336 16616 22678 16029 27172 12472 2295 5111 -24645 -27189 -25436 1383 4412
10324 4412 -6974 -40602 -56356 -28925 -31024 -24883 -8627 10471 22861 31119 -1397 -1971 3636
10311 3636 -22936 -19599 -39621 -29271 -26213 -34135 -9859 -28546 -15116 -1250 -25654 -22213 -28191
10298 -28191 -13931 5755 -9017 850 4580 -6449 -10438 4436 -19148 -1624 -5048 6162
10286 6162 2536 15993 508 -26351 -40983 3679 -10824 -13961 2264 -22305 -9325 16327
10274 16327 4720 27906 11453 -27441 4987 11450 -12716 -40115 -20895 -5197 2737 -1631
10262 -1631 -13408 1967 -34832 9616 27357 24764 23715 5342 -5289 4399 834 -15481 8906
10249 8906 37434 12462 -26644 -6304 -6671 216 11683 -30643 -15933 3059 -19934 -6192
10237 -6192 -29269 -29013 20870 48925 49089 23399 2967 12911 -19013 -46334 -33272 -26905 -23576
10224 -23576 -16726 -9807 14494 27978 -3507 -27978 -37346 -32422 9121 26834 -3547 -12381 -12015
10211 -12015 -19431 -22110 -9873 -3312 -2350 31623 168 2760 -314 -25054 -28265 -2055 5838
10198 5838 -280 4625 20845 38178 32339 -3332 11595 -4885 -17795 -2397 -3973 -22369 -5196
10185 -5196 12936 22371 -4822 4596 3425 -29422 -20365 -14436 10312 19434 18127 1201 -23959
10172 -23959 -41938 -8625 13697 47156 17797 -18967 -15611 -57841 -66078 -38801 -66554 -19672
10160 -19672 18938 187 -10133 -17811 -20052 -14185 -20271 -33387 -63393 -47728 -15536 -19634 -2664
10147 -2664 -25688 -34052 -31824 19226 39589 3845 -7165 -39739 -28957 -20919 -8365 3159
10135 3159 27920 20441 11706 12267 11125 -4158 -20987 -23000 -22386 -5032 -9311 -6562 11805 -3100
10121 -3100 21943 -2475 -35389 -554 -24189 -3011 2611 -3572 -11830 -16139 -34082 -49184 -39127
10108 -39127 -6186 24918 25033 -12873 -6719 5732 -5656 6215 2925 6143 2504 4285 -3203
10095 -3203 -9257 20831 37855 11761 -19085 -22691 -139 16380 -11383 8809 9703 -6008 20010
10082 20010 21389 -9874 -65552 -13310 -10122 -16868 -17155 -35295 168 -6340 30190 56643 53671
10069 53671 16747 20594 17623 -13718 4779 19649 3694 -22935 -11589 -17802 -36003 -6922
10057 -6922 -7302 -11785 20242 26738 10965 -8199 3846 -5135 -25905 -25156 -28652 -333 -17119
10044 -17119 7138 25342 16479 -8769 -8956 -5125 31083 12325 -595 1209 -2156 3327 -13237
10031 -13237 4789 1263 -6713 -33549 -47840 -29117 11144 15725 29754 10235 4385 6055 20681
10018 20681 5416 -5829 -12771 -5120 9636 965 -9292 -13756 -6358 -592 3293 -11444 -20677
10005 -20677 1907 14325 -13911 -29348 -3727 -9195 14003 5056 -3288 -1422 15827 29945
9993 29945 2645 2949 -18623 -34894 -1809 5684 7758 -5987 16292 9515 -8325 15645 -10415
9980 -10415 -25861 -8083 12277 22656 -1693 12437 5242 -4117 22609 13330 6851 632 -26102
9967 -26102 -42213 -27620 -23710 -20176 17870 -1467 -12922 -3673 14881 10822 -1809 -8329 -19257
9954 -19257 3583 9029 10968 6217 27801 15099 18510 24503 -4623 -25947 -37351 -29305 8906
9941 8906 1323 11786 -15962 -21132 1727 -11860 -5639 29811 4739 -11307 28190 25222 -14824
9928 -14824 -15903 -1984 -19949 -8909 -38977 -54382 -33536 -6661 -9707 7145 14225 13697 10150
9915 10150 11658 17745 2432 22636 19340 15479 -10514 -13675 20034 -2090 -20743 -18236 -9188
9902 -9188 -4854 -3536 -10241 4364 31304 20533 27507 31797 31379 6948 2311 -20955 -30622 -41340
9888 -41340 -10557 -11723 -31721 -39838 -26481 14336 6134 -12214 -2221 -5951 -16204 -9936 -16657
9875 -16657 15618 14544 -20207 -14230 -29408 -21873 -22304 5641 -6720 -4688 11797 4184 -8591
9862 -8591 -17305 -9815 -10075 3625 -9364 4512 586 38533 21282 -25232 -746 30347 41525
9849 41525 24596 4192 -1928 8978 8759 19091 15245 39009 16629 -89 15039 2236 -20416
9836 -20416 -46163 -44994 -29899 -20798 -43200 -10310 1561 -12706 10985 20256 2964 -8139
9824 -8139 -23644 -19179 15911 -3304 33623 59355 2516 -2166 -9608 9116 16243 21572 135
9811 135 -8041 -18707 -13054 -15604 1421 -1808 -34598 -45204 392 17839 -7912 5952 30178
9798 30178 -21739 -23033 -21236 -40689 1431 -2333 -15720 -16272 -34836 12682 14400 -14224 -80
9785 -80 20561 -7255 -22062 -16820 -13063 -760 8496 -2365 2714 35077 62636 75417 16263
9772 16263 8896 -3807 -550 -3271 3787 6232 2796 3933 21318 16497 12400 -2495 -44843 -35278
9758 -35278 -46730 -22198 -4728 -7768 -5006 -18686 -11287 23052 14389 16048 11584 3198 1855
9745 1855 4349 24630 -8428 25282 -23309 -49280 -28690 -6078 5820 -19756 -18735 -35541
9733 -35541 -20192 -14971 -2963 -3269 -15547 -29394 -48769 -14247 5446 10208 21164 17538 3817
9720 3817 -432 -7329 -12340 -3675 -1723 -23715 -43970 -18928 -2661 -20241 -43948 -35787 -21607
9707 -21607 -14958 17924 39842 56184 48812 35291 19055 11818 -8469 -20674 -11823 27565 26216
9694 26216 2795 -5880 -11616 -28850 -41192 11555 25177 6333 33215 31521 45384 59696
9682 59696 39331 46653 80819 45032 8033 12588 8642 -10891 -12892 10697 -13893 -15228 -16909
9669 -16909 14776 29031 13330 16494 50754 29676 10598 21177 34336 47631 6321 7153
9657 7153 8108 17965 -6637 2200 31035 11494 -12367 -3754 17106 28883 17881 5919 4099
9644 4099 9529 26500 21086 8420 -8746 15254 9498 35059 68117 26998 6689 -7716 -17990
9631 -17990 -17855 -9579 -11828 -3075 21371 1338 -7629 -36228 -19004 23328 -2987 -13349 15598
9618 15598 -8889 5380 28764 2281 20120 38084 12264 -13157 -17348 5529 35019 6611
9606 6611 8882 4435 10929 22793 23413 40970 21634 1688 -9729 14465 25095 -4255 -1404
9593 -1404 25338 23186 23710 -9192 -18758 1167 -16240 179 1753 -182 28160 18199 21847 36499
9579 36499 32865 15816 20602 31563 14497 4411 2965 13221 29711 21584 -14662 -43684 -17851
9566 -17851 -4081 13323 15385 2848 -10909 -6289 13358 -25939 -2467 34534 41583 43115 7311
9553 7311 18204 6188 7113 13959 38655 31328 40935 34137 22895 14713 16014 31388 -5851 -1414
9539 -1414 -751 5662 34090 46200 61718 53390 3907 -24122 -10275 4656 -39598 -68437 -19355
9526 -19355 5767 -3228 15544 21746 37083 42526 7003 -4075 15499 10494 519 -1639 -5085
9513 -5085 -19213 -21839 -26816 -2897 23448 4552 2457 -20842 -50423 -2008 -7540 12252 19572
9500 19572 -14533 -11330 -5449 2106 44531 16265 2125 1214 -3464 -13436 -24854 -32999 -46053
9487 -46053 -60137 -63898 -42729 -27305 -18330 -18135 -27217 -4528 4737 8089 920 -5486 -30244 -52803
9473 -52803 -25191 -37060 -22317 -31651 -23600 4188 28351 20152 24746 -7838 -22981 -1710 33533
9460 33533 15195 -39865 -11147 -37656 -68383 -35570 -10435 -12463 -8234 8354 10443 24560
9448 24560 16184 -2924 -28918 -44940 -13472 10209 12209 -194 2405 -10780 -10851 -15017 -4399
9435 -4399 16106 1910 -26680 -45320 -36452 -32603 -15649 6829 -19463 -26094 -18251 -19882 22273
9422 22273 29829 1688 -43579 -55975 -60220 -35092 -44312 -16614 -7459 -19233 27304 -11029 -31661
9409 -31661 -7813 28976 46870 38122 -10135 -13059 -12539 -18882 24803 53752 32366 -7061 -28946
9396 -28946 1636 21991 18922 13643 528 22965 13848 9844 -22402 -5344 30770 -8502 2517
9383 2517 24510 5386 -41867 -16943 31269 55777 47663 -7632 -11074 635 3698 4636 26256
9370 26256 37752 10268 -10428 -13050 802 -24469 1281 12543 -15500 -23705 -35545 -12348
9358 -12348 12764 -4892 -10329 -3986 7182 35362 2427 -17681 -2748 -19070 9188 48470
9346 48470 11940 5692 16887 -16729 -44032 -4748 26488 41431 18289 -3416 25331 17442
9334 17442 -5713 3762 24655 26091 -1438 9853 12001 44731 55630 -18567 -33374 -8640
9322 -8640 -7885 -16145 8192 18577 -6790 -19482 -14177 10871 -12589 -12054 4204 14511 -13453
9309 -13453 -13752 19644 26332 25396 8783 -2223 14949 16831 8489 -945 19531 10488 8375 32792
9295 32792 12491 -12261 5511 25629 20412 41942 20182 -8798 -7433 15316 33589 -9155
9283 -9155 3124 5857 19653 41210 18324 4538 -35148 -25366 34 12161 6972 19518 -23597
9270 -23597 -24606 -8929 -34237 -15386 36052 2335 7479 -12535 -32856 -12596 -1529 1086
9258 1086 1955 14601 24446 13692 8777 -6656 -17241 -4786 4642 22565 19707 10310 17076 6429
9244 6429 8521 -12013 -11251 26492 23457 10802 -14900 6525 19579 46834 39326 30279 4635
9231 4635 22841 43415 31348 9121 13878 20658 19016 8166 -45235 -32779 10655 30681 18558
9218 18558 32468 12023 7315 -15410 -28925 -41517 -8888 -538 -19201 8668 17179 -7177
9206 -7177 3488 8133 -20968 -11213 5396 -4590 3342 1848 4585 11748 -35177 1571 -2988 -13326
9192 -13326 -19317 -9971 2648 -38361 -16515 20245 9270 -10365 -12390 -38946 21309 43879
9180 43879 -4965 7401 6945 13656 7568 -11247 -7880 -23269 -22511 -6273 -4558 40124 55980
9167 55980 61610 13557 -2744 8473 2725 5780 23598 15191 -45538 -40801 -7259 26652 44981
9154 44981 40707 21319 22553 -13576 -14800 60959 67931 59747 35587 13100 15746 17841 26861
9141 26861 8808 8651 19398 -3294 371 7333 -19542 11001 33777 42509 44074 62815 64428
9128 64428 13582 -10035 -623 11871 2643 -1746 23101 45266 28562 19029 7361 -3854 -2088
9115 -2088 16455 24323 2060 13736 10366 11340 17267 5980 40992 29458 12369 1500 17468
9102 17468 34623 45296 52592 54933 46730 48062 43832 37259 23527 22099 5782 9378 -90 20248
9088 20248 24157 19107 32384 31271 22415 -5562 10571 28816 14348 18812 28440 13123 -2320
9075 -2320 26491 20441 3871 -13775 1979 9516 30506 37550 17607 29322 10659 8078 26209
9062 26209 20610 -17080 16124 4368 15862 21362 -1601 33910 10601 11654 34869 24412
9050 24412 9140 6635 -4277 -22594 -11971 -17792 -14659 -12441 14636 -8120 4107 -17155 -3565
9037 -3565 38549 45948 37614 30357 50952 43995 -1971 -9221 3286 -4956 998 10545 -9338 16020
9023 16020 15029 70 43383 50663 11392 19946 -16480 11917 9095 5483 -2538 29969 36573
9010 36573 37369 25942 7718 33957 52806 35904 11138 19384 29747 38072 41734 42115 66804
8997 66804 89200 81877 65282 56343 71408 72034 74789 37030 42096 41498 28544 48440 84327
8984 84327 58990 73528 82880 97317 90783 75203 56596 68523 84349 98252 125174 124862 91546
8971 91546 96163 102899 143305 170646 187725 174272 191614 171699 174443 198856 201364 190369 178798
8958 178798 172322 181513 209396 240521 237102 234596 239325 267385 283098 290173 288683 315949 346794
8945 346794 364593 391502 387902 450939 481071 521980 565762 652268 709992 750183 793062 850321
8933 850321 918599 1014090 1111994 1217574 1432010 1655447 1957957 2306042 2544268 2669613
8923 2669613 2711328 2618930 2386354 2068907 1816682 1639485 1467718 1314281 1140284 1031304
8913 1031304 948480 869747 773047 692312 622541 550065 526752 511268 453336 435032 406380
8902 406380 378749 332375 296813 273054 262237 239479 246088 242733 193050 180634 176177 191385
8890 191385 184039 143127 121296 128924 121503 119659 128691 88842 84520 97109 99104 90873 79104
8877 79104 63675 65395 109660 88052 99059 75325 58922 52927 98253 85394 60985 64597
8865 64597 29131 19673 52973 90056 35773 32179 30592 -3988 13186 25220 21114 10577 10549
8852 10549 28256 53031 21356 19067 10878 20931 31982 36540 33941 24057 18958 26819 2220
8839 2220 -8344 31176 14886 49203 70160 39024 28152 9595 -13666 14420 16932 8977
8827 8977 20626 30679 44109 51570 12331 -12114 -38566 -14521 18492 20589 12107 -7221 -15079
8814 -15079 19021 30295 32356 27841 56733 40213 15173 8737 -5205 -31506 -39380 -20255 -21401
8801 -21401 8475 35074 20143 23413 -4737 -7179 19691 3086 29671 37219 55427 35345
8789 35345 6510 15931 37274 35860 21417 29854 -10997 -25990 9991 41927 38514 21109 14597
8776 14597 -18613 -2991 -10799 14251 50372 16810 6942 1671 -4265 -27028 -40256 -56314 -34994
8763 -34994 -8036 13098 22252 -17573 -22860 11487 41353 49580 53828 42386 -2166 -1315 6924
8750 6924 3052 4845 18113 -1455 -9886 -8942 -31976 209 6909 16700 21146 12444 -10469 19737
8736 19737 32080 11897 4576 10342 41332 18134 9184 10058 8046 18456 37530 31499 15535
8723 15535 27703 -23817 -10508 -10318 -23955 -13552 14627 18030 24279 23927 17611 42298 8576
8710 8576 -3095 8716 13456 14525 6654 -3112 6738 -14733 8874 10611 14278 -5392 -40440
8697 -40440 -13488 -25416 -20613 -4558 13436 16287 10514 12619 3464 -17476 -30895 -18331 -5612
8684 -5612 -22687 2870 4880 -8822 -2050 33895 19865 36934 50671 16580 3050 13389
8672 13389 43222 39792 41148 -7547 11244 4675 -2917 -8045 -1591 36408 31693 13548 17090
8659 17090 10015 9123 19941 9864 35631 8772 -29985 -38750 20425 44095 3588 -49393 -45655
8646 -45655 -13079 4046 9062 -2427 25563 7103 -11761 -33412 -51555 -8985 8970 40482
8634 40482 25418 17597 -6131 -3713 -4273 -20049 -31655 -14912 1500 -27158 -45896 -30282 -4953
8621 -4953 -36609 -28983 -4732 -16493 -26940 -25609 -6238 19688 -3361 -13911 -19311 -11663 -11483
8608 -11483 2535 19043 24288 2796 -19193 -33542 -29783 -13298 -6703 4995 -4847 -32103 -54647
8595 -54647 -55936 -48350 -53244 -30181 -14830 -25269 -70159 -66341 -187222 51261 138031 40652
8583 40652 14137 -22122 -11391 -30088 -5288 -5744 -9097 -5396 14353 -725 -2843 3026 21302
8570 21302 20379 2723 15035 5997 -28110 9084 25589 39967 29873 28885 14269 28871 510
8557 510 -5850 -7559 -11001 3844 -832 -5565 14320 -3720 3363 -2035 20872 27258 13501 -4107
8543 -4107 -5174 -22161 1528 20736 23215 1878 -11705 2279 8551 -21890 -14991 17234 -2079
8530 -2079 -1909 -5435 30846 38862 31967 18928 -8104 -19069 -36349 888 -4995 3449 13625
8517 13625 -6978 -4603 -9015 -13492 -40801 -40765 -44628 2726 24189 1357 -7530 -2799 -943 6147
8503 6147 -16479 -14309 -30315 -24343 14170 6246 1923 -5245 -22353 -23993 1001 -15762 5559
8490 5559 12116 5778 10368 -7968 12782 -16650 -8024 666 -36979 2254 -9671 -10648 5294
8477 5294 -5892 -16559 -36206 5608 -4303 15234 4612 -1592 -14184 -323 -18668 49
8465 49 27801 -627 -10903 -18473 -13593 21647 31817 16454 6074 -17536 -16978 -48924 -35152
8452 -35152 -32572 -24283 -15628 -8192 6611 10280 -12298 3302 -9594 31044 44009 -13081 -53578
8439 -53578 -37629 -21658 9230 14278 -24443 -7988 -19644 -12120 -19967 -39577 -45231 -9977 -31342
8426 -31342 -34662 -37289 -35623 4034 -16211 -8406 11294 2514 -13759 -3616 -29693 -14865 22293
8413 22293 954 -24661 -29594 -43016 -31056 -12089 -15347 -32543 -20233 -38445 -32102 -29148 -26559
8400 -26559 -7015 626 17309 -833 -17774 -51959 -29393 -29407 -25008 -1712 -21503 -23782 -18419
8387 -18419 7528 14463 1718 1985 -15952 -21934 -12721 4064 5140 47563 58284 35558 -13175
8374 -13175 -30904 -2319 -2968 -33681 -34726 -18512 7491 12775 28049 5214 16143 24375 -1940
8361 -1940 -26130 -14972 16030 13532 -3181 -3447 15060 8904 -16376 -24933 -21749 -25259 -17278 -23356
8347 -23356 -2853 -13239 -3960 -3679 -20397 -36942 -31489 -18682 -13434 -19597 -4995 10107 16068
8334 16068 -23301 -33007 -32119 -22768 11838 -16297 -24282 -50611 -48958 -8724 10279 -13464 -4302
8321 -4302 17743 -7234 -8812 -40767 -43767 -33676 -24687 6726 37640 2401 -4691 16398 -23598
8308 -23598 -25288 -46521 -52938 -16196 -13892 -26133 -16661 -26763 -29593 -45390 -33984 -17521 -10814
8295 -10814 30536 26286 3140 24094 2654 -37906 -29934 -44129 -41108 -24609 -42653 -64849
8283 -64849 -66709 -45475 -19409 -35162 -46765 -3643 -7955 -10832 -30098 -26348 3421 20021 -7551
8270 -7551 -44138 -38797 -16658 -32287 -59893 -40140 -43558 -36489 -14424 3441 -16722 -4176 -44103
8257 -44103 -27610 -25048 -17641 -23949 -39261 2874 12173 10591 18374 3372 26636 23735 -34586
8244 -34586 -58622 -14831 1608 28658 3195 13219 13738 -14841 -14941 -46624 -13627 -27477 -31851
8231 -31851 -39224 -6693 33434 52314 10244 -10517 6338 8164 -55779 -46845 -21748 -1782
8219 -1782 -35698 -57727 -47046 -66916 -81150 -46664 -60260 -73820 -52490 -78822 -40846 -21012
8207 -21012 -59284 -38410 -46285 -39789 -28434 -14095 22466 -20621 2990 -28024 -44600 -67666
8195 -67666 -54059 -6448 -17501 -40452 58043 61297 -4653 -34779 -45058 -23213 -58741 -39465
8183 -39465 -12382 2146 -2357 17233 -11679 -40481 -23177 -23200 -40390 -60857 -72689 -17414 11284
8170 11284 16047 -23084 -46361 -51219 -60521 -47882 -28399 18005 -5007 6594 -9339 6180
8158 6180 11227 -14220 -38905 -4313 -14749 -4859 20025 -4781 -4025 -39714 -66322 -60775 -4159
8145 -4159 12137 13685 -6858 4394 23655 17976 28 -14544 -33357 -34302 -47454 -29871 -20407
8132 -20407 -32882 -24307 -21694 -7739 10052 22266 12245 -4355 -23185 12640 13550 4036 21654
8119 21654 -10474 2273 21030 10486 3755 15981 -5367 -36988 -55609 -57923 -55764 -44241
8107 -44241 -42040 -3828 -10785 -24599 -20345 -19355 -14821 -26903 -9638 -10088 -13868 -23156 -1635 11665
8093 11665 16563 -2312 -44414 -10426 15510 3253 -15195 -11405 -3339 -11897 -7010 -21738 -31490
8080 -31490 -28996 -17368 -31358 3526 2768 28918 8897 -15356 -17884 -17289 -2053 -28713 -25371
8067 -25371 -13971 -34954 -24364 -13964 -8371 22194 -7449 -33180 -28841 -44313 -39775 -31210 -34013
8054 -34013 -18849 -30362 -36307 -53468 -29635 -18672 -24536 5938 37119 20764 -12322 -13505
8042 -13505 -7984 -48462 -32123 -2832 -23991 -20701 -43981 -57536 -42656 1612 -16987 -44189
8030 -44189 -26323 -11986 -18878 -36595 -28278 -21619 -33584 -34709 -47553 -11911 13645 21268 -16994
8017 -16994 -26698 -31802 -12347 -6908 -12227 -1173 -31752 -37040 -33417 -28629 -27534 -36475 -5447 2434
8003 2434 -30909 -14162 -18216 -10755 -10104 -24343 -24222 16261 284 -3234 -46149 -47453 -8970 -23981
7989 -23981 -73727 -73528 -18287 -20422 -16538 -34868 -53974 -25652 -44587 -39435 -12161 -28832 -32530
7976 -32530 2800 17857 -11019 -38119 -54956 -13133 18187 5013 -23071 -33360 -33125 -7542
7964 -7542 -6168 -25664 -8236 -21246 -42926 -34565 -28577 -29140 22809 41227 7621 16614 17600 -8897
7950 -8897 -31737 -45731 -17949 -2273 -19539 -2054 8415 -18523 -13362 -2300 -43568 -36088
7938 -36088 -15809 -24979 -27747 -28966 -19011 -22130 8139 -2893 36 12686 -13611 -21580 -24313
7925 -24313 -12250 -2634 -36725 -59206 -51562 -47441 -39222 -22699 -20089 -36108 -39671 -52080 -39236
7912 -39236 -49053 -57892 -47773 -25877 -20451 -39558 -27613 -29693 992 -22622 -28689 -15958 -12835
7899 -12835 -41645 -60633 -46738 -24751 -542 -18612 -10065 -5385 -14655 -45656 -52874 -48758 -40414
7886 -40414 -54564 -46212 -40117 -18985 -52722 -57478 -45582 -14528 15831 11770 -13562 -15112 -1088
7873 -1088 -11382 -17227 -24884 -20003 -17554 2926 13793 20734 8237 -3706 10350 -2665 -9866
7860 -9866 4036 -17171 -14285 -24090 -19651 -7299 -11942 -28173 -24050 7024 27730 36274 1440
7847 1440 -13832 -9311 -34902 -26065 -35465 -29059 -17392 -11330 -3370 -22268 -46357 -55498 -43831
7834 -43831 -49048 -56938 -51544 -50744 -53798 -42960 -35785 -18779 -44726 -77430 -56183 -11839 -8458
7821 -8458 -20424 -15694 -4848 -7819 -24734 -33010 7600 16023 19582 -17163 -41030 -59679 -61230
7808 -61230 -28961 -60217 -92819 -59566 -68984 -62802 -24930 -89210 -154873 -198085 -4914 146156
7796 146156 148983 79079 58962 34868 19311 27618 20299 10166 -1503 8068 21623 27859 18417
7783 18417 -14109 -14319 820 22627 36999 23375 9390 -8811 8803 7035 25523 -19451
7771 -19451 -40371 -11117 7911 21528 23330 37524 1565 -33999 7711 14327 -24638 -19030
7759 -19030 -12343 -25257 -27819 -35530 -4658 -19674 -16283 -42501 -25595 -36092 -37126 -23742 -15441
7746 -15441 -12648 -15259 -2541 -12293 -19017 -18838 -22142 -26105 -18550 -13571 -16408 -13019 -31734 -23773
7732 -23773 -43048 -55910 -54201 -37379 -12707 5813 10403 -22793 -46388 -47891 -49041 -79433 -40259
7719 -40259 -39101 -10745 -14299 -28922 -36501 -6461 -17227 -15310 -24841 -9401 -14613 -8767 -391
7706 -391 -16843 -25820 -27418 17846 1067 -3121 -14090 -4856 -17982 -23592 -39269 -8937 -9025 -30220
7692 -30220 -36041 -8913 14502 6792 -36487 -44703 7740 -13943 -27352 -34360 -6728 -4656 -19314
7679 -19314 -17258 -9789 6730 23891 15267 -16177 -29049 -19296 5385 -14037 -8844 5531 -9307
7666 -9307 26209 4737 -3575 -20388 -55671 -66848 -48298 -13870 7630 17724 47780 36833
7654 36833 21543 -14810 -16731 -14343 -29661 -34477 -38695 -23888 -8389 -17585 -21125 -52364 -56754
7641 -56754 -14898 -11748 22909 -14566 -6300 9693 29213 16421 1930 32148 3999 -15897
7629 -15897 -33100 884 -21810 -24092 23090 21419 -9991 -15597 -8033 -30083 -55877 -63186 -52668
7616 -52668 -35752 -23314 -6596 -6467 -28173 -26634 -42951 -31879 738 -6855 -19802 -5960 2121
7603 2121 -4606 -21059 -8475 -32445 -19921 -320 -14863 -52604 -18450 -31681 -47315 -17295
7591 -17295 -7646 -4250 -41062 -34924 -24689 -26828 11745 -19143 -11620 -20333 -42448 -18933 779
7578 779 5406 15348 9915 77 9970 14523 -12193 -48261 -20239 -16212 -53236 -22118 -28202 -30257
7564 -30257 -31112 -22214 -25452 -9642 -14437 -48169 -38342 -44888 -10231 -15411 -31425 -32686 -31011 -38828
7550 -38828 -33097 -14392 -17062 -33580 -22807 -14100 -9981 -30715 -38310 -26649 -34354 -43971 -21307
7537 -21307 -12375 -34587 -27754 -23415 13113 29832 9080 1595 -59213 -50144 -25142 -37368 -33378
7524 -33378 6773 -5762 -14953 -43811 -50671 -44911 -6113 16479 -10205 -3377 -41035 -45424 -35736
7511 -35736 -65850 -43324 -52951 -69850 -35042 -9050 -24288 -10058 -22073 -33778 -18920 -17977
7499 -17977 -34946 -57428 -55750 -22510 -51473 -53070 -34812 -79397 -84145 -63900 -44828 -41348 -25845
7486 -25845 -45357 -45728 -33857 -15294 -20893 -23522 -14141 -2210 7071 8260 -30244 -18239 -11249
7473 -11249 -18000 -39491 -47815 -12104 -27724 -14292 -29432 -36998 -21055 2354 -30210 -30324 -10285
7460 -10285 -53380 -54317 -33391 -52524 -62387 -45821 -14973 -15148 -19023 -4268 16940 -17660 -39678
7447 -39678 -34598 -26051 -7958 -34155 -38164 -30591 -19518 -21975 -11395 -9001 -31424 -34687 -45139
7434 -45139 -55605 -30116 -18195 -41716 -36449 -10174 2251 -12632 -49729 -34247 -44427 -52011
7422 -52011 -86155 -21301 15981 -10411 8003 23767 1931 18845 10567 -20630 -2776 -9548
7410 -9548 20374 -5774 -6604 3915 -4622 -1708 -4485 -3571 31103 42363 16343 -3041 -5127 17370
7396 17370 12740 -7756 -9380 -22549 -50505 -18648 -2397 -13151 -25474 -41021 -19302 -359
7384 -359 5057 -20659 -10072 2155 -22640 -34373 -20466 -20512 -28347 -44191 -44513 -24540 -6864 1240
7370 1240 -31663 -18128 -9645 -17700 10941 20638 -25729 3133 -2127 -19319 -21541 17865 -13943
7357 -13943 -24180 -9761 -7197 -2835 3147 25630 1416 -30779 562 -11450 -17722 -26003 -33938
7344 -33938 -29492 -34590 -38778 -38642 -19218 -47361 -37004 -28000 -12988 -37235 1519 2266 4865 -8996
7330 -8996 -5291 56 -1128 -15717 -8474 40160 1998 -12170 -5773 -18520 13553 2798 -9010
7317 -9010 -18333 -24418 -22112 -4508 702 8410 -14034 -39895 27809 25556 14424 2411 -20926
7304 -20926 2574 13641 5765 6755 -700 -18113 -34140 -16185 -21335 -25877 -10005 650 19674
7291 19674 6160 21580 5412 -2676 -24934 -16686 -5758 6886 10483 -13053 -34115 -47399
7279 -47399 -36515 -25096 28425 17021 -14505 -14450 -25147 -7789 -13147 -6337 -24555 -4132 31578
7266 31578 35736 37946 15449 -5463 1063 15920 -4417 7508 13399 -34000 -44628 -28881 -16275
7253 -16275 -5540 -19625 -26556 -24525 -22316 -16353 -9187 -20314 159 -32148 -37953 -19210 -13935
7240 -13935 11982 20735 22570 -20229 -10634 3362 -30164 -57629 -29726 -23278 -24935 -45517 -26256
7227 -26256 9184 27849 28375 13794 -32985 -48942 -50174 -42730 -29525 -5380 23442 7779 -37304
7214 -37304 -47417 -29672 -980 334 -24397 -18709 -3464 -7922 -43667 -21624 -44189 -9312
7202 -9312 -15545 -2628 -6809 -13330 -479 4340 -29238 -56738 -55902 -40315 -75376 -84386 -41870
7189 -41870 -30943 -26016 -17625 -10390 -18205 -30029 -23947 -27801 3959 -28268 -38332 3087 -15062
7176 -15062 -39402 -24177 -1301 7612 332 816 15902 11695 13049 2246 -18519 -4970 9670
7163 9670 17821 -25854 6628 27077 -8155 -9111 -28936 -17585 53934 42789 9391 -16538 -9208
7150 -9208 2415 -38825 -24074 -2154 15335 51988 51100 25862 6750 -2537 18875 44338 39210
7137 39210 -13431 19875 -13204 -24804 -30765 -28942 9606 18356 4922 -11664 -5874 -16648 -18544
7124 -18544 -3207 -12483 -2486 13684 12122 -4791 30162 39400 30075 2613 -27673 11678 1150
7111 1150 -8805 -326 6298 1821 11793 40710 29317 -18214 -23573 4144 17579 24602 -14001
7098 -14001 23043 27094 8526 -18933 -11649 -13943 -30933 -10698 11742 -1426 -38557 -16799
7086 -16799 -2121 -3950 12117 22072 9168 -39122 -25434 -27372 -25376 -33894 -55042 -21077 15687
7073 15687 38382 38647 15660 13726 6327 -123 2780 11769 3477 4948 17167 5776 17697 15408
7059 15408 -14398 23871 49373 26169 19377 24605 17464 10172 25454 54888 19241 -4580 18738
7046 18738 36191 -2375 -39940 -48 -1302 -13598 -13496 -3076 -13345 -11194 5397 -9392 -62
7033 -62 -8677 536 28012 16996 -9019 -39073 7738 27115 28664 35695 10512 9122 27174
7020 27174 1745 -8921 6083 24732 29850 39202 44026 48009 30523 44404 60284 22076 22614
7007 22614 50923 20293 27734 5094 -18517 -16623 14179 24841 60054 66051 53053 41035
6995 41035 59564 23545 6228 31449 43491 18524 13352 9491 5628 35209 24611 30981 37617
6982 37617 49739 68641 48783 58957 46631 -5975 -10811 9644 25235 -2298 25222 40556
6970 40556 33967 49801 70475 40180 -8923 -32211 1279 36178 65967 48585 13235 14044
6958 14044 2255 23212 29154 26707 11619 11827 -2419 29293 41593 10015 -9835 943 52118
6945 52118 65733 63566 20812 -15664 3194 25782 -8059 -9371 22412 60991 46518 11423
6933 11423 -19344 29789 66066 23768 36784 40153 29031 18094 46603 5964 -19250 12178
6921 12178 12903 29497 45020 53434 27494 41855 37421 14022 6035 -26331 -11576 19101 23966
6908 23966 36545 60452 53969 43320 27905 42456 17922 2121 33978 59493 79393 70862
6896 70862 55794 32699 20846 6018 26237 17765 59130 59192 69344 25332 29889 27040 31569
6883 31569 15720 25602 56757 85489 59819 26573 42664 31890 22676 42162 60676 33576
6871 33576 37825 24707 17036 9654 7500 13543 -11387 -249 4531 -222 8815 11578 18301 16607
6857 16607 3242 3280 -16575 -6616 14424 3613 18149 6977 43045 61986 32954 21035 26958
6844 26958 42600 4746 -24312 6789 16716 32717 45592 40926 64033 82008 45342 37494
6832 37494 29486 27100 25705 34492 26202 19741 21437 46867 23332 27545 43906 37510 77960 73861
6818 73861 67722 71876 64803 29537 42886 73195 62589 57323 25428 -8343 2170 44680 51680
6805 51680 73240 58488 51661 74306 77859 69880 61075 42374 38872 37575 53336 78645 73129
6792 73129 56014 67864 78281 98997 100006 93304 61727 48261 48243 45102 63125 67887 59511
6779 59511 62169 66624 74635 58497 39335 29543 51346 68666 66962 58364 50974 83101 101386
6766 101386 70990 83767 117561 92013 82335 94864 72999 105500 95615 84600 66349 50143
6754 50143 37120 29987 74895 121030 93930 78744 114318 81114 49037 56154 64622 47288
6742 47288 61797 82553 79632 69939 57664 76342 54197 56743 69706 86972 121681 83201
6730 83201 85178 80418 109375 66161 86684 94857 100313 90044 121502 132127 116690 124380 114287
6717 114287 101050 105019 92268 74936 97604 109617 116233 81433 58901 93163 131165 123606
6705 123606 101086 111559 127755 116255 87769 87526 88969 100569 75150 96429 125970 137462
6693 137462 156172 119806 106253 116336 132479 115286 128475 101988 111180 125987 102360 122086
6681 122086 168770 168650 151627 147126 162640 170725 170918 191222 165594 176433 180030 172539 160954
6668 160954 169194 156265 155243 175710 177064 135921 134333 168527 213883 209812 190031 193314 171771
6655 171771 161921 155254 185272 223752 221175 216761 202849 199317 199763 188049 210942 220750 209129
6642 209129 228104 222850 215902 215285 216998 249151 253802 244081 268041 298821 323076 340797 320009
6629 320009 316430 321414 335180 357223 376714 383769 414362 389451 404926 449359 444757 480505
6617 480505 486627 490829 505484 550987 613589 619782 635103 643402 714225 770185 812757 811480 798795
6604 798795 777797 760278 749801 772773 752196 784632 812398 812009 839838 880068 882195 845314
6592 845314 853275 893967 885574 938311 967718 955112 949873 938105 924327 930063 915651 913614 971252
6579 971252 969420 975256 888166 869558 862301 821458 806420 851177 868738 883518 890500 885613 885698
6566 885698 863520 810647 774111 734126 711239 681464 631606 647088 673848 629328 601331 593538
6554 593538 562844 573366 521474 496265 473468 502689 512599 487238 477769 468368 515750 521463
6542 521463 509404 490970 477370 444447 427301 458841 470919 438323 455110 459469 453738 480835
6530 480835 494703 499673 477338 484757 456399 449167 464948 459177 453086 473492 506279 508469 519824
6517 519824 492215 481748 506780 523801 509603 544204 514766 498448 516314 510328 536375 548274
6505 548274 562377 550638 554027 559472 539723 536778 540923 532571 560187 563803 549257 565053 537043
6492 537043 532941 550158 543396 540132 525232 555730 539017 556233 561983 550886 576367 555454
6480 555454 547838 554508 567075 557943 533759 567990 561531 558581 593844 564560 552864 578644 576424
6467 576424 588537 605999 593640 560894 572744 625452 597731 586195 595419 624345 639371 664689
6455 664689 664989 692554 682823 649948 679364 692317 667627 674252 672153 673571 690007 750964 729626
6442 729626 730563 723848 696303 707784 755504 783078 785897 814222 821081 834093 832858 816993 832402
6429 832402 842521 892747 928019 880306 905869 924411 948923 949698 966390 978578 1001416 1020283
6417 1020283 1007210 1019039 1072454 1071233 1096612 1088975 1121670 1147475 1180209 1212263 1254028 1217018
6405 1217018 1234598 1270763 1287606 1346192 1344612 1357037 1400530 1418322 1423004 1484609 1513010 1526864
6393 1526864 1556677 1594216 1607043 1614541 1656559 1674098 1726582 1744832 1751799 1802450 1829684 1864157
6381 1864157 1878539 1874910 1866472 1891812 1933567 1967844 1991929 2056411 2091498 2103971 2116636 2135646
6369 2135646 2153184 2238453 2302418 2330634 2349640 2369433 2409100 2435987 2484764 2522836 2581247
6358 2581247 2635829 2689968 2748903 2768267 2793639 2836123 2869678 2890563 2941399 2988753 3065405
6347 3065405 3150574 3260192 3344531 3394981 3390784 3391965 3410840 3470817 3530887 3562674 3640771 3671108
6335 3671108 3733560 3822241 3890549 3956699 4061254 4172816 4285128 4424370 4608730 4767327
6325 4767327 4945046 5090289 5257687 5472461 5672108 5938017 6180547 6427527 6707036 6992272
6315 6992272 7300313 7596482 7959002 8375744 8792233 9243943 9718449 10201271 10684647 11166709
6305 11166709 11752581 12355744 12970387 13672895 14371865 15110018 15883288 16620057 17354260
6296 17354260 18165349 19073745 20093182 21264444 22557372 23982454 25511523 27117490
6288 27117490 28812211 30633765 32630397 34834190 37299960 40020936 42725722 45160441
6280 45160441 47483819 49970682 52689255 55929637 59826339 64515414 70300492 77362962
6272 77362962 85728719 94968248 102868263 105773060 103474604 99468704 96451311 95151936
6264 95151936 95513164 97269226 99907417 102856376 106226439 110216515 113847727 115147212
6256 115147212 114414413 114120706 115664365 119143050 124072034 129365978 132515826 131364663
6248 131364663 126564483 120808486 116352719 114079048 113988244 115707318 118264238 119188524
6240 119188524 116174588 110400412 104886113 100938749 98731361 98213211 99415772 102189457
6232 102189457 106170803 110781376 113734428 111290431 103117677 92972416 83813488 76340774
6224 76340774 70456061 65829091 61854586 57872029 53685312 49473682 45635057 42218215
6216 42218215 39204881 36500168 34138167 32077094 30174279 28439868 26847778 25337680
6208 25337680 23809707 22281783 20880594 19633318 18531017 17599035 16773072 16044880 15423037
6199 15423037 14877605 14421458 13942566 13317428 12630196 11973231 11392627 10905396 10459930
6190 10459930 10012114 9623600 9255760 8898449 8519696 8196322 7905840 7635320 7413471
6181 7413471 7237004 7014785 6836568 6671604 6525181 6400711 6222069 6116831 6022612 5917566
6171 5917566 5876747 5834798 5831650 5853028 5925448 5988076 6027648 5857060 5570278 5294987 5077220
6160 5077220 4856643 4700273 4604639 4489491 4364051 4250734 4138702 4003350 3947882 3834354
6150 3834354 3703808 3649886 3601530 3569893 3502232 3471067 3458504 3369063 3287755 3208716 3079269
6139 3079269 2998904 2943099 2898273 2863908 2855311 2874518 2865195 2829107 2720045 2589733 2470412
6128 2470412 2392323 2327039 2267235 2210772 2180734 2114950 2018850 1932505 1895757 1830471 1769866
6117 1769866 1779105 1757329 1696087 1682192 1724872 1709851 1652351 1633376 1579851 1553483 1588939 1568596
6105 1568596 1565325 1561076 1560095 1533376 1522310 1509090 1490909 1494725 1485882 1488708 1464621 1471039 1484667
6092 1484667 1489471 1459977 1436028 1438831 1439141 1438154 1435253 1405989 1424564 1445806 1451332 1399629 1388907
6079 1388907 1396895 1413547 1398193 1420890 1431851 1403143 1403569 1418933 1466795 1483437 1469629 1500927
6067 1500927 1510849 1516528 1549481 1592235 1664037 1719405 1733036 1759526 1766276 1724820 1714824 1729337
6055 1729337 1743252 1770772 1777065 1794570 1805334 1810132 1790004 1779654 1764687 1748831 1745377 1780851
6043 1780851 1803679 1818634 1845344 1860668 1852661 1844271 1805615 1761303 1730942 1712790 1733571 1744571
6031 1744571 1721100 1704167 1692035 1665847 1620188 1601322 1658833 1630018 1594399 1610978 1603728 1605532
6019 1605532 1575450 1529113 1544122 1507695 1478638 1454847 1432142 1405465 1432468 1395288 1369020
6008 1369020 1347329 1332481 1290033 1250353 1230094 1232497 1216647 1222347 1204448 1215808 1230964 1232997
5996 1232997 1235858 1197985 1209161 1229481 1209104 1232533 1221059 1236119 1264451 1267529 1257726 1257107
5984 1257107 1268421 1273506 1304276 1349917 1367177 1373324 1356028 1328140 1353456 1355308 1375010 1396381
5972 1396381 1441060 1466030 1484878 1484762 1473604 1494943 1494040 1512288 1530138 1559023 1567629 1580924
5960 1580924 1608782 1594151 1612610 1623598 1602743 1581959 1583520 1604264 1649680 1654368 1671234 1703779
5948 1703779 1701568 1717670 1772993 1827338 1858058 1946963 2036910 2038454 2021427 2022650 1958756 1920883
5936 1920883 1926922 1942764 1975473 1978217 1981827 1979758 2005977 2046679 2078977 2084687 2107052 2087102
5924 2087102 2093756 2108698 2129020 2156942 2179245 2213064 2250592 2298991 2385408 2470741 2540084 2526223
5912 2526223 2509509 2448392 2442376 2483712 2482131 2418869 2400020 2386440 2366964 2373316 2366548 2404514
5900 2404514 2387224 2384836 2401575 2401622 2393392 2377893 2449210 2462699 2482038 2540968 2577135 2657316
5888 2657316 2754905 2780855 2770017 2725868 2629177 2573846 2496819 2450366 2446567 2454933 2424000 2408514
5876 2408514 2395182 2374380 2379761 2359042 2360623 2374968 2376546 2376392 2395103 2412548 2421588 2440975 2486729
5863 2486729 2531153 2525405 2528137 2586282 2645826 2695038 2725050 2723294 2745209 2762367 2763677 2751903
5851 2751903 2746703 2767242 2788458 2810450 2830505 2843522 2860775 2896207 2949784 2937939 2958518 2970651
5839 2970651 3007100 3040382 3061813 3113452 3154863 3197827 3228196 3274430 3302680 3335338 3404835
5828 3404835 3487711 3529277 3550872 3625942 3641553 3675093 3655116 3620903 3659622 3769985 3830455
5817 3830455 3889663 3936701 3986839 4010174 4033183 4065203 4115889 4195486 4235695 4292345 4379387
5806 4379387 4477830 4531181 4608663 4694582 4780941 4868255 4988373 5106885 5217492 5355485 5521714
5795 5521714 5645756 5820710 5976939 6138328 6330817 6595527 6833496 7065555 7300044 7559345
5785 7559345 7850578 8147194 8524886 8880951 9271254 9679713 10139372 10591027 11054797 11540580
5775 11540580 12066330 12599744 13214653 13880606 14592868 15297492 15934018 16567647 17216650
5766 17216650 17959393 18758485 19693007 20731827 21881635 23151311 24461571 25746386 27047138
5757 27047138 28411594 29912713 31563241 33465664 35670012 38071354 40708327 43470720
5749 43470720 46319016 49328622 52661803 56500347 61165886 66894307 73737898 81651338
5741 81651338 90034267 97010590 100246135 99733049 97944902 97159844 98096070 100787807 105205515
5732 105205515 110779062 116140031 119797073 121019286 119932516 117514495 115507504 115171609
5724 115171609 116901079 120598043 125863709 131902620 137051474 139007324 136924872 132865905
5716 132865905 129649816 128480356 129275117 131585128 134313589 135013254 132335446 127433064
5708 127433064 122226483 118188124 116027684 115742704 116954798 118814355 120335541 121037152
5700 121037152 120198159 116639258 110700367 104411963 99260891 95607141 93251197 91966913
5692 91966913 91158815 89741310 86644615 81833636 76679845 72122336 68095182 64525370
5684 64525370 61482212 58785022 56346866 54095399 51980479 50042780 48310653 46790406
5676 46790406 45347894 44075849 42976530 42010346 41194752 40659221 40331400 40116490 40094091
5667 40094091 40346832 40909807 41898798 43393889 45324220 47464506 49254118 50155827 49808870
5658 49808870 48619165 47333295 46491059 46178062 46270054 46499986 46788007 47200046 47719318
5649 47719318 48183454 48576658 49052933 49810724 51124407 53133028 55892814 59283010 62669851
5640 62669851 65100214 66008512 65464188 64079771 62642902 61751806 61354269 60792480 59599999
5631 59599999 58304143 57496291 57118505 56841112 56516207 56162783 55926098 56100534 56801986
5622 56801986 57633075 58381412 59258742 60561483 62222720 63844080 64275911 62646076 59238172
5613 59238172 55322229 51866892 49200386 47235551 45748596 44498027 43441331 42698478
5605 42698478 42147358 41426199 40208098 38689989 37206143 35933333 34828664 33919186 33272164
5596 33272164 32799177 32280437 31495713 30406728 29414734 28543345 27666208 26711176 25674312
5587 25674312 24719076 23841566 23070860 22354682 21641225 21003913 20459379 20093915 19872993
5578 19872993 19745897 19667666 19572716 19540355 19546918 19498115 19322872 19111540 19025635 19097431 19171418
5567 19171418 19089530 18765981 18314035 17809362 17216379 16546364 15858402 15272660 14748654 14332297
5557 14332297 14001928 13752177 13528348 13341961 13106095 12795488 12517741 12288322 12067012
5548 12067012 11843460 11653389 11526047 11466122 11488969 11542737 11677862 11828111 11882723 11804756
5538 11804756 11617697 11421521 11244192 10992314 10655067 10312882 9996214 9746366 9540222
5529 9540222 9337378 9171972 8991561 8748445 8496048 8249144 8087566 7926137 7812551 7799864
5519 7799864 7772722 7705184 7575985 7457464 7416718 7431288 7391202 7229335 7027423 6815701
5509 6815701 6607483 6439669 6245602 6071538 5936782 5766014 5647100 5530328 5445684 5347894
5499 5347894 5261892 5153798 5007779 4892026 4828991 4787445 4754521 4715971 4594687 4484340
5489 4484340 4379205 4320175 4295117 4225377 4214204 4166287 4087267 4020731 3957692 3881953 3809449
5478 3809449 3747041 3707604 3686990 3659517 3617555 3591406 3563999 3551304 3527904 3526160 3546230 3536076
5466 3536076 3534489 3530854 3533084 3563809 3591056 3643623 3676863 3659835 3699639 3762409 3803050 3853239
5454 3853239 3923903 4003422 4065547 4151412 4253838 4319931 4433595 4540014 4645985 4780253
5444 4780253 4947051 5059606 5216810 5385494 5561765 5746805 5983666 6202440 6399064 6617991
5434 6617991 6887505 7151089 7392707 7666684 7972114 8337200 8652144 8963475 9321799 9682083
5424 9682083 10097439 10516973 10996555 11526570 12108679 12719854 13404276 14143067 14936098 15801825
5414 15801825 16692584 17621955 18631433 19717977 20908468 22201286 23559815 25045602
5406 25045602 26647063 28440085 30401989 32477195 34737975 37025216 39323767 41547977
5398 41547977 43503545 45010082 45787772 45944334 45582023 44962391 44362005 43850920 43534941
5389 43534941 43359044 43398835 43633749 44155779 44964605 46066442 47484123 49103957 50851599
5380 50851599 52445252 53801041 54931597 55888696 56659096 57169694 57236660 56702199 55505667
5371 55505667 53736264 51554786 49300223 47146501 45216551 43547656 42098075 40811731
5363 40811731 39715246 38839809 38177873 37667704 37392555 37297262 37294423 37337807 37372833 37213809
5353 37213809 36800718 35987783 34698259 33075768 31215040 29289335 27524001 25890591
5345 25890591 24350770 22884737 21519290 20267216 19103490 17983444 16992973 16076469
5337 16076469 15254658 14523660 13850986 13219310 12649025 12110046 11578663 11060172 10562923
5328 10562923 10135567 9704186 9309326 9002626 8732923 8474884 8222432 8019444 7836020
5319 7836020 7656274 7533345 7453990 7375891 7308170 7238122 7111466 7047227 6966165 6926612 6944801
5308 6944801 6948529 6935440 6907104 6818574 6795719 6759341 6772466 6812905 6850426 6940197 7095935
5297 7095935 7218180 7380676 7607279 7858511 8109111 8436077 8778358 9049973 9417059 9792987
5287 9792987 10214244 10749195 11356746 12030541 12753841 13540544 14485123 15653987 17202534
5278 17202534 19258641 21937755 25389530 29236280 31805308 32142905 29540908 25587173
5270 25587173 22875103 21323437 20144198 18549607 16778869 15169660 13886739 12802478
5262 12802478 11886498 11063650 10393521 9829660 9305914 8829103 8369527 7960493 7481386
5253 7481386 7021835 6612824 6252977 5974712 5708656 5478677 5269240 5099076 4939071 4756172
5243 4756172 4644657 4511988 4405893 4360087 4269051 4196594 4125979 4080806 4034574 3980106 3962481
5232 3962481 3966706 3910872 3911789 3905153 3890726 3862271 3802929 3715722 3698555 3675042 3630196 3586844
5220 3586844 3547306 3548248 3522401 3458540 3406518 3413226 3401831 3405185 3452816 3490581 3495558 3492275 3495643
5207 3495643 3501185 3532455 3579230 3615914 3625186 3676588 3741483 3809414 3859500 3949595 3998818 4042962
5195 4042962 4110307 4127767 4177342 4256024 4347759 4382582 4404295 4378171 4386061 4428399 4500792 4518985
5183 4518985 4554487 4572849 4612327 4625457 4620010 4609168 4608827 4566070 4554761 4534629 4528150 4508522
5171 4508522 4486198 4493246 4509916 4536666 4567935 4603420 4655079 4696725 4777648 4886511 4958777
5160 4958777 5040576 5069182 5085229 5188955 5317255 5427473 5501479 5613049 5707925 5827785
5150 5827785 5956127 6081439 6183923 6310692 6427623 6631740 6788718 6957722 7174068 7407179
5140 7407179 7635677 7874208 8159626 8464568 8759864 9030469 9320869 9597091 9902865 10261522
5130 10261522 10611832 10972666 11366472 11807054 12301108 12852563 13468968 14153401 14869269
5121 14869269 15530866 16259602 17002290 17837196 18744729 19713246 20719773 21790888 22949201
5112 22949201 24147491 25459322 26844502 28450987 30275346 32174630 33908153 35516185
5104 35516185 37258968 39272517 41471747 43844918 46375751 49020745 51674616 53924046
5096 53924046 55547823 57351887 59817697 62834136 66357802 70318930 74711419 79842132
5088 79842132 85833797 92582212 99794994 107638917 116572298 127007303 138706446 149382552
5080 149382552 156540216 161482736 167551892 175544678 184975262 195858922 208868905 225384165
5072 225384165 247700391 277925741 317391362 366317224 417315164 446403682 432095871
5065 432095871 384156873 334078903 296558633 270944965 253504037 238541441 221407284
5058 221407284 201639895 182828991 166357566 151971139 139522825 128649050 119195430
5051 119195430 111077843 103945014 97556184 91667853 85811311 79361732 72738000 66810125
5043 66810125 61743680 57259768 53408321 49992786 46949469 44140428 41593855 39248598
5035 39248598 37182023 35296798 33550915 31936646 30405280 28973851 27656352 26389539
5027 26389539 25135021 24024742 23100476 22237854 21504659 20856561 20357716 20049841 19909966
5018 19909966 20020124 20410859 20668571 20316490 19172902 17868248 16778327 15978861 15364073
5009 15364073 14874992 14398167 13818558 13276656 12718328 12172858 11663904 11186678 10747076
5000 10747076 10355030 10000794 9688473 9406925 9132399 8885908 8603561 8352899 8144753
4991 8144753 7950157 7768806 7599424 7424290 7292725 7142390 7059476 6954112 6776915 6554543
4981 6554543 6352848 6156056 6031100 5896289 5742447 5619542 5471109 5300603 5182011 5063986
4971 5063986 4988592 4898886 4797570 4684422 4589211 4537489 4455526 4306516 4164420 4001469
4961 4001469 3873649 3755686 3637888 3521347 3416210 3286948 3181555 3107053 3030175 2966998
4951 2966998 2894221 2816907 2779438 2727839 2658167 2570858 2492243 2447850 2373679 2339852 2325153
4940 2325153 2338612 2308465 2264422 2256533 2263065 2260017 2254919 2263815 2247382 2228917 2202570 2180905
4928 2180905 2187426 2192133 2236925 2231955 2228590 2229478 2191382 2151986 2128423 2098344 2072460 2006372 1948297
4915 1948297 1892612 1878610 1858836 1882762 1834267 1811646 1764066 1708237 1690760 1693422 1678646 1686944
4903 1686944 1695727 1664040 1645926 1637429 1647008 1632652 1597940 1611192 1606221 1613674 1620690 1598270 1584737
4890 1584737 1607815 1601542 1620397 1603309 1611847 1600281 1596919 1583518 1623580 1642767 1636245 1667397
4878 1667397 1676532 1682595 1710724 1666247 1643711 1662585 1642542 1628308 1615100 1640651 1653073 1663524
4866 1663524 1681946 1696909 1673696 1621272 1607232 1607788 1607242 1620084 1658658 1640009 1623921 1631729
4854 1631729 1622988 1665700 1745876 1790568 1776025 1840085 1963060 2085752 2169059 2158526 2147245
4843 2147245 2102075 2056944 1995016 1868371 1794024 1707814 1625321 1547051 1508159 1446486 1400253
4832 1400253 1335047 1285778 1247318 1207945 1136579 1094202 1039096 1044555 1027484 974504 923769 904048
4820 904048 871625 846112 841569 815322 820338 820727 819047 829778 834034 814148 804873 821481 804273
4807 804273 781641 776072 741528 730923 746423 766808 768886 775005 799289 828259 837534 881641
4795 881641 901410 902387 949666 1000084 1001649 1005579 1022424 1031109 1103281 1092648 1115910 1176082 1241395
4782 1241395 1282256 1357165 1430892 1489352 1575558 1681726 1810766 1985660 2176280 2300472
4772 2300472 2304495 2198710 2098973 1996386 1902136 1882083 1868123 1881535 1929167 1919742 1921730 1915343
4760 1915343 1914639 1942390 1946939 1948688 2014766 2119491 2192270 2368366 2577941 2810293 2973967
4749 2973967 2999419 2827999 2511788 2281207 2091126 1965049 1865801 1770506 1682348 1572962
4739 1572962 1456500 1347302 1241645 1155209 1105254 1045233 1006120 979111 954928 900752 843268
4728 843268 820604 783210 776357 762070 717143 689721 653992 623222 581415 547429 555977 537190
4716 537190 526697 545289 539021 509453 496923 445045 422523 408715 416574 386358 406247 403739
4704 403739 381730 371046 373309 398473 394605 380271 403711 399951 386077 388301 397036 380801 364208
4691 364208 404992 417902 387529 374127 351054 338476 340452 339153 310576 325421 342680 335122
4679 335122 320036 304647 329780 334815 311998 288847 305516 297362 267426 284567 282169 297717
4667 297717 299329 298010 279826 288122 297349 274694 273206 290553 291982 287850 283369 287926 308658
4654 308658 266271 257877 283725 328545 337992 307983 286481 305861 297884 281649 278158 301840
4642 301840 268782 260301 270665 268542 274787 267456 222689 198515 203349 265077 255382 255092 256588
4629 256588 235391 254916 249631 258342 233943 264339 303105 302055 236786 200421 208046 219018
4617 219018 225881 224341 198895 229904 232851 245032 248831 231984 241876 261148 265410 264018 263230
4604 263230 266153 264832 257053 269402 285858 274524 235998 273578 287010 279181 260727 244032
4592 244032 253120 220370 228604 219056 219022 225168 223951 229826 208351 232435 236111 242000 225322 201249
4578 201249 195256 180315 193820 172214 141676 138404 163774 215732 165065 152777 153556 146617 135706
4565 135706 147650 153416 163807 173274 201135 202471 188363 174320 220169 208625 198783 247460
4553 247460 250980 220119 226551 234703 212366 190772 149551 163600 162847 184783 235398 224107 219192
4540 219192 221773 212524 204968 165379 161273 191863 205169 199337 235671 210791 238533 225885 201189
4527 201189 187477 226644 272264 299360 286770 242744 231365 204383 213679 214759 202231 196553
4515 196553 200599 212536 196839 174660 151901 169018 186839 171042 172908 157411 190291 208222
4503 208222 227590 203087 196453 190017 164791 160829 153042 176679 197775 213800 225618 197287
4491 197287 203613 196742 191358 185838 130420 124545 148716 163089 184680 196797 220581 205944 175259
4478 175259 176979 201859 217904 226408 206700 152794 126028 169432 178774 168259 185156 199741
4466 199741 201167 197746 194247 175231 214500 188600 175902 169471 164004 181188 176021 199054 229711
4453 229711 231266 216146 212233 203433 211800 236386 198040 192372 197022 199413 203363 198668 188570
4440 188570 240287 231350 199829 203503 212517 180422 210244 235966 237447 232205 252196 248211 243209
4427 243209 254349 222786 236598 219201 224857 213234 249187 281116 247978 246657 228059 230421
4415 230421 200279 180615 210640 237727 267597 288616 294076 302628 266584 237685 203454 228614
4403 228614 234436 248354 247921 286296 328231 304451 314645 278626 277213 240324 244466 269953 293876
4390 293876 303334 281566 260501 276448 246627 227868 262626 279849 258522 251895 253459 316606
4378 316606 315085 299603 323205 321095 325766 285312 262079 300624 279119 291529 312133 306650
4366 306650 322431 302651 287075 323966 333174 369422 329322 278440 286651 310229 315044 327987
4354 327987 315423 323390 332700 314241 310293 314399 313912 356153 351997 326081 329963 341451 350041
4341 350041 340389 359818 336498 381626 376008 361249 401670 370362 349486 351619 370108 379364
4329 379364 380034 366729 355840 372093 355710 346196 386453 418118 428263 405878 391676 410855
4317 410855 402025 407389 376849 380432 381114 395711 409666 443138 447402 421509 406495 453686 452262
4304 452262 394806 412233 428861 445354 416734 433290 445734 453369 487111 503706 486413 470833
4292 470833 465562 486016 478880 461113 454145 443589 450819 481314 471391 448734 502796 546580 569503
4279 569503 523964 510973 520685 524213 504265 511273 546036 600644 593826 597318 599539 596791 586231
4266 586231 581912 595781 594673 591772 617868 664865 691895 697643 710632 729487 721727 733952 730206
4253 730206 728016 718266 715937 753001 763497 779672 773629 789597 799696 782364 771449 806669
4241 806669 820193 840204 888719 861987 855257 860817 879300 908030 932477 949427 967157 993506
4229 993506 987198 1008237 1044464 1063404 1081429 1100700 1109834 1141603 1148199 1145306 1145395 1173761 1179529
4216 1179529 1202401 1248459 1302022 1320030 1340273 1367519 1373772 1411417 1453803 1442814 1443627 1465169
4204 1465169 1483177 1544597 1567749 1599029 1646707 1703073 1709116 1777557 1793860 1798415 1836514 1849110
4192 1849110 1897223 1961255 1974579 1993843 2058103 2111772 2143001 2178495 2220611 2256438 2297502
4181 2297502 2350463 2400890 2450871 2477189 2548443 2613489 2633162 2649774 2692764 2779025 2860081
4170 2860081 2887772 2949741 3013057 3044765 3087962 3166695 3207344 3290039 3313054 3384067 3443319
4159 3443319 3501941 3587449 3632042 3659334 3723471 3757859 3796748 3866186 3902676 3922663 3950199
4148 3950199 4004633 4056236 4091653 4146604 4184852 4231393 4248963 4286660 4360823 4355814 4348264 4347810
4136 4347810 4392364 4410688 4442133 4459869 4474992 4470472 4438906 4405276 4403880 4406988 4399061 4404836
4124 4404836 4358774 4307695 4263370 4210158 4188514 4158161 4104891 4038139 4032324 4003746 3988027 3916560
4112 3916560 3844292 3841148 3778865 3744746 3708747 3617639 3568396 3516177 3495176 3374308 3310419
4101 3310419 3288360 3218307 3161789 3145229 3089280 3028363 2959459 2929801 2884304 2820369 2770947
4090 2770947 2689901 2652144 2605328 2548958 2501595 2470580 2435877 2397905 2326914 2262904 2209425
4079 2209425 2191171 2160809 2115258 2080459 2060764 1993888 1956163 1951467 1908566 1855297 1804843 1803544
4067 1803544 1736385 1714528 1662053 1619884 1605381 1577221 1525955 1508044 1480101 1432896 1422679
4056 1422679 1411992 1413964 1359934 1348473 1321729 1292351 1285933 1256572 1239131 1229162 1165133 1153685
4044 1153685 1169430 1164848 1153093 1105988 1081141 1059616 1050739 1076169 1003654 977854 995836 961326
4032 961326 918695 906517 897398 886523 889441 847624 816378 790037 807676 806435 813193 799746
4020 799746 768495 753328 738776 743798 710061 691582 682655 699289 657918 643935 680087 708080
4008 708080 699593 679020 657835 661458 622096 582319 571614 543029 530980 551184 550505 538283
3996 538283 544844 551176 542874 521518 513740 509214 498350 513223 481618 485222 519510 502931 488647
3983 488647 458829 438763 433966 447223 408465 401476 408248 427424 408835 392535 408124 418208
3971 418208 411601 399335 373160 389894 398813 389658 376590 384744 371391 367308 384159 373813 403595
3958 403595 387966 404350 392806 355611 320221 303421 318071 317375 322125 338247 318812 327658
3946 327658 347693 344083 337311 318369 315687 347826 322446 279406 312519 294902 291793 297292 280381
3933 280381 288189 250427 239288 230207 219384 228101 257689 246948 269854 269336 244941 238371 252446
3920 252446 261895 223956 229878 232027 216687 222203 235320 232420 252496 260672 257769 249101 275428
3907 275428 274185 246404 243937 263077 271894 279371 272231 289991 283793 254849 252600 223550 195370
3894 195370 156739 172254 201445 218302 253935 263469 253251 220292 200705 206647 193401 218896
3882 218896 221422 223168 273536 249701 209947 188877 167114 146845 177908 183682 168266 195975
3870 195975 249712 259178 253035 228434 185788 200817 211088 217417 209598 199496 195873 232807 215123
3857 215123 220561 212474 199895 200977 179761 172052 191169 180233 169237 174161 169200 196131 187088
3844 187088 197519 194770 223404 200133 189730 191112 193808 192288 198464 249151 251135 196174 177139
3831 177139 177730 202695 206751 200712 214988 212158 184763 196346 205361 168760 158200 186153 208307
3818 208307 186534 180359 206790 201759 202613 193969 190765 193631 181469 184583 184724 166251 219844 237513
3804 237513 189209 181255 183580 208716 201500 160294 190181 206251 186291 207815 210352 210760 182504
3791 182504 182371 226372 237389 237414 211939 220439 237937 186906 149851 169515 183191 176964 207578
3778 207578 204249 188189 190148 243096 256102 243066 244746 226026 226240 239690 218692 219727 229395
3765 229395 243503 223923 239400 253676 250421 217382 206577 196229 215653 193079 230540 254503
3753 254503 259612 254987 245486 251924 239546 213698 204597 248568 253561 271432 263302 246964 223103
3740 223103 231935 233818 250090 239847 233260 239430 244733 220076 260862 271741 265130 257802 259990
3727 259990 253197 264999 287378 262519 278893 255977 275290 292000 275994 257233 276428 264617
3715 264617 262128 277040 246684 243694 254399 243365 233409 262040 263730 253068 279534 282057 240240
3702 240240 259347 261494 240386 233913 258424 282110 308991 314279 275301 261464 282916 273831
3690 273831 260825 282931 285625 274269 245178 232395 244457 257319 260262 261951 235847 282968
3678 282968 275368 256852 239832 233154 239356 260975 316853 331491 324772 289425 261655 258105 273504
3665 273504 320190 309625 267184 276235 292858 330155 330711 301998 292731 330676 326729 326071 314771
3652 314771 335949 327827 320895 336395 333235 337389 331442 344550 350692 353359 360258 371472 347681
3639 347681 348756 368312 400797 431114 442789 471623 490338 469383 465168 456337 468147 516675
3627 516675 549348 584085 559148 549493 552258 592934 637586 629724 594059 642806 639705 669882
3615 669882 712147 716691 719399 756474 802635 846922 891555 944343 1025688 1071954 1105369 1180424
3603 1180424 1265302 1378370 1515961 1720456 1945844 2152365 2213990 2154666 2006670 1837301
3593 1837301 1750059 1678992 1658807 1649002 1643982 1617144 1630951 1612249 1577184 1554249 1592230 1610362
3581 1610362 1632319 1626969 1656741 1691817 1752467 1794590 1884628 1969107 2048284 2165495 2300609
3570 2300609 2470096 2711957 3072416 3482340 3934081 4221736 4075933 3669346 3393550 3203744
3560 3203744 3070687 3004771 3018391 3043324 3039780 3063105 3072289 3036279 2968865 2857890 2741708
3549 2741708 2677964 2593891 2517416 2464435 2481960 2457561 2400010 2368103 2377187 2370124 2447296 2492713
3537 2492713 2550992 2697617 2856009 3064350 3244163 3216416 3054447 2924836 2825383 2773152
3527 2773152 2746186 2787951 2853331 2991845 3130062 3254566 3383257 3453647 3371786 3204903
3517 3204903 3011132 2866833 2782608 2642344 2499816 2456086 2403929 2294095 2206662 2133182
3507 2133182 2082986 1989749 1900018 1856183 1821095 1761095 1766208 1740355 1720283 1737550 1713779 1665341
3495 1665341 1597401 1648324 1682379 1721658 1768308 1817947 1905895 1954230 1980445 1956997 1901999
3484 1901999 1804555 1762197 1714355 1616783 1556827 1501979 1497834 1448066 1397366 1381527 1343862 1343734
3472 1343734 1293117 1257122 1241579 1237157 1236158 1197175 1192226 1163208 1159338 1125475 1135882 1167916
3460 1167916 1132634 1124973 1102893 1048210 1065639 1082463 1057694 1085642 1119086 1110811 1112301 1154745
3448 1154745 1172216 1151487 1176211 1206977 1225858 1254996 1265289 1264450 1280824 1284065 1310806 1323291
3436 1323291 1353960 1355389 1381154 1434685 1450958 1466958 1498616 1548252 1548093 1577558 1668039 1745043
3424 1745043 1769399 1832433 1898330 1927238 2004336 2092805 2137939 2196794 2328552 2432534 2500392
3413 2500392 2581947 2686309 2786549 2830795 2811494 2852414 2877012 2884477 2900606 2874989 2855198
3402 2855198 2852752 2817905 2780213 2747256 2768348 2804692 2852217 2885524 2920501 3003863 3081993 3166238
3390 3166238 3267423 3354867 3498134 3690349 3880946 4109930 4301897 4511836 4732982 4972656
3380 4972656 5331792 5723750 6254381 6977669 7759833 8726754 9246198 8898213 8289910 7808667
3370 7808667 7460300 7231978 7100309 7049108 7055318 7055355 7025681 7080486 7166475 7263129 7447467
3359 7447467 7697089 7941837 8226524 8586331 9021685 9532377 10200052 11021151 11944784 12668756
3349 12668756 13159863 13682277 14346175 14554014 14182872 13768707 13597155 13720578 14108112
3340 14108112 14815104 15828015 16804105 16961856 15970669 14594689 13444866 12643203 12086091
3331 12086091 11715204 11466859 11174967 10846348 10656250 10631456 10675072 10911490 11116721 11007654
3321 11007654 10579675 10188836 9883081 9693554 9618286 9623910 9793404 10098962 10628997 11391840
3311 11391840 12350357 13085441 12870074 11680721 10357714 9261937 8429099 7849400 7401931
3302 7401931 6964891 6493080 6002016 5501806 5084510 4712365 4402523 4094626 3856071 3622975
3292 3622975 3422768 3250414 3057512 2882521 2706808 2539078 2365690 2216321 2099300 1984350
3282 1984350 1896628 1773743 1688240 1617526 1578740 1498623 1397447 1381750 1369843 1312700 1231388
3271 1231388 1146185 1128044 1073947 1023997 1000783 970053 949335 925097 917885 860164 850604 842840
3259 842840 811727 770993 725282 724673 684906 678573 669177 649043 617420 610747 596527 585786 578803
3246 578803 539024 532931 537433 533478 542669 528653 512030 490848 456118 471906 475457 474222 479501
3233 479501 497957 459116 460097 441262 435343 400497 388435 363090 351983 387509 365629 342733
3221 342733 367214 363599 344796 331076 325854 334400 348785 328615 282952 303560 343073 316886
3209 316886 330202 333796 303224 282910 313292 323692 304845 295171 288579 303559 286780 309137
3197 309137 275377 257555 240215 262243 294393 311816 304854 314784 298544 298912 294748 277887 283072
3184 283072 244543 253300 274262 309809 318278 278222 281482 303736 330064 333822 324079 345065 307120
3171 307120 342761 374805 411414 406114 371051 373798 379066 400139 406803 398419 413678 437561 407845
3158 407845 437029 483632 509835 517123 525462 537943 570521 601591 649809 681529 717670 725497
3146 725497 707850 672768 616521 595337 618540 616500 619739 601576 591888 591056 569136 579855 569216
3133 569216 567540 569865 547238 546468 543958 555901 577054 590745 610886 609307 647578 710829 701362
3120 701362 708625 745313 803423 841649 839528 809891 723147 659973 604462 605175 616735 600334
3108 600334 555699 511795 527604 536256 565480 567142 557515 516462 493087 503224 486996 493151
3096 493151 467939 467848 470719 473862 492692 504544 494674 508845 499991 533237 569261 550862 547498
3083 547498 551598 524175 523474 553374 529255 490662 481777 479169 497557 509611 530070 517723 543703
3070 543703 562232 522236 501335 495733 481234 481020 485446 474350 476663 484412 476104 503503 479025
3057 479025 451903 455598 470287 464102 457854 486477 446100 452027 441511 408599 424442 448587
3045 448587 441843 440867 424258 402346 437345 433793 384326 374453 401860 423528 407177 363830 323785
3032 323785 342228 363762 367935 348427 334072 350299 353330 343943 313273 279315 259370 255682
3020 255682 287513 272745 229642 231151 253443 216498 212507 205343 189263 174932 171410 160372
3008 160372 154838 163246 160732 166494 182437 186195 162473 164802 139265 144535 124801 133080 134068 107733
2994 107733 104303 119847 109986 117367 124744 147411 124910 79114 76732 99845 96722 102509 102560 69346
2980 69346 59645 84231 120152 102144 65108 67112 94749 109938 112814 118937 121756 112398 97367
2967 97367 95213 80682 63909 73863 83025 84789 76481 84480 74628 81901 48047 59074 54798 37058
2953 37058 18148 8887 20310 25950 50368 85351 79287 108633 74792 53171 27220 13195
2941 13195 22799 30391 24597 66111 49981 15441 49526 45843 37355 47449 24322 26632 23959
2928 23959 25283 72035 54530 29725 27430 18963 20486 58682 57728 25459 28141 34339 21147
2915 21147 -18133 -17602 483 1038 1348 13705 33364 49404 22460 32327 55385 12018 11647 -11353
2901 -11353 -7135 15889 33942 16202 9530 6366 31780 1558 -764 36016 30134 29884 45132
2888 45132 38358 2092 -7051 4211 9335 -12819 6606 35978 5791 -16570 -55913 -28233
2876 -28233 -6670 9790 221 -7720 11349 -8392 -10716 20107 -1843 -6879 27003 16814 -18696
2863 -18696 13734 14422 30866 20944 -3156 -47354 -13181 -5802 -27840 -25519 -34368 -20556 46143
2850 46143 69719 23757 15771 -9273 -47400 -15515 2232 2520 253 3187 5382 -170 3737
2837 3737 4723 -3095 -10998 -22373 -21443 -18953 -23224 -9847 -6852 25447 -3372 -6195 17037 2695
2823 2695 -30583 -8458 -8198 -1104 -13798 -12850 -3521 14309 7125 -26847 -17310 27861 2695 -17725
2809 -17725 3817 4170 12637 35388 2921 -28038 -20242 -3738 -6690 -18959 -45871 -12322 -36975
2796 -36975 -23513 27169 42797 42466 35576 24545 31674 5115 -16354 -33282 -27102 -6364 -13889
2783 -13889 -12105 -13267 14652 1172 -8462 -10335 2156 26530 -7852 -15974 27094 43887 19292
2770 19292 17044 -1068 13018 10454 13703 28833 31845 14871 -3453 -86 6616 7527 5536 732
2756 732 -4619 -7242 -14064 -9227 -8908 -17176 -21366 -19969 -46498 -31445 -17353 -4901 -32073 -55367
2742 -55367 -68699 -19239 -6283 -5273 9453 -3963 19699 -5066 -5167 2199 -11717 9100 13115
2729 13115 -13739 -18574 -25331 -28173 -28730 -24528 -18411 -26627 -13681 -25780 -35265 -54091 -45805 -32329
2715 -32329 -5176 10710 11644 -2564 3112 -17979 -10727 -10933 -26078 -53167 -31114 -22438 -34335
2702 -34335 -24529 -20569 -12218 4964 -3808 -14151 -12490 -6906 -23932 -35355 -3057 21199 4075
2689 4075 17643 11232 -50809 -63931 -58137 -39329 -4102 8101 24359 23500 7876 3662 -19432
2676 -19432 1778 15485 33511 37846 28741 -2549 -1094 -26618 -48097 -4737 30013 -3647
2664 -3647 -27204 1381 10641 -8774 -22149 -27648 -19646 1060 -29168 -27037 -56920 -22284 -5679
2651 -5679 -9054 -35523 -36318 -23666 -39389 -2273 -11665 -14336 -52482 -64694 -57714 -44601 -28762
2638 -28762 10767 3763 20404 -4723 -22026 -32962 -21475 -12425 -32232 -25649 -27525 -39303 5294
2625 5294 -6800 -41331 -23683 -26581 -22888 -45252 -21908 3705 -5878 -18291 1651 11135 -1742
2612 -1742 13940 -7268 6854 19330 8407 310 1647 -19498 -36718 -5354 8157 -5985
2600 -5985 -30428 -27277 -7192 -4832 -21535 -5624 -4248 -6828 10351 4265 -2386 -9588 -30594
2587 -30594 -25422 411 5858 -294 10929 -8987 -223 -3116 -22991 -29937 -29040 -30268 -13354 12152
2573 12152 16260 18533 3994 -13067 -18940 -44946 -39976 -39015 -10613 -7750 -25140 -7860 9277
2560 9277 -34322 -59293 -3838 21204 -3320 -38095 -24852 2135 16251 19797 17828 19542 11333
2547 11333 21020 38653 44402 34580 55827 55599 7574 4104 17407 41389 54619 36412 7621
2534 7621 -687 -2150 -5031 -19510 -23382 -21208 7496 28578 -4846 6927 -17970 -48356 -33000
2521 -33000 -39767 -2821 4635 -46478 -32189 -24880 -42213 -33741 -13678 4574 -16462 -48377 -70238
2508 -70238 -49430 -34491 -22327 -12063 -41314 -35233 -29767 -52816 -21147 -56716 -45767 -8452
2496 -8452 -3856 -9075 -26226 -25301 -48979 -70350 -46485 -18509 -33555 -25160 -5897 9505 15173
2483 15173 5141 1523 -3328 3972 5803 12601 3172 -24955 -19454 -11452 -9490 639 7322 9114
2469 9114 5018 -6680 569 -26490 -36151 -18870 -42730 -3309 -7488 -5611 29002 3597 -7822
2456 -7822 2342 -4489 -10179 -1077 -13151 6703 7942 42236 33307 14070 -1177 -15858 -36392
2443 -36392 -43205 -13760 -6602 -36287 -52121 6945 34822 3527 20387 3760 -16434 -14072
2431 -14072 6441 55469 32560 -21912 -28139 -13764 -26615 -25022 -37114 -36332 -38980 -49457 -38231
2418 -38231 -8910 -8365 49387 47376 14565 -5205 25834 61336 29768 2933 5571 -708 12632
2405 12632 40777 34172 47563 71034 32887 1067 21959 38067 16416 7441 2214 48875
2393 48875 41893 19743 39697 57860 58996 33772 23447 31296 32806 11483 13473 17373 30402
2380 30402 39577 50871 29157 59479 49387 38843 -4169 54199 67408 38649 46248 76025
2368 76025 50732 13040 14046 14211 -6379 3244 52754 48843 41376 68390 48170 22226 31153
2355 31153 54312 51475 38301 43853 71319 65215 66841 97268 72881 58707 85483 105988 81320
2342 81320 81812 76523 83572 85008 91190 108968 137603 156461 140948 124488 135280 151208 161949
2329 161949 161574 149801 185273 190835 197376 186765 168610 230774 247190 259454 287308 326419
2317 326419 339967 383789 415616 422583 438127 438610 480350 511850 540612 567497 606202 669883
2305 669883 671156 715759 732343 772447 822048 864493 885312 947785 1046902 1108934 1162408 1249040
2293 1249040 1346910 1433861 1526588 1666641 1773281 1866546 1998320 2145721 2342212 2541544
2283 2541544 2678238 2880813 3159896 3509555 3934310 4546489 5278565 6208192 7280537
2274 7280537 7823713 7343412 6219745 5326757 4716537 4319611 4086402 3840251 3504737
2265 3504737 3136632 2841973 2583505 2368409 2221886 2105276 1955963 1797446 1653538 1550292
2255 1550292 1417554 1281217 1202031 1111777 1002775 917035 849763 779006 747176 674855 636209
2244 636209 580097 570582 573881 519983 465855 442088 429093 394624 373028 360250 310185 297689
2232 297689 296544 267487 249922 211462 188964 214087 231758 205419 189381 203523 183226 162864
2220 162864 162710 150204 152345 177284 163165 163926 151355 183823 186457 127135 83386 95799 104427
2207 104427 98257 102797 91519 94160 128294 111667 90583 95610 94439 107779 88654 103535 99518
2194 99518 101568 79962 67877 79921 87903 68825 50021 86803 82403 55565 64712 55732 56669
2181 56669 78395 59651 60737 37580 10843 16121 -510 29653 14273 13462 39580 14363 -19663
2168 -19663 -14893 -9174 -16144 -7780 29582 62190 36714 40114 43629 36243 53295 41585 23374
2155 23374 20221 -5257 -15940 -34758 -7018 20298 34219 20018 11881 -21584 -27402 14677
2143 14677 6352 -17691 -29805 -3997 -3525 25893 22432 15486 31348 25125 6302 25216 22561
2130 22561 37449 -8804 -32439 -10924 -15236 -9612 6616 22325 18955 19944 20004 8955 -27847
2117 -27847 -30316 -8114 6029 6845 -1079 37283 3279 -40011 -29496 -3635 7808 -24907 -25185
2104 -25185 2745 14572 11691 2274 -14914 -12240 -12374 -4384 11159 41372 18163 -11892 -38593
2091 -38593 -41828 -37656 -49115 -29346 9273 8340 -17568 -33824 -11477 -34030 -2706 14996 -24945
2078 -24945 -67768 -44054 -12071 -31998 -12846 -875 -10915 -2573 -7653 -13407 -25535 -11500
2066 -11500 5502 4244 18280 -12606 -209 8848 -20050 -37809 -11428 6071 -5851 -5893 10736
2053 10736 17613 11831 -15704 -27897 -9687 -21452 -5606 -15266 -11564 31600 20015 17073 4720
2040 4720 12602 -1078 8137 -2913 3305 -15281 3667 -31512 -20412 -10919 -26552 -17766 -45016
2027 -45016 -20367 -9423 -15358 -21083 -30328 6357 25933 7130 -8733 -31175 -35312 -22495 -13252
2014 -13252 -10439 -1297 15841 5813 18595 22936 7529 12882 -5160 19006 48329 54785 35365
2001 35365 23516 2194 -702 -8696 -5667 11490 -18591 -29511 23388 6374 -14506 -21458 -26489
1988 -26489 -49730 -43823 -8282 4052 -6572 21407 35793 43460 24524 -9947 2981 6171
1976 6171 -24057 -2000 -25641 -28830 -59371 -64167 -45804 -27889 -18195 -33034 -3940 -32375 -39301
1963 -39301 -67482 -56355 -17352 23076 7957 -58418 -64434 -47856 -26800 -16701 -43321 -62306
1951 -62306 -43318 -37133 -61892 -21233 -15120 -6560 -6428 6894 -3279 -28632 -17650 -20898 -41794
1938 -41794 -41628 -23105 -13134 18558 1064 13636 18140 28077 15181 13133 13614 1900 13222
1925 13222 341 5804 21811 14111 6393 13977 -10215 -27286 -29841 -42108 -21652 -1399 -662
1912 -662 -1547 -27393 -32512 -21605 1182 -3776 13735 -2092 -31494 -11323 13319 -27917 -57416
1899 -57416 -59779 -36680 -19507 -9499 12109 1942 10456 4829 -418 -26142 7222 -7907 -30104
1886 -30104 -30331 -24537 -8185 -5811 -22575 -15830 8976 816 -20889 -37391 -23824 -9745 -22922
1873 -22922 -38869 -5981 10513 -7504 -7180 -6332 -4008 -19851 -76902 -43838 -18156 -24996 -23004
1860 -23004 -14554 -33689 -30386 -21587 -32190 -41335 -27610 8437 21855 1042 -17919 -29931 -35226
1847 -35226 -29947 -18574 1578 -10728 -14759 -33537 -4057 11419 -30274 -29709 -15680 -21292 -16235
1834 -16235 -4841 -26452 -41397 -28696 -2459 13468 -2223 -5391 -26338 -44060 -13406 -8291
1822 -8291 -15079 -21089 -17952 -21487 -9126 382 9048 12868 4857 5814 -1126 1810 16786 15931 -1472
1807 -1472 -7952 -38604 -37295 -8875 -19201 -36167 -25598 -16173 3654 -6734 -14694 -1709 12241
1794 12241 -1779 -4935 -19698 -54398 -16020 -18604 -10448 -16061 -71860 -49272 -25631 -22549 -18063
1781 -18063 -10976 -1468 -6357 -20197 -28258 -29671 -1609 -12793 -6389 -4183 -14323 -16413 -47655
1768 -47655 -25337 -37624 -4018 -9090 -26496 -17201 -14320 -33944 -37959 -28451 15982 6372 -17946
1755 -17946 -29368 -22459 -13724 -8347 26506 14502 -19584 -42072 -31534 -57336 -49497 -31035 -22065
1742 -22065 -18693 -25793 -39172 -43479 -61332 -35568 -30442 -34609 -10811 -3312 -34748 -22727 -20260
1729 -20260 -39103 -17237 -26610 -23258 5122 -42255 -60506 -47067 -64800 -58082 -51765 -35122 -11236
1716 -11236 -17966 -21012 -32704 -50876 -48231 -19859 -31233 -53455 -64591 -60636 -57910 -43272 -35195
1703 -35195 278 7725 -5790 -8208 -30439 -36163 -31657 -17343 -21114 -38873 -56973 -56655 -52069
1690 -52069 -53655 -44047 -17268 -27668 -38426 -32180 -30412 -32385 10252 -14462 -15471 -2462 -27433
1677 -27433 -35324 -24308 -5352 36541 20818 -783 6998 -20272 10037 -9665 -8785 -7039 -20458
1664 -20458 -35451 -8140 8734 -17536 -3533 -243 -9231 -27939 -31675 -12842 -7271 20862 25471
1651 25471 2398 -1203 -7048 -16514 -31076 -12078 -39691 -32158 -12472 -27998 -47285 -14300 15770
1638 15770 -10130 -21302 -35119 -30280 -28934 179 1316 -5596 -28195 -28782 -33040 -63596 -45067
1625 -45067 -34993 -37919 -42753 -21545 -25705 5217 42741 41504 -31845 -31010 4856 7992 -13457
1612 -13457 -11909 8026 3357 -17037 -4348 -8722 -5799 -14700 -49187 -15996 4509 -15773 -27820
1599 -27820 -8921 -23093 -31177 -41975 -46816 -53991 -44406 -1949 3478 -23130 -16798 -21568 -14088
1586 -14088 -32993 -32285 -18435 -27036 -32897 -29625 11505 19155 4641 -12811 -7961 8301 -17306
1573 -17306 -22238 -5567 -5924 -24787 -27437 -25064 -2930 133 -36379 -37670 -29556 5370 -9778
1560 -9778 -31156 -45161 -23722 -5842 -28065 -6889 -7125 -48406 -30141 -29844 3200 -9792 -54865
1547 -54865 -57325 -28425 -9817 -32444 -27855 -34479 -13021 -7606 -1583 9192 11671 22543 -4479
1534 -4479 -27706 -11379 16329 -15671 -34787 5611 21503 13054 -4109 1200 15483 -12918
1522 -12918 -22100 5591 -20024 -14371 -17352 -458 -9171 -20653 -34519 -26315 -38026 -29330 -55392
1509 -55392 -32978 -3409 -7317 -30653 -31032 -30587 -43156 -22832 -9907 -1888 11051 -5998 -8816
1496 -8816 -21734 -30573 -5162 -21776 10939 747 -3882 -17527 -33105 -26221 10134 17054 1263
1483 1263 -12233 -34406 -37930 -25917 -24633 -27843 -7131 -30139 -6802 4670 11419 -4792 -17698
1470 -17698 -25488 -18004 9108 25203 -17054 -45909 -18233 -28309 -22729 -16078 -11152 -8751 -14044
1457 -14044 -17663 -2703 -13222 -20668 -9659 -15949 -16397 -9721 -14597 -33710 -22723 -42605 -59394
1444 -59394 -25853 -20936 -6256 378 12929 -7267 -565 -7073 -3351 8438 32537 50863 35566
1431 35566 -7527 -200 -256 -26766 -33331 -28362 -18739 -31946 -29160 -16613 -9872 -43679 -27629 -8330
1417 -8330 -37228 -30452 -35244 -11939 1163 -21323 -16082 32064 -2250 -15429 -13414 -31602 -62803
1404 -62803 -42385 -4964 14735 -40 -3391 -22974 -22257 7366 2150 -31717 -22328 -15750 -46901
1391 -46901 -44945 -40875 -4337 -4933 -14075 -31744 -16304 -11349 -34824 -24635 11365 18284 -7739
1378 -7739 -15800 -2843 6548 294 29788 40641 26843 16883 16566 -4320 -11632 2641 -18492
1365 -18492 -2618 5164 4757 -3049 -10791 -7226 -5068 -10631 10219 -2679 -35329 -57336 -47406 -38979
1351 -38979 -21329 -22459 -21247 -26668 -4477 20862 20203 -8787 -14847 -7877 -25929 -30147 -8048
1338 -8048 24143 11038 -9939 3626 -2340 14826 10012 -3050 36191 18426 -14144 -26260
1326 -26260 -27709 3129 21144 -11400 -28943 514 16248 10147 -2375 -9824 -14100 -1108 12728
1313 12728 -1764 -12515 -35679 -7550 27494 26198 48333 28547 16496 10215 6903 12551 7547
1300 7547 4564 10805 -7920 6373 12625 -58 -37502 -48240 -41327 -7362 14155 3252 -6576
1287 -6576 -2220 -42279 -6437 14714 -19244 -37952 -12600 -18818 2723 41103 27809 14890
1275 14890 9609 31039 -11999 -11639 -20411 -16313 -1712 8852 -6024 -1981 -20249 -53596 -71279
1262 -71279 -41769 -21550 -20462 -24603 -15583 -39869 -19544 -16308 -26038 -6183 -1648 -23653 -43212
1249 -43212 -17832 -33377 -44615 -28817 -27950 -30324 -14243 2820 7311 -9880 -18128 17474 9743
1236 9743 3900 -22683 -5508 -26843 -38063 -14792 -4259 7507 4997 1605 21153 20989 22893
1223 22893 3606 -23905 -30944 -3449 -1188 -9434 -7657 -16928 -20664 5442 18505 11915 31205
1210 31205 49232 30508 12634 -1393 29890 30849 16734 13274 9769 12758 10337 19983 16484
1197 16484 13287 -4931 365 -14815 -18337 8022 18290 -24512 -40804 -52488 -25105 -25218 -50025
1184 -50025 -27070 13987 -29845 -10197 -1739 961 -12242 -16527 29765 29451 23393 13494 459
1171 459 -23657 -18072 -5399 -14670 -20695 4463 -7803 -28367 -35074 -56439 -54233 -43995 -10565
1158 -10565 11665 -17238 12032 7079 1780 -15649 -37980 -17603 -10959 42881 18016 8136 1579
1145 1579 -3738 4073 -5755 2562 37204 1206 -23009 -44697 -20698 -23166 4702 -15458 -36795
1132 -36795 -15615 5983 -4611 33131 44197 28575 -2209 -42174 -32678 -32110 -16629 -8418 -942
1119 -942 -15032 -520 -6799 -1420 16319 25037 5340 -13581 -50691 -57637 -39132 6344 -5765
1106 -5765 -10788 8882 -5084 -13368 6123 6597 -8039 -30635 -7292 -2801 -16452 -17514 -2385
1093 -2385 31337 34761 26294 19381 -14678 10222 13393 4624 -1958 2570 -8558 -27471 -8545
1080 -8545 6340 21383 13887 1700 -2015 -6555 -18452 -8818 47 -12005 -7922 10148 -10681
1067 -10681 -52346 -35459 -17844 4134 9176 2001 3998 13590 1242 -1847 6946 31097 25818
1054 25818 10188 -2884 -40867 -7008 -23790 -6400 41525 17418 -4036 -9249 -23898 482
1042 482 -9423 -1963 -6814 4568 14235 11990 -8647 -16433 -11842 -28164 -6572 -24927 -23640 -19795
1028 -19795 19847 18104 20841 17089 -7150 -1115 22317 -13278 10057 14151 24040 7354 8233
1015 8233 1622 -49676 -59470 -9960 -96 -13009 -5367 -17753 -5340 2378 28700 45244 16740
1002 16740 -3034 -339 15023 26750 -107 10654 3310 -21941 3859 13042 -2302 15127
990 15127 -10877 -29295 -17877 15855 29456 -2944 -7572 -6982 -18225 -15149 -12851 28205 19154
977 19154 -5560 10687 9757 -26636 -22375 -23407 5488 24783 18287 -17971 -29877 -32217 -28751
964 -28751 -29747 -25986 -66537 -35109 -28713 -70408 -82377 -23954 26671 49667 6062 -25204 -21680
951 -21680 17367 21525 29808 34886 -4873 -12026 -6743 -4658 -20755 18390 24221 24976 38175 29387
937 29387 23870 21161 2907 -17654 -41122 -23839 10637 15166 14092 -3664 -15386 3339 -13743
924 -13743 -16570 14133 -54 -32457 -12976 -8296 2548 -11126 -24074 -948 -13900 -5286 -312
911 -312 -4340 10437 -12416 -15235 -32723 -24584 -1899 -41375 -13741 -4891 -23884 -15533 -11329 32720
897 32720 27506 21349 10698 23601 -13373 13678 16577 6371 -7776 -19532 4891 28663 -1366
884 -1366 12660 15689 42865 24657 6339 -11363 -35420 7132 18195 32229 28427 4798 -5914
871 -5914 12346 -20956 -35086 -61036 -42136 -9728 -11249 -25345 -22533 1211 -1950 8919 21118
858 21118 23809 -1498 -7143 -11419 3416 17182 22110 36469 15931 -20911 11221 33718 5398
845 5398 23838 54701 48069 -14052 11238 2230 16034 47398 26077 2967 -69161 -48761 -34833
832 -34833 -16135 6792 7175 26926 21226 20830 14671 47721 27439 40002 18759 21415 29034 -11164
818 -11164 2719 -39496 -18471 1277 392 -35534 -10716 6977 -8092 -3954 -30263 -33758 8369
805 8369 30909 22002 -7354 4090 20483 -6380 -10078 -1719 43678 27152 22070 16268 21768
792 21768 -3616 -22445 26616 32515 16404 54799 73086 80276 42974 16841 -12591 -3120 4404
779 4404 -2590 6704 -14419 9224 29329 -1630 -10531 -5227 8344 -6505 31412 57046 13285
766 13285 16444 30220 24059 43528 58880 29154 -8023 6862 -1119 -4912 -3613 2812 -1307
753 -1307 8058 545 -18205 -26842 14822 18028 21208 7844 -8318 -5484 -29237 -2073 -12333
740 -12333 4543 -24008 -41990 -4946 5697 13584 9336 14573 9656 12028 24926 8199 7130
727 7130 20668 38823 25491 28439 47246 35155 -3287 -11184 -7434 34530 50809 25253 -10859
714 -10859 -13985 -6295 19128 31827 29606 36250 43403 49978 43408 11655 39628 36324 6805 1919
700 1919 1225 19975 28565 22770 6734 4980 36494 77465 82294 56970 29652 35609 27178 23605
686 23605 9018 -24437 -19899 -6689 -4415 10113 31292 39408 54972 52142 27415 22569 24427
673 24427 15036 2225 -26735 -42532 -23048 -9073 7927 34720 28760 1236 -13996 20060
661 20060 -3558 25768 6912 24460 12038 -11158 8908 33525 31079 16762 -209 -27032
649 -27032 -12455 20428 36619 7994 12746 36843 48745 28523 -3385 -18495 -28045 745
637 745 -14703 -47049 -29321 -1499 1937 -30578 3503 8180 -2010 9694 51658 -900 -2799
624 -2799 51905 51145 56065 49878 26767 -8399 -5068 14621 15036 23564 24566 27769 12193 741
610 741 -8950 11785 4757 49713 20373 184 -17524 -21368 2341 4698 18010 50350 66210
597 66210 33744 2235 19569 37251 32064 26146 1277 27573 36700 34075 39255 35972 13290
584 13290 -8594 33342 71439 81432 67463 42669 59036 45914 75120 51478 2963 20501
572 20501 32059 32705 21427 25064 39430 55561 33550 26633 16528 21359 41473 28136 59062
559 59062 51233 23680 35853 23871 51961 44573 32494 33774 25237 27473 40878 59286 44270
546 44270 52491 44050 48739 66580 34234 51567 41882 19728 14924 8651 19896 10170 6289 -15884
532 -15884 1018 22459 -1725 -33345 -33129 -14343 10639 37282 39179 29017 40449 19899 -3093
519 -3093 -9396 17947 10440 5445 38504 44368 29317 -4712 -7281 5740 15047 30874 -1832
506 -1832 -20593 -25489 12158 23369 27166 30682 -7236 11329 32614 8279 -12257 -7849 1135
493 1135 10712 19544 -2334 -1662 -11476 12919 50192 67300 56373 27833 45772 25837 31811
480 31811 12555 28404 7350 -27084 2341 38428 62382 33543 34913 33737 10254 29544
468 29544 26620 32519 53779 48771 18218 31837 31727 20833 22795 -5628 -10272 48381 53219 -7349
454 -7349 -11099 -6142 17623 -14692 -4833 2121 -21059 -7783 37537 19107 64336 67522 48293
441 48293 50485 35745 66931 40523 6849 5136 545 12854 4025 -3958 27294 29673 39726
428 39726 41432 31439 45466 23383 35534 53986 56647 20374 -9735 -24599 21461 43851 12721
415 12721 30814 39535 40072 7750 16500 16816 9780 49111 59489 16423 25108 25049 22532 24683 33015
400 33015 25456 21706 23599 16497 -23345 -1692 11844 9460 29367 56470 40775 16075 12159
387 12159 41290 46694 59972 45134 45134 51776 23314 53500 46525 46974 56392 38690 45065 7951
373 7951 -20019 -1739 19612 40938 19541 9809 36072 43113 29150 20873 38896 58324 37166
360 37166 36249 59849 53117 65889 43209 23867 45598 36100 33181 9144 10737 -3557 18136
347 18136 27136 -4957 15280 15062 24414 62700 53844 14754 57076 14922 21330 33101 28116
334 28116 30029 74229 61948 22493 14820 -8856 12715 9697 5151 16655 34146 27905 60270
321 60270 73850 55220 35963 61957 53608 55007 41796 574 -48 11352 25377 61906 44799
308 44799 78699 42392 11673 20370 9082 -3029 -11284 2144 45746 40118 24030 -251 -4886
295 -4886 15647 33626 47900 39986 -2274 6016 15025 9192 15854 31568 18224 16277 24499 39843
281 39843 73555 68065 27377 -5924 38481 40232 34998 -18175 4134 53619 50354 69316 74432
268 74432 46167 54068 56765 83468 85766 37794 13665 -6886 22409 31673 41356 38062 46202
255 46202 28303 31085 12602 8125 57709 49736 30682 35493 38864 5413 23851 -2756 -37689
242 -37689 -17246 23621 28977 25775 24651 31743 46562 25597 31056 28260 64919 76213 49682
229 49682 40381 32937 21318 22907 41284 36889 17068 1221 16370 55116 69636 56095 46222
216 46222 27042 47596 49130 48045 21307 49285 57763 22764 16628 76071 62863 46818 39968
203 39968 41571 13772 32063 29266 40946 50333 28935 45514 58503 40527 2405 8549 37305
190 37305 33027 17943 44879 51564 55677 17361 20 28674 13333 6942 9225 -15465 -5152
177 -5152 2939 50593 28027 21724 20434 42234 43393 27611 23323 24723 32522 16465 30187 31474
163 31474 19177 25018 47312 54008 37564 22302 7850 36767 41248 29105 35150 37478 3295
150 3295 20638 38565 41006 49075 52382 54710 31556 28265 44014 56554 39387 25123 37088
137 37088 16507 44268 43649 32818 20927 13877 34939 37261 28544 16811 17770 22349 19583 37255
123 37255 46514 49170 44479 39698 60148 39837 25818 45081 59075 47169 23369 37954 56500
110 56500 52442 46134 59789 71281 45607 41043 34000 45915 33495 40488 34717 19941 11363
97 11363 -23275 -4751 10134 27739 48099 62680 82761 60060 49398 27460 27171 37242 45343
84 45343 47902 57379 17634 11213 11739 33299 33365 43426 59619 33836 22209 30028 24966 13608
70 13608 41418 45399 45823 46643 39780 25913 47812 39130 9764 21655 40289 57740 53035 59281
56 59281 40446 25966 19079 18750 34309 12257 26666 21480 48260 51695 35048 23242 6109
43 6109 9657 11802 18181 19316 19348 39642 25380 17783 20624 7270 13122 34559 54956 55943 31945
28 31945 19537 51906 63987 31075 50744 50364 37684 52471 55600 46923 30991 53081 50916
15 50916 50418 55860 44825 37795 34276 26999 24780 -1982 15018 59812 65170 54560 35651 26320
1 26320 13700
0 13700
$$ Imaginary data points
##PAGE= N=2
##DATA TABLE= (X++(I..I)), XYDATA
16383 -553902 -538667 -522183 -511541 -504378 -505046 -492106 -485366 -476958 -451567 -440477 -420901 -415536 -403968
16370 -403968 -401434 -401401 -417214 -405463 -379430 -362382 -348201 -339859 -315999 -290593 -290639 -293176 -271264
16357 -271264 -260587 -271520 -262759 -262299 -256199 -208431 -196401 -190279 -164933 -141607 -139409 -131511 -114328
16344 -114328 -119903 -123402 -92489 -69297 -71768 -66310 -55585 -24469 -16734 -14738 4284 9835 -16131
16331 -16131 31459 58616 50918 33268 51342 87210 126037 116636 115801 99969 111799 131062
16319 131062 132927 180946 183878 186095 207546 209838 203925 206517 214379 216326 238040 277102 258959
16306 258959 273676 306828 317025 297617 298238 324567 343966 351371 339312 345688 369989 384759
16294 384759 388356 392105 434961 448435 438017 437311 456513 469285 481519 491442 506499 506788 521027
16281 521027 514629 535059 561362 556578 567293 569711 578519 564465 561248 587232 629745 605467
16269 605467 599151 617121 624527 637236 630134 636365 649400 679074 682536 692486 710083 707077 703893
16256 703893 702722 697397 723859 727959 728782 728704 757786 784620 789774 782897 799375 772803 756757
16243 756757 755390 767206 817021 836974 820630 816553 829216 831044 872250 863024 854926 873565
16231 873565 888284 874671 876068 876412 889083 891550 917379 941722 928066 931509 928719 927240 939927
16218 939927 957071 953509 946183 957569 943666 935450 957260 978469 986022 970083 980280 1023221
16206 1023221 1039325 1014572 1014792 1018456 975473 995027 1028246 993315 1014230 1031785 1052307 1038314
16194 1038314 1050361 1074255 1039959 1041190 1062701 1066925 1070640 1066550 1078190 1070875 1077316 1078507 1093169
16181 1093169 1121412 1095637 1110258 1093673 1087221 1131503 1131641 1144907 1143739 1119402 1099510 1122043
16169 1122043 1136707 1139285 1159500 1130882 1153372 1161565 1129468 1146921 1151839 1162805 1163795 1160673
16157 1160673 1176566 1193792 1192876 1147406 1160173 1214278 1189379 1174374 1197329 1181659 1206297 1179064
16145 1179064 1214751 1232419 1204754 1207541 1231807 1224917 1243559 1241375 1227866 1227226 1253814 1252406
16133 1252406 1245063 1207819 1217975 1249898 1233736 1244805 1262855 1226977 1212227 1241749 1249089 1228006
16121 1228006 1243420 1256289 1257487 1257581 1266186 1227377 1228366 1250324 1254170 1235039 1223513 1224974 1238984
16108 1238984 1261933 1230526 1264917 1280461 1293719 1279510 1301066 1294653 1261336 1266591 1293257 1280264
16096 1280264 1257705 1259525 1279118 1290928 1290664 1288863 1329967 1313823 1299221 1284387 1286401 1270525
16084 1270525 1271940 1283445 1265880 1243035 1268219 1271653 1273142 1271440 1273690 1279009 1287705 1281679 1291465
16071 1291465 1283444 1252485 1267383 1265077 1285262 1314052 1331747 1313635 1317623 1319535 1294131 1308573
16059 1308573 1281877 1289344 1301617 1311053 1296774 1288872 1307062 1275198 1240489 1255511 1270869 1265405
16047 1265405 1309915 1310881 1264478 1276724 1305691 1278466 1297187 1323661 1323398 1346063 1304789 1266204
16035 1266204 1280423 1293677 1304348 1310979 1290334 1295273 1292978 1279982 1304671 1286996 1288284 1276718
16023 1276718 1269114 1269291 1293559 1299658 1281906 1276479 1327710 1332638 1319704 1344663 1346841 1349303 1335568
16010 1335568 1331051 1319594 1326429 1312527 1319890 1320970 1306127 1311877 1334298 1354553 1306113 1314474
15998 1314474 1318751 1302694 1305024 1319355 1321075 1319126 1308423 1307868 1310512 1274909 1283571 1303945 1333313
15985 1333313 1337070 1301236 1327114 1310123 1318857 1308988 1297058 1321886 1343226 1333094 1319548 1330820
15973 1330820 1356152 1355197 1336449 1314957 1310176 1304688 1286560 1294390 1318221 1335031 1323447 1308464
15961 1308464 1303905 1317784 1299396 1290783 1292097 1341683 1324608 1345342 1315849 1321386 1276608 1251709
15949 1251709 1296359 1308453 1311699 1342045 1329854 1300625 1305741 1307793 1317806 1292773 1305549 1318727
15937 1318727 1327201 1330010 1299967 1291615 1344249 1330991 1299596 1291895 1316963 1330559 1352556 1366192
15925 1366192 1358346 1324042 1361797 1313038 1296205 1296772 1317437 1327964 1305044 1324002 1281716 1316624
15913 1316624 1297946 1303093 1309062 1307744 1312204 1308389 1306299 1295775 1333327 1312200 1319194 1310422 1305218
15900 1305218 1292005 1321340 1309461 1295570 1315183 1319122 1301925 1308479 1301515 1297280 1292868 1306654
15888 1306654 1332937 1336211 1340016 1321576 1316559 1337394 1332273 1315017 1337264 1319420 1319577 1333977
15876 1333977 1340003 1362633 1329749 1306636 1322282 1320547 1303127 1304901 1293809 1281545 1303472 1312143
15864 1312143 1335207 1341484 1351629 1328148 1332377 1320805 1305027 1320695 1340810 1325676 1357333 1359773
15852 1359773 1306831 1293412 1312770 1320567 1300471 1294907 1304926 1313758 1309149 1295705 1310955 1308564
15840 1308564 1281954 1275262 1317336 1308508 1318211 1326961 1316589 1291519 1294945 1307656 1329672 1328238
15828 1328238 1325209 1335624 1341507 1330376 1337159 1335549 1341890 1353262 1324968 1317393 1334783 1365314
15816 1365314 1355182 1353013 1363679 1386487 1349790 1308553 1317332 1317540 1329904 1337073 1355567 1327505
15804 1327505 1301398 1314583 1321028 1338008 1373249 1340362 1320335 1344240 1325287 1321359 1362679 1343193
15792 1343193 1314287 1333514 1336197 1320362 1312591 1360604 1348241 1364413 1337811 1313825 1323982 1322680
15780 1322680 1336482 1318777 1320000 1312272 1315193 1321056 1337449 1346263 1347889 1345114 1326442 1337897 1348251
15767 1348251 1331443 1294235 1311037 1323316 1330869 1345347 1348653 1348365 1329585 1335538 1351970 1351040 1348958
15754 1348958 1343109 1347529 1341716 1357383 1362469 1337811 1337138 1372927 1392467 1385099 1359480 1352926 1320379
15741 1320379 1320544 1337107 1326483 1360218 1396166 1380810 1341255 1305321 1303783 1321945 1357034 1398658
15729 1398658 1367463 1373109 1384967 1342717 1350830 1342846 1370566 1364592 1382246 1359795 1339200 1356092
15717 1356092 1364053 1327028 1306003 1302048 1316128 1348422 1365820 1344124 1346900 1336972 1312162 1327934
15705 1327934 1331933 1351175 1334094 1319891 1318958 1323287 1354041 1352816 1338227 1345194 1345593 1348832 1328657
15692 1328657 1336371 1342994 1360767 1365650 1343078 1318601 1348123 1354461 1338138 1358419 1370844 1365942
15680 1365942 1335254 1321366 1324380 1313282 1296798 1321057 1363118 1340841 1345886 1332481 1337052 1324648
15668 1324648 1340401 1326836 1313702 1307662 1321643 1314864 1311307 1328523 1334843 1358994 1375858 1363536
15656 1363536 1373768 1361654 1331492 1328375 1342684 1355869 1340903 1350137 1356562 1352894 1344774 1357245
15644 1357245 1344595 1336019 1341142 1365808 1356416 1330255 1344777 1342259 1349749 1339427 1323437 1318954
15632 1318954 1353326 1342605 1315791 1336905 1335039 1335891 1350156 1348248 1322012 1358523 1354073 1334996
15620 1334996 1344638 1340966 1334436 1325077 1338586 1367000 1376291 1345688 1348755 1349003 1327339 1357960 1372415
15607 1372415 1375708 1362910 1341882 1355010 1378043 1377036 1395080 1388376 1382718 1377893 1384446 1363857
15595 1363857 1345675 1348774 1381895 1380738 1357751 1343906 1336825 1349708 1330690 1322298 1349607 1389734
15583 1389734 1360847 1360934 1345307 1350024 1343318 1357221 1386386 1377365 1395285 1376404 1329560 1334810 1339539
15570 1339539 1361267 1354155 1321745 1316280 1310307 1329029 1316577 1359207 1390488 1388545 1389322 1361727
15558 1361727 1349630 1353840 1350657 1331976 1366269 1365585 1368787 1377011 1393028 1367752 1358556 1381138 1387911
15545 1387911 1377085 1385909 1379008 1363850 1348714 1366765 1366069 1361778 1377914 1372180 1371172 1387324 1361032
15532 1361032 1323367 1384702 1370236 1377887 1373300 1378873 1358492 1333547 1305052 1333271 1356936 1374504
15520 1374504 1354861 1364140 1368906 1335100 1351037 1352889 1381049 1384581 1396237 1365812 1353452 1326511
15508 1326511 1330633 1330437 1341271 1335072 1345195 1369683 1361190 1371848 1357981 1383043 1346913 1334913
15496 1334913 1385223 1407565 1388659 1324125 1318974 1356647 1362403 1368081 1351895 1365032 1367245 1368817
15484 1368817 1355103 1360588 1306381 1340033 1359120 1349503 1355224 1369176 1375749 1338945 1344868 1344192 1343403
15471 1343403 1339581 1329314 1349925 1378508 1375339 1386754 1357026 1362485 1398413 1394420 1389549 1400330
15459 1400330 1410455 1384908 1385648 1393676 1397189 1389937 1403089 1463510 1392130 1359026 1372184 1410996
15447 1410996 1424388 1386200 1377378 1371913 1356701 1354167 1354043 1359167 1379315 1376575 1432428 1421929 1376412
15434 1376412 1375723 1380347 1378816 1371321 1368970 1388191 1401466 1366593 1339893 1339951 1365935 1354280 1362439
15421 1362439 1361611 1368500 1384059 1390112 1357134 1376486 1366643 1347676 1385668 1401505 1382004 1400230
15409 1400230 1388765 1391537 1411142 1359987 1376007 1377435 1402842 1395985 1356576 1377460 1422204 1438700
15397 1438700 1384733 1388234 1426904 1411919 1396581 1374367 1386633 1400460 1368559 1369734 1401292 1409240
15385 1409240 1360396 1384091 1379955 1332355 1355416 1364293 1353786 1372550 1378880 1374659 1370946 1377655
$$ [...]
##END NTUPLES=NMR SPECTRUM
##END=
