##TITLE=1H_CG-1221-B
 200.13MHz, CDCl3,
 8 sc
 
 13.2.2025
##JCAMPDX= 6.0         $$ Bruker NMR JCAMP-DX V2.0
##DATA TYPE= NMR SPECTRUM
##DATA CLASS= NTUPLES
##ORIGIN= UXNMR, Bruker Analytische Messtechnik GmbH
##OWNER= pz
$$ XWIN-NMR		Version 3.5
$$ Thu Feb 13 14:23:03 2025 Russian Standard Time (UT+4h)  she@DPX200
##.OBSERVE FREQUENCY= 200.1313
##.OBSERVE NUCLEUS= ^1H
##.ACQUISITION MODE= SIMULTANEOUS
##.ACQUISITION SCHEME= undefined
##.AVERAGES= 8
##.DIGITISER RES= 18
##SPECTROMETER/DATA SYSTEM= spect
##.PULSE SEQUENCE= zg30
##.SOLVENT NAME= CDCl3
##.SHIFT REFERENCE= (INTERNAL, CDCl3, 0, 15.5232)
##AUDIT TRAIL= $$ (NUMBER, WHEN, WHO, WHERE, WHAT)
$$ ##TITLE= Audit trail, XWIN-NMR		Version 3.5
$$ ##JCAMPDX= 5.01
$$ ##ORIGIN= Bruker BioSpin GmbH
$$ ##OWNER= she
$$ F:/spectra/data/she/nmr/H-C/1/pdata/1/auditp.txt
$$ ##AUDIT TRAIL=  $$ (NUMBER, WHEN, WHO, WHERE, WHAT)
(   1,<2025-02-13 14:21:17.70 +0400>,<she>,<DPX200>,
      <created by zg, POWCHK disabled, PULCHK disabled
       configuration hash MD5:
       00 E9 B6 7A A2 85 ED C7 34 08 36 98 17 FE 4E 26
       data hash MD5: 16K
       10 4C 70 60 97 62 02 C8 11 66 98 C7 05 9D F4 14>)
(   2,<2025-02-13 14:21:23.00 +0400>,<she>,<DPX200>,
      <Start of raw data processing
       efp BC_mod = 2 LB = 0.25 FT_mod = 6 PKNL = 1 PHC0 = -468.8324 PHC1 = 14.59221 SI = 16K 
       data hash MD5: 16K
       56 1D F8 7E 35 15 1F E9 AA BC DD 7B 62 AB 31 19>)
(   3,<2025-02-13 14:21:50.89 +0400>,<she>,<DPX200>,
      <pk PHC0 = -1.736142 PHC1 = 2 
       data hash MD5: 16K
       1C 98 3B B7 0A 3C 8A F3 75 66 95 A4 E3 53 87 D3>)
(   4,<2025-02-13 14:21:55.31 +0400>,<she>,<DPX200>,
      <abs ABSG = 5 
       data hash MD5: 16K
       7B BF 92 AA D1 99 86 E4 93 4D 95 D2 7C 6C 4C F8>)
$$ ##END=
$$ 
$$ hash MD5
$$ 9C AB 25 34 B6 DB 97 5E 4C D5 EC F1 7F 3E FD 4E
##$RELAX= 
##$RELAX= 
##$RELAX= 
##$RELAX= 
##$RELAX= 
##$RELAX= 
$$ Bruker specific parameters
$$ --------------------------
##$DU= <F:/spectra>
##$EXPNO= 1
##$NAME= <H-C>
##$PROCNO= 1
##$TYPE= <nmr>
##$USER= <she>
##$AMP= (0..31)
100 100 100 100 100 100 100 100 100 100 100 100 100 100 100 100 100 100 
100 100 100 100 100 100 100 100 100 100 100 100 100 100 
##$AQSEQ= 0
##$AQ_mod= 1
##$AUNM= <au_zg>
##$AUTOPOS= <>
##$BF1= 200.13
##$BF2= 200.13
##$BF3= 200.13
##$BF4= 200.13
##$BF5= 200.13
##$BF6= 200.13
##$BF7= 200.13
##$BF8= 200.13
##$BYTORDA= 1
##$CFDGTYP= 0
##$CFRGTYP= 5
##$CHEMSTR= <none>
##$CNST= (0..31)
1 1 145 1 1 1 1 1 1 1 1 1 1 1 1 1 1 1 1 1 1 1 1 1 1 1 1 1 1 1 1 1 
##$CPDPRG= <>
##$CPDPRG1= <>
##$CPDPRG2= <>
##$CPDPRG3= <>
##$CPDPRG4= <mlev>
##$CPDPRG5= <mlev>
##$CPDPRG6= <mlev>
##$CPDPRG7= <mlev>
##$CPDPRG8= <mlev>
##$CPDPRGB= <>
##$CPDPRGT= <>
##$D= (0..31)
0 0.7 0 0 0 0 0 0 0 0 0 0.03 0 0 0 0 0 0 0 0 0 0 0 0 0 0 0 0 0 0 0 0 
##$DATE= 1739442077
##$DBL= (0..7)
120 120 120 120 120 120 120 120 
##$DBP= (0..7)
150 150 150 150 150 150 150 150 
##$DBP07= 0
##$DBPNAM0= <>
##$DBPNAM1= <>
##$DBPNAM2= <>
##$DBPNAM3= <>
##$DBPNAM4= <>
$$ [...]
##$SUBNAM3= <"">
##$SUBNAM4= <"">
##$SUBNAM5= <"">
##$SUBNAM6= <"">
##$SUBNAM7= <"">
##$SUBNAM8= <"">
##$SUBNAM9= <"">
##$SW= 18.0517328524113
##$SWIBOX= (0..15)
0 0 2 0 0 0 0 0 0 0 0 0 0 0 0 0 
##$SW_h= 3612.71676300578
##$TD= 16384
##$TD0= 1
##$TE= 0
##$TE2= 300
##$TE3= 300
##$TEG= 300
##$TL= (0..7)
0 120 120 120 120 120 120 120 
##$TP= (0..7)
150 150 150 150 150 150 150 150 
##$TP07= 0
##$TPNAME0= <>
##$TPNAME1= <>
##$TPNAME2= <>
##$TPNAME3= <>
##$TPNAME4= <>
##$TPNAME5= <>
##$TPNAME6= <>
##$TPNAME7= <>
##$TPOAL= (0..7)
0.5 0.5 0.5 0.5 0.5 0.5 0.5 0.5 
##$TPOFFS= (0..7)
0 0 0 0 0 0 0 0 
##$TUNHIN= 0
##$TUNHOUT= 0
##$TUNXOUT= 0
##$USERA1= <user>
##$USERA2= <user>
##$USERA3= <user>
##$USERA4= <user>
##$USERA5= <user>
##$V9= 5
##$VALIST= <valist>
##$VCLIST= <CCCCCCCCCCCCCCC>
##$VD= 0
##$VDLIST= <DDDDDDDDDDDDDDD>
##$VPLIST= <PPPPPPPPPPPPPPP>
##$VTLIST= <TTTTTTTTTTTTTTT>
##$WBST= 1024
##$WBSW= 4
##$XGAIN= (0..3)
0 0 0 0 
##$XL= 0
##$YL= 0
##$YMAX_a= 608032
##$YMIN_a= -710447
##$ZGOPTNS= <>
##$ZL1= 120
##$ZL2= 120
##$ZL3= 120
##$ZL4= 120
##$ABSF1= 15.48576
##$ABSF2= -2.56609
##$ABSG= 5
##$ABSL= 3
##$ALPHA= 0
##$AQORDER= 0
##$ASSFAC= 0
##$ASSFACI= 0
##$ASSFACX= 0
##$ASSWID= 0
##$AUNMP= <proc_1d>
##$AZFE= 0.1
##$AZFW= 0.1
##$BCFW= 0
##$BC_mod= 2
##$BYTORDP= 0
##$COROFFS= 0
##$CY= -3
##$DATMOD= 1
##$DC= 0
##$DFILT= <>
##$DTYPP= 0
##$F1P= 0
##$F2P= 0
##$FCOR= 1
##$FTSIZE= 16384
##$FT_mod= 6
##$GAMMA= 0
##$GB= 0
##$INTBC= 1
##$INTSCL= 3.241238e-09
##$ISEN= 128
##$LB= 0.25
##$LEV0= 0
##$LPBIN= 0
##$MAXI= 10000
##$MC2= 0
##$MEAN= 0
##$ME_mod= 0
##$MI= 1.114404
##$NCOEF= 0
##$NC_proc= -5
##$NLEV= 6
##$NOISF1= 3.799351
##$NOISF2= 2.8
##$NSP= 0
##$NTH_PI= 0
##$NZP= 0
##$OFFSET= 15.52322
##$PC= 1
##$PHC0= -470.5685
##$PHC1= 16.59221
##$PH_mod= 1
##$PKNL= yes
##$PPARMOD= 0
##$PSCAL= 0
##$PSIGN= 0
##$REVERSE= no
##$SF= 200.129999695314
##$SI= 16384
##$SIGF1= 3
##$SIGF2= 2
##$SINO= 0.751879
##$SIOLD= 32768
##$SREGLST= <19F.Aceton>
##$SSB= 0
##$STSI= 16384
##$STSR= 0
##$SW_p= 3612.71676300578
##$SYMM= 0
##$S_DEV= 0
##$TDeff= 16384
##$TDoff= 0
##$TI= <>
##$TILT= no
##$TM1= 0
##$TM2= 0
##$TOPLEV= 0
##$USERP1= <user>
##$USERP2= <user>
##$USERP3= <user>
##$USERP4= <user>
##$USERP5= <user>
##$WDW= 1
##$XDIM= 16384
##$YMAX_p= 270458192
##$YMIN_p= -545140
$$ End of Bruker specific parameters
$$ ---------------------------------
##NTUPLES= NMR SPECTRUM
##VAR_NAME=  FREQUENCY,     SPECTRUM/REAL,   SPECTRUM/IMAG
##SYMBOL=    X,             R,               I
##VAR_TYPE=  INDEPENDENT,   DEPENDENT,       DEPENDENT
##VAR_FORM=  AFFN,          ASDF,            ASDF
##VAR_DIM=   16384,         16384,           16384
##UNITS=     HZ,            ARBITRARY UNITS, ARBITRARY UNITS
##FACTOR=    0.220516191357247, 1,           1
##FIRST=     3106.66202632956, 0,            0
##LAST=      -506.054736676223, 0,           0
##MIN=       -506.054736676223, -545140,     0
##MAX=       3106.66202632956, 270458192,    0
$$ Real data points
##PAGE= N=1
##DATA TABLE= (X++(R..R)), XYDATA
$$ [...]
8983B82563O3360o5692M7070L9799j4358j1121M1875l2367j8701k7477j9689O3537
8971C48799N9680N0615k0958N1757O246L1337R6305p3228K5849J522j8901N375
8959E64398L492R2187J7020P0170N527k1579K7916o051K943N4452K2650M7693
8947H80818Q4228R8584J28301Q4901R4833O5998N7177J38492J13103J14890Q6815
8936A948140J36051K18737K42643J92025L43997L81294M92118O18821Q20810J028351
8926F422987J081385J435295J302445L52172o21207j510129j692824j351807r79740
8917D438577p01147n62917n45593l62251k94547k21284j75209j87663p3969j04205
8907A209792r5901j26706p8239n0583n0570k2314l5256j30560q5083m9842k3796
$$ y = [282563, 345923, 280231, 327301, 367100, 352742, 341621, 383496, 351129, 332428, 304951, 285262, 348799, 408479, 459094, 438136, 489893, 496139, 527476, 623781, 550553, 576402, 577924, 559023, 564398, 567890, 660077, 677097, 747267, 752794, 731215, 759131, 753080, 756023, 810475, 833125, 880818, 965046, 1063630, 1191931, 1276832, 1371665, 1437663, 1494840, 1633332, 1746435, 1861325, 1948140, 2084191, 2302928, 2545571, 2737596, 3081593, 3462887, 3955005, 4573826, 5394636, 6422987, 7504372, 8939667, 10242112, 10594284, 9973077, 8462948, 6770124, 5418317, 4438577, 3737430, 3174513, 2628920, 2266669, 1972122, 1750838, 1575629, 1387966, 1313997, 1209792, 1113891, 987185, 908946, 858363, 807793, 785479, 750223, 619663, 534580, 484738, 460942]
8896D60942o588m2734m4273J8650R24o3198p1890J2204M9059o9558J1235l2319
8884B22454J8656O6588q4511j0982J1349J5869n889k4322o7800K1394M4769n0668
8872A56907q2062p618N1047J2169J9934R181N4696p6776k0063K4696k0755k6152
8860I5204k8065P7119l1630l5741j6909N8866j1070k4310j8796m1580M7262K3364
8848I3714l778k8391n5756k9928K6886P607O9532J4735m6487m0749l0036M6073
8836B3422L6140J0175p533l6664M8005o9144j5086L0379J4929O4003m9151N366
8824E4841L1574n9308j6208m6852L8476k3107M5568M8373q6343J2676N5773k2183
8812C3280R978M166k2293J3451n4211M488J7993K1787K4075q2025m6316K1731
$$ y = [460942, 454354, 411620, 367347, 385997, 386921, 323723, 251833, 264037, 313096, 243538, 254773, 222454, 241110, 307698, 223187, 212205, 223554, 239423, 233534, 209212, 141412, 162806, 207575, 156907, 74845, 67227, 118274, 130443, 150377, 159558, 214254, 137478, 117415, 142111, 121356, 95204, 67139, 144258, 112628, 76887, 59978, 118844, 107774, 83464, 64668, 23088, 70350, 93714, 89936, 61545, 5789, -24139, 2747, 10354, 79886, 94621, 48134, 7385, -22651, 23422, 59562, 69737, 62204, 25540, 73545, 4401, -10685, 19694, 34623, 98626, 49475, 54841, 86415, 27107, 10899, -35953, 2523, -20584, 24984, 73357, -12986, -310, 55463, 33280, 43258, 47424, 25131, 38582, -15629, -11141, 6852, 28639, 52714, -29311, -75627, -53896]
8800e3896M390M4672m5758J7856k7035j482M7501O1593k0352J9024l942q65o5335
8787b3629P941O3778m0244j3993m66m1955P1630n173l0302j4484j5389k441j010
8774d5737L3026O714P792L9893l0525o9981k174L7071J8456P8047n991l1897p6136
8761d1442L951O6900j0523J9053o0674M2509p5264L6214R7794k5839j3853N6236
8749I5062n5421j1694N4802k1601j5856m6991J762K6332m4887M4427K2499L3733
8737H2167n6945Q07J3558k8494k3904O219L9712k9187p188K5586j8560l7591k707
8724c6527m2685J4229J10255k3777J0473n615K0142Q495r6807L8482R9092l5144
8712F0613k4151p1492k1472P146O6089K4047N274q4577k7625K9887J9884l2148
$$ y = [-53896, -49506, -4834, -50592, -32736, -59771, -61253, -13752, 47841, 27489, 46513, 42571, 41706, -23629, -15688, 48090, 7846, -6147, -6613, -48568, 23062, 17889, -12413, -26897, -42286, -44727, -45737, -12711, -5997, 1795, 41688, 11163, -58818, -60992, -23921, -5465, 72582, 66591, 34694, -41442, -37491, 29409, 18886, 37939, -22735, 19774, -55490, -19276, 78518, 52679, 38826, 95062, 39641, 27947, 82749, 61148, 45292, -1699, 63, 26395, -18492, 25935, 48434, 82167, 25222, 26029, 39587, 11093, -12811, -6592, 33120, 3933, -3255, 22331, 3771, -33820, -36527, -79212, -64983, 45272, 21495, 31968, 26353, 46495, 54990, -41817, -3335, 95757, 60613, 36462, -35030, -56502, -49356, 16733, 40780, 46054, -38523, -66148, -36261, -16377, -48525]
8700d8525p703O0309J0849J2517n7481m6684J58K1253R93N7906n8826L4702j2797
8687c3329J8337M9842l7900n0960J6482L0275N1386P6386j3619o4914L172J7802
8675F2960n5201p3285Q3874K1262r170k1717k2295m4145R417J02095M206j2K9844
8662H7833m6660m0362J4938k9139O0040L6872m9268j014J6568k4454o4245J4069
8650b4822q964K4128j5952p375M5853J3342N24o08r3178M177Q0444m1484l5628
8637e9543M9745L875J2482q922J5740M6933N8830P62m7445k5689K1589L785k3449
8624D8693k7756l5750j0348l9547j8583M7185Q8261l004l4077m2591j2851J9888
8612b0480N0192k2309j4917k6416J1125M000o784p9576K3247L9469N0382j3297
$$ y = [-48525, -56228, 4081, 14930, 27447, -30034, -76718, -76560, -55307, -54314, 3592, -55234, -20532, -33329, -14992, 34850, -3050, -54010, -37528, -7253, 44133, 120519, 106900, 41986, 45158, 62960, 7759, -65526, 18348, 39610, 30440, 8723, -13572, -57717, -48300, 53795, 58001, 57989, 87833, 41173, 811, 15749, -13390, 46650, 83522, 34254, 33240, 49808, 25354, -38891, -24822, -33786, -9658, -25610, -32985, 12868, 26210, 26734, 26126, -67052, -62875, 17569, -23915, -59543, -9798, -5923, 6559, -2363, 13377, 60310, 119140, 119902, 72457, 46768, 68357, 72142, 48693, 20937, -14813, -25161, -64708, -83291, -36106, 52155, 49151, 15074, -27517, -40368, -20480, 29712, 7403, -7514, -33930, -22805, -18805, -25589, -105165, -81918, -42449, 7933, -5364]
8600e364q7575N2376M9791l049l059l7766N8580O4238l2751N16M4893m9822j6650
8587C4358j3139o8956O6204l9450K6071M360l4522L4599k8904n6852q452J76292
8575I1609m8745l6737J3845k8913k1236j709L9928N442m23o629K4140L2915K3624
8562H7111p1152K1862j7407o639m2283m218l661l9684L486J7265P979L9358j672
8549i655L8897M6368o0859j1286M5899m4972O309L2701m6502l3448N5079j5998
8537B533q866O5025n1559k8237O971R681O5654l3545m9890j836J789L8633m5550
8524b9197m8n8227O7343L1001q636j3841l2587M4344K7157M926J0093l3901m0516
8511c2089l3766P1177j1091K2785K1634n4970k0551J4740k7605O267l7508J4326
$$ y = [-5364, -92939, -40563, 9228, 6179, 3120, -34646, 23934, 88172, 55421, 55937, 100830, 51008, 34358, 21219, -47737, 18467, -20983, 5088, 9448, -25074, 9525, -19379, -76231, -84683, 91609, 42864, 6127, 19972, -8941, -30177, -31886, 8042, 13484, 13061, 6432, 30572, 63487, 87111, 15959, 37821, 20414, 13775, -28508, -32726, -36387, -76071, -72585, -55320, -47341, -7983, -9655, 29242, 75610, 14751, 3465, 49364, 4392, 10701, 43402, -3100, -36548, 18531, 2533, -6333, 58692, 7133, -21104, -14133, -4452, 61202, 27657, -22233, -24069, -22280, 16353, -29197, -29245, -87472, -20129, 10872, 2236, -11605, -44192, 152, 27309, 32235, 42328, 8427, -32089, -65855, 5322, -5769, 17016, 38650, -16320, -36871, -22131, -49736, -43469, -80977, -66651]
8499f6651N2118L2540j334k739l7396K8483O2606j5232m5543m56O3058q2879L0310
8486A6885j8228K158m850L3443m8711j0457K2186K5743n509o2198L6699k8555
8474d1394n0669M7080M2453j9033k2850M1156J3589r621K471J8384n688R651k0932
8461D597N24m1799L7192M0585K4450k1598k0633q880l068J8358J9370j3374l3616
8448B108M1360K028J648K4964k9304j8018k7880M7971K9462m0583K2321r412K1720
8435F8385j3256l793k6389j06957J8201j4379k0115l2486o10M1182M6057N7163
8423A3003q0043J3444M0621K9832m1812M8645k9791j5653J5855P491k1330m9787
8411f9525N6424R534j1607n2545n7901K2812K6246N7080N3888k0033L3243J8902
$$ y = [-66651, -14533, 18007, 16673, 13934, -23462, 5021, 67627, 52395, 6852, 6396, 69454, -13425, 16885, -1343, 815, -4035, 29408, -19303, -29760, -7574, 18169, 12660, -49538, -12839, -41394, -92063, -44983, -2530, -21563, -44413, -3257, 10332, 711, 3182, 21566, 15878, 25529, 4597, 5121, -36678, 514, 41099, 65549, 43951, 23318, 14438, 11370, 29728, 49098, 35724, 2108, 43468, 45496, 47144, 72108, 42804, 24786, -3094, 44877, 74339, 33756, 56077, 46665, 68385, 55129, 51336, 24947, -82010, -63809, -78188, -98303, -130789, -131399, -90217, -44160, 13003, -67040, -53596, -12975, 16857, -24955, 23690, -6101, -21754, -5899, 1592, -19738, -69525, -13101, -3567, -15174, -67719, -125620, -102808, -76562, -19482, 34406, 14373, 47616, 66518]
8399F6518o470m8954r2731k8186N2976M2737j9526j2227P4530o019j6681l6408
8387c0441m6690Q282L6869K2683L6107J3455m5530P350k5814J5488k0121l2142
8375f0504m1096J6131K1517N1773K5315J963l9583j5917P330o984K8841M8941
8363C7727M9508J0909n3967m3983j1197j0322M8714l3765K174N568k1704M9111
8351B8773J1665k6063j0469o2524P434L6545j9677O3346N3313J3928o4874J0789
8339D2186j5172K9905L9834r3900j6504M9299J2407k0262m6681J5245l2085n4966
8327i0694R5329N4162j03704k9055M8430O1725J2370m4526O8690k3039m4269R369
8315A4788L0196o0260k3263M3990J4701K3604o873Q548O1651o937p7411n6484
$$ y = [66518, 60048, 11094, -81637, -109823, -56847, -14110, -33636, -45863, 28667, 22648, 5967, -30441, -77131, -68849, -31980, -9297, 26810, 40265, -5265, 2085, -23729, -8241, -28362, -60504, -101600, -85469, -63952, -12179, 13136, 15099, -24484, -40401, -33071, -40055, -11214, 37727, 87235, 98144, 44177, 194, -11003, -21325, 27389, -6376, -4202, 1366, -20338, 28773, 40438, 14375, 3906, -58618, -51184, -14639, -34316, 29030, 82343, 96271, 31397, 42186, 27014, 56919, 96753, 2853, -13651, 35648, 48055, 27793, -18888, -3643, -35728, -90694, 4635, 58797, -44907, -73962, -25532, 36193, 48563, 4037, 72727, 49688, 5419, 14788, 44984, -15276, -38539, 5451, 20152, 43756, 36883, 45431, 107082, 100145, 22734, -33750]
8303c3750J4601R301Q204K1496j5506j3936m7701N9030O6214J2877j7912m8470
8291A4448l1860j4628M5312l1792L5261l6949q987q349m207j1809K6117n8237
8279h5680M4457K6274n2789J06359k7387l9854l28M9622K8427j0931l7288l4640
8267c3758j8640O7837M9157q736n0836k3745J7439N9860m3640o4450J2596L8307
8255A391M4915j8107k345K4786l5467m4839n0179K0017N7842L910M930J8973l861
8242B1966O7779j2676l1654j5305r307M2354l4661j3807L0197L3375l6760l0485
8230A1016n9287K6347N1325r74l6874k5867K9875K8904k0553m508k3253l6242
8218f0091K4297n806K0822k440L1086J5989m4707J4273L3476j0172Q487j0964
$$ y = [-33750, -19149, -9848, -1644, 19852, 4346, -9590, -57291, 1739, 67953, 80830, 62918, 14448, -17412, -32040, 13272, -18520, 16741, -20208, -29195, -37544, -41751, -53560, -27443, -85680, -41223, -14949, -67738, 38621, 11234, -28620, -28948, 20674, 49101, 38170, 882, -33758, -52398, 15439, 64596, 55860, 5024, -18721, -1282, 58578, 14938, -49512, -36916, 1391, 46306, 28199, 25854, 50640, 15173, -29666, -79845, -59828, -1986, 1924, 6854, 25827, 21966, 89745, 77069, 45415, 30110, 20803, 63157, 28496, 14689, 44886, 78261, 41501, 11016, -48271, -21924, 29401, 28427, -8447, -34314, -4439, 24465, 3912, -596, -23849, -60091, -35794, -41600, -20778, -23218, 7868, 23857, -20850, -6577, 26899, 16727, 25214, 14250]
8206A4250k712j9465K6278m581K8883m323l8464p208K6584R973M990Q0718r000
8193A05923J63945o65329j49679L23659J147Q1646L5134L6661j8071K8561k2271
8182g8674Q3919k3398K1533k7068k0637m3326L0864K2038K0610L2212m0590k247
8170b4764j4952m1125M3939M6083J3381J732l3526m7234l1542l4074N4815K7739
8158c9528M400O7814j7641q083m2006P638P2902j8492k1211l5227l1012o091J4622
8145e1915O0111J0857j4444K6681k2773k128K1701J5127n9424O391M451L2693
8133B7328K2191k4098l2519J0529K4936M500j1490k8399P281L1917K0646l3835
8121A8987L363l4688k2671Q2199Q19J004k6390p7952M3837M2158K2910K6179J0881
$$ y = [14250, 11538, -7927, 18351, 13770, 42653, 38330, -134, -7342, 19242, 29215, 34205, 114923, 105923, 269868, -395461, -545140, -221481, -220334, -138688, -103554, -66893, -84964, -56403, -78674, 5245, -18153, 3380, -23688, -44325, -87651, -56787, -34749, -14139, 18073, -22517, -24764, -39716, -80841, -36902, 9181, 22562, 24294, -9232, -56466, -88008, -122082, -67267, -39528, -35128, 32686, 15045, 6962, -35044, -27406, 45496, 27004, 5793, -29434, -60446, -66537, -51915, 8196, 19053, 4609, 31290, 8517, 6389, 28090, 43217, -16207, -9816, -5365, 27328, 49519, 25421, -7098, 3431, 28367, 32867, 21377, -7022, 259, 32176, 52822, 18987, 22350, -12338, -35009, 47190, 48009, 49013, 22623, -55329, -11492, 30666, 53576, 79755, 90636]
8108I0636j0146m5268l9248M6034o3503j5477O1653J0109o3997k577N2295l7951
8096a7440q650l5652j2290M2121k2818j5835K7784K4157J434N8702l1774n1557
8084d1818K4523K9956O3606j2983o0392L8174K0547p7343l9353O3252j8543q963
8072a9337P6285r6524J4798M322n486K9831j3002K0116N5637k7680m3536l5013
8060c9589J508O1402l297k8150k7885m1332J1669O9922L9998j8107l3616r975
8048a7452K5296K6610l0678K102K6907l4541N0241L097P985J0905n6966j5787
8036b281k1165k1793J2803k254O470O3059R1910J7462r2751L8109j1072l6648
8024D1849k1421r212K912O4561j7683l393O104L3056O0837p9347m496J8986m4470
$$ y = [90636, 80490, 35222, -4026, 42008, -21495, -36972, 24681, 34790, -29207, -31784, 20511, -17440, -26090, -61742, -74032, -31911, -54729, -70564, -42780, -18623, -17189, 41513, 9739, -41818, -17295, 12661, 76267, 63284, 2892, 41066, 61613, -15730, -55083, 8169, -10374, -19337, 56948, -39576, -24778, -20456, -25942, 3889, -9113, 11003, 66640, 38960, -4576, -39589, -38081, 23321, 20024, -8126, -36011, -77343, -65674, 4248, 44246, 26139, -7477, -17452, 7844, 34454, 3776, 5878, 32785, -1756, 48485, 51582, 59567, 70472, 13506, -2281, -23446, -45239, -32436, -34690, -28220, 34839, 126749, 144211, 51460, 89569, 78497, 41849, 20428, 11216, 14128, 78689, 61006, 57613, 63717, 96773, 157610, 78263, 73767, 92753, 48283]
8011D8283K9738J9626n4120m0216N3560k828n3954N899J1215m6369J0303r2895
7999a11758l2798R3561P2915n6244M341P519Q7012Q080J330j765m4933l0579J8559
7986A5240M5017m1865M838M9643n6968o491k3434j2620O1803L8897J9996n2827
7974D1229J4579j9537J893j9608j8137k899K4801J9754M7150n170p8455l9368
7962c3768L2212p152L5121L2592J6718j5204k9152k5769M7547l0269K2776k5597
7950B0055j7604l0046K0857J1496M2313J2651K669k2490m33k0195m2613k7980
7938e1320P249O0476J3801q767j6089K4738J5292M1602J345L8161j3263m1378
7926G1847n6804J4918l113l8586K4644M5476k4383q631j0424l9292m5585J3836
$$ y = [48283, 78021, 97647, 43527, 3311, 56871, 54043, 89, 5988, 17203, -29166, -18863, -111758, -144556, -50995, 21920, -34324, -29983, -22464, 64548, 72628, 73958, 72193, 27260, -3319, 15240, 60257, 18392, 23230, 72873, 15905, 9414, -14020, -26640, 35163, 74060, 94056, 41229, 55808, 36271, 38164, 18556, 419, -2480, 22321, 42075, 89225, 84055, 5600, -33768, -1556, -8708, 26413, 59005, 75723, 60519, 31367, 5598, 53145, 22876, 45652, 20055, 2451, -27595, -6738, 4758, 47071, 59722, 62391, 39901, 39468, 19273, -23340, -51320, -44071, 16405, 30206, 21439, 5350, 30088, 45380, 86982, 88327, 126488, 113225, 71847, 15043, 29961, 26848, -11738, 12906, 58382, 33999, 25368, 14944, -24348, -69933, -56097]
7914e6097O5993K5951j7738L75j0942m8837O5599q509m950l9977K1702p300P4698
7901E9968o7625l2527J7121M5561J2442o3091J8815O7487M201n7399m020k3699
7889b2766J6808N9143K3406p8632m610L2736J8566n9071K3907J4120l2762q977
7877a8132k5429j2255o2088L1914L7779K9342J8363k6468M361J6145L3003m4104
7865a7569M1931L697l327J7042M271K6612l9751l0203J9956o13j147j091M0112
7852E9920M134m030m9468Q25n086L9492l2285K5946J1922j3349L630L6733p4223
7839D161L8365m917n3313l2434N6617O8563n7282q268O3684k0777r09l7933J2562
7826B8119P9406r6577n919O011J3277M2495K1518l9269j6451M6105N0135o6549
$$ y = [-56097, 9896, 35847, 18109, 18484, 7542, -41295, 24304, 15795, 10845, -29132, -7430, -14730, 59968, -7657, -40184, -23063, 22498, 34940, -28151, -9336, 58151, 62352, 4953, 933, -22766, -5958, 53185, 76591, -2041, -6651, 26085, 44651, -14420, 9487, 23607, -9155, -18132, -43561, -55816, -117904, -85990, -48211, -18869, -506, -26974, -22613, -6468, 26535, -17569, 24362, 28059, 24732, 41774, 46045, 72657, 32906, 2703, 22659, 22046, 20899, 19808, 59920, 64054, 60024, 10556, 11381, 6295, 45787, 13502, 39448, 51370, 38021, 41651, 78384, 4161, 42526, 37609, -15704, -48138, 8479, 77042, 19760, 11492, 75176, 54399, 53490, 15557, 28119, 107525, 10948, 5029, 11040, 24317, 66812, 88330, 49061, 32610, 78715, 128850, 62301]
7814F2301p5608M3497N6300k2985l6417J2731O9861p5174o7736J1522K5767K9905
7802C3964N4293o7474J6766O1269j4306m9066m920M6534o3770k4075q365L3889
7790A4739o696j6734k5997m295L3718K8356J2450k6656k2348K3330J5421l5888
7778a0600K4494M117m8815J4858P2016J1060j6189K4609K8899p2573j4426R956
7766B7406K4363J3771M440l6261K1215J1519q175l7550m3727K6438j6777k6457
7754c9795L4189J5720N6312k2052r9280J9486K7103M9292m839k0688q758N1054
7742E7744P4644m3578l9328m7230k9409M2137L7154n94l881m0195j3777n7535
7730f3848R5356l2614l2610O0384O1108L054m2018k3701k2290N3239K0832j290
$$ y = [62301, -13307, 30190, 86490, 63505, 27088, 39819, 109680, 34506, -33230, -21708, 4059, 33964, 88257, 20783, 37549, 98818, 84512, 35446, 30526, 77060, 13290, -10785, -19150, 14739, 8043, -8691, -34688, -38983, -5265, 23091, 35541, 8885, -13463, 9867, 25288, -10600, 13894, 18011, -30804, -15946, 56070, 67130, 50941, 75550, 104449, 31876, 17450, 27406, 51769, 65540, 69980, 33719, 54934, 66453, 58278, 20728, -22999, 3439, -13338, -39795, -5606, 10114, 66426, 44374, -54906, -35420, -8317, 40975, 36136, 15448, 6690, 57744, 132388, 88810, 49482, 2252, -27157, 14980, 52134, 51540, 47659, 7464, -6313, -63848, 31508, -1106, -33716, 26668, 87776, 90830, 48812, 25111, 2821, 56060, 76892, 75602]
7718G5602J528l0068j31316P6581J07167L412k5338K683p2888K1070n8164l092
7706c2823L5229k1535K3842o76O456m4218L1472M6825l9331k2883K1387P541l3403
7693b2117l0185P2929K8843L3862j9220n3508l6740M3741O9596n6298J613O1532
7681I4048N1487o1313o1426J3938L2101k2663m4038j1882M3946L8383J9224l4384
7669E7421k3531j8757m001j0344M4603J4985L821M1375q669J1593j0954k7213
7657G0329l390P724r0718j714N9775r191j7962m0941J2217N4820j0846J0767j4381
7644B6489J178j976r449r045L8539k6443l6082N8180N6339q624L0814l9066p837
7631G3017Q813k3196K8515l6625R980K2816K343j058j3934O4968m2113o7691j442
$$ y = [75602, 77130, 47062, -84254, -7673, 99494, 102906, 77568, 80251, 7363, 28433, -29731, -32823, 2406, -19129, 4713, 4037, 10493, -33725, -2253, 44572, 5241, -17642, 3745, 11286, -22117, -52302, 20627, 49470, 83332, 64112, 10604, -26136, 17605, 87201, 30903, 32516, 94048, 145535, 84222, 22796, 36734, 68835, 46172, 2134, -9748, 34198, 72581, 91805, 57421, 33890, 15133, 11132, 788, 45391, 60376, 64197, 105572, 96903, 108496, 97542, 70329, 66939, 74663, -16055, -17769, 42006, 32815, 14853, -26088, -13871, 40949, 30103, 40870, 26489, 27667, 25691, 16242, 7197, 45736, 19293, -16789, 41391, 97730, 89106, 119920, 80854, 73017, 81830, 58634, 87149, 50524, 60504, 83320, 85663, 84605, 70671, 135639, 93526, 25835, 24393]
7618B4393p585R9492o11o5983o0796L4961N8805K6144q6507k2997j1590j0160
7606b2434L5226J7572l1952J6854P633m457K1633O722n5159L7816K8811K935N0409
7593A11609k5135J8507K8560j6394l1225k4280O1488K3514j06317k2241m676j9159
7581e749M7531j7224j7081j4391J13121K3450q5861N1745J0909r851r954l6330
7569E0315j6994P8224l971k4821m8434J7750j2084m2552M502L522P0157j3433
7557F2181k3050M5620k5459L8408O498m4416m4150L1275J3253k01N251n7688K8739
7544C6261O3067J5948j2097m528J917n8411N0321M155l7160k8823K0386M6718
7532I7754N1571p7873p6213q142N5797L622M302M6088K585J318j4009m1273n5836
$$ y = [24393, 16808, 116300, 115689, 49706, -11090, 23871, 82676, 108820, 22313, -684, -12274, -22434, 12792, 30364, -1588, 15266, 22899, 18442, 40075, 46797, -8362, 29454, 58265, 61200, 111609, 86474, 104981, 133541, 117147, 85922, 61642, 123130, 146644, 40327, 18086, 13410, -5749, 41782, 24558, 7477, -6914, 106207, 129657, 43796, 95541, 106450, 96599, 86645, 50315, 33321, 111545, 107574, 82753, 34319, 52069, 39985, -2567, 1935, 5457, 75614, 62181, 39131, 84751, 59292, 97700, 104198, 59782, 15632, 46907, 60160, 59959, 65210, 7522, 36261, 99328, 115276, 103179, 98651, 100568, 42157, 92478, 96633, 59473, 30650, 51036, 97754, 149325, 71452, -4761, -12903, 42894, 46516, 50818, 96906, 99491, 100809, 86800, 45527, -10309]
7519a0309K6235j1043P8411L2689j8237j5232j2136J1768k9084n6748L2178J1312
7507C9804R801k6318J037O8067Q034k6166M5512k9923m5288m7566P3079N6324
7495A26397p387K4755L4891q8408J4491L0763l5598o690K1239m4369J3111M0924
7483A24119k1882J4109R799m4123n1172L8429j3416K1253k9812p970k9710M6296
7471E5920L6304k538K5021L4820l8592m1941K0567k2513L9037K3644m7195M2644
7459A25178l7506l649m1502l5746j921O9633O0972l7178K77R0866J217m0020Q421
7446A59042R235k8528n6336k8523J7416M5500l4023L9961J3915m2793l2327L3202
7434I5741k506j7287J6080M9978J3608l3501q541r8476K4152Q1815m9158k0220
$$ y = [-10309, 15926, 4883, 83294, 115983, 97746, 82514, 70378, 82146, 53062, -3686, 28492, 39804, 49605, 23287, 24324, 92391, 100425, 74259, 119771, 89848, 44560, -3006, 70073, 126397, 119010, 143765, 178656, 90248, 104739, 135502, 99904, 93214, 114453, 70084, 83195, 124119, 102237, 116346, 126145, 82022, 30850, 69279, 55863, 77116, 47304, 39334, 9624, 55920, 92224, 89686, 114707, 149527, 110935, 68994, 89561, 67048, 106085, 129729, 82534, 125178, 87672, 84023, 42521, 6775, 4854, 74487, 135459, 98281, 98558, 189424, 190641, 150621, 159042, 168277, 139749, 83413, 54890, 72306, 117806, 83783, 123744, 137659, 94866, 62539, 95741, 93235, 75948, 92028, 142006, 155614, 122113, 113572, 15096, 39248, 121063, 71905, 51685]
7422E1685M7241p729J8166j4862l1010M7288k1959J6676L6334k7726K4203P937
7410A46244l7772M654m7658J2100k6884J7805O2945k2245q8168Q144M6765N6581
7398A32511K3896n7210l5147o974J510p459N2232O050M8057j7557k8693o920k3248
7385H1048J8297Q037j9497k97N0933l5225K7631K6000m2740j785K1134K0164M2672
7372A96372O438k1516j0518L733n9869R048n4057p9890K8445N3240j0439k572
7360E8415P9406K8787K4535o8938L0867O8813l7396m2491k3171k8518J7801M1109
7348A49219k5496l5277K1043l0126K0267K3715M1471R458o4877o124Q9455j0933
7336A81795J7208l2099k9019K0192l7085n099J4489L5701j8812K6941k1774K2514
$$ y = [51685, 98926, 91197, 109363, 94501, 63491, 110779, 88820, 105496, 141830, 114104, 138307, 146244, 108472, 113126, 65468, 77568, 50684, 68489, 131434, 109189, 21021, 29165, 75930, 132511, 156407, 99197, 64050, 57076, 58586, 51127, 103359, 109409, 157466, 139909, 111216, 104296, 81048, 99345, 107382, 87885, 87588, 138521, 103296, 130927, 156927, 114187, 112402, 133536, 153700, 196372, 202810, 181294, 170776, 174509, 114640, 123688, 69631, -10259, 18186, 71426, 60987, 58415, 137821, 166608, 191143, 122205, 153072, 221885, 184489, 141998, 118827, 90309, 108110, 149219, 123723, 88446, 109489, 79363, 99630, 123345, 164816, 174274, 109397, 103273, 192728, 181795, 199003, 166904, 137885, 158077, 120992, 115893, 130382, 166083, 147271, 174212, 152438, 174952]
7324A74952j6748K9305q4893k8038Q7992r4756l5908L0695O7157M8432m0445l0415
7312A07330r287L0353L9266M6093l6308j10174K1805O3449j0917o4991Q826k2018
7300F3427k6632O6292J9059L7079L7154k8504k8362j8306K1056J8586k8012L368
7288A36205j515L8152l0423j5378L0493L9871l1953J3420J5436Q63j4303m860
7276A76008R573j7440O2232k7828n7390L9734J5760m2595m4430J8318J086L5084
7264A68112J1918p504j8727M3936L482l9363O793K3461Q9515o9583k8655J9147
7252B02532L416K1863n2305m4739Q0748L5252L0674o3081K1994k0631K831j4040
7240B04514O056M1872k9715N722L983l3342j3538L2971p021m788R9477j2739j0978
$$ y = [174952, 158204, 187509, 102616, 74578, 162570, 67814, 31906, 62601, 129758, 178190, 137745, 107330, 98043, 128396, 167662, 213755, 177447, 67273, 89078, 152527, 141610, 76619, 85445, 63427, 36795, 103087, 122146, 159225, 196379, 167875, 139513, 121207, 142263, 160849, 132837, 136205, 134690, 172842, 142419, 127041, 157534, 197405, 165452, 178872, 194308, 195171, 180868, 176008, 185581, 168141, 230373, 202545, 145155, 184889, 200649, 158054, 113624, 131942, 133028, 168112, 180030, 172526, 153799, 197735, 201217, 161854, 168647, 192108, 281623, 212040, 183385, 202532, 205948, 227811, 175506, 130767, 211515, 246767, 277441, 214360, 236354, 215723, 218554, 204514, 210570, 252442, 222727, 228449, 232432, 199090, 185552, 218523, 211502, 206714, 306191, 293452, 282474]
7227B82474j8517n714r372n6499j9535N7602Q5893J672l4983k9434n0094m8342
7215A55151N7139R3527L0639m1610k2065m903l3191k2917R540o261J248K2946
7203B39243j1479M1314m4622k6300P1114k2690m946j6052J1150K841j701l1542
7191B06330k3605l0927K7862L5390O3732J7997n118Q437L5433L0713j10875N058
7179B60427Q6656l3916Q02l2101R995N9773j8536o807L8942m1682m9842J6342
7167B90053M0709j743n326r400l2067L7993L1776k1896J1232K2820N9230k4124
7155C99257p1796L264K5484k0677j2459M4343k0278m1691M8611j3580K1018J1826
7143C73322k8325M2198o231J6364j3515j540M3347n3144r918O1306N0256J1311
$$ y = [282474, 263957, 258243, 248871, 192372, 172837, 230439, 316332, 318004, 283021, 253587, 203493, 155151, 212290, 305817, 336456, 294846, 272781, 267878, 234687, 211770, 221310, 215049, 216297, 239243, 227764, 269078, 224456, 198156, 269270, 246580, 241634, 225582, 236732, 239573, 237872, 206330, 182725, 151798, 179660, 215050, 278782, 296779, 291661, 300098, 335531, 366244, 255369, 260427, 347083, 313167, 313969, 281868, 291863, 351636, 333100, 326293, 365235, 323553, 273711, 290053, 330762, 329019, 323693, 314293, 282226, 320219, 351995, 330099, 341331, 364151, 423381, 399257, 327461, 330725, 356209, 335532, 323073, 367416, 347138, 305447, 354058, 340478, 361496, 373322, 344997, 387195, 380964, 397328, 383813, 382273, 425620, 372476, 362558, 423864, 474120, 485431]
7131D85431o9888j7873K2477j8185O1j713J429K3376L3668m4342j6514N195J8359
7118D21481m78J4328J6620k1190K3467n860K0536M8017O4521l2762l9538J1847
7106E20989n3992M8928l3367j8556P5201J2856l49p992M624m4130k4135Q148O7016
7093E55241M0032N8314k7175k6523L8575N7204l587n6371j6717N452P200Q838
7081F40483K7055R355K0670Q830K3300J0000L2724m4705K2381M6201L3088k5633
7069H03749k5184J3025j0175R930m4849Q9866O0061j5657o4404Q0204l8007j8559
7057H40000J7663P9208p325o5813N2090N5224J230m5903j6174O3999P105O0817
7045A042121M9804m038K9887j8477N7420N3172l6581j9431L159m889J51362m0971
$$ y = [485431, 415543, 397670, 420147, 401962, 402023, 400310, 401739, 425115, 458783, 414441, 397927, 403122, 421481, 421003, 435331, 451951, 430761, 454228, 448368, 468904, 516921, 581442, 548680, 509142, 520989, 466997, 515925, 482558, 464002, 539203, 552059, 551710, 543718, 548342, 504212, 480077, 488225, 555241, 595273, 653587, 626412, 599889, 638464, 695668, 692081, 635710, 618993, 624445, 631645, 640483, 667538, 676893, 697563, 706393, 729693, 739693, 772417, 727712, 750093, 796294, 829382, 803749, 778565, 791590, 781415, 791345, 746496, 836362, 896423, 880766, 816362, 896566, 858559, 840000, 857663, 936871, 929546, 863733, 915823, 971047, 972277, 926374, 910200, 974199, 981304, 1042121, 1091925, 1087887, 1117774, 1099297, 1156717, 1209889, 1173308, 1153877, 1157036, 1152147, 1303509, 1262538]
7033A262538k3968J3022K9868K3098j9484J3891M9970N8071L146o458R984N780
7021A419458P3324O7091l6524P6811L0377n667k313K0270L4307N4181Q9145j9786
7009A800674R524L8396L9964Q3415J4599R984L4466N2936K9559K8782K4772J1652
6997B178723O6821L729N8621L4390m5807L2672O9370P9133K6371N0980L4646J8245
6985B607894P9993K9000J38945j7180P260P1756L8545M1167L9475O4224K5412
6974C126491J3245P8753J16649K1828L4459O4182L0531J23605P6368j461l9410
6963C645240N5880M3760K2146P9323Q4216l24M0848P9425K5682L7298M0854J838
6951D156186P68R7916M3407k0757L651p642N2804j0601J14L7822q4097J9788l2008
$$ y = [1262538, 1238570, 1251592, 1281460, 1304558, 1285074, 1298965, 1348935, 1407006, 1410152, 1403694, 1413678, 1419458, 1492782, 1559873, 1523349, 1600160, 1630537, 1624870, 1622557, 1642827, 1677134, 1731315, 1820460, 1800674, 1810198, 1848594, 1888558, 1971973, 1986572, 1996556, 2031022, 2083958, 2113517, 2142299, 2167071, 2178723, 2245544, 2249273, 2307894, 2342284, 2296477, 2329149, 2398519, 2477652, 2504023, 2555003, 2589649, 2607894, 2687887, 2716887, 2855832, 2838652, 2845912, 2917668, 2956213, 2997380, 3036855, 3101079, 3126491, 3139736, 3218489, 3335138, 3356966, 3391425, 3455607, 3486138, 3609743, 3686111, 3684650, 3645240, 3701120, 3744880, 3767026, 3846349, 3930565, 3930241, 3971089, 4050514, 4076196, 4113494, 4154348, 4156186, 4156954, 4254870, 4298277, 4277520, 4281171, 4273529, 4326333, 4315732, 4315846, 4353668, 4269571, 4289359, 4257351]
6938D257351m107k0150j9351l6843n71r898n2691n7520n3777O489J7195r7152
6926C928975J6111p7742r0303o1415l0298j12598J1554o0900m0456J5099n3321
6915C444706l9233q8488o3489p6854r3103p4884l9360o5015j528l6050l3233n4020
6903B779449J8249o7194j53148o1849m4147j4021J2651o2410m444r1875m7718
6892B263543k57q0690o1827j4789k8697l3899n026j5353r1592K758j5717p0801
6880A847653j04925n1475l3850M627o5441j7020j5959J2682n445l0414j9208n1389
6868A469836k5354m1217K678m5056m4522j18655k998L5749M8845M1177j3167k8960
6856A278356l6890n9455l7513P351j8438M5319l7722n1020k6168p0956l1548J3342
$$ y = [4257351, 4253244, 4233094, 4213743, 4176900, 4176329, 4166431, 4113740, 4056220, 4002443, 4008932, 4026127, 3928975, 3945086, 3867344, 3777041, 3715626, 3685328, 3572730, 3584284, 3523384, 3482928, 3498027, 3444706, 3405473, 3316985, 3253496, 3176642, 3083539, 3008655, 2969295, 2904280, 2902752, 2866702, 2833469, 2779449, 2797698, 2730504, 2577356, 2515507, 2471360, 2457339, 2469990, 2407580, 2403136, 2311261, 2263543, 2263286, 2182596, 2120769, 2105980, 2077283, 2043384, 2038358, 2023005, 1931413, 1934171, 1918454, 1847653, 1742728, 1691253, 1657403, 1662030, 1596589, 1579569, 1563610, 1576292, 1570847, 1540433, 1521225, 1469836, 1444482, 1403265, 1405943, 1360887, 1316365, 1197710, 1194712, 1230461, 1279306, 1320483, 1307316, 1278356, 1241466, 1182011, 1144498, 1151849, 1133411, 1178730, 1141008, 1089988, 1063820, 992864, 961316, 974658]
6844I74658l554M1625l7182l5645j8807J2094K4405k1892m2886Q0303m8954n9431
6832H64734P902L5740o130o4581k3598M7598q925p1496j6101J1234R230q0982
6820G04625M7920m771K3916l3773M5500k747o442j06057o3921k9144L4640L919
6808F13665j1628o200p177l0492l429R3032J9776m4244k4913L7689K0645n2522
6796F04202m0120R9657k1998r2763l4855j1498M2637K899N424k702R981q106n8552
6783D94206J9060j635O980n8347L2421L6511L7687r382k6570p48l3481N8933j4954
6770E40681l0161j0437M3491k3559m1775m3946M3412l1751J8733q520R355k9241
6758D36282m8170K3170P043L1902o7244K4950N6214N4738l3438M3315j1169q1883
$$ y = [974658, 971104, 1012729, 975547, 939902, 921095, 933189, 957594, 935702, 892816, 973119, 924165, 864734, 872636, 908376, 902246, 837665, 814067, 861665, 852740, 781244, 765143, 776377, 785607, 704625, 752545, 747774, 771690, 737917, 783417, 780670, 774228, 668171, 604250, 575106, 609746, 613665, 602037, 595837, 588660, 558168, 554739, 647771, 667547, 623303, 598390, 636079, 656724, 604202, 564082, 663739, 641741, 548978, 514123, 502625, 545262, 548161, 553585, 550883, 560864, 552758, 494206, 513266, 511631, 518611, 460264, 492685, 529196, 566883, 557501, 530931, 530183, 496702, 555635, 540681, 510520, 500083, 543574, 520015, 478240, 434294, 477706, 445955, 464688, 456168, 465523, 436282, 388112, 411282, 418325, 450227, 382983, 407933, 464147, 518885, 485447, 528762, 517593, 435710]
6746D35710K1036N3894R968m4124l2N375L982q115l4783O410k0121l4848M2577
6733D36929O7975j4269k2111l1887L9645p718m340J1561J6057o3235L2576L9068
6721E00251n3102n3093K4537n117j8697Q1725m828l9884j7743N730j9087j2926
6709C87766n6214J6101Q0336Q440j2496j6331K8142l847K7367K6645j6258N417
6697D75068l9070m517M3527l6085m3128l2752k5698N1010J6422O3431j0277l8177
6685D19754J3715j9421J3639j3971n166k4141k2996N0331L1608l7690j4054P560
6673C99168K6203J494L7827k921k0245N5849J983l0564l8280r96K5749n7489K4403
6660D22181L8520K4726j3298J5272j4743q492O8668r3012o755L6729J5127N7975
$$ y = [435710, 456746, 510640, 520608, 476484, 476452, 481827, 485809, 477694, 442911, 449321, 429200, 394352, 436929, 504904, 490635, 468524, 436637, 476282, 468564, 464224, 475785, 491842, 428607, 461183, 500251, 447149, 394056, 418593, 413476, 394779, 476504, 471676, 431792, 414049, 419779, 400692, 387766, 331552, 347653, 427989, 436429, 423933, 407602, 435744, 431897, 459264, 485909, 469651, 475068, 435998, 431481, 475008, 438923, 395795, 363043, 337345, 388355, 404777, 468208, 457931, 419754, 433469, 414048, 427687, 413716, 408550, 384409, 361413, 411744, 443352, 405662, 391608, 399168, 425371, 426865, 464692, 461771, 441526, 497375, 499358, 468794, 430514, 429518, 455267, 397778, 422181, 460701, 485427, 472129, 487401, 472658, 464166, 532834, 439822, 433067, 469796, 484923, 542898]
6648E42898Q67m8356N7394J9956k6164M1611j0702o9624L3616Q672M0699L3611
6636F24478j0429K0803O3078o956M6739o4907j5080J5850n4847K0377N2117L5144
6624G26367n2484q63j2720M1662P8166k6255p4344J5257M2233o704K9776P289
6612G67380P677m6662k7949M8293J3180j6802o2854j2819J191m0925n447N7037
6600F81300J4326j9888M4789L201n7065l3227Q0871M0488p5846K2901j0074l5679
6588F56097l9062j9621n9409N0784k3374k5194p819N317K5290J383j0993k3571
6576E29828N0985k8635o9347N2749O1721m2753N1684l6528k2252P3636l8318K5182
6564F07952m9073J63J16515k5910p6457K474R690M9539J1160m0434k283K7897
$$ y = [542898, 543765, 495409, 552803, 572759, 546595, 588206, 577504, 507880, 541496, 550168, 590867, 624478, 614049, 634852, 697930, 690974, 737713, 672806, 657726, 673576, 618729, 639106, 691223, 726367, 673883, 673020, 660300, 701962, 780128, 753873, 679529, 694786, 737019, 730315, 760091, 767380, 775057, 728395, 700446, 748739, 761919, 745117, 682263, 669444, 670635, 629710, 624263, 681300, 695626, 675738, 720527, 723728, 666663, 633436, 714307, 754795, 678949, 701850, 691776, 656097, 617035, 597414, 538005, 588789, 565415, 540221, 532402, 537719, 563009, 564392, 553399, 529828, 580813, 552178, 482831, 535580, 597301, 554548, 606232, 569704, 547452, 621088, 582770, 607952, 558879, 559042, 675557, 649647, 573190, 575664, 585354, 634893, 646053, 605619, 603336, 631233]
6552F31233n1404l8286j2149k5037J4680o7526j8231M5383N1463J1988J2467Q407
6540E62988j540j284J3347k3579R1999l718l2463m1421n5580R5406n0636m7483
6528E06036N3298J9088N2199M623n527N8877J2344j3641K493L9021k5389P9494
6516G82916O0588o9703J3965j6640O283k6544K3466k7092L663k7510j034O7924
6504G90282L9906L6940l34K022L5791j2095m3062K0420K1729k543L0641J93J1124
6491I31014L1664j8904n6317q848J6285k2797j0q324o771K7767k1003j2277q986
6478H42493k852J3823n0398N9781l6816q9472L4794N9827K118j4721J1714M2356
6466H72647L6172r220l4108K8508j3870n3595l1035N0322j5216J6144O151j1069
$$ y = [631233, 579829, 541543, 529394, 504357, 519037, 451511, 433280, 478663, 530126, 542114, 554581, 562988, 561448, 560164, 573511, 549932, 641931, 638213, 605750, 564329, 508749, 604155, 553519, 506036, 559334, 578422, 630621, 635244, 629717, 688594, 700938, 687297, 689790, 728811, 703422, 782916, 843504, 773801, 787766, 771126, 777409, 750865, 774331, 747239, 750902, 723392, 722358, 790282, 830188, 867128, 866794, 868816, 904607, 892512, 849450, 869870, 891599, 889056, 919697, 919890, 931014, 962678, 943774, 887457, 878609, 894894, 872097, 872087, 863763, 856992, 884759, 863756, 851479, 842493, 839641, 853464, 803066, 862847, 826031, 736559, 771353, 831180, 833298, 818577, 830291, 872647, 908819, 899599, 865491, 893999, 880129, 826534, 795499, 845821, 830605, 846749, 852900, 841831]
6454H41831m693J5164j1289q628N2484J0598j5516m3204N2976M9824m8891P8436
6442I69092K2615p0373n9450M3622L6035M084k3856l6517L316K0913P4788J65
6430I84434M4927l5801m2263P7949N8724M449j9314P555O7134q567n6366J2988
6418A095849L2647m4350L1787L7365j434O515K4521o1917J2397Q5459j2418j4475
6406A191946k3283M5823K976P774m6949l7271J8458M5627P7784L2554K504j5139
6394A302804R485N6153J7147j5494k0483N9163K1269J784K1145k2430L6322Q4645
6382A551510J1626L3868L6361J2060K5142O9250M891o9000P1354M495p69N2032
6370A802820O7833M9532L8874O8840P0097j2702j5363J7206Q0704K8265M5793
$$ y = [841831, 837138, 852302, 841013, 832385, 884869, 895467, 879951, 836747, 889723, 939547, 890656, 969092, 991707, 921334, 861884, 905506, 941541, 945625, 921769, 885252, 888568, 909481, 984269, 984434, 1029361, 993560, 951297, 1029246, 1087970, 1092419, 1073105, 1080660, 1147794, 1139227, 1082861, 1095849, 1128496, 1084146, 1115933, 1153298, 1151864, 1158379, 1182900, 1120983, 1133380, 1218839, 1206421, 1191946, 1168663, 1214486, 1217462, 1225236, 1178287, 1141016, 1159474, 1205101, 1282885, 1315439, 1317943, 1302804, 1312289, 1368442, 1385589, 1370095, 1349612, 1408775, 1430044, 1431828, 1452973, 1430543, 1466865, 1551510, 1563136, 1597004, 1633365, 1645425, 1670567, 1739817, 1744708, 1675708, 1747062, 1751557, 1750788, 1802820, 1870653, 1920185, 1959059, 2027899, 2097996, 2085294, 2069931, 2087137, 2167841, 2196106, 2241899]
6359B241899O9822Q6463J00559K7620l0993M0337O8028J12298J24961O2136N1964
6348B955094P6301J28872K9531J36764J79140R9721P2263J49703J75862J59007
6338D162258J69924P7295J54282J63003J42596J34037J78324J23256J32927K14743
6328E652645K17244K18870J97462K30766K70913K88450K85558L18289L63576M34622
6318H478395M70336N24412N81648O02464O42363O80308P41151P83012Q09925P59950
6308A5073964P72273R53956J029925J281181J398811J643588K039370K325960
6300B6519028K902263L546023M057611L924945K921270J039039q45526j879685
6292D2184968k447984k166399j412358o66639J75338J044500J839142K284627
$$ y = [2241899, 2311721, 2398184, 2498743, 2526363, 2495370, 2535707, 2603735, 2716033, 2840994, 2903130, 2955094, 3031395, 3160267, 3189798, 3326562, 3505702, 3605423, 3677686, 3827389, 4003251, 4162258, 4332182, 4409477, 4563759, 4726762, 4869358, 5003395, 5181719, 5304975, 5437902, 5652645, 5869889, 6088759, 6286221, 6516987, 6787900, 7076350, 7361908, 7680197, 8043773, 8478395, 8948731, 9473143, 10054791, 10657255, 11299618, 11979926, 12721077, 13504089, 14314014, 15073964, 15846237, 16800193, 17830118, 19111299, 20510110, 22153698, 24193068, 26519028, 29421291, 32967314, 37024925, 40949870, 43871140, 44910179, 44064653, 42184968, 39736984, 37570585, 36158227, 35491588, 35666926, 36711426, 38550568, 40835195]
6284D0835195K192220J446492P49088K66568N64771J184162J948981K021205J279965
6275E2488647j37254j585848k505544k685825k044377j079651k31121J32292j52824
6266D2198495j082167j634530j816805j749500j047083j82760O23121J693542
6258C7002313K472486K700402J831217l4108k390000m010723m840381m725555
6250B8005651l990316l291745k612207k044913j664265j277963j167458r21169
6242A1035615q31327p14784n93873n96552m72242l81499m23954l96504l66630
6233F258250k18539k23729k40615k24347k72983j38597k86271k06369k18863j45428
6223D082509j57332j63943j02391p8486p9039r1198o9869j60382p2192j61238
$$ y = [40835195, 43027415, 44473907, 45222995, 45489563, 46054334, 47238496, 49187477, 51208682, 52488647, 52351393, 50765545, 48260001, 45574176, 43529799, 42450148, 42219027, 42351319, 42198495, 41116328, 39481798, 37664993, 35915493, 34868410, 34685650, 35308771, 37002313, 39474799, 42175201, 44006418, 43972310, 41582310, 37571587, 32731206, 28005651, 24015335, 20723590, 18111383, 16066470, 14402205, 13124242, 11956784, 11035615, 10204288, 9489504, 8895631, 8299079, 7826837, 7445338, 7021384, 6624880, 6258250, 6039711, 5815982, 5575367, 5351020, 5078037, 4939440, 4653169, 4446800, 4227937, 4082509, 3925177, 3761234, 3658843, 3580357, 3501318, 3410120, 3340251, 3179869, 3107677, 2946439]
6213B946439j13919j29893o0690o5911j24127o0183k674j04287k1308m8888j25183
6202B089376q9548l1329m445j6754o824j23679n1409l0824J4336p5451j8352j5225
6190A639872J3611k5998o1123j7769J5956m5459n9790k7912L6593m7427N983j9989
6178A406548m6591l1848M4361M960k2890m2345L9500L2036k1257K191j2868r7346
6166A254451p053M4387Q212R564q6546P104o1325p1720P2779M8969p3992l6678
6154A108152j10125N9159P3760p7058m9509j3626r959O5846R591p6492O0835q6997
6142I53577k5k6971o077M2590r694p03J6081q6011n571L5262K8706K3888r0359
6129H74693K648K6473M3205j7566m683Q5086O385K572l4461j8080J421o9317l244
$$ y = [2946439, 2832520, 2702627, 2641937, 2576026, 2451899, 2391716, 2389042, 2284755, 2263447, 2214559, 2089376, 1999828, 1968499, 1964054, 1947300, 1940476, 1816797, 1765388, 1734564, 1748900, 1673449, 1655097, 1639872, 1653483, 1627485, 1566362, 1548593, 1564549, 1519090, 1459300, 1431388, 1467981, 1420554, 1426537, 1406548, 1359957, 1328109, 1372470, 1377430, 1354540, 1312195, 1351695, 1383731, 1362474, 1364665, 1351797, 1254451, 1247398, 1291785, 1299997, 1309561, 1223015, 1230119, 1168794, 1097074, 1169853, 1218822, 1144830, 1108152, 998027, 1057186, 1130946, 1053888, 1004379, 990753, 980794, 1046640, 1056231, 979739, 1040574, 953577, 953552, 926581, 920504, 963094, 953400, 952697, 968778, 882767, 877196, 912458, 941164, 965052, 874693, 877341, 903814, 947019, 929453, 924770, 1009856, 1016241, 1018813, 984352, 966272, 967693, 898376, 895132]
6116H95132P7416J8642o0462k30N4212K1636o4600k8510l6332J6184L1660Q1590
6104A006338J2639O56L9434N7895o2857n5639j6417J1793l6090j0615j474J9445
6092I65108O9080j2712J7427p51l8037L9428M2065K9460J2220L8017n5213O0421
6080A166513j2098k8345k258N6933O1736K7787K5627J8244R9939n4712m0916l3090
6068A285360K070Q351q0165J2077O4464O4308k6323J1921K660j2037Q684Q8938
6056A430308k9927O059P6671L3535M5028K8258K8621j9401m1237q2823O679P1712
6044A553483J4262j2686L3221m3394J2703l6427L6676L4112n1919L0355P6707
6033A647093o9646N5023j4381j985j5543r523k5509J9778K9334K6190R308n893
$$ y = [895132, 972548, 991190, 930728, 930498, 984710, 1006346, 941746, 913236, 876904, 893088, 924748, 1006338, 1018977, 1019633, 1059067, 1116962, 1054105, 998466, 982049, 993842, 957752, 947137, 945663, 965108, 1034188, 1021476, 1038903, 1038152, 1000115, 1039543, 1081608, 1111068, 1123288, 1161305, 1106092, 1166513, 1154415, 1126070, 1123812, 1180745, 1242481, 1270268, 1295895, 1314139, 1414078, 1359366, 1318450, 1285360, 1287430, 1295781, 1215616, 1227693, 1292157, 1356465, 1330142, 1342063, 1344723, 1332686, 1341370, 1430308, 1400381, 1406440, 1483111, 1516646, 1561674, 1589932, 1618553, 1599152, 1557915, 1475092, 1481771, 1553483, 1567745, 1555059, 1588280, 1544886, 1557589, 1521162, 1557838, 1591950, 1540031, 1570386, 1647093, 1577447, 1632470, 1618089, 1616104, 1600561, 1591038, 1565529, 1585307, 1614641, 1640831, 1650139, 1644246]
6021A644246K3638O6179k427O630j9022P8647J1624j9694K305K8661M5997O7810
6009A934594K3729J9958M1698N0258j4731R795L9385N1504M4897Q745j1978L6612
5997B234466K4678r579Q2395Q6946N4511Q8411J58264P2659J9291J69M4278q0725
5985B775764j9251j9546Q7246l5922j0670N4509L4233p067J1471m2641n357N3609
5973B876378J24992O3419J37428J15240N6462K4110j4668P0238J0327k7004j17707
5962C319215q7888j9463n8057J0713m2117j4949J7516l1228O0178J2976p0594
5951C096302N7152O6676n9551n664N4522P7723P8777j217k3059j383p0388n3871
5939C216019n2698j15666o8967J1273k0754j04893q195k1829R7814j187l2818
$$ y = [1644246, 1667884, 1734063, 1731636, 1738266, 1719244, 1797891, 1809515, 1789821, 1792126, 1820787, 1866784, 1934594, 1958323, 1978281, 2019979, 2070237, 2055506, 2065301, 2104686, 2156190, 2201087, 2209832, 2197854, 2234466, 2259144, 2249565, 2331960, 2418906, 2473417, 2561828, 2720092, 2792751, 2812042, 2812211, 2856489, 2775764, 2756513, 2736967, 2824213, 2788291, 2777621, 2832130, 2866363, 2859296, 2870767, 2828126, 2822769, 2876378, 3001370, 3064789, 3202217, 3317457, 3373919, 3398029, 3383361, 3453599, 3463926, 3436922, 3319215, 3231327, 3211864, 3153807, 3164520, 3122403, 3107454, 3124970, 3093742, 3153920, 3166896, 3096302, 3153454, 3220130, 3160579, 3154915, 3209437, 3287160, 3365937, 3364720, 3341661, 3340278, 3269890, 3216019, 3163321, 3047655, 2978688, 2989961, 2969207, 2864314, 2856119, 2834290, 2932104, 2930917, 2898099]
5928B898099o5426L2214L4912N0901l0115j1604j4151J5282J0457J8934M4964
5917B984467J128L4083M52M557n0609J01707r1004j7669m6854N1391j4462r334
5905B947853L8925m2151K0952M9641K240j8704l4552Q4711O9891l9194L437R1744
5893C174793N2197K8124k4520j2652P0302j8844p250N0230K2468J4140L5512J07927
5881C492427L5213o2742o985J1688J8242Q6461P8956m0046k414N2458N9465J9978
5869C742701L2099J5410j2704N4828m6010P7752N1492K8631o584n1597J03977
5858C989995k421J1502P5440M9273N0812N7861K6350L6339P627j7807Q7001J20919
5846D492891Q5118j8773j2550M4048Q6712K7196R9851R2190P7700J8878l9294
$$ y = [2898099, 2832673, 2864887, 2899799, 2950700, 2920585, 2908981, 2894830, 2910112, 2920569, 2939503, 2984467, 2985595, 3019678, 3020130, 3024687, 2974078, 3075785, 2984781, 2967112, 2920258, 2971649, 2957187, 2947853, 2986778, 2944627, 2965579, 3015220, 3017460, 2998756, 2964204, 3048915, 3118806, 3079612, 3083049, 3174793, 3226990, 3255114, 3230594, 3217942, 3288244, 3269400, 3262150, 3312380, 3334848, 3348988, 3384500, 3492427, 3527640, 3464898, 3457913, 3469601, 3487843, 3574304, 3653260, 3613214, 3610800, 3663258, 3722723, 3742701, 3774800, 3790210, 3777506, 3832334, 3786324, 3864076, 3915568, 3944199, 3937615, 3886018, 3989995, 3987574, 3999076, 4074516, 4123789, 4174601, 4232462, 4258812, 4295151, 4302778, 4284971, 4371972, 4492891, 4578009, 4559236, 4546686, 4590734, 4677446, 4704642, 4804493, 4896683, 4974383, 4993261, 4953967]
5835D953967K9130J04542M4998R9804n302k042L1375M5749O7706N8657J20358
5824E548942Q3001P0820Q888J88035N1095Q0660J25521J20817J26663J27964J40793
5813F673199J45628J59861J70238J06903P3328J15827J13754K26137J35858J54909
5803H075642K03829J20325J36819J27508K72250K82550K02651J91816K20511K36591
5793A0070492K35829K72836K10487J83908K28201K88338L17611L22149L24944
5784A2454795L33343M04344L69830M41282M60118M68819M07213N24521O10544
5775A6474809O14705O84853P58798P92092P62619R42860J008885J035281J199912
5766B4274814J363866J528322J773404J962006J969414J894836K034722K257817
$$ y = [4953967, 4983097, 5087639, 5132637, 5232441, 5227139, 5225097, 5256472, 5302221, 5369927, 5428584, 5548942, 5631943, 5702763, 5711651, 5899686, 5950781, 6031441, 6156962, 6277779, 6404442, 6532406, 6673199, 6818827, 6978688, 7148926, 7255829, 7329157, 7444984, 7558738, 7784875, 7920733, 8075642, 8279471, 8399796, 8536615, 8664123, 8936373, 9218923, 9421574, 9613390, 9833901, 10070492, 10306321, 10579157, 10789644, 10973552, 11201753, 11490091, 11807702, 12129851, 12454795, 12788138, 13192482, 13562312, 14003594, 14463712, 14932531, 15339744, 15864265, 16474809, 17089514, 17774367, 18533165, 19325257, 20087876, 21030736, 22039621, 23074902, 24274814, 25638680, 27167002, 28940406, 30902412, 32871826, 34766662, 36801384, 39059201]
5758C9059201K549040L341606M186189M517447M433842L387193J465852n44617
5750F2395753j844543k359749k061740j189263l61723O57771J747027K510105
5742E9493638K626587K073748J138042M48394L66528Q52636J769610K836775L253526
5733G4859484K852138J636861L3008j348286j809123j385096o01894J14138K13595
5724G4564825l49572r90652j481734j537920j192540o69694R0664Q23854J686423
5715G0943654K477333K541643J965945L86110j392329k759093l414792l213766
5707F7534705k513444j767917j152605n38386o1950K06386K77998M50033N60622
5698F2995442N02395M92639N79932N99138Q27728J108584J404586J616061J929777
$$ y = [39059201, 41608241, 44949847, 49136036, 53653483, 58087325, 61474518, 62940370, 62395753, 60551210, 58191461, 56129721, 54940458, 54578735, 55236506, 56983533, 59493638, 62120225, 64193973, 65332015, 65780409, 66146937, 66999573, 68769183, 71605958, 74859484, 77711622, 79348483, 79381491, 78033205, 76224082, 74838986, 74237092, 74351230, 74564825, 74215253, 73224601, 71742867, 70204947, 69012407, 68342713, 68433377, 69257231, 70943654, 73420987, 75962630, 77928575, 78314685, 76922356, 74163263, 70748471, 67534705, 65021261, 63253344, 62100739, 61562353, 61500403, 61706789, 61984787, 62434820, 62995442, 63497837, 63990476, 64570408, 65169546, 65997274, 67105858, 68510444, 70126505, 72056282]
5689G2056282K486044L105421L730662M304491M562619M721736M688203M234540
5681A03889998L526047K790960K184042K289002K992598M274012O101927Q377728
5673A36426314J0663507J2470554J2513132R956057N639390R10353k881501m087589
5665A81610217l216954j344144O31020J322334R89834L54203j92176m49443L29222
5656A80034113J986429L970966O278030R401792J3095421J6381813J7506507J4388273
5648B63043344P414848n49533o899554j0050779r938662r506778r640110r961519
5640B13911257r784112r185766p883140o920465o808148o672558o006403m355503
5632A56295162j952619Q50002L473762N963071Q722439J1068228J1236590P528952
$$ y = [72056282, 74542326, 77647747, 81378409, 85682900, 90245519, 94967255, 99655458, 103889998, 107416045, 110207005, 112391047, 114680049, 117672647, 121946659, 128048586, 136426314, 147089821, 159560375, 172073507, 182029564, 187668954, 188579307, 185697806, 181610217, 178393263, 177049119, 177680139, 179002473, 179992307, 180346510, 180154334, 179704891, 180034113, 182020542, 185991508, 192269538, 201671330, 214766751, 231148564, 248655071, 263043344, 270458192, 269908659, 263009105, 252958326, 243019664, 233512886, 223872776, 213911257, 204127145, 194941379, 187058239, 180137774, 173329626, 166657068, 160650665, 156295162, 154342543, 155192545, 158666307, 164629378, 173351817, 184420045, 195656635, 203185587]
5624B03185587o4492q977971j5887614j9252682j8981936j6322828j3227947j0463255
5616A00006862q243363o548782n372252m548878m091616l647169l326616k845778
5608F1382408k406168j953535j600590j229794p55431m55832m70549p19669j130775
5599E0660065j410022j642929j639855j422075j032651o05944k39965J19661K84288
5590D3070573J96300M578l00157n41634o85776o78082p43100o41602m55640l69644
5580C8855816m77401o58744q95708j204164j383415j445302j508354j341319j164890
5571B8776519j020641p75739m95411l05271j45196r9865q194o4254j20082k33167
5561B5508699m60145o34406r05656r12709r42673r65206q69602q01513p87569
$$ y = [203185587, 203121095, 194143124, 178255510, 159002828, 140020892, 123698064, 110470117, 100006862, 91763499, 85214717, 79842465, 75293587, 71201971, 67554802, 64228186, 61382408, 58976240, 57022705, 55422115, 54192321, 53436890, 52981058, 52510509, 51790840, 50660065, 49250043, 47607114, 45967259, 44545184, 43512533, 42906589, 42666624, 42786285, 43070573, 43266873, 43271451, 42971294, 42429660, 41743884, 41065802, 40322702, 39681100, 39225460, 38855816, 38378415, 37719671, 36823963, 35619799, 34236384, 32791082, 31282728, 29941409, 28776519, 27755878, 26980139, 26484728, 26179457, 26034261, 25934396, 25926202, 25861948, 25741866, 25508699, 25048554, 24414148, 23508492, 22595783, 21653110, 20687904, 19818302, 19016789, 18229220]
5552A8229220p25268p37346n13725m67415m23155l14153k44439j60594k5522m6361
5542A4571242r3892j80713j93564l21524l17503l44175l18985k89953j69593l9602
5532A2301738k10911j79818j07448r0752k55502k27844k08493j63834j41235k00704
5522A0515197j77379p5213J2629K1761Q012k391N4953R5596J37361Q4309Q4962
5511A0759797N6507m767P7114R1167K2080L7351J2175n8129l895j2141L2230k5183
5499A0984306r991J8979N2266O9234Q6297J12859J19597J99025K35031K47383
5489A2114986K02081K99897L94632M19658L46877M97829L90627N21454N72610
5480A5760651M96482M12729K74989K10989J43183J41023J60443K63827K42609
$$ y = [18229220, 17503952, 16766606, 16252881, 15785466, 15362311, 15048158, 14803719, 14643125, 14617603, 14571242, 14477350, 14296637, 14103073, 13781549, 13464046, 13119871, 12800886, 12510933, 12341340, 12301738, 12090827, 11911009, 11803561, 11712809, 11457307, 11229463, 11020970, 10857136, 10715901, 10515197, 10337818, 10262605, 10275234, 10296995, 10305007, 10302616, 10357569, 10453165, 10590526, 10674835, 10759797, 10816304, 10811537, 10888651, 10979818, 11001898, 11039249, 11051424, 10993295, 10989400, 10977259, 11009489, 10984306, 10974315, 10993294, 11045560, 11114794, 11201091, 11313950, 11433547, 11632572, 11867603, 12114986, 12317067, 12616964, 13011596, 13431254, 13778131, 14275960, 14666587, 15188041, 15760651, 16257133, 16669862, 16944851, 17155840, 17299023, 17440046, 17600489, 17864316, 18106925]
5471A8106925L01050M38161N34334N50601O33420O80616P23111P76431P11270
5462B3455919P23007Q34589Q16646Q74935R07786Q94801J010325J066170J077975
5453C1662153J190416J249697J334785J567706J725102J845794J872364J985801
5445D4433818K054332J990385K095562K355113K518589K778306K955843L221936
5437F4403884L612990L900038M459422M851965N399904O113565O816457P714133
5429A07272358Q796498R714897J0741804J1653462J2036107J1598966J0202109
5422A82016201P832502M723362J467601j237089l133360m295400m868227m934884
5414A77570706m524137l745054k563621r91993O58641K510629M426069O235765
$$ y = [18106925, 18407975, 18846136, 19380470, 19931071, 20564491, 21245107, 21968218, 22744649, 23455919, 24178926, 25013515, 25830161, 26705096, 27612882, 28507683, 29518008, 30584178, 31662153, 32852569, 34102266, 35437051, 37004757, 38729859, 40575653, 42448017, 44433818, 46488150, 48478535, 50574097, 52929210, 55447799, 58226105, 61181948, 64403884, 68016874, 71916912, 76376334, 81228299, 86628203, 92741768, 99558225, 107272358, 116068856, 125783753, 136525557, 148179019, 160215126, 171814092, 182016201, 189848703, 194572065, 196039666, 194802577, 191669217, 187373817, 182505590, 177570706, 173046569, 169301515, 166737894, 165745901, 166404542, 168915171, 173341240, 179577005]
5406A79577005P657990Q751256R390724R407207Q879302P879746O270883L998072
5398B41812185Q71649k691502o227091r004194j0865652j1696476j1614001j1053289
5390A79531629j0064694q979660p538334o063640m362365k834524j382795k40354
5382A38065263R12029J748655K231908K125089J366310q1440k123202m312004
5374A39932608o203300p669831q590532q895217q940868q486576p864931p153256
5366G6128097o359370n608052m826983m173784l644859k974014k674957k275200
5358D3590878k000935j999957j981008j942800j738118j783892j597412j513010
5350B9033746j264905j316493j226827r77766r43512q53559p63565o88420o65132
$$ y = [179577005, 187234995, 195986251, 205376975, 214784182, 223663484, 231543230, 237814113, 241812185, 242683834, 239992332, 233765241, 224761047, 213895395, 202198919, 190584918, 179531629, 169466935, 160487275, 152948941, 146885301, 142522936, 139688412, 138305617, 138065263, 138977292, 140725947, 142957855, 145082944, 146449254, 146367814, 144244612, 139932608, 133729308, 126059477, 117468945, 108573728, 99632860, 91146284, 83281353, 76128097, 69768727, 64160675, 59333692, 55159908, 51515049, 48541035, 45866078, 43590878, 41589943, 39589986, 37608978, 35666178, 33928060, 32144168, 30546756, 29033746, 27768841, 26452348, 25225521, 24247755, 23304243, 22450684, 21687119, 20998699, 20333567]
5341B0333567n99412n41771n52567n61328m44227m59357m66669m26448l58756
5332A5923032k80966k22778k77695j72634p2642q0051m7755J54j6577o6826j9930
5321A4665332K1964j17878k63711l12454k84458l58025l94990l62331k70431k74225
5311A2048793k39430k09616j59968m1950m7148k1116J5304J21314J13411K17943
5301A1797537L12430K75042K95184K89924M10104M52825N74432P18297Q83784
5292A6009559J143371J295018J594166J843401J721676J866574J975441K264532
5284B9713738K425032J277060p21329k565332l710192l691202k978977k305832
5276A7442966j818086j446559j131538q67835p12964o19809m77635l50892k79309
$$ y = [20333567, 19734155, 19192384, 18639817, 18078489, 17634262, 17174905, 16708236, 16281788, 15923032, 15642066, 15419288, 15141593, 14968959, 14896317, 14816266, 14768511, 14768665, 14752088, 14685262, 14665332, 14687296, 14569418, 14305707, 13993253, 13708795, 13350770, 12955780, 12593449, 12323018, 12048793, 11809363, 11599747, 11439779, 11397829, 11350681, 11329565, 11344869, 11466183, 11579594, 11797537, 12109967, 12385009, 12680193, 12970117, 13380221, 13833046, 14407478, 15125775, 16009559, 17152930, 18447948, 20042114, 21885515, 23607191, 25473765, 27449206, 29713738, 32138770, 33415830, 32694501, 30129169, 26418977, 22727775, 19748798, 17442966, 15624880, 14178321, 13046783, 12178948, 11465984, 10846175, 10368540, 10017648, 9738339]
5267I738339j44642m8777k1542N7589J72739J75837K52733L53840N11333N98707
5257A1646156N44347M15205J19700k58004n24088o60058p90732p27662n55405
5248I209459n76334n19048m07046l16996k38338k43585j73900k02299k29378j43215
5238F159320q5788o3924l8922m8711j5348l7512j069O1100O1731R6089J46385
5227F233351J79329K13906K64496R9754N3614p4551j58067j43121k70790k05619
5217F192302k29838j93857j89323j54073m9055m9419q130K114K5443k0645j02081
5206E223438p388K07q605R4q8811q4895m8095q4270K0534j8624L654k4099k3044
5193D860096Q776M0399P8966J20407O6336L9813Q8167Q7899R8744O7492J20930
$$ y = [9738339, 9593697, 9544920, 9523378, 9580967, 9753706, 9929543, 10182276, 10536116, 11047449, 11646156, 12190503, 12605708, 12725408, 12467404, 11943316, 11283258, 10492526, 9764864, 9209459, 8633125, 8114077, 7707031, 7390035, 7151697, 6908112, 6734212, 6531913, 6302535, 6159320, 6073532, 6009608, 5970686, 5921975, 5906627, 5869115, 5868046, 5929146, 5990877, 6086966, 6233351, 6412680, 6626586, 6891082, 6990836, 7044450, 6969899, 6811832, 6668711, 6397921, 6192302, 5962464, 5768607, 5579284, 5425211, 5376156, 5326737, 5318607, 5320721, 5346164, 5325519, 5223438, 5216050, 5216257, 5207652, 5207746, 5118935, 5034040, 4985945, 4901675, 4922209, 4903585, 4907239, 4883140, 4860096, 4868872, 4909271, 4988237, 5108644, 5174980, 5214793, 5302960, 5390859, 5489603, 5557095, 5678025]
5182E678025J24056J01258J63249J61906J03817J09850J27711J32666J16026J14222
5172F932786O870K4741M7131R1055K8350q102M9165P6490J28679J60659J86264
5161G724088K09390K28952K54373L54261L51933L79718M32244M38711L04560M30377
5151A1108607L62024K37307J99282K65515K02742K10015K34286K65335L15914
5142A3401027L81019L28051L55880N29956N07076N03935O86151Q12904R84313
5133A8490312J174760R31482O33892Q24184R67934J155321J191824J345159J582845
5124B8297713J903275K190664K602108K954353L305826L861791M864817O196930
5116E6177477O825802O412333M430511P41799k092732l492829m201653l123316
$$ y = [5678025, 5802081, 5903339, 6066588, 6228494, 6332311, 6442161, 6569872, 6702538, 6818564, 6932786, 6939656, 6964397, 7011528, 7102583, 7130933, 7122831, 7171996, 7248486, 7377165, 7537824, 7724088, 7933478, 8162430, 8416803, 8771064, 9122997, 9502715, 9934959, 10373670, 10678230, 11108607, 11470631, 11707938, 11907220, 12172735, 12375477, 12585492, 12819778, 13085113, 13401027, 13782046, 14110097, 14465977, 14995933, 15503009, 16006944, 16693095, 17505999, 18490312, 19665072, 20596554, 21230446, 22054630, 23022564, 24177885, 25369709, 26714868, 28297713, 30200988, 32391652, 34993760, 37948113, 41253939, 45115730, 49980547, 56177477, 63003279, 69415612, 73846123, 74587922, 72495190, 69002361, 64800708, 61677392]
5108F1677392j573812k97488J075046J813094J853513J701496J645659K252869
5100G0147769L239593M673286N918437P634566R609209J1248120J4873318J9611881
5092A46956179K3836020K4676379J6360159N89669j5039439k4439110k8789761
5085A44150096k5449904j9753375j5853256j2286057r454166p342898n845266
5078D8165174m922140m136357l483489k891689k494038k196020j808240j675317
5070B4557884j564895j407845j102692r59779r50950r80517r28227q80530p19417
5061A5063032p21554o70860o31821n31639n18385m15517m32355l61299m63188
5052A0316414l59314l87114l51581l41591k61145k56426k48499k55423j98042
$$ y = [61677392, 60103580, 59806092, 60881138, 62694232, 64547745, 66249241, 67894900, 70147769, 73387362, 78060648, 83979085, 91613651, 101222860, 112470980, 127344298, 146956179, 170792199, 195468578, 211828737, 212418406, 197378967, 172939857, 144150096, 118700192, 98946817, 83093561, 70807504, 61353338, 54010440, 48165174, 43243034, 39106677, 35623188, 32731499, 30237461, 28041441, 26233201, 24557884, 22992989, 21585144, 20482452, 19522673, 18571723, 17591206, 16662979, 15782449, 15063032, 14341478, 13670618, 13038797, 12507158, 11988773, 11573256, 11140901, 10779602, 10316414, 9957100, 9569986, 9218405, 8876814, 8615669, 8359243, 8110744, 7855321, 7657279]
5043G657279k40283k10867k27058k63542k36751j80092j71024k26057k23493p6128
5033E601984j45742j49095j67289j27076q0998j06470n8328k2517m8229p4565
5023D621675j8437J3290o922r6001p0589k7219p8959j03132l9083q1486m0580
5012D072557j4912j12053o4418k577k4950K4858l750l9137M6775O684O9208J20883
5000D079168P6030P632R3941J25898J51302J76006J83470R0717K84161L19932
4990E588257K99501N39772N79498N59062P00113P96830R29879J094592R80633
4981A2068137O88912J61715n26091r23855j259271j451096j172505r43153o85568
4972E957225o18002m87094l72266k73314k29331l02327k27653j95073j55043j24653
$$ y = [7657279, 7416996, 7206129, 6979071, 6715529, 6478778, 6298686, 6127662, 5901605, 5678112, 5601984, 5456242, 5307147, 5139858, 5012782, 4931784, 4825314, 4766986, 4744469, 4696240, 4621675, 4603238, 4616528, 4609606, 4513605, 4443016, 4415797, 4336838, 4233706, 4194623, 4113137, 4072557, 4057645, 3945592, 3881174, 3878597, 3853647, 3878505, 3874755, 3835618, 3882393, 3889077, 3958285, 4079168, 4155198, 4162830, 4256771, 4382669, 4533971, 4709977, 4893447, 4984164, 5268325, 5588257, 5887758, 6427530, 7007028, 7566090, 8266203, 9063033, 9992912, 11087504, 12068137, 12757049, 12918764, 12392673, 11468818, 10209547, 8758451, 7585946, 6642793, 5957225, 5339223, 4852129, 4479863, 4206549, 3977218, 3674891, 3447238, 3252165, 3097122, 2972469]
4962B972469j23574j36967k7633j21965j22633j04608k1478k8260m2914m0941
4952B201496o3714j5986k7283p6964j03534l2448o1747n8887M696n8849P761N3757
4940A768298r7225J8499j01593R491L7556J432k9044M8233P0295K5159J6074o8819
4928A698356l5794K1462O3295N2542K5869m6738J4944P7238m6592j7262J228P4327
4916A882875N5963N5484L6008l658K9313J16015L2841o3494m6248j3544P0180
4905B151735P2446M424O3333N2745R9296K8824P6447J51861J4070P8660K11691
4894C005532J10159J64424J54363J32636K20228K24928K02071J32937J80211K10524
4884D738013L37422L20227L46178M41924M93612N66203N22744O30074Q03903R67798
$$ y = [2972469, 2848895, 2711928, 2684295, 2562330, 2439697, 2335089, 2313611, 2285351, 2242437, 2201496, 2137782, 2121796, 2094513, 2017549, 1914015, 1881567, 1819820, 1760933, 1765629, 1706780, 1714541, 1768298, 1671073, 1689572, 1587979, 1597470, 1635026, 1636458, 1607414, 1655647, 1725942, 1751101, 1767175, 1698356, 1662562, 1684024, 1747319, 1799861, 1825730, 1778992, 1793936, 1871174, 1824582, 1807320, 1808548, 1882875, 1938838, 1994322, 2030330, 2026672, 2055985, 2172000, 2204841, 2141347, 2095099, 2081555, 2151735, 2224181, 2228605, 2291938, 2344683, 2443979, 2472803, 2549250, 2701111, 2715181, 2793841, 3005532, 3115691, 3280115, 3434478, 3567114, 3787342, 4012270, 4214341, 4347278, 4527489, 4738013, 5075435, 5395662, 5741840, 6183764, 6677376, 7243579, 7766323, 8396397, 9200300, 10168098]
4874A0168098J319654J771592K060939K062688J377595K34911o76972j322058
4866A6996447j796611j925235j765035j656564j465057j222625q59365p99204
4858E506751n92496n20209m54332l13679l69596k07497j80753j43528j63858j92080
4848B368723p8135r7470n0944n9835j14894r4260l0587q3246j17324m8729p2574
4837A520725m9343O9619J9339o0479l8327K5190M8855O149j257p4812o3755q4987
4825A316917p4255n2221j0063j6175o7203q4134l7681J5692l4527m789m3863l9757
4813H67941J7940M3779J5711j00487k8730J8598l7224J1165K3332O7111r701R4751
4801I84186P2323l6220L1925m4721q4032m2793l922L6351m0011o604K710j6377
$$ y = [10168098, 11487752, 13259344, 15320283, 17382971, 18760566, 18995477, 18318505, 16996447, 15199836, 13274601, 11509566, 9853002, 8387945, 7165320, 6305955, 5506751, 4914255, 4394046, 3939714, 3626035, 3256439, 3048942, 2868189, 2724661, 2560803, 2368723, 2290588, 2193118, 2142174, 2082339, 1967445, 1873185, 1842598, 1759352, 1642028, 1593299, 1520725, 1471382, 1541001, 1560340, 1499861, 1461534, 1486724, 1535579, 1541728, 1540471, 1465659, 1401904, 1316917, 1242662, 1190441, 1180378, 1164203, 1097000, 1012866, 975185, 990877, 956350, 951561, 907698, 867941, 885881, 929660, 945371, 844884, 816154, 834752, 797528, 808693, 832025, 899136, 889435, 984186, 1056509, 1020289, 1052214, 1007493, 923461, 880668, 876746, 913097, 873086, 866482, 869192, 852815]
4789H52815K0163K636j2708n110J5332k1808k0746M4343P9448l3224O8234N4728
4777A044103K5447J30176J26273J50889Q3820j9077j17318q9737j31821q0756
4767A121999j45618j29015j547n0287O260q8010l8724K2965r8080L872l8959k5177
4755E39679m083P6847J8249m8003j0139l1878L2766M891p4959o1850L9323j1571
4743D69272J5726n7635r976j7661L0428J5964m4126P3178L548j5615L8335k2432
4731D79006j919N3156K2748l6447M5596j745p336M3054m6585n4300p1021J6405
4719D40612K2700N2594J1548o1560k783K0562j0670j1427K6628q324L1839n1767
4707D59952l7199N5121k5816k9152r334J2940k2373L1966O0761P1421J5612k9568
$$ y = [852815, 872978, 875614, 862906, 857796, 873128, 851320, 830574, 874917, 954365, 921141, 989375, 1044103, 1069550, 1199726, 1325999, 1476888, 1560708, 1541631, 1424313, 1334576, 1202755, 1121999, 976381, 847366, 845819, 795532, 801792, 713782, 675058, 698023, 599943, 603815, 564856, 539679, 535596, 612443, 630692, 582689, 572550, 540672, 573438, 578329, 503370, 441520, 480843, 469272, 484998, 427363, 417387, 399726, 430154, 446118, 401992, 475170, 478718, 463103, 501438, 479006, 477087, 530243, 552991, 516544, 562140, 560395, 553059, 596113, 549528, 495228, 424207, 440612, 463312, 515906, 527454, 465894, 463111, 483673, 473003, 461576, 488204, 479880, 511719, 459952, 422753, 477874, 452058, 422906, 413572, 426512, 404139, 436105, 496866, 568287, 583899, 554331]
4695E54331l0579o589K1904n5446Q470N803l0969o607n7821M6692L2683j8358
4683D63514l7253N0909M9457n561j0114j0662N5001k4879K3891m0180l0275J5405
4671D99253j1251J5345L7101M7501K1072j01511k7434O510J2112k1453M2961m5561
4659D74645o857l5990k4423k5909K6872P7711L9172J1099q828j4938o2274m8998
4647D01282Q144K3426j4692J08717l1340p7871R90J2667q862m8918j4599J8257
4635C77201o9244K4177J2031K6324J00286M4820o0605n2938J9168L5507q42m828
4623D51057j518q924o240K9026l9244r266P1435j1684k8258j1429K4984J1230
4611D71169m0552k4310K9802L5320l309k7159o306l2838l3194k576J2697o5305
$$ y = [554331, 523752, 517163, 539067, 483621, 492091, 497894, 466925, 460318, 402497, 449189, 481872, 463514, 426261, 477170, 526627, 521066, 510952, 500290, 555291, 530412, 554303, 514123, 483848, 499253, 488002, 503347, 540448, 587949, 609021, 507510, 480076, 486586, 498698, 477245, 520206, 474645, 467788, 431798, 407375, 381466, 408338, 486049, 525221, 536320, 527492, 512554, 450280, 401282, 409426, 432852, 418160, 526877, 495537, 417666, 418656, 431323, 422461, 373543, 358944, 377201, 307957, 332134, 344165, 370489, 470775, 515595, 454990, 402052, 421220, 456727, 455885, 451057, 449539, 440615, 434375, 463401, 424157, 414891, 486326, 474642, 446384, 434955, 459939, 471169, 430617, 406307, 436109, 471429, 468120, 440961, 434655, 401817, 368623, 366047, 378744, 313439]
4599C13439K9636N2565r1494O2186L6616K6405L9954P583o3531k1326J4552j3129
4587C93456N8301j4894j5601L8749j6591j7977K9285m59o0449P6464J4774l5935
4575D49123J1453n128J8355j9735P667K2632K9660L7747K894R556j8837l383K1896
4562E63900l507m0638l523N7893j4382K4493k3884K1597K658R976N2750m7930
4550E99403o6012L1110j3727q735j5738j1634O850n4345j6682n910K5625K661
4538D72866k9004l1257J4587N0752l0844m8779k003j8719N5641J3085j0011m5588
4526C90726L5972N9389N90l6446k7512R550o7963Q6699J183l8123M5840L705L5510
4513D99120k0843k7599r141K7007M8642Q55K5942k5102k6931L7198k8198l355
$$ y = [313439, 343075, 395640, 304146, 366332, 402948, 429353, 469307, 476890, 413359, 392033, 406585, 393456, 451757, 436863, 421262, 460011, 443420, 425443, 454728, 454269, 393820, 470284, 485058, 449123, 460576, 455448, 473803, 454068, 461735, 484367, 514027, 551774, 554668, 564224, 545387, 542004, 563900, 560393, 519755, 516232, 574125, 559743, 584236, 560352, 581949, 584607, 594583, 647333, 599403, 533391, 564501, 550774, 542039, 526301, 514667, 521517, 467172, 450490, 444580, 470205, 472866, 443862, 412605, 427192, 477944, 447100, 398321, 396318, 377599, 433240, 446325, 436314, 390726, 426698, 486087, 486677, 450231, 422719, 432269, 364306, 451005, 452188, 414065, 459905, 463610, 499120, 478277, 450678, 441537, 468544, 517186, 518041, 543983, 518881, 491950, 529148, 500950, 497595]
4501D97595O222N1441M4444K4914n9535p4552J0529Q0028L3202m2431n6661O6788
4489E81984j4643L1331j846k9756K6509j5419k407m7373Q5473M4687m2337K7318
4477F43521L0938m9553R024m1480K5665K2120K7274K5024M8825j1294k4145O62
4465G06581o2422O896R6141J0628K9716M354J1350q3472N101m6407O9404K5163
4453G73033j631M5155j5453q836k39Q0788N024j1337j5715j3872l1554l9779j4433
4440G51151P0694j8907L3437Q7172P0139m4836k9772P1251j2921l3308J2260L2946
4428I89306J916p6679K2037M2775K5970K4207M3521j585N0287j0934J7060q198
4416A119683L9500O1132N6312p2811k2070J9837n7894J4162Q5933j7170J0683
$$ y = [497595, 503817, 555258, 599702, 624616, 565081, 490529, 501058, 581086, 614288, 571857, 515196, 581984, 567341, 598672, 596826, 567070, 593579, 578160, 575753, 528380, 613853, 658540, 616203, 643521, 674459, 624906, 633930, 592450, 618115, 640235, 667509, 692533, 741358, 730064, 705919, 706581, 644159, 651055, 747196, 757824, 787540, 791894, 803244, 719772, 724873, 678466, 747870, 773033, 771402, 816557, 801104, 792268, 792029, 872817, 877841, 866504, 850789, 836917, 805363, 765584, 751151, 821845, 802938, 836375, 923547, 993686, 948850, 919078, 990329, 977408, 944100, 956360, 989306, 991222, 914543, 936580, 979355, 1005325, 1029532, 1073053, 1071468, 1121755, 1110821, 1127881, 1119683, 1159183, 1220315, 1276627, 1203816, 1181746, 1201583, 1143689, 1157851, 1243784, 1226614, 1237297]
4405A237297O1733j2110k205k0671L1061L0818N9867l4352l919L0744J7380m5973
4393A349670l4623M0826M2111K6214K5953R2049n924n6551N4889M0167k7392Q586
4381A555975R193K5888o738j3472M7743L5611O2091J5190N8125n2638m3034J3823
4369A707757K5961P0375J4287Q431K0627o99J9206J2277j2971l9328j0838m025
4357A811060Q7296P9469J6465Nl3184r40L8861K8557K7985l1638N3538M615o770
4344B075319j0648j8373K9340r500L4273J3952j5470M2247j0110p1596M4854O598
4332B110886j6584L8948l358L5643J4329j9425M314J2240j0289o1561R301j9228
4320B095216K3008m518j5263j229l8155m3441K8870J6152o682J2553k8081l2351
$$ y = [1237297, 1299030, 1286920, 1284715, 1264044, 1295105, 1325923, 1385790, 1351438, 1347519, 1378263, 1395643, 1349670, 1315047, 1355873, 1397984, 1424198, 1450151, 1542200, 1536276, 1479725, 1534614, 1574781, 1547389, 1555975, 1565168, 1591056, 1584318, 1570846, 1618589, 1654200, 1716291, 1731481, 1789606, 1736968, 1693934, 1707757, 1733718, 1804093, 1818380, 1826811, 1847438, 1846739, 1865945, 1878222, 1865251, 1825923, 1815085, 1811060, 1898356, 1977825, 1994290, 1994295, 1961111, 1960171, 1999032, 2027589, 2055574, 2023936, 2077474, 2082089, 2075319, 2064671, 2046298, 2075638, 2066138, 2100411, 2114363, 2098893, 2141140, 2131030, 2059434, 2104288, 2110886, 2094302, 2133250, 2129892, 2165535, 2179864, 2160439, 2164753, 2176993, 2166704, 2105143, 2114444, 2095216, 2118224, 2113706, 2098443, 2097214, 2059059, 2015618, 2044488, 2060640, 2053958, 2066511, 2038430, 2006079]
4308B006079P831o8947j545j5126p550m7758K5555J7168k6027j430q4571O0138
4296A863817j461k0252Q940n1057N2124m0152o4892k7208l5035j1275j7977L7730
4284A693302n852K4855J1976L1938l7355j681J6438m182m0760p7038R815J3572
4272A635028L1826k8332o3504q0604j5864J8287j3808k762j9917p7976J5604o0625
4260A337353q2040k7571o778M2415l2317J695L717j2921k2676k856j4206M4122
4248A227937m2244m3892L5242l7672m370j0479l0842l626L7854M2804j1762r5519
4236A063431m2768M1143j5185J710k4894M6331n983L4952L4988j006j8782J1556
4224A125493L396j2072l8255o2878L3734k2146K4287m5493o492J749M1444O277
$$ y = [2006079, 2013910, 1944963, 1943418, 1928292, 1920742, 1872984, 1898539, 1915707, 1889680, 1888250, 1803679, 1863817, 1862356, 1842104, 1851044, 1799987, 1852111, 1811959, 1747067, 1719859, 1684824, 1673549, 1655572, 1693302, 1687450, 1712305, 1724281, 1756219, 1718864, 1717183, 1733621, 1729439, 1688679, 1611641, 1621456, 1635028, 1666854, 1638522, 1575018, 1494414, 1478550, 1496837, 1483029, 1480267, 1460350, 1382374, 1397978, 1337353, 1255313, 1227742, 1220964, 1263379, 1231062, 1232757, 1236474, 1223553, 1200877, 1198021, 1183815, 1227937, 1185693, 1141801, 1177043, 1139371, 1135001, 1124522, 1093680, 1090054, 1127908, 1170712, 1158950, 1063431, 1020663, 1061806, 1046621, 1048331, 1023437, 1069768, 1063785, 1098737, 1133725, 1132719, 1113937, 1125493, 1128889, 1116817, 1078562, 1015684, 1049418, 1027272, 1051559, 1006066, 999574, 1001323, 1042767, 1049044]
4212A049044K7157p873J7740L9263k3217n5296o6247N8490J2279O8640m6314L0980
4200A104646N6661n2189K2005M7753n351L4261M6513K001P5863R3304R1984K2574
4188A540025K5322j9235r567J9152r2614j38660J6259r3016q5579M4883q4018
4177A122952m4685m4224n9710l1099n2121J7827J7958J9862R95j8184m5012m6135
4165H38424K6300J9953k819M2678K8453m3892j0108L375j4216k483k3113k640
4153H59912P642j8356O4894L8046o5870j824M9199O224M259M056p742j9186p1926
4140H49328k257M1797k1829K5584r053k8626K1626k4038r873q124p1915k832K5094
4127G84882N0264K0391P216j1476l0534L7934K3586J1935K662J960M9032K1940
$$ y = [1049044, 1076201, 1068328, 1086068, 1125331, 1102114, 1046818, 980571, 1039061, 1051340, 1119980, 1073666, 1104646, 1161307, 1109118, 1131123, 1178876, 1173525, 1207786, 1254299, 1256300, 1332163, 1425467, 1517451, 1540025, 1565347, 1546112, 1536545, 1555697, 1463083, 1324423, 1340682, 1247666, 1162087, 1206970, 1122952, 1078267, 1034043, 974333, 943234, 891113, 908940, 926898, 946760, 947755, 929571, 884559, 838424, 864724, 884677, 881858, 924536, 952989, 909097, 898989, 902364, 888148, 885665, 862552, 859912, 867554, 849198, 914092, 952138, 886268, 884444, 933643, 939867, 944126, 948182, 940440, 921254, 849328, 847071, 888868, 867039, 892623, 883570, 854944, 876570, 852532, 842659, 834535, 762620, 759788, 784882, 835146, 855537, 862753, 851277, 820743, 858677, 882263, 894198, 896860, 898820, 947852, 969792]
4115I69792J6767m4269j4877M7686j8252m7943K0792k5830R932O217N4641M050
4103I78706j6550m7432R4380k7467l0296K2494Q0811O466p702j3157k9116N0626
4091A061763K0299P8649L7896Q1775O3378Q7117K5182M3221N537r3747k0170k6030
4079A364870l0866k3864j89518N882m7189r3092r637j4482k7311J1875J6801r417
4067I54052m4460k9687k9130R0552n0199l0400n504M063J793r128Q419q093j1006
4054H41272L4073o1630P883L9750P8986p5490j5964J4683k4212M0800m6520p19
4042H32912j6554k6352j7370N0432K4167j7509l3004j9537o7821K7590k8015J4267
4030G23206j7837M5616J4357n3440l2749M1810L219K8270L8849q0451n3074J1710
$$ y = [969792, 986559, 942290, 927413, 975099, 956847, 908904, 929696, 903866, 913798, 920015, 974656, 978706, 962156, 914724, 1009104, 981637, 951341, 973835, 1054646, 1061112, 1053410, 1040253, 1011137, 1061763, 1082062, 1160711, 1198607, 1280382, 1343760, 1430877, 1456059, 1499280, 1504817, 1411070, 1390900, 1364870, 1334004, 1310140, 1120622, 1126504, 1079315, 986223, 976586, 962104, 934793, 946668, 963469, 954052, 909592, 879905, 850775, 941327, 891128, 860728, 855224, 859287, 861080, 851952, 860371, 852278, 841272, 875345, 813715, 821598, 861348, 940334, 864844, 848880, 863563, 839351, 880151, 833631, 832912, 816358, 790006, 772636, 823068, 847235, 829726, 796722, 777185, 709364, 736954, 708939, 723206, 705369, 750985, 765342, 711902, 679153, 720963, 724182, 752452, 791301, 710850, 657776, 669486]
4018F69486N9238J8224K8153l2259k3541o5231J0041o21Q072N1474o052j8190
4006F98794n7106n8896M9490j2560o7223j8582M6179K6647k1343m9950K0450P833
3994E63733j5065M249j2355j648J101M2000K1753J1318o068r540k9710J7219j9216
3981E67771R589m2293N3508J5284j2502l8243m3314l5924L525M470K7159j4018
3969D95012m411m6714k428o450j8453R534O1766k2157o2198J7613O393L3836k9540
3956D31803j2644l3293k1172K5215j5117P8194o2314R446R8672o3387k3665jJ0827
3943D22564m7045k8486l0052J2011Q8204J9264N276p6174o2973L8281L8520j3550
3931C65840j7083L4275J6659o4053J8969k5087K3507J0554l1812L1192l1505L9495
$$ y = [669486, 728724, 746948, 775101, 742842, 719301, 654070, 664111, 663490, 671562, 723036, 716984, 698794, 641688, 582792, 632282, 619722, 552499, 533917, 580096, 606743, 585400, 535450, 555900, 563733, 548668, 552917, 540562, 538914, 540015, 582015, 603768, 615086, 609018, 599478, 569768, 586987, 567771, 577360, 535067, 588575, 603859, 591357, 553114, 509800, 473876, 477401, 481871, 509030, 495012, 490601, 443887, 441459, 435009, 416556, 426090, 487856, 465699, 403501, 421114, 427507, 461343, 431803, 419159, 385866, 364694, 389909, 374792, 452986, 390672, 400118, 498790, 435403, 411738, 411737, 422564, 375519, 347033, 316981, 328992, 417196, 436460, 441736, 365562, 302589, 340870, 379390, 365840, 348757, 383032, 399691, 335638, 354607, 329520, 353027, 363581, 331769, 362961, 331456, 370951]
3919C70951j6703k7301k7542j4377N6953l395l523P6201J705o2811o3084N8465
3907C45539l7168j7272n96L5417j9730l9385O2898K9618m8030j220P7681m2189
3895C45563k5784M5028l969m8887N3393m3953m8814J042j4305O2930N752M8522
3883C76518k7283N5648q917p2200N6265j0521N936L7495l4128l0360n437k0900
3871C22116l1988L9559J1093M0221N6638m664o4918k4021K2254J3442K5334J8507
3859D23573k0990N6417j3688l4771l0515J5882K4524P5288o9419l7738J2736L8852
3847D40151L0150m2709j6703k8790Q937l4349N949P5965L95n3677K6729j835m8557
3834C61656K6506N2733k7850J8353J0180K4656J0806m246l5438M3048O3840l0288
$$ y = [370951, 354248, 326947, 299405, 285028, 341981, 338586, 335063, 411264, 412969, 350158, 287074, 345539, 308371, 291099, 290503, 325920, 306190, 266805, 329703, 359321, 311291, 310071, 387752, 345563, 319779, 364807, 360838, 311951, 365344, 321391, 272577, 273619, 259314, 322244, 327996, 376518, 349235, 404883, 395966, 323766, 380031, 369510, 375446, 412941, 378813, 348453, 343016, 322116, 290128, 329687, 340780, 381001, 437639, 432975, 368057, 344036, 366290, 379732, 405066, 423573, 402583, 459000, 445312, 410541, 380026, 395908, 420432, 495720, 426301, 388563, 401299, 440151, 470301, 427592, 410889, 382099, 391036, 356687, 362636, 438601, 438996, 385319, 412048, 410213, 361656, 388162, 440895, 413045, 431398, 441578, 466234, 477040, 472794, 437356, 480404, 544244, 513956]
3822E13956K5232P0134n6737n9902K0804J7771J107k6371l0143j5944N5424j0162
3810E05169m3354j8231l4715O0924j4135k465P4546M5651J8675N2862j111M5236
3798F89052N0888k7089r42R528k5741P3066N6127L320n4825K5798K7114j1413
3786H14883l4970M0738m8422m9442J3470M0269J3979l8223L9375J9017L37P117
3774H18128j3836N572O1617j3220n471K4665M3571Q0681l8250k6527L0716k2319
3762I45327J5926L6934j1040L2280J9911J6986j8277N3657J00467q072l0821m4535
3750A108743k5340m304l8958K7708o2232L098M6954k0871K488L1783N0695J1607
3738A131371M1306n9607j5334L1852N6189L495j7484M5667N8643j6671Q75l8068
$$ y = [513956, 539188, 609322, 552585, 492683, 513487, 531258, 532365, 505994, 475851, 459907, 515331, 505169, 461815, 443584, 408869, 469793, 455658, 453193, 527739, 573390, 592065, 644927, 643816, 689052, 739940, 712851, 711909, 721437, 695696, 768762, 824889, 828209, 773384, 799182, 826296, 814883, 779913, 820651, 772229, 722787, 736257, 776526, 790505, 752282, 791657, 810674, 811011, 818128, 804292, 809864, 871481, 858261, 852790, 877455, 921026, 1001707, 963457, 936930, 967646, 945327, 961253, 998187, 987147, 1019427, 1039338, 1056324, 1038047, 1091704, 1192171, 1184099, 1153278, 1108743, 1083403, 1079099, 1040141, 1067849, 1005617, 1008715, 1055669, 1034798, 1037286, 1069069, 1119764, 1131371, 1172677, 1113070, 1097736, 1129588, 1185777, 1189272, 1171788, 1217455, 1276098, 1259427, 1260302, 1222234]
3726A222234j1828j5821N1521M7691k4175m9670k2092q184p9207o6214N3369R1871
3714A189495o9394l7129K9040k1461L6778L1576o296K4565m190j3604n8027j1272
3702A090081j298K0160L5556j7481q1761k4933R9711m318k0796L7534l3208r232
3690A090015J2740k112l7647j6095K8911Q555n9822o0153l4453L5683K2544l2903
3678I55263k0446j5541M0681O767P382p3517r887P879r468o0809L4624K2649N0748
3665I36325k6684l1275J5820J4789R8463L8615n5274l3903o254k5063q4081K8622
3653H70100J4896L9168R933J3349J1076r3752J0767L7679M234j2893k1094N4924
3641I38387l8654J0874J0742L5273o688k2784l2480k8379j3928M3720J32806J3603
$$ y = [1222234, 1210406, 1194585, 1246106, 1293797, 1269622, 1219952, 1197860, 1189676, 1110469, 1044255, 1097624, 1189495, 1120101, 1082972, 1112012, 1090551, 1127329, 1158905, 1152609, 1177174, 1172984, 1159380, 1101353, 1090081, 1088783, 1108943, 1144499, 1127018, 1045257, 1020324, 1120035, 1115717, 1094921, 1132455, 1099247, 1090015, 1102755, 1100643, 1062996, 1046901, 1075812, 1084367, 1024545, 964392, 929939, 965622, 988166, 955263, 934817, 919276, 959957, 966724, 974106, 900589, 890702, 898581, 889113, 828304, 862928, 885577, 936325, 909641, 878366, 894186, 908975, 1007438, 1046053, 990779, 956876, 950622, 925559, 841478, 870100, 884996, 924164, 934097, 947446, 958522, 864770, 875537, 913216, 917450, 904557, 883463, 938387, 899733, 910607, 921349, 956622, 949934, 927150, 894670, 866291, 852363, 896083, 1028889, 1042492]
3629A042492M6629J2291p243k9116M898n1876O619K274N5859N8696O5596K4281
3617A231400J5556L3192N8050K1460J441k3485Q7261J24120J1650M0957K1264
3606A622866L3407R2373L4878Q3302N6479J59890J73745R1177P3736K16275N7254
3595B695382n2136M662j20562j30863n8607o4155l8228o4880J0856K596K9921
3584B213986L5358o8061k8904R739L5103J10054J7542M5411J7057m791O4534R3538
3572B540566J22510J17613J33476J34474K20454K54260K37773J99806L14795J97309
3562D473036j0346j14036k09460k96634k82368j35059j68163j60351j31254p6806
3552B888559q9590q2487j2812p3454q1993L6613j9715j3369R3614r988L4262O0344
$$ y = [1042492, 1089121, 1101412, 1094169, 1065053, 1069951, 1018075, 1024694, 1026968, 1082827, 1141523, 1207119, 1231400, 1246956, 1280148, 1338198, 1359658, 1361099, 1337614, 1424875, 1548995, 1560645, 1601602, 1622866, 1656273, 1748646, 1783524, 1866826, 1923305, 2083195, 2256940, 2348117, 2421853, 2638128, 2695382, 2643246, 2647908, 2527346, 2396483, 2337876, 2273721, 2235493, 2170613, 2181469, 2184065, 2213986, 2249344, 2181283, 2152379, 2162118, 2197221, 2307275, 2324817, 2370228, 2387285, 2382494, 2447028, 2540566, 2663076, 2780689, 2914165, 3048639, 3269093, 3523353, 3761126, 3960932, 4275727, 4473036, 4462690, 4348654, 4139194, 3842560, 3560192, 3425133, 3256970, 3096619, 2965365, 2888559, 2798969, 2716482, 2703670, 2630216, 2548223, 2584836, 2565121, 2551752, 2645366, 2635378, 2669640, 2729984]
3540B729984N4235M916M7283L544K8315R5518J11015Q9335J71876J04038P6332
3529C516391J8614m3608j06326o5813k05616j91305q4297q7985m3846m0931k7497
3518B637781n6466l7734L0341M958O2430l5206k6455K4007K3084L1752J05317
3507B763809J17395L2867K956K5824Q9852O8301K8597P3373j5657O628J13699
3496C307644R4193Q0600R7836Q2851P8494J58579J53123K30167J55671K50206
3486D689364K84673K11470R7209m5497j48474j41153l11246k12878j40324j2679
3476D270465n685L3942O4392P849N1453R1849J59099J44005R6156P7938J41983
3465E133446O3854J04462J48617J09375J65913K03451K48493L01286L92178N15008
$$ y = [2729984, 2784219, 2789135, 2836418, 2839962, 2868277, 2963795, 3074810, 3164145, 3336021, 3440059, 3516391, 3535005, 3491397, 3385071, 3319258, 3113642, 2922337, 2838040, 2750055, 2706209, 2665278, 2637781, 2581315, 2543581, 2573922, 2578880, 2641310, 2606104, 2579649, 2603656, 2626740, 2658492, 2763809, 2881204, 2914071, 2917027, 2942851, 3032703, 3101004, 3129601, 3202974, 3187317, 3193945, 3307644, 3401837, 3482437, 3580273, 3663124, 3741618, 3900197, 4053320, 4283487, 4439158, 4689364, 4974037, 5185507, 5282716, 5237219, 5088745, 4947592, 4636346, 4423468, 4283144, 4270465, 4264780, 4298722, 4363114, 4370963, 4422416, 4514265, 4673364, 4817369, 4913525, 4991463, 5133446, 5197300, 5301762, 5450379, 5559754, 5725667, 5929118, 6177611, 6478897, 6871075, 7386083]
3455G386083N03445O53272O44255N17044K73477o26l20264m65244l15884k51270
3445H624288j66945q2544J00774K12029K40627M02520M65357N35383N66143O87413
3435A1585045P12939Q05725P98481P11853O19510L44907Q7700k78674m67743l84141
3425A4535602k91336k15671k27642j49456N1470J46837J11220r8738l09147n30859
3415A3022280n30274m35162l20058k75843j10142J30946K86792L90565N78163
3406A2737267N62476O76753R41997J129502J235211J428164J650885J606416J065039
3397B3033710K96714j77298o63558q78903q15679p59565n34165l24323j34577
3388A9042356J47768K59721K84702J15542J5089j51262N364K77683O22915J281913
$$ y = [7386083, 7889528, 8542800, 9187055, 9704099, 9977576, 9976950, 9656686, 9191442, 8875558, 8624288, 8457343, 8374799, 8475573, 8687602, 8928229, 9330749, 9796106, 10331489, 10897632, 11585045, 12297984, 13103709, 13902190, 14614043, 15233553, 15578460, 15666160, 15387486, 14919743, 14535602, 14244266, 14028595, 13800953, 13651497, 13702967, 13849804, 13961024, 13862286, 13553139, 13022280, 12492006, 12056844, 11736786, 11460943, 11350801, 11481747, 11768539, 12159104, 12737267, 13299743, 13976496, 14918493, 16047995, 17283206, 18711370, 20362255, 21968671, 23033710, 23330424, 23153126, 22489568, 21610665, 20794986, 20035421, 19501256, 19176933, 19042356, 19190124, 19449845, 19734547, 19850089, 19865178, 19713916, 19719280, 19996963, 20619878, 21901791]
3378B1901791J784577K088345J926385Q91688m13498j267977j771614j723743
3370B3415954j310267p03538j77162Q3888K21664J74053m218q8366k93034n66223
3360B0752751o13255o35465o72423m00097k00242j7557J68195L22605O64468J031894
3350B0400874J249919J545483J150449J5884j163982j959109k364675k309523
3342A6565320j792091j417475j072575p89217n08570k39547p5720m9558k20299
3333A0400268m75986o51717p94763p10767o38852o11825m46064m42449l43223
3324E284622l09063l49945k58123k13262k13390j35901j59632j95009j72631j10412
3314C167254j18957j48766k197j37203l8282p2702n4162j1966j04464l9556p2517
$$ y = [21901791, 23686368, 25774713, 27701098, 28592786, 28179288, 26911311, 25139697, 23415954, 22105687, 21402149, 21224987, 21308875, 21530539, 21704592, 21700374, 21612008, 21318974, 20752751, 20139496, 19504031, 18831608, 18431511, 18231269, 18213712, 18381907, 18704512, 19368980, 20400874, 21650793, 23196276, 24346725, 24362609, 23198627, 21239518, 18874843, 16565320, 14773229, 13355754, 12283179, 11493962, 10985392, 10745845, 10670125, 10620567, 10400268, 9924282, 9272565, 8477802, 7767035, 7128183, 6516358, 6070294, 5627845, 5284622, 4975559, 4625614, 4367491, 4154229, 3940839, 3804938, 3645306, 3450297, 3277666, 3167254, 3048297, 2899531, 2897334, 2760131, 2721849, 2649147, 2594985, 2583019, 2478555, 2438999, 2366482]
3303B366482j07130n4784n1948j12710L412j6978o5431o8059k3964m2690j07424
3292A718776l974R194j5064j02508m7392j06142P504n7658j02784L8363J8005
3281A356320o0189l3802J7768j7792j5755R997J5065L2153o267j6961q1584p0776
3269A128177J0061j40159n7184L9025o9894R870M2288m1085n3090N7539L7304
3258I62852j0523r061k6971j6188l2828o2711r722M6100K3285Q361o6628O491
3246H12457J6336k8531l5248N8356K8611l5223Q247M6699k5489l4188k9094j3942
3234G68991J3335j0252M4283J5210j895k5506p6730J4211J6426p1126K9634M0391
3222G56972m0789J4869l1738j0338O6034M3069k4434L8805j8316p4036M1102N3838
$$ y = [2366482, 2259352, 2204568, 2152620, 2039910, 2043322, 2026344, 1960913, 1892854, 1868890, 1826200, 1718776, 1714802, 1723996, 1708932, 1606424, 1559032, 1452890, 1460394, 1402736, 1299952, 1338315, 1356320, 1296131, 1262329, 1280097, 1262305, 1246550, 1256547, 1271612, 1303765, 1297498, 1280537, 1198953, 1128177, 1138238, 998079, 940895, 979920, 910026, 919896, 962184, 921099, 868009, 925548, 962852, 952329, 943268, 916297, 900109, 867281, 804570, 794848, 840948, 864233, 872594, 805966, 812457, 828793, 800262, 765014, 823370, 851981, 816758, 825005, 871704, 846215, 812027, 782933, 768991, 782326, 772074, 816357, 831567, 829672, 804166, 727436, 741647, 758073, 686947, 716581, 756972, 716183, 731052, 699314, 688976, 755010, 798079, 773645, 812450, 794134, 720098, 761200, 815038]
3210H15038k0225J04642l657L6798o7104J7027Q0799j3999J2664K4804P053M847
3198I98687N8194N6141N1475R4622J05820l4291k8720J30412J24196M4523J28378
3187A729437R8533J46242J66900J0825n8275M0709J6121j10412k2540o5600n2406
3176A899534o19J3390K8663L6037k7947l4233q0767q3903k849O526j2962n2037
3164A688833J46844R1768Q3134J5437M4621J1783K2193N9032O3546J81163K07627
3153B615981K39411J48788J28788Q0436o3798p0492r7616j10200j02536q4135
3143B684627j1352J02318p7332j47129j00099p8971j02725j91827j98819j29483
3133A749208m8843J9605k6004J825j4896K0546n6813p30j0025J9478J23L6498
$$ y = [815038, 794813, 899455, 895798, 932596, 865492, 882519, 963318, 949319, 961983, 986787, 993840, 998687, 1056881, 1113022, 1164497, 1259119, 1364939, 1330648, 1301928, 1432340, 1556536, 1601059, 1729437, 1827970, 1974212, 2141112, 2151937, 2093662, 2134371, 2150492, 2040080, 2017540, 1951940, 1899534, 1898915, 1912305, 1940968, 1977005, 1949058, 1914825, 1834058, 1750155, 1747306, 1753832, 1740870, 1688833, 1835677, 1927445, 2010579, 2026016, 2070637, 2082420, 2104613, 2163645, 2227191, 2408354, 2615981, 2855392, 3004180, 3132968, 3213404, 3149606, 3079114, 2981498, 2871298, 2768762, 2684627, 2673275, 2775593, 2698261, 2551132, 2451033, 2372062, 2269337, 2077510, 1878691, 1749208, 1700365, 1719970, 1693966, 1695791, 1680895, 1701441, 1644628, 1643898, 1633873, 1653351, 1653474, 1689972]
3121A689972L7157J7154Q7766K5350m2663l3189L5898p8602j4210k8402l7316
3110A658915k4827l597k7366q7672o7986K0161k7833j00978j14858k5197m4860
3099A153902n1079p5956Q8190P5468m0209l1192m0650n5069k9869q2702l2436
3088H78398N2476k042k4475j11597o2816m7509k7613N3830m8704j0158J2371K458
3076F64619R4585n6004J9639m5292l2598P711k1722O7535L130k2557k1662K6215
3064F83599L4569K1870j873K4011j12454n741J1218q7934l532m2709O0971k8670
3052E53325o5695J224M3555Q678m063O107L9305m8938k6382o5864m9801J29179
3040E20630O420o9720n5923o0149k1989J1329R0504k0734o7302N3469m7488j5622
$$ y = [1689972, 1727129, 1744283, 1832049, 1857399, 1814736, 1781547, 1817445, 1738843, 1724633, 1696231, 1658915, 1634088, 1630491, 1603125, 1515453, 1447467, 1467628, 1439795, 1338817, 1223959, 1198762, 1153902, 1102823, 1026867, 1115057, 1190525, 1150316, 1119124, 1078474, 1023405, 993536, 910834, 878398, 930874, 928832, 904357, 792760, 729944, 682435, 654822, 708652, 659948, 649790, 662161, 664619, 759204, 703200, 722839, 677547, 644949, 652660, 630938, 698473, 701603, 679046, 657384, 683599, 718168, 740038, 738165, 762176, 649722, 643981, 655199, 567265, 563733, 521024, 581995, 553325, 487630, 488854, 532409, 541087, 537024, 543131, 582436, 533498, 507116, 441252, 391451, 520630, 527050, 457330, 401407, 341258, 319269, 330598, 421102, 400368, 333066, 386535, 339047, 323425]
3028C23425p397r320J263L6j5325m4378j8794M0976n1162L2994j3847n3602M8602
3015B33471K2896M7294k7310n7105m6293K9404L7986l4840o453j8295K2947k1384
3003A82318J910P0137l4494m0273O735O886J5153k3491k64o3662j4346l103K3181
2990A26687O3336k8459j3174p7370J1066l8825L072J5468m3051N8085M5813m8258
2978G4390L6498k1756k490L7194j5202M4869n0243l2674n422K9589o355J7031
2966A05429M6149K00l8858K365o7153j4294M9103l4359l1246N4816p407J9714
2954H4459N125J9029M9915k0745p1957o4151J0342N5888K9090J7799k6818m4021
2942D3955N4227N6958p1862j9304O2591N0311m0563p0989L1337m5735K5711M9799
$$ y = [323425, 316028, 306708, 307971, 308007, 292682, 248304, 229510, 270486, 219324, 252318, 238471, 184869, 233471, 256367, 303661, 276351, 219246, 172953, 202357, 240343, 205503, 199050, 180755, 203702, 182318, 184228, 254365, 219871, 179598, 186333, 193219, 208372, 184881, 184617, 120955, 106609, 103506, 126687, 190023, 161564, 148390, 71020, 82086, 43261, 46333, 61801, 18750, 76835, 122648, 74390, 110888, 89132, 86642, 123836, 108634, 153503, 103260, 70586, 65164, 94753, 88398, 105429, 151578, 151778, 112920, 115285, 48132, 33838, 82941, 48582, 17336, 72152, 64745, 84459, 89584, 108613, 158528, 137783, 65826, 1675, 12017, 67905, 96995, 114794, 87976, 43955, 98182, 155140, 83278, 63974, 126565, 176876, 136313, 65324, 96661, 50926, 76637, 126436]
2930A26436r553Q747o0188J56K4048m2077k0331q614Q5436k2773m1307k7195Q957
2917B1742o054L6938k6148Q1536k4123n9629K6359n1547m25P4647R4904p1630
2905I6570m9325o633j1578l488J4553M769P618L8011j4172J3355k2576n8014O696
2892A5786N2237k4407l2158L7865j529J6642m9083k939L6101l1369K748N0057
2880F9951O782m8349L5543k3514M8224j8199K0463o0997k2232K5272R336K2603
2868F4883o4367J0478L7165N0107R260l6124n314j8131l6581q247N0234k253k3858
2855B7252R327n0259K9089l339O1338k850M639J8209n4182K6033K3343k7996J9925
2842H0529R36p0352M545O1687m5464n3792K8209j8865j5031J9871K7161P9981
$$ y = [126436, 116883, 125630, 65442, 65598, 89646, 47569, 27238, 18624, 104060, 81287, 39980, 12785, 21742, 15688, 52626, 26478, 108014, 83891, 24262, 50621, -926, -1351, 73296, 168200, 96570, 47245, 40612, 29034, 25546, 40099, 44868, 52486, 90497, 76325, 89680, 67104, 9090, 15786, 68023, 43616, 11458, 49323, 47794, 64436, 15353, 12414, 48515, 17146, 19894, 69951, 76733, 28384, 63927, 40413, 88637, 70438, 90901, 29904, 7672, 32944, 42280, 64883, 516, 10994, 48159, 98266, 107526, 71402, 66088, 47957, 11376, 3129, 53363, 51110, 27252, 36579, -13680, 15409, 12070, 73408, 70558, 75197, 93406, 39224, 65257, 88600, 60604, 80529, 81465, 11113, 15658, 77345, 31881, -21911, 6298, -12567, -27598, -7727, 19434, 99415]
2830I9415n7024m8785K6628J9403k6812K319J5295J0225K8395O426k0270j7368
2818C7847p895L0775m2712J1050M6065J7495r4075k5159Q4563K1066K3538k0820
2806H1738n9838J5344M0716j2489o8650j8627R3178n1913l0191n249l1266M8275
2794A028o61q491l6599J8197Q485k2500M6097J6729k1259j4723j5759l108O6931
2781C4367J6992J760J770l6414k4521J518O3809K6848q9015k8043M394l8266M3045
2768b1756j7415J9631Q7071l8177P39j9995p5453O7038J546J8730K9953q2348
2756c0436N077j3057j0607K0401l1502j0818P134Q6040k1964n3624K8664K843
2744b1849L177K8687n3098k2311N7024N074l0888j5342L1934p960r48p990M2182
$$ y = [99415, 42391, -6394, 20234, 39637, 12825, 15144, 30439, 40664, 69059, 75485, 55215, 37847, 29952, 60727, 18015, 29065, 75130, 92625, -1450, -26609, 57954, 79020, 102558, 81738, 21900, 37244, 77960, 65471, -3179, -21806, 71372, 19459, -10732, -15981, -47247, 1028, 367, -8124, -44723, -26526, -18041, -40541, 5556, 22285, 1026, -13697, -29456, -32564, 34367, 51359, 53119, 54889, 18475, -6046, -4528, 59281, 86129, -2886, -30929, -26535, -64801, -21756, -39171, -19540, 67531, 29354, 30093, 10098, -65355, 1683, 3229, 21959, 51912, -30436, -25359, -38416, -49023, -28622, -60124, -70942, -63808, 22232, 268, -53356, -24692, -21849, -18672, 10015, -43083, -65394, -8370, -3296, -34184, -49526, -17592, -25552, -26500, -34490, 7692]
2731G692K1084l0987Q036L5917J0284k0197j0154o232R942J7424m5904J7278J1366
2718B5549k2605l3094O2557O2036q1161m8116j9291k8295J25932o2993K5211k7309
2706b1579O068N3642k7785k834q973N9609j9279l6944L0872m3027k9548k70L9284
2693g64L3048k7916L0818K6978L3254l9782l3777L4209o3165N161J3447Q38r20
2680A1429p368O256o04m0224l1521m93L6318K9295j5536o7634m9547O6594P1815
2667H780N215l7351q23J6863L6914q5362M1267n5132L1729N1735M4062m5593k3607
2654a1303k2573M9442L5224m417J7451k1439j2471j2147k6902j5481N554K242
2642a6820M6327O8938l7152k7691m8324j8027Q734K6526O1554r709n9671k7831
$$ y = [7692, 28776, -2211, 5825, 41742, 52026, 31829, 21675, 15443, 25385, 42809, -3095, 14183, 25549, 2944, -30150, 32407, 94443, 13282, -34834, -54125, -82420, 43512, -19481, 5730, -21579, -15511, 38131, 10346, 7512, -1461, 58148, 38869, 1925, 32797, -10230, -39778, -40048, -764, 32284, 4368, 35186, 62164, 95418, 55636, 21859, 56068, -7097, -1936, 11511, 12349, 11429, 4061, 10317, 9713, -30511, -62032, -62525, -26207, 3088, -12448, -80082, -129629, -63035, 8780, 13995, -23356, -24179, -7316, 29598, -55764, -14497, -69629, -37900, 13835, 57897, 12304, -11303, -33876, 15566, 50790, 46373, 63824, 42385, 29914, 17767, -9135, -24616, -19062, -16820, 29507, 98445, 61293, 33602, -14722, -32749, -24015, 2511, 64065, 54356, -5315, -33146]
2630c3146L467O240K4016K9559j1256p032M512j6539j1334L1188J2392p8700M2471
2617d162n0191L5207K732l9566J4760r183j2190L6316K2984N8539k9977Q244k5855
2604G658j3921q055J0384P451J4616k6921N958J2006m443j9209K6797K1169j7036
2591A6454m3126P1825j9823n3045J7244k3522j9652J48K3307l892N3726N554O6760
2578I1958m6531l5852n836J2559j411J6342K2439K8894k5099J393M752N20l6256
2565B7872n1434K1827P0732L310J4929l4075N4149k5176l4321K7292l1770n8859
2553a5524O3869M8577n428J1217j5434J6013o651n430k7136n6350l7905q777O8079
2540B9120k555j8043L7358Q665o0907n984K5077k1186Q400n024M1247L5581n9431
$$ y = [-33146, -29679, -23439, 577, 30136, 18880, 11848, 16360, -179, -11513, 19675, 32067, -46633, -4162, -54353, -19146, -16414, -55980, -41220, -50403, -62593, -26277, -3293, 55246, 25269, 33513, 7658, -6263, -14318, -3934, 3517, 18133, -8788, -2830, 9176, 4733, -14476, 12321, 33490, 16454, -26672, 45153, 25330, -27715, -10471, -33993, -53645, -53497, -30190, -34082, 19644, 25198, 91958, 45427, 9575, 3739, 16298, 14887, 31229, 53668, 82562, 57463, 58856, 63608, 64128, 27872, -23562, -1735, 68997, 72307, 87236, 53161, 107310, 82134, 47813, 75105, 43335, -15524, 48345, 96922, 91494, 102711, 87277, 103290, 96639, 91209, 64073, 7723, -30182, -38959, 29120, 26565, 8522, 45880, 54545, -6362, -12346, 12731, -8455, -55, -5079, 36168, 71749, 12318]
2527A2318j6806N9403l8188P6575j0862p7736k7902N93N9645J6972p0297Q997
2515g288m6723J3161p017K599O6624L8187k5678l8708O5860k3116n4112j022J9977
2502B744k6628j1045J540M833o767L5707N2630k9635p5209l0051O4346N1980K3064
$$ y = [12318, -4488, 54915, 16727, 93302, 82440, 4704, -23198, -22605, 37040, 54012, -16285, -7288, -54011, -40850, -47867, -45268, 21356, 59543, 33865, -4843, 61017, 37901, -16211, -17233, 2744, -23884, -34929, -33389, -28556, -35323, 384, 53014, 23379, -51830, -81881, -17535, 34445, 57509]
$$ [...]
##END NTUPLES=NMR SPECTRUM
##END=
