##TITLE=1H_CG-1221-1
 200.13MHz, CDCl3,
 8 sc
 
 12.2.2025
##JCAMPDX= 6.0         $$ Bruker NMR JCAMP-DX V2.0
##DATA TYPE= NMR SPECTRUM
##DATA CLASS= NTUPLES
##ORIGIN= UXNMR, Bruker Analytische Messtechnik GmbH
##OWNER= pz
$$ XWIN-NMR		Version 3.5
$$ Wed Feb 12 13:41:25 2025 Russian Standard Time (UT+4h)  she@DPX200
##.OBSERVE FREQUENCY= 200.1313
##.OBSERVE NUCLEUS= ^1H
##.ACQUISITION MODE= SIMULTANEOUS
##.ACQUISITION SCHEME= undefined
##.AVERAGES= 8
##.DIGITISER RES= 18
##SPECTROMETER/DATA SYSTEM= spect
##.PULSE SEQUENCE= zg30
##.SOLVENT NAME= CDCl3
##.SHIFT REFERENCE= (INTERNAL, CDCl3, 0, 15.5133)
##AUDIT TRAIL= $$ (NUMBER, WHEN, WHO, WHERE, WHAT)
$$ ##TITLE= Audit trail, XWIN-NMR		Version 3.5
$$ ##JCAMPDX= 5.01
$$ ##ORIGIN= Bruker BioSpin GmbH
$$ ##OWNER= she
$$ F:/spectra/data/she/nmr/H-C/1/pdata/1/auditp.txt
$$ ##AUDIT TRAIL=  $$ (NUMBER, WHEN, WHO, WHERE, WHAT)
(   1,<2025-02-12 13:40:10.45 +0400>,<she>,<DPX200>,
      <created by zg, POWCHK disabled, PULCHK disabled
       configuration hash MD5:
       00 E9 B6 7A A2 85 ED C7 34 08 36 98 17 FE 4E 26
       data hash MD5: 16K
       D4 31 A9 7A BC 1A 91 F7 0B 38 87 49 14 2A E9 73>)
(   2,<2025-02-12 13:40:13.10 +0400>,<she>,<DPX200>,
      <Start of raw data processing
       efp BC_mod = 2 LB = 0.25 FT_mod = 6 PKNL = 1 PHC0 = -465.239 PHC1 = 9.19221 SI = 16K 
       data hash MD5: 16K
       96 4E AD 4F EF 4B F3 B5 64 5D 75 77 B2 67 B1 7F>)
(   3,<2025-02-12 13:40:32.25 +0400>,<she>,<DPX200>,
      <pk PHC0 = 2.193249 PHC1 = -2.2 
       data hash MD5: 16K
       83 EC C4 02 68 A8 E3 E5 1C 5E 85 35 40 E6 1A D1>)
(   4,<2025-02-12 13:40:35.71 +0400>,<she>,<DPX200>,
      <abs ABSG = 5 
       data hash MD5: 16K
       CE 52 71 96 DA 65 75 63 4B 10 9B F0 6B 6D FF 59>)
$$ ##END=
$$ 
$$ hash MD5
$$ 74 57 CE 98 58 73 DE 97 2A 1B E7 E9 AD B6 4B BB
##$RELAX= 
##$RELAX= 
##$RELAX= 
##$RELAX= 
##$RELAX= 
##$RELAX= 
$$ Bruker specific parameters
$$ --------------------------
##$DU= <F:/spectra>
##$EXPNO= 1
##$NAME= <H-C>
##$PROCNO= 1
##$TYPE= <nmr>
##$USER= <she>
##$AMP= (0..31)
100 100 100 100 100 100 100 100 100 100 100 100 100 100 100 100 100 100 
100 100 100 100 100 100 100 100 100 100 100 100 100 100 
##$AQSEQ= 0
##$AQ_mod= 1
##$AUNM= <au_zg>
##$AUTOPOS= <>
##$BF1= 200.13
##$BF2= 200.13
##$BF3= 200.13
##$BF4= 200.13
##$BF5= 200.13
##$BF6= 200.13
##$BF7= 200.13
##$BF8= 200.13
##$BYTORDA= 1
##$CFDGTYP= 0
##$CFRGTYP= 5
##$CHEMSTR= <none>
##$CNST= (0..31)
1 1 145 1 1 1 1 1 1 1 1 1 1 1 1 1 1 1 1 1 1 1 1 1 1 1 1 1 1 1 1 1 
##$CPDPRG= <>
##$CPDPRG1= <>
##$CPDPRG2= <>
##$CPDPRG3= <>
##$CPDPRG4= <mlev>
##$CPDPRG5= <mlev>
##$CPDPRG6= <mlev>
##$CPDPRG7= <mlev>
##$CPDPRG8= <mlev>
##$CPDPRGB= <>
##$CPDPRGT= <>
##$D= (0..31)
0 0.7 0 0 0 0 0 0 0 0 0 0.03 0 0 0 0 0 0 0 0 0 0 0 0 0 0 0 0 0 0 0 0 
##$DATE= 1739353209
##$DBL= (0..7)
120 120 120 120 120 120 120 120 
##$DBP= (0..7)
150 150 150 150 150 150 150 150 
##$DBP07= 0
##$DBPNAM0= <>
##$DBPNAM1= <>
##$DBPNAM2= <>
##$DBPNAM3= <>
##$DBPNAM4= <>
$$ [...]
##$SUBNAM3= <"">
##$SUBNAM4= <"">
##$SUBNAM5= <"">
##$SUBNAM6= <"">
##$SUBNAM7= <"">
##$SUBNAM8= <"">
##$SUBNAM9= <"">
##$SW= 18.0517328524113
##$SWIBOX= (0..15)
0 0 2 0 0 0 0 0 0 0 0 0 0 0 0 0 
##$SW_h= 3612.71676300578
##$TD= 16384
##$TD0= 1
##$TE= 0
##$TE2= 300
##$TE3= 300
##$TEG= 300
##$TL= (0..7)
0 120 120 120 120 120 120 120 
##$TP= (0..7)
150 150 150 150 150 150 150 150 
##$TP07= 0
##$TPNAME0= <>
##$TPNAME1= <>
##$TPNAME2= <>
##$TPNAME3= <>
##$TPNAME4= <>
##$TPNAME5= <>
##$TPNAME6= <>
##$TPNAME7= <>
##$TPOAL= (0..7)
0.5 0.5 0.5 0.5 0.5 0.5 0.5 0.5 
##$TPOFFS= (0..7)
0 0 0 0 0 0 0 0 
##$TUNHIN= 0
##$TUNHOUT= 0
##$TUNXOUT= 0
##$USERA1= <user>
##$USERA2= <user>
##$USERA3= <user>
##$USERA4= <user>
##$USERA5= <user>
##$V9= 5
##$VALIST= <valist>
##$VCLIST= <CCCCCCCCCCCCCCC>
##$VD= 0
##$VDLIST= <DDDDDDDDDDDDDDD>
##$VPLIST= <PPPPPPPPPPPPPPP>
##$VTLIST= <TTTTTTTTTTTTTTT>
##$WBST= 1024
##$WBSW= 4
##$XGAIN= (0..3)
0 0 0 0 
##$XL= 0
##$YL= 0
##$YMAX_a= 585323
##$YMIN_a= -615223
##$ZGOPTNS= <>
##$ZL1= 120
##$ZL2= 120
##$ZL3= 120
##$ZL4= 120
##$ABSF1= 15.48686
##$ABSF2= -2.564989
##$ABSG= 5
##$ABSL= 3
##$ALPHA= 0
##$AQORDER= 0
##$ASSFAC= 0
##$ASSFACI= 0
##$ASSFACX= 0
##$ASSWID= 0
##$AUNMP= <proc_1d>
##$AZFE= 0.1
##$AZFW= 0.1
##$BCFW= 0
##$BC_mod= 2
##$BYTORDP= 0
##$COROFFS= 0
##$CY= -3
##$DATMOD= 1
##$DC= 0
##$DFILT= <>
##$DTYPP= 0
##$F1P= 0
##$F2P= 0
##$FCOR= 1
##$FTSIZE= 16384
##$FT_mod= 6
##$GAMMA= 0
##$GB= 0
##$INTBC= 1
##$INTSCL= 3.241238e-09
##$ISEN= 128
##$LB= 0.25
##$LEV0= 0
##$LPBIN= 0
##$MAXI= 10000
##$MC2= 0
##$MEAN= 0
##$ME_mod= 0
##$MI= 1.114404
##$NCOEF= 0
##$NC_proc= -5
##$NLEV= 6
##$NOISF1= 3.799351
##$NOISF2= 2.8
##$NSP= 0
##$NTH_PI= 0
##$NZP= 0
##$OFFSET= 15.51331
##$PC= 1
##$PHC0= -463.0458
##$PHC1= 6.99221
##$PH_mod= 1
##$PKNL= yes
##$PPARMOD= 0
##$PSCAL= 0
##$PSIGN= 0
##$REVERSE= no
##$SF= 200.130001679212
##$SI= 16384
##$SIGF1= 3
##$SIGF2= 2
##$SINO= 0.751879
##$SIOLD= 32768
##$SREGLST= <19F.Aceton>
##$SSB= 0
##$STSI= 16384
##$STSR= 0
##$SW_p= 3612.71676300578
##$SYMM= 0
##$S_DEV= 0
##$TDeff= 16384
##$TDoff= 0
##$TI= <>
##$TILT= no
##$TM1= 0
##$TM2= 0
##$TOPLEV= 0
##$USERP1= <user>
##$USERP2= <user>
##$USERP3= <user>
##$USERP4= <user>
##$USERP5= <user>
##$WDW= 1
##$XDIM= 16384
##$YMAX_p= 413929323
##$YMIN_p= -394645
$$ End of Bruker specific parameters
$$ ---------------------------------
##NTUPLES= NMR SPECTRUM
##VAR_NAME=  FREQUENCY,     SPECTRUM/REAL,   SPECTRUM/IMAG
##SYMBOL=    X,             R,               I
##VAR_TYPE=  INDEPENDENT,   DEPENDENT,       DEPENDENT
##VAR_FORM=  AFFN,          ASDF,            ASDF
##VAR_DIM=   16384,         16384,           16384
##UNITS=     HZ,            ARBITRARY UNITS, ARBITRARY UNITS
##FACTOR=    0.220516191357247, 1,           1
##FIRST=     3104.67884289317, 0,            0
##LAST=      -508.03792011261, 0,            0
##MIN=       -508.03792011261, -394645,      0
##MAX=       3104.67884289317, 413929323,    0
$$ Real data points
##PAGE= N=1
##DATA TABLE= (X++(R..R)), XYDATA
$$ [...]
9073E7978M0916J7497l03q03j3954o835l6612L9005P3561R536k0302k0982J3033
9060A51735M273n3615L7942m9434L2720J9048Q592j2196J0185K2k1519O200l5223
9047I8730m2465M106R080J8210l0389K8603K803J1203j10472P2343K3876P179
9035I2807J1017l7336q875L0724K0968L8253N3420n5360l0553J2808q521j6811
9023A02541K4667o0240M9068j2866j1508l3263M1720R261j00218J5736O0219M4549
9011A29666M1587L4015L4123l1829o6846k7391M8461Q6747M0019o3578j3506L2206
8999B43674o4723l8205R430J8449l242K558M8404n4778K4039M3046j06694o8965
8987E2993K9983Q517p875N3704J6024N2385J1033l4436L7765O805L1298m2081
$$ y = [57978, 98894, 116391, 116088, 115285, 101331, 94496, 57884, 96889, 170450, 179986, 159684, 138702, 151735, 156008, 102393, 140335, 90901, 123621, 142669, 151261, 139065, 149250, 149272, 127753, 133953, 98730, 56265, 60371, 69451, 87661, 57272, 85875, 88678, 99881, -10591, 61752, 85628, 92807, 103824, 66488, 57613, 88337, 109305, 147558, 200978, 145618, 115065, 127873, 119352, 102541, 127208, 66968, 116036, 103170, 91662, 58399, 100119, 109380, 9162, 24898, 85117, 129666, 171253, 205268, 239391, 207562, 140716, 113325, 161786, 248533, 288552, 224974, 211468, 243674, 178951, 140746, 150176, 168625, 165383, 167941, 216345, 161567, 185606, 228652, 121958, 52993, 82976, 91493, 83618, 137322, 153346, 205731, 216764, 182328, 220093, 226898, 258196, 216115]
8975B16115L0761k6848K3542l5264K4552M1061k4987L1257K857M5898N5768k1213
8963C63499J7319L2801L7257j8147j0964O4488K6215K001m0745R3760o6055N1056
8951E52485K5907q302K5729N4318M5623P592O7327l2219Q0943R6634J42552J01063
8939A159652L6413J10104O4919J33962J94992J67827J72028K19380K81868M55535
8929B996680N51864O18224P71478J085800J117532M04039j59988m82543j084376
8920E818710j106012q27671n90757m42992m30303l53979l79690j92782j63660
8911A330864j14523q7716m1294o4572j09367q2584k3775k5157m5614q5770k7471
8900F23021k1519j9190q1053j1966o4701k0185p653n2879m3875L3643L2704m83
$$ y = [216115, 246876, 220028, 243570, 208306, 232858, 273919, 248932, 280189, 283046, 328944, 384712, 363499, 380818, 413619, 450876, 432729, 421765, 486253, 512468, 514469, 473724, 567484, 501429, 552485, 578392, 570090, 595819, 650137, 695760, 703352, 770679, 738460, 819403, 916037, 1058589, 1159652, 1196065, 1306169, 1371088, 1505050, 1700042, 1867869, 2039897, 2259277, 2541145, 2996680, 3548544, 4166768, 4938246, 6024046, 7141578, 7545617, 7385629, 6903086, 5818710, 4712698, 3885027, 3294270, 2851278, 2420975, 2066996, 1687306, 1494524, 1330864, 1216341, 1128625, 1087331, 1022759, 913392, 830808, 807033, 781876, 736262, 650492, 623021, 601502, 582312, 501259, 489293, 424592, 404407, 396754, 343875, 300000, 333643, 366347, 365864]
8888C65864L1165m078q0283J774O8351m3806L0057p243m8609l6429j9559n2193
8876B05011K2593j2281L8699p2861p9398N1200L4183n0647m9910j5436N5490J8647
8864A45290N0337R835l8037Q782j6123n9116l7248M9061q004J1523M7611j5669
8852A48242k3815m3127Q752k563j4585N893P3441L1320l2530o5803M4588k2168
8840A07645J8741Q8054Q095l8213o2818r5393J3566J5881J4945r321O902L4499
8828A02583L4738r128o659n9423L3724P9428n9196R653J4231k4791j5537m728
8816I4895K0172J5273k6795J4652j834J8133n3331p788M7465k5318n8113L2569
8804F9980n7318L4431M0150m767K8093J9167k2043r564K2572k5282l7317l2592
$$ y = [365864, 397029, 392951, 312668, 314442, 382793, 338987, 369044, 361801, 313192, 276763, 257204, 205011, 227604, 215323, 254022, 181161, 101763, 152963, 187146, 136499, 86589, 71153, 126643, 145290, 195627, 205462, 167425, 176207, 160084, 100968, 63720, 112781, 104777, 116300, 163911, 148242, 124427, 81300, 90052, 87489, 72904, 78797, 152238, 183558, 151028, 85225, 129813, 107645, 126386, 214440, 222535, 184322, 121504, 26111, 39677, 55558, 70503, 61182, 68084, 102583, 137321, 128193, 121534, 62111, 95835, 175263, 116067, 125720, 139951, 115160, 99623, 94895, 115067, 130340, 103545, 118197, 116363, 134496, 81165, 73377, 120842, 95524, 37411, 69980, 12662, 47093, 87243, 82476, 110569, 129736, 107693, 98129, 120701, 95419, 58102, 25510]
8792B5510J0131L1655l4317N892J8568K2766J4424j8501j1863j4221M536O1405
8780A15985K569l8243Q796L8221k1636Q58J1449J0418j4148l6506j1810M1913
8768A07866j9280k7867M388N821J513K6232J1823l9379l4319r616M1915O0255
8756A29352M5805n0164j0385j0347R2983j3328r5722n744k8687M9549m5224j5392
8744D2696j8283O7337o978j015l1602k6049K2015l190N9420l7194m6704j7075
8732C378q3968N5269K5922l8725M2000Q7817J9163j413J0606o200n0491o3158
8720B00Q304J7689O6818M5984L2139l7879M112o0081j9969l4195m2583Q6748K2135
8707H9422M197j2012l1732p357n9685L2521M5036M5709J0661m7539o3983r362
$$ y = [25510, 35641, 67296, 32979, 38871, 57439, 80205, 94629, 76128, 64265, 50044, 54580, 115985, 118554, 80311, 89107, 127328, 105692, 106550, 117999, 128417, 114269, 77763, 65953, 107866, 88586, 60719, 65107, 70928, 72441, 98673, 110496, 71117, 36798, 27182, 69097, 129352, 175157, 124993, 114608, 104261, 197244, 183916, 88194, 82450, 53763, 103312, 58088, 42696, 24413, 91750, 84772, 83757, 52155, 26106, 48121, 44931, 104351, 67157, 20453, 3378, -80590, -25321, 601, -38124, 3876, 91693, 110856, 109443, 120049, 113849, 63358, 200, 8504, 26193, 93011, 138995, 171134, 133255, 137367, 77286, 57317, 23122, -19461, 67287, 89422, 93619, 81607, 49875, 42518, -17167, 15354, 60390, 106099, 116760, 69221, 5238, -4124]
8695d124P661M5657r524m315k6606R895q456M2363k4787M814o221J1794n1902
8682a3751J8168N7597m0696l493L6221N4365n5217l7306J8507J7794P4603n6263
8670G0529k0143j8616l6890r452K7686m2596m3585n202K1190O6072pM8642M2030
8657I9658K5478j19476j02012O2344R550o600M4042l2510L1786m0744N1M0401
8645A1968M3607j7676J3507r6791N3970j439j0679m2622R639K1252j6277J2482
8633a9059k1862M525Q618J32445l3303R260J1651k0752j2778k1205o630j1818
8621A9092K4912q111l217j1371L1171k4653L2639j7589l8946N699O7731l6528
8609D0829p205J2480n4267M3501l8045q341j6614J9515m010k4029L5363O7625
$$ y = [-4124, 3537, 49194, 39670, 35355, 8749, 18644, 10188, 52551, 27764, 32578, 26357, 38151, -13751, 4417, 62014, 21318, 17825, 54046, 108411, 53194, 15888, 34395, 52189, 126792, 70529, 50386, 31770, -5120, -14572, 13114, -29482, -73067, -78269, -57079, 8993, 8986, 57628, 99658, 125136, 5660, -96352, -34008, -24458, -31058, 12984, -19526, 12260, -28484, -28433, 11968, 55575, 37899, 51406, -45385, 8585, 7146, -3533, -46155, -36516, -15264, -31541, -19059, -40921, -36396, -27778, 104667, 71364, 80624, 92275, 71523, 58745, 37540, 30910, 19092, 44004, 35893, 32676, 21305, 52476, 27823, 60462, 42873, 3927, 9626, 77357, 40829, 33624, 46104, -8163, 35338, -2707, -11048, -27662, -8147, -12157, -36186, -823, 66802]
8597F6802m5453n7605J2767L5588O6221Q982r7320j6604J4143o6524J1219N8729
8585i055q406l148J7024R6286j7089O7m0369o4117m0444j9220P4004p260k6977
8572d8704N6R6364j0398j5243L9901Q900m5693o1720r7173K1016O7082K7216J0318
8559h078l0581L287j7216j0794L3780P5902l6359k350l3922J7680L2312m4406
8547b0745K8652j6402j524N5528k2050r787K013J924j68o1094N4007k803n5015
8534d7464n4987L8408N3858k3295l1210L9235M3961n425O5714n7547n5223M7539
8522A3564K5076K6486k4266p0818k2766r853R504J7482m6320J4245J8096j4413
8510f3983k453L5792j5679K5150l6252K1955L933j21449Q8852J9598k9669N271
$$ y = [66802, 21349, -36256, -23489, 12099, 78320, 87302, -10018, -26622, -12479, -79003, -67784, -9055, -17461, -20609, -3585, 92701, 75612, 75679, 35310, -28807, -69251, -88471, -14467, -21727, -48704, -48648, 47716, 37318, 22075, 61976, 70876, 25183, -36537, -133710, -112694, -45612, -18396, -8078, -38659, -35372, -52588, -63382, -29602, 46300, 9941, 7591, -26331, -8651, 23661, -20745, 7907, -8495, -10019, 45509, 23459, 13672, 15685, 17609, 17441, -43653, 10354, 7551, -47464, -102451, -64043, -10185, -33480, -64690, -25455, 18506, 13081, 78795, 21248, -33975, 13564, 38640, 65126, 40860, -29958, -52724, -62577, -53073, -35591, -81911, -67666, -49570, -63983, -66436, -30644, -46323, -21173, -57425, -35470, -31537, -152986, -64134, -44536, -74205, -68934]
8498f8934P4111K9283k4051K4562J3131L4237n4367o4237J5337J4726l947K901
8486g248j3555j8632O052M3691n418m7411K1290K4708l8818K0470O6505m3928
8474G706J3318l4542j708j2222o4607l6891M4290q558J2914k6066J5862N8088
8462c2416L5847O81o540l76j23349M2934O0702j1341L6568J0507j2526O196P581
8449A4468j7312n5594K7333N7503J0979k1340l3439m4848O687N2942M7948n8858
8437a3531j00183K4814O0377M6065R126q027k8266J6112j9009l5655L5584p2303
8425h4896l8090O6429R2278m0576n9383J1305r1845N3472J28682j6807k0750K8530
8413B8349l0171j6676k5425n4318K7319M2912L8672k5257l001P3034j4280l6069
$$ y = [-68934, 5177, 34460, 10409, 34971, 48102, 82339, 27972, -36265, -20928, -6202, -10149, -7248, -20803, -39435, -33383, 10308, 4890, -42521, -21231, 3477, -35341, -14871, 51634, 7706, 21024, -13518, -15226, -27448, -92055, -128946, -84656, -93214, -80300, -106366, -90504, -32416, 3431, 4112, -2428, -2804, -126153, -83219, -22517, -33858, 2710, 13217, 691, 6887, 14468, -2844, -58438, -31105, 26398, 37377, 16037, -17402, -62250, -55563, -2621, 45327, -13531, -113714, -88900, -28523, 17542, 26668, 18641, -9625, 6487, -12522, -48177, -12593, -84896, -122986, -56557, 35721, -4855, -64238, -52933, -144778, -91306, 37376, 20569, -181, 28349, -1822, -18498, -43923, -98241, -70922, -28010, 10662, -14595, -17596, 55438, 41158, 5089]
8401E089P921j6563J2330L2082q2321n1287N8824N4792p3915p2217M4398N7532
8389b3335L7845m7768J4948K8452N110q3715N81N7094j6625j5222k269l2667j5329
8376i2900K5218L7299j1866n8608R2400J0923o3855N440r947J2990P812p948L2834
8363b0208q557m1501N65P6378O6985l5643p564q7017j0716o368o1012k5509L7422
8350a22745R32M4508O2249J7339r0485N3147J5177j26296j8682N1196O9976K412
8338d1272k7458O399K8418j3770K4045n9866K5799L0777N4002l3262j0792l034
8326b0014r4144M1521J4226J1806L3261k3737n212K5864k4424J9049J8815l6976
8314c9965n3258J6984N5719j2337n6803k6455L1060N7739L0014l5700L6605k1708
$$ y = [5089, 13010, -3553, 8777, 40859, -41462, -92749, -33925, 20867, -53048, -125265, -80867, -23335, 14510, -33258, -18310, 10142, 15252, -68463, -67882, -10788, -27413, -42635, -44904, -77571, -92900, -67682, -30383, -42249, -100857, -8457, 2466, -61389, -55949, -65896, -52906, -45094, -53042, -20208, -28765, -70266, -69701, 6677, 73662, 38019, 30455, -56562, -67278, -73646, -134658, -160167, -122745, -121813, -77305, -15056, 2283, -88202, -35055, -19878, -146174, -164856, -113660, -43684, -41272, -68730, -62331, -33913, -47683, -23638, -83504, -57705, -26928, 27074, -6188, -16980, -20014, -114158, -72637, -58411, -46605, -13344, -37081, -42293, -16429, -40853, -21804, -2989, -39965, -93223, -76239, -20520, -32857, -89660, -116115, -85055, -27316, 2698, -33002, 3603, -18105]
8302a8105Q385R025m3729K772J4587k7736J44l831k4826L8171L1031L224M425
8289f463m5552J9603k1137L2576l9267k58K9537K1011n2638l359l9967n4054Q8920
8276g1048J2774L4888N49l1453j0665K3746j1964M2383n345k0377J9738K191j19
8263a4702m4552M8999J3993O440n4209p9998P8777k3446K3794M383k4816j1166
8251g6503o059M3598l0784M661M6758m025n8311j6494L7611M2801k3013L5380
8239d380K4346n9490k8722o70j8512n2253K2910j3385O7083M9348l3645p7848
8227a25218N2651J6986J066m3648k4190P2072p4387l9536O2907L3769K824J6278
8215d8426j2174K2751j4480L0080O494j0166J9737q632p5548L0057K6506o2972
$$ y = [-18105, -9720, -695, -44424, -41652, -27065, -54801, -54657, -58488, -83314, -45143, -14112, -10888, -6463, -52015, -32412, -53549, -20973, -60240, -60498, -30961, -9950, -62588, -65947, -105914, -159968, -71048, -58274, -23386, -22837, -54290, -64955, -41209, -53173, -10790, -16135, -36512, -16774, -14583, -14702, -59254, -10255, 3738, 10178, -44031, -124029, -45252, -68698, -44904, -40521, -65337, -76503, -82562, -38964, -69748, -65087, -18329, -22354, -80665, -97159, -59548, -16747, -39760, -4380, 19966, -39524, -68246, -68916, -87428, -139681, -116771, -130156, -63073, -13725, -47370, -125218, -72567, -55581, -54515, -98163, -122353, -50281, -124668, -164204, -101297, -67528, -64704, -48426, -60600, -37849, -52329, -22249, -15755, -25921, -6184, -14816, -90364, -60307, -33801, -96773]
8203i6773N0223N2092m8288m3329N1328M29J8402k0152r9993L4433k06073q6944
8191c94645M03611M926L785k897k6551k5616p9957k1227N1647L87Q554O2202P47
8178a5034L2274j2231J0809l0749K4441l9247K1212L1736l0337k8233K3003q83
8166a3239q3609R578N6064K9280m3713P898p657k8498O0430p8799K9906K9131
8154c3228M4234k3795n165k9782K0779K7065J7335N0270m7680m5022n6637o329
8142h7955K490N2961J0437M0750R322k18m1947j7072l5248m1608J9916P1036J8856
8129A720m2526N2026m6365m8349n2293m634O9515L5552L4128J7L0666m4586k3486
8116c8615K9319K033m9109K0092M1134M823q0620m6409L2368N3228k8027p727
$$ y = [-96773, -46550, 5542, -42746, -86075, -34747, -34318, -15916, -36068, -136061, -101628, -307701, -394645, 8966, 13892, 17677, 14780, -11771, -37387, -117344, -138571, -86924, -86537, -77983, -15781, -15034, 17240, 5009, 15818, -14931, 9510, -29737, -8525, 23211, -7126, -35359, -12356, -13239, -96848, -87270, -31206, -1926, -45639, -37741, -45398, -73896, -13466, -92265, -62359, -33228, 11006, -12789, -17954, -47736, -26957, 108, 17443, 67713, 20033, -24989, -81626, -87955, -85465, -32504, -22067, 18683, 28005, 27787, -14160, -31232, -66480, -108088, -88172, -17136, 1720, -40806, 11220, -35145, -83494, -135787, -140421, -70906, -35354, -1226, -1209, 29457, -15129, -38615, -9296, -7263, -56372, -36280, 4854, 9677, -70943, -117352, -84984, -31756, -59783, -67510]
8104f7510j476k4065J9894L3615k6521K0595K0590k3292J6460J0738m2360k0898
8092h4230j3188K7811R3492k1807n3356o2583O782P357J9673j0739L6309M8354
8080f125o320K2021N1j7304m9125l4825O3638p0182k4058P6557k866m5151K0592
8067g3097M6506K8830m2181l983K2332p44j0861J1862n3706M8248l1512n4829
8055a13135N2775L3030k0379N6757l5884m9430K3817n5769r162L8524l537L0011
8043e2382o435k7109l7694M1899J3051L866r417M46L1448K0663R51o6054P0974
8030a5793n8376K3292J0303P461K6970n7779J6858O9750K3681K523n3897N439
8018D32r486J1009k7721r426j2476K292j9859N6015j6119M5268K5835l9586p2978
$$ y = [-67510, -68986, -93051, -73157, -39542, -66063, -45468, -24878, -48170, -31710, -20972, -63332, -84230, -97418, -69607, 23885, 2078, -51278, -113861, -107079, -99722, -80049, -90788, -54479, -6125, -12445, 9576, 9627, -7677, -56802, -91627, -27989, -98171, -122229, -45672, -48538, -93689, -73097, -26591, 2239, -39942, -43925, -21593, -22337, -33198, -21336, -75042, -26794, -58306, -113135, -60360, -27330, -47709, 9048, -26836, -76266, -52449, -108218, -117380, -78856, -82393, -52382, -58817, -85926, -123620, -81721, -68670, -64804, -74221, -73775, -42327, -21664, -20713, -86767, -15793, -74169, -50877, -40574, -33113, -6143, -63922, -47064, 22686, 46367, 48890, -5007, 432, -9054, 1955, -25766, -35192, -47668, -45376, -65235, -9220, -25339, 19929, 45764, 6178, -66800]
8005f6800L3791M6555L1459n7814p1237K5635j9665L9163k1845j9867j9213L1829
7993f8009r300J5846J1023J3241N226J2901k3259p7482j2543K9022M6348m6525
7981a03511M1619M1694l5901o8166K7759O3568n7295J7568R3679m3107m5684O0564
7969g213m6123m9349L4272j9458l2587L4811j5330K9717M9491L0437l5213L2119
7957E574k6827j0553P2361J3191o7599J1836k2493j2666N6087N5228o8658Q153
7945A3634k8328l1055J2906j3332J901k3041J8354K9015J9616j4176m7889L5010
7933b7385J4669o1052L4477l8835l2093M0732L3883o31K5683l8792l1550K8379
7921e2515K1313n849r652k7226J5497L7937m969k242n335N3720j3110m1425K7348
$$ y = [-66800, -33009, 13546, 45005, -12809, -84046, -58411, -78076, -38913, -60758, -80625, -99838, -68009, -77309, -61463, -50440, -37199, -31973, -19072, -42331, -119813, -132356, -103334, -56986, -103511, -61892, -20198, -56099, -124265, -96506, -32938, -90233, -72665, 21014, -22093, -67777, -7213, -53336, -102685, -68413, -87871, -120458, -85647, -100977, -71260, -21769, 8668, -26545, 5574, -21253, -31806, 40555, 53746, -13853, -2017, -24510, -37176, 18911, 74139, 5481, 13634, -14694, -45749, -32843, -46175, -44274, -67315, -48961, -19946, -330, -14506, -62395, -27385, -12716, -73768, -39291, -78126, -110219, -69487, -35604, -36235, -10552, -49344, -80894, -52515, -31202, -37051, -46703, -73929, -58432, -20495, -25464, -27706, -33041, 20679, 7569, -33856, -6508]
7908f508j3130n557J9223K9982J4465k0698o1225m24J7792j8470p2884M5758P3607
7895A931k0442O340p1194M383p862k6920M0673N1915J1252O6272m2892r2284M5811
7882c3017k0362l9262o5969J05647m836j462M4452o8356M7083J8357k301m2123
7870f2149j6657R0516j7070M979j4209k6949K1624J3371j3954o2030p8356O7466
7858i3418Q9097L4993j1859l7327j4121N790M4378o0710m4122J9669r594J9333
7846e7891j8019l2795J9248O0617O0050k3723j00181J0217L5530j5980K7433K0235
7834a5259R811K3359n0111q7863J03176J09223R694p9080n0939k3050j1475N199
7822e7315J2366k1901l092k402k9958N3064K5958n5384m8992L7508L0248j9607
$$ y = [-6508, -19638, -25195, -5972, 24010, 38475, 17777, -43448, -43872, -26080, -44550, -117434, -71676, 1931, -18511, -12171, -83365, -78982, -86844, -113764, -73091, -21176, -9924, 56348, 13456, -78828, -33017, -53379, -92641, -158610, -52963, -57799, -59261, -14809, -83165, -36082, -17725, -20026, -62149, -78806, 11710, -5360, -381, -14590, -41539, -19915, -6544, -20498, -82528, -160884, -93418, -4321, 30672, 18813, -18514, -32635, -26845, 17533, -43177, -87299, -67630, -77224, -57891, -75910, -108705, -89457, -28840, 31210, 7487, -92694, -82477, -46947, -62927, -35494, -15259, -5448, 17911, -32200, -120063, -16887, 92336, 102030, 22950, -27989, -51039, -62514, -57315, -44949, -66850, -69942, -72344, -102302, -49238, -23280, -78664, -127656, -90148, -59900, -79507]
7810g9507O3824k7973n167K6761l8566q9300M4107n365k9416J11734P3721K3018
7798F7871j8590k3595J8302l0391m7189M3338k6308k7003m0423j0960p501l8342
7786a40791O5877L8063M1402L197k3486l6675k4090O3717L6342k6889j0593o297
7774b0223n7881j2683N3546P21J5072o3340r875Q6659j369n0427j7777K527J4363
7761f0687Q3261P0468p1315k6743J9357j1981m3398L1475N5718k9169K2062o0156
7749b1108o3772k2444N2664j2696k01L5690M9368m9432j0738o775j2093j2144
7737g3681L6915N6351k8072q026L931m98J8266M403n5813R906N6608l8133p5445
7724i3288m174K6749m977k5203L2565j4491K2782p708O6557M1234j0161p8243
$$ y = [-79507, -15683, -43656, -48823, -22062, -60628, -149928, -105821, -111186, -140602, -28868, 44853, 67871, 49281, 25686, 43988, 13597, -33592, 9746, -16562, -43565, -83988, -94948, -102449, -140791, -74914, -36851, 4551, 7748, -15738, -52413, -76503, -12786, 23556, -3333, -13926, -20223, -78104, -90787, -37241, -36520, -21448, -84788, -94663, -8004, -9373, -59800, -77577, -75050, -60687, 22574, 93042, 21727, -5016, 14341, 2360, -41038, -9563, 46155, 16986, 39048, -21108, -84880, -107324, -54660, -67356, -67557, -31867, 17501, -31931, -42669, -49444, -61537, -73681, -36766, 19585, -8487, -16513, -12582, -13080, 5186, 9589, -46224, -36318, 20290, -17843, -93288, -97462, -70713, -75690, -100893, -68328, -82819, -60037, -67745, -1188, 40046, 29885, -48358]
7712d8358l2348N1080m4805K2122K9613M6459q5402j1750K1236j1311J6462l1218
7700g8220j7586L959m107j2786N1529O1807P578m4357n5534K3317L3401m8809
7688g9808q301N3695J1485k9973n4859Q1786J8599m1870j3855K4910q388M427
7676d2152K2888N138K7793J4751K9278L0125o1389J640J6267j4310l5388p5573
7664h0932Q2069j3215N2232l2946l3698k1316K1606L4050o0203k8698J3350o209
7652g3910k301P2730k2743R242k2771j2268p7k6551k2168j5828J285M1627j4145
7639h7878J1750N7559L306j3289j8210j5028J0432K8898k7879k585K7939L7084
7627A2099K4158m7828J5433K0315n0843j6782M0936J4577O3423j7979k7740J7587
$$ y = [-48358, -80706, -29626, -74431, -52309, -22696, 23763, -61639, -73389, -52153, -63464, -47002, -78220, -95806, -91847, -95954, -108740, -57211, 4596, 12174, -32183, -87717, -64400, -30999, -79808, -88109, -34414, -22929, -52902, -107761, -25975, -7376, -49246, -63101, -38191, -46579, -42152, -19264, -14126, 13667, 28418, 57696, 87821, 26432, 28072, 44339, 30029, -5359, -80932, 1137, -12078, 40154, 7208, -26490, -47806, -26200, 7850, -52353, -81051, -67701, -73910, -76211, -3481, -26224, -16982, -39753, -52021, -52098, -78649, -100817, -116645, -115360, -73733, -87878, -76128, -18569, -15263, -28552, -46762, -61790, -51358, -22460, -50339, -52924, -24985, 12099, 36257, -11571, 3862, 24177, -26666, -43448, -2512, 12065, 75488, 57509, 29769, 47356]
7615D7356k4450j7547l6745M490n6860L9914J5402N2927L8597N082m3284l1607
7603f725N3876J7482l9663m1453K1032o468j1002J2846k5044J3000K5790p791
7591E880p0950p779k2942M6519k1411N9725K7262m1437J5779l1750L9719j7532
7579a8917K0500P2713J350M961m9279k5827k2217J2354j3778k2108M6866L7919
7567D4537l6011k6953l2783m5735P46O6657M2383M956k1947k6755p315k1713J6365
7554d3568k8399K8315j7999p708L0921N660K1035%m0339O6879K78N848k9396L9426
7540C0953k8521l6173M075J1662k863L1565k9872K7253L1089l4655l4217K0550
7528i154K1482m0216j0874k9202J0352M1279N8730l1974R360k3914O032M943o9851
$$ y = [47356, 22906, 5359, -31386, -26896, -83756, -43842, -28440, 24487, 63084, 68166, 24882, -6725, 47151, 64633, 24970, -16483, 4549, -1919, -12921, -75, -25119, -12119, 13671, 5880, -65070, -72849, -95791, -49272, -70683, -10958, 16304, -25133, -9354, -41104, -1385, -18917, 1583, 74296, 75646, 80607, 31328, 5501, -16716, -4362, -18140, -40248, 6618, 44537, 8526, -18427, -51210, -96945, -96199, -29542, 12841, 17797, -4150, -30905, -38220, -59933, -43568, -71967, -43652, -61651, -69359, -38438, -32778, -11743, -11743, -52082, 14797, 15075, 20923, -8473, 30953, 2432, -33741, -29666, -18004, -20867, 10698, -19174, 8079, 39168, 4513, -29704, -9154, 12328, -27888, -38762, -67964, -57612, -16333, 42397, 10423, 19783, -4131, 1901, 6844, -63007]
7515f3007R224k6520k592N4735N5848j5910l141k4419K8878K4695K0362k2034
7503C6119k2395n73l5399l7378j4629Q1832L9190m1350n7420J7394L0876L2033
7491B8300K1752j1046l5450M4518n1232q0891L1898J8421K5534m0617m3406N1035
7479d1184O9173P17m0622J5570k9075K4346K3874l364J197n286O8446m6124R400
7466D7068J9831n3046Q029L0060J434k8319m4740o54K373K0055O3689m9582J8986
7453C5184J7698r8638M473J0191n491j8308k5347k4776K5571O4818q403r6177
7441a19205J4037M4767m79N0914n2261N1766n5885l5756K5491L5537q0627N9676
7429f2025O4640J2830l0667N340N5159k3621l702j4791Q151K2021k0033j2794
$$ y = [-63007, -53783, -80303, -82895, -28160, 27688, 11778, 8637, -15782, 13096, 37791, 58153, 36119, 13724, 13151, -22248, -59626, -74255, 7577, 46767, 5417, -52003, -34609, -3733, 28300, 50052, 39006, 3556, 48074, -3158, -84049, -52151, -33730, -8196, -48813, -92219, -41184, 27989, 28706, -11916, 3654, -25421, -1075, 22799, 19435, 20632, 15346, 83792, 37668, 47068, 66899, 13853, 21882, 51942, 53376, 25057, -19683, -20337, -17964, 2091, 65780, 16198, 35184, 52882, -45756, -41283, -31092, -36583, -54891, -80238, -105014, -79443, -14625, -23028, -119205, -105168, -60401, -60880, -9966, -62227, -10461, -66346, -102102, -76611, -41074, -121701, -62025, 2615, 15445, -15222, -9882, 45277, 21656, 17954, 3163, 11314, 33335, 13302, 508]
7417E08j7144j4638N4619o399n8991O2286L5029n7097q901k6177N177J7599j8857
7404c2986l5620K7307o6054K1744O6493J4407K472K1472R707M836J7622k219l9455
7391I726k4671k3703M4664K3806M264j1947M030m3885l0104L0476j531j2219l0075
7378f1169L2646l8673n3539R1235M3967p5532L9373o517k8041R1747k477n5014
7366b1994L16n5243M5638O0153l2623J9409M3628k9737K4320j5218l7597k2025
7354b0973k7260L7858M8159K1014P040o8776M2366j8574q0070N6579L8271j1491
7342B4143k6931j286K628K6883m9855K8953R2964p1091o0424J2476m3010L0903
7330c3647M4630Q442n1961P3970l2608J0264k0390M3136K6243l8676M3812p6190
$$ y = [508, -16636, -31274, 23345, 16946, -42045, 20241, 55270, -1827, -10728, -36905, -31728, -14129, -32986, -68606, -41299, -107353, -85609, -19116, -4709, -2237, 19235, 28942, 33778, 51400, 49181, 9726, -14945, -38648, 6016, 29822, 34086, 22139, 26169, -17716, -47820, -17344, -18875, -31094, -61169, -28523, -67196, -120735, -29500, 14467, -61065, -21692, -28209, -56250, 35497, 33020, -21994, -21678, -76921, -31283, 28870, -3753, 15656, 59284, 29547, 53867, 38649, 1052, -20973, -48233, -10375, 37784, 58798, 65838, -2938, 39428, 20854, -59216, -2637, 35634, 24143, -2788, -4074, -1446, 25437, -24418, 4535, 97499, 26408, -34016, -21540, -64550, -33647, 10983, 19425, -32536, 41434, 8826, 19090, -1300, 41836, 68079, 29403, 73215, -2975]
7318b975j3428J5918O3913j8769L162P883k9015k6212j259J7578J7517k8918k4032
7305a8637K7629n6813O548O9880K0563k7482O5103l5623l6199M849O0553k7636
7293E2735p1267l2297j4945K8129P80L1339K9625k1416l6923M9594j6964r083
7281a0693o397K7918N586Q890j7601P5178j7203o6140M6485l1687L1089N9292
7269A04717l2980q0393m8727R887K7446k52m4162M1710l4960Q2165j6870o2866
7257e5285J1490K9371j3686k9750L8890l8426N1595M4424p199m038K0280l5890
7245A1776o1497m111K192N4535R218n1660J8740q330N2026l0707L1588M3233l5242
7232C1761j2792k3691p269L8099k4835J3419k0324R060q612j4167J0015R2078
$$ y = [-2975, -16403, -485, 63428, 44659, 47821, 55704, 26689, 477, -782, 16796, 34313, 5395, -18637, 8992, -47821, -41273, 28607, 49170, 21688, 86791, 51168, 14969, 19818, 80371, 52735, -18532, -50829, -65774, -37645, -36865, -5526, 24099, 2683, -34240, 15354, -1610, -10693, -17090, 10828, 16414, 25304, 7703, 82881, 65678, -462, 46023, 14336, 45425, 104717, 71737, -8656, -57383, -47496, -20050, -20302, -64464, -22754, -57714, 24451, 7581, -55285, -43795, -14424, -28110, -57860, -18970, -57396, -5801, 38623, 31424, 27386, 47666, 11776, -49721, -53832, -51640, 2895, 12113, -39547, -20807, -29137, 22889, -7818, 23770, 67003, 31761, 18969, -4722, -11991, 26108, 1273, 14692, -5632, 3428, -5184, -19351, -9336, 82742]
7220H2742r737l9798j580M1586n2052j11743J15132l217L5593N7799J8029n8367
7208G4387m0388m8749K9843p53l7188L030L1910J5652N3938j2883J7012K4729
7196A10540k0062j6985r554l9620k9091J6731J2001j0749O5598k4518n9591K2361
7184A7061J5222L5254n3919l9926m1642M0181l0260N559K9062N403M4838q968
7172A7865K6360M42k8979k57n1635M385P0628O3046r7894k5007K1147r982l4378
7159d4259O1358M7491m8133l4660o2705P2215r113l3381j9286P897O8808J5923
7147B2155N8804j9247r9344K4704N5655j9074j5943n0576j4658j5548P7022P4822
7135G8772j03402P927L5103J9753m4494J0161j6377m853K2650m5275M6136L7240
$$ y = [82742, 73005, 33207, 31627, 73213, 21161, -90582, 24550, 21333, 56926, 114725, 132754, 74387, 33999, -14750, 15093, 14340, -22848, -19818, 12092, 27744, 81682, 68799, 85811, 110540, 90478, 73493, 63939, 24319, -4772, 11959, 23960, 13211, 78809, 54291, -5300, 17061, 32283, 67537, 13618, -26308, -67950, -27769, -58029, -52470, -23408, -18005, 26833, 17865, 44225, 44667, 15688, 15431, -36204, -31819, 38809, 101855, 3961, -21046, 101, -9881, -44259, 17099, 64590, 16457, -18203, -80908, -8693, -17806, -51187, -70473, -62576, 6232, 22155, 80959, 61712, -37632, -12928, 42727, 23653, 7710, -42866, -57524, -73072, 3950, 78772, -24630, -16703, 18400, 38153, -6341, 3820, -12557, -17410, 5240, -40035, 6101, 43341]
7123D3341m9408M3203k9794n1672P140o148n559J5996O9580m6698N0511N16k0429
7110B0579j032J1390J1030p14k7905l4691q9516K8404N4436M6116n367q2373j3304
7097h2947O4472K9675l4474o153L7275j6730n9649J16148J1517n1701q3058P0873
7085d752L5212L7296k673k1646K1432K2407l9481P9879l2800p1298K9716k1840
7073C1452P66j8604Q1067j3918k1463n3582J92l6428j0464J3381j2238K3072N3371
7060C6604j3274J0335K6859k9443Q870l252J765J6481j3313m0826l188n4259K1367
7047c5274m2310M2187N7369L6601k2133q6099Q2230j65M413k8414P113O7685L0434
7034A13637k1297j8899l4184K2098R422j02420K4093P3013L9217K5258m2664j7771
$$ y = [43341, -6067, 37136, 7342, -44330, -37190, -43338, -48897, -32901, 36679, -10019, 40492, 41008, 20579, 19547, 30937, 41967, 41253, 13348, -21343, -110859, -82455, -28019, 18097, 12730, -69643, -82947, -18475, 11200, -23274, -29427, 7848, -8882, -68531, 47617, 59134, 7433, -75625, -4752, 30460, 67756, 65083, 43437, 64869, 87276, 47795, 127674, 94874, 23576, 53292, 31452, 32218, 13614, 94681, 80763, 59300, 5718, 5910, -30518, -40982, -27601, -39839, -16767, 36604, 23330, 33665, 60524, 31081, 39951, 36699, 38464, 54945, 41632, 806, -2382, -56641, -35274, -77584, -35397, 21972, 58573, 36440, -49659, 32571, 32406, 36819, 8405, 15518, 83203, 113637, 92340, 73441, 39257, 61355, 70777, -31643, -7550, 65463, 104680, 129938, 87274, 69503]
7022F9503k7043M485m7657P8337q222n8776N6860k438J4461M5527K197j51760
7010b4526L0585L6763J223L1393K1228R354J5343M157q9284J0551p949J2069M4181
6997I5088m5053m6558L6326K7862n5096j3926k5825K3343N2767L0855j3168k1353
6985D5262J9670J182k3359l8115J2478M6040q0485k5261N1626J1976K4356N6014
6973A01384l6164p1219L2523N5608n2463k8371K9885r0051l4839O4265L6407L5564
6961D2529K0152m3442K9357M357p269k217m1225l1615M6317M5487l8819l7691
6949a4079P5649o8907n1922o274L8441R0570J2714j584L1883n0313l9830K2658
6937C9006K8673l4630m8426K1478k102j0252n3679o377O6042N0698j4378M6008
$$ y = [69503, 42460, 46945, -712, 77625, 69403, 10627, 67487, 65049, 79510, 125037, 127234, -24526, 6059, 42822, 44045, 75438, 96666, 106020, 121363, 125520, 36236, 46787, 38838, 50907, 95088, 50035, 3477, 39803, 67665, 12569, -1357, -27182, -3839, 48928, 79783, 66615, 45262, 64932, 66114, 42755, 4640, 17118, 63158, -17327, -42588, 9038, 21014, 45370, 101384, 65220, -5999, 26524, 82132, 29669, 1298, 31183, -58868, -93707, -29442, 6965, 42529, 62681, 19239, 48596, 52953, 45684, 43467, 2242, -29373, 16944, 62431, 23612, -14079, 61570, -7337, -59259, -65533, -27092, 63478, 76192, 74608, 106491, 56178, 16348, 39006, 67679, 33049, -15377, 6101, 3999, -6253, -59932, -66309, -267, 50431, 36053, 82061]
6925H2061l1834j947J583j0602Q810K9121j3790l8964m204J3681R724k1208q275
6912A4156q5046O434P4961k3257K6978N9866m3885K7414J8949n9614m8627n924
6900c7595K9061L4015j826L926p51o2131R913k9623L963j6040M4926K2657k4588
6887b4093J08423k1657n7406N4036L2892m2875p531M9001k3376j8679o9867P609
6875a3523KN1010M7835l6087l1195N5842j3250j8482O0949O943j25930k7015O4697
6862B1796p516K0156o628k4653m117N2421m2206m3718N0824L6192m0183K2901
6850C5269O1553k3153J0408R728n2541n3823M8874k3041m5429j1267O4833M6959
6838F8370N3267q702n0421P701m5723j4122L5290O274j3980M1790j3660J4556
$$ y = [82061, 50227, 48280, 49863, 39261, 48071, 77192, 63402, 24438, 20234, 33915, 43639, 22431, 14156, -70890, -64456, 10505, -12752, 14226, 74092, 30207, 57621, 76570, 16956, -31671, -37595, -8534, 25481, 23655, 27581, 26830, -35301, -25388, -55011, -51048, -67088, -22162, 495, -24093, 84330, 62673, 5267, 59303, 92195, 49320, 41789, 90790, 67414, 48735, -21132, -13523, -13521, 37489, 85324, 49237, 18042, 73884, 60634, 42152, 103101, 110044, -15886, -42901, 21796, 14280, 34436, 27808, 3155, -962, 51459, 9253, -34465, 16359, 52551, 12368, 35269, 96822, 73669, 84077, 93805, 41264, -12559, 36315, 13274, -32155, -43422, 21411, 68370, 121637, 112935, 62514, 70215, 24492, 10370, 45660, 51934, 37954, 79744, 66084, 80640]
6826H0640k0583k9580M567l1054o9712P5279m299N9712k3453o509J4101n226l7222
6813F661K0375l9139P89n3309k8995N0076P0092m0670k1524M3907m533L7354L514
6800D4598k8781K3440o164n6009l1604N5898K6701j7012J5577j5020N8286J157
6788G1067k217l2343k7490o1707k6717M3685P6639M561L3486p5399j2594K2393
6776A3364m439J4180K8395j2746O981M5693r328j2753k3321k5987M1320N1168
6764A12527M2306p217k0076j1360n1347K016Q798M028K8889L9750k1265k53o8637
6751E8159k1563O2773k132m1231p385O0714M8756N9967n7134j6120L6323K1580
6739B02707J0508k0311l2713M0877k0114J0956k7022m6776l2435N7292N41j8257
$$ y = [80640, 60057, 30477, 35044, 3990, -65722, 9557, 5258, 64970, 41517, 35008, 49109, 43883, 6661, 27036, -12103, -11314, -64623, -93618, -43542, 26550, -14120, -35644, 8263, 3730, 41084, 44598, 15817, 39257, 33093, -22916, -54520, 1378, 28079, 11067, 26644, 11624, 69910, 71067, 68850, 36507, 9017, -52690, -79407, -35722, 40917, 45478, 78964, 3565, -9029, 13364, 8925, 23105, 51500, 38754, 45735, 91428, 82100, 69347, 46026, 20039, 61359, 112527, 154833, 147616, 127540, 116180, 64833, 66849, 75647, 79675, 108564, 148314, 127049, 126796, 58159, 36596, 99369, 97237, 56006, 48621, 109335, 158091, 218058, 160924, 144804, 181127, 202707, 213215, 192904, 160191, 201068, 180954, 191910, 164888, 118112, 85677, 142969, 143510, 125253]
6727A25253J5034o3420K6315R916j8173L1493L0021k8306N6983Q245j226k8659
6715A63476l6723n1410J9166K8827k1494J1564J5691m6529m5825O9633j3616m3458
6703D9302q928L6877J7794J6344k1976q7407J1515K4298L1029M3796o4954K5199
6691G2889M3274k9503m7782L2454K0678j1368N468L7164K2354m9908j5628J7823
6679I7915J7559k2462R0079q817r4460l2166k6974L3466P8060j1355m7724n4459
6667A8662K7751J0225L2427K0527k5868n1247K9929j4305k6661K2735K0091M0887
6655A05153P119j2087O9966K5905m1697j1076j1570K9952o9801J4246k2841l3008
6643E0261R6596L01k8717O0276o845j07629M3425N8142Q39L319L7631J4209J178
$$ y = [125253, 140287, 76867, 103182, 113098, 94925, 126418, 156439, 128133, 185116, 193361, 192135, 163476, 126753, 75343, 94509, 123336, 101842, 113406, 129097, 82568, 36743, 106376, 92760, 49302, 40374, 77251, 95045, 111389, 89413, 2006, 13521, 37819, 68848, 112644, 47690, 72889, 116163, 86660, 38878, 71332, 92010, 80642, 86110, 123274, 145628, 95720, 80092, 97915, 115474, 93012, 183091, 174274, 79814, 47648, 20674, 54140, 132200, 120845, 73121, 18662, 46413, 56638, 89065, 109592, 83724, 32477, 62406, 48101, 21440, 44175, 64266, 105153, 112272, 100185, 170151, 196056, 154359, 143283, 131713, 161665, 91864, 106110, 83269, 50261, 146857, 147158, 118441, 178717, 171872, 64243, 107668, 165810, 166649, 169968, 207599, 221808, 222986]
6630B22986L5872M8781K4290j7826q450n2219j4023l3819n4596K7514O3361k0024
6618B21847L487J7986M480p0694m6176N6446n70L042l8350j8031M3036n0423K8648
6605A54728k7402J5292l897p630k90l5419L878k735K7183R131k6769l4880L990
6592G5180j217P0947P392l6475j7985k9559K2221K119K8181j935m7333q987q112
6579E4437n311K1700J7915J7245J7168m2637M573j6642J4146Q217m4123K6467
6567G3155R1570k866m2596m5966R988K0830l0372K4620M9745P1529n9245m4127
6555A16265L4595k5001L8202n6390k9588O54j0308j9664l4964K4368N1116J3402
6543A02687q636n2279M2695N7191m7353O159M246n1096j2466L7218K5258K164
$$ y = [222986, 258858, 307639, 331929, 314103, 305653, 253434, 239411, 205592, 150996, 178510, 241871, 221847, 225334, 243320, 247800, 177106, 130930, 187376, 186806, 189848, 151498, 133467, 176503, 126080, 154728, 127326, 142618, 138721, 131091, 130801, 95382, 99260, 96525, 123708, 132839, 106070, 71190, 75180, 73963, 144910, 152302, 115827, 97842, 68283, 90504, 92623, 120804, 118869, 71536, 62549, 54437, 49126, 70826, 88741, 105986, 123154, 80517, 85090, 68448, 82594, 90811, 46688, 73155, 164725, 161859, 119263, 73297, 83285, 104115, 73743, 98363, 148108, 219637, 160392, 116265, 150860, 125859, 164061, 107671, 78083, 78737, 68429, 48765, 13801, 38169, 89285, 102687, 94051, 41772, 84467, 141658, 94305, 100464, 104710, 53614, 41148, 78366, 103624, 105788]
6531A05788k3215m8306J4905Q3465l9772K8168o1495J3154J0775m5417L6756K6097
6519A00903M7433K2167n748J4282p6622K9824J0861o6876P1508O3841l2861K3037
6507B01749l5966k9278R0407k5973l9641L1355m125J1190M4694L6028o245k8258
6495B45937q548j1342L602m4477L8749p2511K0563L1282l420j3990K863J0861
6483A99569J3718J7252m7907n6407j7346K1057l7738J9193m6620m566O2196n607
6471A16794M5772k0263m8168K5019k854M5172j3394o3132O291P1540Q7474o1790
6459A88461l6016R166k5691j5513L099M071p0707N3490o0814L4188L5570k1144
6447I8160L6085p060R752l1372q115P3889j9611l2714m874m1214M4706K9097k5660
$$ y = [105788, 82573, 34267, 49172, 132637, 92865, 121033, 59538, 72692, 83467, 38050, 74806, 100903, 148336, 170503, 164755, 179037, 102415, 132239, 143100, 76224, 147732, 211573, 178712, 201749, 165783, 136505, 226912, 200939, 161298, 192653, 188528, 199718, 244412, 280440, 274195, 245937, 237389, 226047, 229649, 185172, 223921, 151410, 171973, 203255, 199835, 185845, 188708, 199569, 213287, 230539, 182632, 126225, 108879, 129936, 92198, 111391, 64771, 60205, 122401, 116794, 162566, 142303, 94135, 119154, 116300, 161472, 148078, 84946, 91237, 162777, 250251, 188461, 152445, 161611, 135920, 120407, 123506, 127577, 56870, 110360, 49546, 83734, 119304, 98160, 134245, 127185, 136937, 105565, 97450, 171339, 151728, 119014, 114140, 72926, 117632, 146729, 121069]
6434A21069j9497k5906o3562N1293L2221q052K133J2412K5754L4869l2602M2055
6422A72187M1802m9172l0225k4575Q3402l7288n7419O6503N1105K4162m7929o6648
6410A25905n4266L2784k7720N4139M7904l7607l7685n7342Q6922J4014j5436k40
6398A31372j0567L0693K428J766j1075J6398O1067m2718M716L1753o134l5914
6386A73785l6495R5304R719l4636l6724q483J9210l360M2918K3425K020m7311
6374A99372J8670q6177L468J29694k5480J0373M7697l9992m950J6498J6658n6030
6362B29801K6850J5879o0790J02788n0631L4789k7541l9284K6192l268M3318j7643
6350B80460k1064l753M186M6651P780r657l7293k6799j5939j8296J6767j9028
$$ y = [121069, 101572, 75666, 12104, 63397, 95618, 87566, 89699, 102111, 127865, 162734, 130132, 172187, 213989, 164817, 134592, 110017, 193419, 156131, 98712, 165215, 216320, 240482, 192553, 125905, 71639, 104423, 76703, 130842, 178746, 141139, 103454, 46112, 133034, 147048, 131612, 131372, 120805, 151498, 153926, 155692, 144617, 161015, 222082, 179364, 184080, 215833, 209699, 173785, 137290, 232594, 242313, 207677, 170953, 162470, 181680, 178320, 221238, 244663, 246683, 199372, 218042, 131865, 135333, 265027, 239547, 249920, 297617, 257625, 252675, 269173, 285831, 229801, 256651, 272530, 211740, 314528, 263897, 298686, 271145, 231861, 258053, 254785, 298103, 280460, 259396, 255643, 259829, 306480, 314260, 304603, 267310, 240511, 224572, 206276, 223043, 204015]
6338B04015k55L1999l8767M2267M3884r948R897q167P1823K521J9449J5720r0147
6325B94291n1785N3830L4267j3157j00158K8337P7421l8210N2650J9062k1807
6314C34741J2698j5605O0498K3415K4034p0967k1479R3552K2060N4428n4768K8343
6302D90950j9564M0220Q8028J2178m7604K0205J23031m0304o4725J3436L5969
6291F51820m6746m8771M6085K8616K8114M443k5709J8862M8074J18413j9770K9692
6279H33123o1491p684Q1336M6572j6704P2116K7315M6016K5048M4173J36912M5948
6267A272680j202k2645J0326L3683j687o1606J6012k2812k5304k8238P1481Q132
6255A248820l0470p1497N0383N7698M6068j7581q404M9535M0803J8798o395J5205
$$ y = [204015, 203760, 235759, 196992, 239259, 283143, 273195, 283092, 274925, 346748, 349269, 368718, 384438, 294291, 242506, 296336, 330603, 317446, 217288, 245625, 323046, 284836, 337486, 356548, 334741, 347439, 331834, 392332, 415747, 439781, 368814, 347335, 440887, 462947, 517375, 462607, 490950, 471386, 511606, 599634, 611812, 564208, 584413, 707444, 667140, 602415, 615851, 651820, 605074, 556303, 602388, 631004, 659118, 663561, 637852, 656714, 704788, 823201, 803431, 833123, 771632, 763948, 845284, 891856, 875152, 947268, 974583, 1020599, 1045647, 1089820, 1226732, 1272680, 1271478, 1248833, 1259159, 1292842, 1291155, 1229549, 1245561, 1222749, 1197445, 1169207, 1240688, 1248820, 1218350, 1146853, 1197236, 1254934, 1301002, 1283421, 1275017, 1324552, 1365355, 1384153, 1377758, 1392963]
6243A392963l9566q6973p4369M9144q466m4651j4643o094M453j04723o5091l7758
6231I64226L906J5433M6511M2319K7528N1397k2996k3075P017O4245r9728j23877
6219I52906j7121j29598r1781k9585m6379k6169P259O107m9156L714k9349j5320
6207E35528K7081n5861o262k2567L8965L7381m5886k3652m8303J8343k9170J7415
6195D43012N1650R47j1832m4975K5056L9634m899l5369J7615Q954p2825j5171
6183D01797Q476K9865L3800k0004l1360K1373L3318J9383o654J5909Q3421M9478
6171F38802l8670k0172k9535L2978K4369J5765k3815P5470N3505N8298m7659q1490
6159F57846j4151k3997J1556j8094J3226j7414m6652K5870L0834k4729q4698N3774
$$ y = [1392963, 1353397, 1266424, 1192055, 1241199, 1232733, 1188082, 1173439, 1167345, 1171798, 1067075, 1001984, 964226, 968132, 983565, 1030076, 1072395, 1099923, 1151320, 1128324, 1105249, 1112266, 1176511, 1076783, 952906, 935785, 806187, 714406, 684821, 638442, 612273, 619532, 625639, 576483, 580197, 550848, 535528, 562609, 506748, 500486, 477919, 516884, 554265, 508379, 484727, 436424, 454767, 425597, 443012, 494662, 495609, 483777, 438802, 463858, 503492, 498593, 463224, 480839, 489793, 416968, 401797, 410273, 440138, 473938, 453934, 422574, 443947, 477265, 496648, 489994, 505903, 589324, 638802, 600132, 579960, 550425, 583403, 607772, 623537, 599722, 675192, 728697, 786995, 739336, 657846, 643695, 619698, 631254, 613160, 626386, 608972, 562320, 588190, 619024, 594295, 509597, 563371]
6147E63371K9676o9160L6308J3984L6843N2460Q8276K5273J3249M6909j8674k7659
6135G90856j2835q3200k8374m5391n2852K8711J8163k9215J463n6559K9793j2502
6123E48058k3132J1304j0557k8834j8012j4179N6281J6791k8068O2507n398j2342
6111E54419Q4275j4205p522o1680m4328l3929k8852j56L6901K5814l237l4634
6099D72866j6057M6690j412o08r0713L8415L2266J6373K0716J0434J814J8351
6087E49135M6932l9491j4772J4607p68p8012Q764M1326M1753R4344o5794m9728
6075E48296N6408L1348L2613k9788n462n208n1608j3640O087J0093M9021O4934
6063F93094k0878K958n146M659O953O9955n2031l0626k6711K8160P5930k5681
$$ y = [563371, 593047, 523887, 560195, 574179, 611022, 663482, 751758, 777031, 790280, 837189, 818515, 790856, 778021, 694821, 666447, 621056, 568204, 596915, 615078, 585863, 587326, 530767, 560560, 548058, 524926, 536230, 525673, 496839, 478827, 464648, 520929, 537720, 509652, 572159, 566761, 554419, 638694, 624489, 616967, 555287, 510959, 477030, 448178, 448022, 484923, 510737, 507500, 472866, 456809, 503499, 502087, 501479, 410766, 449181, 481447, 497820, 518536, 528970, 530784, 549135, 596067, 556576, 541804, 556411, 555643, 477631, 486395, 527721, 569474, 663818, 598024, 548296, 604704, 636052, 668665, 638877, 633415, 628207, 576599, 562959, 569046, 579139, 628160, 693094, 672216, 675174, 670028, 674687, 681640, 751595, 699564, 668938, 642227, 670387, 746317, 720636]
6051G20636k401j0193K2909M978L819N9595k1751m5008L1864J2576p8565J4521
6039G12980L782m4818O6417P1517j2818M0380L2907n7795N0888N4295j983L203
6027I18955j4242j3168L2558J3563K3346L9430J554p512J6311K7065K235L5394
6015A075489k2382N704M1351M7194l2869R253M7965l0787L9405R3774P5709J0839
6003A360645N2055J30058J1162j1390J35324J01251J08076J68538J54312J21599
5993B331630O5035l8417Q770n2618o5111r2544m3173K9350n0814q2394K2190M236
5981B036140Q4489M0401R6783J29074L7241J29232K57664K36076P5396J24664
5971C247160Q4309N3847r1282j33519j13493j39856j68750j56794j00178j51300
$$ y = [720636, 718235, 708042, 730951, 735929, 739748, 799343, 777592, 732584, 764448, 777024, 698459, 712980, 716762, 671944, 738361, 809878, 797060, 837440, 870347, 812552, 863440, 917735, 915752, 918955, 904713, 891545, 924103, 937666, 961012, 1000442, 1001996, 994484, 1010795, 1037860, 1040095, 1075489, 1053107, 1058811, 1100162, 1147356, 1114487, 1123740, 1171705, 1140918, 1180323, 1274097, 1349806, 1360645, 1412700, 1542758, 1553920, 1542530, 1677854, 1779105, 1887181, 2055719, 2210031, 2331630, 2396665, 2358248, 2367018, 2314400, 2249289, 2156745, 2113572, 2142922, 2092108, 2009714, 2031904, 2036140, 2120629, 2161030, 2257813, 2386887, 2424128, 2553360, 2811024, 3047100, 3122496, 3247160, 3331469, 3385316, 3294034, 3160515, 3047022, 2907166, 2738416, 2581622, 2481444, 2330144]
5961B330144j9858J8746m4813J9124O420K0382M2160K6240N4822J27278P7491
5950B658136J11696P2127J16670r26j74210j99266k58627j43404j96710r6596
5940A888890k9305p4437J1213j7904j8119L71k6846l1026o4702m5287q776l1088
5928A552984q691Q757L8494K0421p2911j4008M306k275l3198o8090j2010J9800
5916A433579q926P4689l418j11547J7363L2955M6633K0752j7661k447L0519Q6026
5904A598517j5260j6706R557L9752M0873l0660J9815L4274J4002k6681p035R6311
5892A756759J2750k4937L2870K3221M9436J1018k9416N8056O7086j0128P3291
5881B020006k4294o119K8790J7533j1948K706M8340N1423L9593j6Q4113K4604
$$ y = [2330144, 2310286, 2329032, 2284219, 2303343, 2309763, 2330145, 2372305, 2398545, 2453367, 2580645, 2658136, 2769832, 2841959, 2958629, 2957703, 2783493, 2584227, 2325600, 2182196, 1985486, 1888890, 1859585, 1785148, 1796361, 1778457, 1760338, 1760709, 1733863, 1702837, 1638135, 1592848, 1584072, 1552984, 1544293, 1553050, 1591544, 1611965, 1539054, 1525046, 1529352, 1527077, 1493879, 1425789, 1413779, 1433579, 1424653, 1499342, 1495924, 1384377, 1401740, 1434695, 1481328, 1502080, 1484419, 1481972, 1512491, 1598517, 1583257, 1566551, 1576108, 1615860, 1656733, 1626073, 1645888, 1680162, 1694164, 1667483, 1660448, 1756759, 1769509, 1744572, 1777442, 1800663, 1850099, 1861117, 1831701, 1889757, 1956843, 1946715, 2020006, 1995712, 1989593, 2018383, 2035916, 2023968, 2026674, 2075014, 2126437, 2166030, 2166014, 2250127, 2274731]
5869B274731k230N2074J1087Q142K9500L7272J07781m1369n9859J33932M0450
5858B591511o6027O1789J9400M5432J09890J283K7926M2751J2079m332Q7318K9849
5846B958869J0039Q8698K2058N0351N3051m4792K7684O7928P4691J3771j6627
5835C305721O8828N3951k632P697N4345Q2982O162P0277L7640k3866Q1198K8202
5823C770505P4010J4988N4561M6258J8799J06068m24J220o803K7364J6807p113
5811D116240P0775M3174j0321N6181N2414M6727J09704M5058P5381M6014R7391
5800D748738J54104J2541K8918N3281P263R1203R2501O0477L8727P5347K9803
5789E392903K1387K1193R2017J24301R4624P2400J27763J26106J51965J76152
$$ y = [2274731, 2272501, 2324575, 2335662, 2343804, 2373304, 2410576, 2518357, 2476988, 2417129, 2551061, 2591511, 2525484, 2587273, 2606673, 2652105, 2761995, 2763278, 2791204, 2833955, 2846034, 2841702, 2929020, 2958869, 2968908, 3057606, 3079664, 3130015, 3183066, 3138274, 3165958, 3233886, 3308577, 3322348, 3305721, 3374549, 3428500, 3425868, 3433565, 3487910, 3570892, 3577054, 3647331, 3684971, 3661105, 3742303, 3770505, 3844515, 3859503, 3914064, 3960322, 3979121, 4085189, 4084765, 4085985, 4079182, 4106546, 4123353, 4116240, 4187015, 4230189, 4219868, 4276049, 4328463, 4375190, 4484894, 4529952, 4605333, 4651347, 4748738, 4902842, 4915383, 4944301, 4997582, 5004845, 5096048, 5188549, 5249026, 5287753, 5363100, 5392903, 5414290, 5435483, 5527500, 5651801, 5746425, 5818825, 5946588, 6072694, 6224659, 6400811]
5779F400811J01390J59825J19500J50763J74232J47525J68271J16238J77548K00143
5769G916246J93851K74790L22958K72323L34358L93855L99567N53003N86687N98068
5759A1845706N49521M64814L45732K04020J68490K92374L68674L44074J96558
5750A4779963r4961j01954k5647l2779N6275K02691L01333M29057N30526M97764
5740A6542268N79316P36851Q85304J040987J038634Q96233P95340Q40028R65440
5731B4320401J037844J054300Q85143O43530L14680K5254j86562l65630m00476
5722B7328484m28984m01155l13822j58848M4191K82374M99458O33451Q56405J037666
5712B9379220J292867J553898J796002J970434K174895K274193J950954J499095
$$ y = [6400811, 6502201, 6662026, 6781526, 6932289, 7106521, 7254046, 7422317, 7538555, 7716103, 7916246, 8110097, 8384887, 8707845, 8980168, 9314526, 9708381, 10107948, 10660951, 11247638, 11845706, 12395227, 12860041, 13205773, 13409793, 13578283, 13870657, 14239331, 14583405, 14779963, 14685002, 14583048, 14557401, 14524622, 14580897, 14783588, 15084921, 15513978, 16044504, 16542268, 17121584, 17858435, 18743739, 19784726, 20823360, 21719593, 22514933, 23354961, 24320401, 25358245, 26412545, 27297688, 27941218, 28255898, 28281152, 28094590, 27728960, 27328484, 26899500, 26498345, 26184523, 26025675, 26069866, 26352240, 26851698, 27485149, 28341554, 29379220, 30672087, 32225985, 34021987, 35992421, 38167316, 40441509, 42392463, 43891558]
5704D3891558J135110R36813P33519K37665P0072R1346L12275O16572J115378
5695D9140308J602124K317207K885962L430586M098611M480077M621667M523563
5687G7100105M602395M830032N268049N629992O389813P439695R022993J1139781
5679A31422855J3665596J6450387J9566688K2427267K2122918J7515477R103781
5672B52274969p83830p965965j1170321j0934549q932448p035026n535742l866188
5664A96050900j590779Q46117L222598N434655Q177353J2016646J6991414K2321817
5656B63470721K7788156L3904844L6781016L1359176J8208149K417261j0056267
5649D03873056j5695605j7204648j9118314k2334878k3891270k3198073k0985113
$$ y = [43891558, 45026668, 45963481, 46697000, 46934665, 47004737, 47096083, 47408358, 48024930, 49140308, 50742432, 53059639, 55945601, 59376187, 63474798, 67954875, 72576542, 77100105, 81702500, 86532532, 91800581, 97430573, 103820386, 111260081, 120283074, 131422855, 145088451, 161538838, 181105526, 203532793, 225655711, 243171188, 252274969, 251491139, 243525174, 232354853, 221420304, 212487856, 205452830, 199917088, 196050900, 194460121, 195306238, 198528836, 203963491, 212140844, 224157490, 241148904, 263470721, 291258877, 325163721, 361944737, 393303913, 411512062, 413929323, 403873056, 388177451, 370972803, 351854489, 329519611, 305628341, 282430268, 261445155]
5642B61445155j8281245j4982811j1076807p377897l912080n84470L293916P750460
5634B16274221J1927482J5121888J8032327K1748705K3761401J8393968M405608
5627C29665600j2286314k4465196l0228761l1178236k9109676k5257946k0776798
5620A56362673j6617687j3383428j0931520r237821q098109p266610o567844n808818
5612G8450836n147192m633569m317281l952766l650762l435104l136420k898613
5604D7279129k622018k343819k066176j818091j608495j379833j069091r35771
5596C3435835p08305p49453q79649r77992j089731r80514q94216p29917p65194
5587B5660864q08547j015597j030207r38480r35569q13883o60262o48103p01668
$$ y = [261445155, 243163910, 228181099, 217104292, 209726395, 205814315, 205229845, 208523761, 216274221, 228201703, 243323591, 261355918, 283104623, 306866024, 325259992, 329665600, 317379286, 292914090, 262685329, 231507093, 202397417, 177139471, 156362673, 139744986, 126361558, 115430038, 106192217, 98094108, 90827498, 84259654, 78450836, 73303644, 68670075, 64352794, 60400028, 56749266, 53314162, 50177742, 47279129, 44657111, 42313292, 40247116, 38429025, 36820530, 35440697, 34371606, 33435835, 32727530, 31978077, 31098428, 30120436, 29030705, 28050191, 27155975, 26426058, 25660864, 24852317, 23836720, 22806513, 21868033, 20932464, 20118581, 19458319, 18810216, 18108548]
5578A8108548n68103n12994n28811n16493m36276l78339m34425l98592l27646
5569A4006869l63913l52105k57403k28644k66067l16301k13101j30238j50088
5560A1729009r2158r0983j48568m6335l6926l6869m8117p0057q6952p9543j2779
5549A0979722l2897Q6778J05385J14661N2521m613j45792k40357l60736k87772
5539A0266900j65968j37965j90184q2034k9502j44162j41319j47230j14580M7123
5529I161079n3610n2881o0740r780q941r7158P479L3870L8038k553O4134N9775
5517I078712J13328J05740J71067K01085J43403J11702K00124Q4647M3360L9952
5507A0293120o781m1578k8892Q511K7128k0587l088Q2665L5437m1862Q3429J43764
$$ y = [18108548, 17540445, 17027451, 16498640, 15982147, 15545871, 15167532, 14733107, 14334515, 14006869, 13642956, 13290851, 13033448, 12804804, 12538737, 12222436, 12009335, 11879097, 11729009, 11636851, 11545868, 11397300, 11350965, 11314039, 11277170, 11229053, 11158996, 11072044, 10992501, 10979722, 10946825, 11033603, 11138988, 11253649, 11306170, 11301557, 11155765, 10915408, 10554672, 10266900, 10100932, 9962967, 9772783, 9690749, 9661247, 9517085, 9375766, 9228536, 9113956, 9161079, 9107469, 9054588, 8993848, 8984068, 8975127, 8877969, 8885448, 8919318, 8957356, 8954803, 9018937, 9078712, 9192040, 9297780, 9468847, 9669932, 9813335, 9925037, 10125161, 10209808, 10253168, 10293120, 10286339, 10244761, 10215869, 10224380, 10251508, 10230921, 10227833, 10310498, 10345935, 10304073, 10387502, 10531266]
5495A0531266P4014J41312K34407J47098J35882K52507K30474J57650J72833J56386
5485A2233829K16907K46957K37884M09832L01676K51178K98181M17798M41793
5476A5056035M50424M90096N29690N97980O65058O78499O92445Q88183Q90082
5467B0938492R46490J100306J170241J186640J305297J354949J377402J418614
5459C0798431J525774J510320J345340J460327J513608J647570J735092J949204
5451D3485666K154884K272336K552994K811560L123068L420017L799010M162618
5443F7782153M448487M870367N380615N923081O446839P027940P723819Q536729
5435A18140030R561231J0659893J1975480J3483691J5109170J6680284J8036945
$$ y = [10531266, 10605280, 10746592, 10980999, 11128097, 11263979, 11516486, 11746960, 11904610, 12077443, 12233829, 12450736, 12697693, 12935577, 13345409, 13647085, 13898263, 14196444, 14614242, 15056035, 15506459, 15996555, 16526245, 17124225, 17789283, 18467782, 19160227, 20048410, 20938492, 21884982, 22985288, 24155529, 25342169, 26647466, 28002415, 29379817, 30798431, 32324205, 33834525, 35179865, 36640192, 38153800, 39801370, 41536462, 43485666, 45640550, 47912886, 50465880, 53277440, 56400508, 59820525, 63619535, 67782153, 72230640, 77101007, 82481622, 88404703, 94851542, 101879482, 109603301, 118140030, 127701261, 138361154, 150336634, 163820325, 178929495, 195609779, 213646724]
5428B13646724J8448210J7249574J4160396R375169L601493j852730o065291q571888
5420B59991657r617813r384336q142452o281786l972136j598789R59722L513263
5412B25467330O088536Q675572J0903614J2927828J4345392J4866803J4454020
5405C07729095J3254882J1330706Q411754M227512j442544p532375j3226989j7135447
5397C05616594j9116275j9398143j8310101j6230668j3756732j1002203q347148
5390A99455324n869209l679050j802365l6099J409958K791178L828431M286114
5382B00384282L811053K109163q60421m576589q256866j1205679j3061519j3800690
5374A54542734j3625347j2901415j1639183j0351182r127456p966035o990923
$$ y = [213646724, 232094934, 249344508, 263504904, 272880073, 276481566, 274628836, 268563545, 259991657, 250373844, 240989508, 232847056, 226565270, 222593134, 220994345, 221954067, 225467330, 231555866, 240231438, 251135052, 264062880, 278408272, 293275075, 307729095, 320983977, 332314683, 340726437, 344953949, 343511405, 335979030, 322752041, 305616594, 286500319, 267102176, 248792075, 232561407, 218804675, 207802472, 199455324, 193586115, 189907065, 188104700, 188068601, 189478559, 192269737, 196098168, 200384282, 204195335, 206304498, 205444077, 200867488, 192610622, 181404943, 168343424, 154542734, 140917387, 128015972, 116376789, 106025607, 96898151, 88932116, 81941193]
5367H1941193o096241n331837m795901m249253l760662l438833l073978k849705
5359D8344783k591369k407154k139616k053066j949228j869465j585267j502927
5351C2246691j320418j250478j190597j058689r17195p07109q11169q19495p80104
5342B3391437p82976q51679p60886p63534p28023o28849o74483n77178n38514
5333A7085315l68289l45000k76027k27732j55494j47157k13323j69432k39217
5324A4943644k38966l60647k78473k97563m51237m11830l86211l68716l55886
5315A1794115l53514l05646k96923k62919k20017r8063j51599j02961r74k9755
5305I971744n7393m3366N9057q587K4991J94976K44391L52647M18340L94828L52424
$$ y = [81941193, 75844952, 70513115, 65717214, 61467961, 57707299, 54268466, 51194488, 48344783, 45753414, 43346260, 41206644, 39153578, 37204350, 35334885, 33749618, 32246691, 30926273, 29675795, 28485198, 27426509, 26509314, 25802205, 24991036, 24171541, 23391437, 22608461, 21756782, 20995896, 20232362, 19504339, 18875490, 18201007, 17623829, 17085315, 16717026, 16372026, 16095999, 15868267, 15712773, 15565616, 15352293, 15182861, 14943644, 14704678, 14344031, 14065558, 13767995, 13316758, 12904928, 12518717, 12150001, 11794115, 11440601, 11134955, 10838032, 10575113, 10355096, 10257033, 10105434, 10002473, 10001499, 9971744, 9914351, 9870985, 9930042, 9921455, 9946446, 10141422, 10385813, 10738460, 11156800, 11551628, 11904052]
5294A1904052L21042N8976n9463j38115k07156k59419k58494l05665j72731L805
5284A0886832P8923K57985N38114P53228O23122J67774m10977p60223r67749r60627
5274A0206402q19161o26708m60803m10357k31211j08618K927R1235J49303K12542
5264H005551K99686K97157K22160O6095r2456j96786k39060l42808m71388m31546
5254G116605m57531m14166l89987l68360k66938k89157k60520j60956j87556r2270
5244D229164j76777j02963n1638k2135p3943j30299q198l2970J2193P2768O0982
5233C776184r356K3196R3943K5385J22619O5143n0298j1877r5789j05351r5368
5222C738431j08466j15077j09964n0198m4465l1602j5695m1153L5845P7299m444
$$ y = [11904052, 12225094, 12284070, 12224607, 12086492, 11879336, 11619917, 11361423, 11055758, 10883027, 10886832, 10965755, 11223740, 11761854, 12515082, 13138204, 13305978, 12895001, 12134778, 11167029, 10206402, 9387241, 8760533, 8299730, 7889373, 7658162, 7549544, 7552471, 7643706, 7793009, 8005551, 8305237, 8602394, 8824554, 8890649, 8798193, 8601407, 8362347, 8019539, 7548151, 7116605, 6659074, 6244908, 5854921, 5486561, 5219623, 4930466, 4669946, 4508990, 4321434, 4229164, 4052387, 3949424, 3897786, 3875651, 3801708, 3671409, 3663211, 3630241, 3642434, 3715202, 3776184, 3766828, 3790024, 3883967, 3909352, 4031971, 4097114, 4046816, 4034939, 3939150, 3833799, 3738431, 3629965, 3514888, 3404924, 3354726, 3310261, 3278659, 3262964, 3221811, 3257656, 3334955, 3330511]
5211C330511m8763j30242j32198o4041n1148p6781j20057o9111j09426o0347j6397
5200B452000p0340N0709j1432o9047N428O3883O938M0966j3178q240J58437Q8713
5188B694837J21825J06539K11547J10657O9692J56191O8442N4325Q5781N8092
5178C737928j3055q3320j15574r3578j80393j45183j44823q9731r1110o7471q6384
5167B627306j40344j09109J2416k0316o0166l4329l5724k621p173l900o791O451
5155B225700J31098L12K5759l21P6698R7406J9361Q9553R5572J10419O9333O4813
5143C005703p4727j04067j49785j62771j76041p7421k7740r7626j04838o9067
5133A961620j07300j15079m1993j363n259n1225o2550N971l8332k3805o214P8806
$$ y = [3330511, 3281748, 3151506, 3019308, 2955267, 2904119, 2827338, 2707281, 2638170, 2528744, 2468397, 2452000, 2381660, 2432369, 2420937, 2351890, 2357318, 2421201, 2428139, 2469105, 2455927, 2447687, 2606124, 2694837, 2816662, 2923201, 3134748, 3245405, 3315097, 3471288, 3539730, 3594055, 3679836, 3737928, 3724873, 3641553, 3525979, 3432401, 3252008, 3106825, 2962002, 2872271, 2781161, 2713690, 2627306, 2486962, 2377853, 2390269, 2369953, 2309787, 2275458, 2239734, 2237113, 2229940, 2226040, 2219249, 2225700, 2356798, 2357110, 2382869, 2382548, 2459246, 2556652, 2576013, 2665566, 2761138, 2871557, 2940890, 3005703, 2930976, 2826909, 2677124, 2514353, 2338312, 2260891, 2233151, 2135525, 2030687, 1961620, 1854320, 1739241, 1697248, 1695885, 1690626, 1639401, 1576851, 1582822, 1544490, 1520685, 1514471, 1593277]
5121A593277l6961L1830Q4810N7176N0191O5239N6003J05473Q7539r413L8094
5110B123258P0929P8829Q5586J29949N5383J31869K12215J14455J46233M5436
5100C194142L2736L058J83186R6450J33178P3926n8131O6654K8056J3628j44231
5089C622652j19764k28867j83372r9062j0330j00460p2311P162k1336L0865m637
5078B820540l4552k0431p8788j42368j62602j56426r8525q2075p0704n6695j20126
5067A797248o3871o0863n9219K8779J01311p0598J5326L8783L4713l6369m7646
5056A677594k7083M6090l2691q9912n5921o5956l5478j08679r6934j12084j15758
5045I83188p6555J3881q803p181l5880m2444n1559k1175q410j8805p2005r201
$$ y = [1593277, 1556316, 1588146, 1672956, 1730132, 1780323, 1845562, 1901565, 2007038, 2094577, 2085164, 2123258, 2194187, 2273016, 2358602, 2488551, 2543934, 2675803, 2888018, 3002473, 3148706, 3194142, 3226878, 3229936, 3413122, 3509572, 3642750, 3716676, 3658545, 3725199, 3753255, 3766883, 3622652, 3502888, 3274021, 3090649, 2991587, 2981257, 2880797, 2808486, 2815648, 2794312, 2825177, 2820540, 2785988, 2765557, 2686769, 2544401, 2381799, 2225373, 2126848, 2044773, 1974069, 1917374, 1797248, 1733377, 1672514, 1613295, 1642074, 1743385, 1672787, 1688113, 1726896, 1761609, 1725240, 1677594, 1650511, 1696601, 1663910, 1573998, 1518077, 1452121, 1416643, 1307964, 1211030, 1098946, 983188, 906633, 920514, 911711, 904530, 868650, 826206, 774647, 753472, 745062, 726257, 654252, 645051]
5033F45051O6116m4217p3390j2220k9723J4605o6127P3444m9553k6742N3613o0512
5021D90345l9425k7016n2778l4066O4589j2809K6756K8739L343k0723L3468k2911
5009D37512n886J5270n3894n0537k7406r115P9806N4675l5667K8851p4732n171
4997C53706P7002K9059K5615N1865O3471O8175J2025K1702l536j3661k875K2104
4985G04652K4203k2265k4478k2332k7337p1611O95p881j8230n0359n893P163m0472
4972D45855J4816j645j5243J7940k4377K726o8054r7875N0885k1504J1398P5862
4960C90784l925l2597K400K7982O6909p884J7359P1696m001n5661l7334l4350
4948D01378j2998k6435k2257J3284L8678K5826j692L4708Q371j5481n3959N7784
$$ y = [645051, 711167, 666950, 593560, 581340, 551617, 566222, 500095, 573539, 523986, 497244, 550857, 490345, 450920, 423904, 371126, 337060, 401649, 388840, 415596, 444335, 447678, 426955, 460423, 437512, 431626, 446896, 393002, 342465, 315059, 305944, 385750, 440425, 404758, 433609, 358877, 353706, 430708, 459767, 485382, 537247, 600718, 668893, 680918, 702620, 699084, 685423, 682548, 704652, 728855, 706590, 682112, 659780, 632443, 560832, 561527, 553646, 535416, 485057, 479164, 486327, 445855, 460671, 459026, 443783, 461723, 437346, 440072, 372018, 274143, 325028, 303524, 314922, 390784, 386859, 354262, 356662, 384644, 451553, 443669, 461028, 532724, 528723, 473062, 435728, 401378, 388380, 361945, 339688, 352972, 391650, 417476, 415784, 450492, 458863, 443382, 389423, 447207]
4936D47207N214L265j3741j2174M2369m6847m757Q2481M5068n8495n799l19K2531
4923E06003J16913q900Q887Q5102O9331L9130o9568M9102L6027j6326L1540n648
4911H41593O9124K4773P3377J35741M7790J5599J34770Q5352O5880L9580R9103
4900A632682J57481J42014J30010J42567J14576P8842L7915J31173J63976J06581
4890B837817J44535L2159J53083K04093J62577K58344L16158L11615M23473M65431
4880E309285L62044L24024M26449N91876O76497Q71159J195983J446575J709671
4871A2913563J293411O30376J32103j00822n66424j194463j623932j712255j433840
4862H337717j252396j018019q67629o41928n10798m53322m01241k96133k26018
$$ y = [447207, 452421, 455686, 441945, 429771, 472140, 425293, 420536, 503017, 548085, 489590, 483791, 483472, 506003, 622916, 614016, 622903, 708005, 777336, 816466, 746898, 796000, 832027, 815701, 847241, 841593, 910717, 935490, 1008867, 1144608, 1192398, 1207997, 1342767, 1428119, 1493999, 1533579, 1632682, 1790163, 1932177, 2062187, 2204754, 2319330, 2398172, 2436087, 2567260, 2731236, 2837817, 2982352, 3014511, 3167594, 3371687, 3534264, 3792608, 4108766, 4420381, 4843854, 5309285, 5671329, 5995353, 6421802, 7013678, 7690175, 8561334, 9757317, 11203892, 12913563, 14206974, 14837350, 14969453, 14868631, 14302207, 13107744, 11483812, 9771557, 8337717, 7085321, 6067302, 5199673, 4557745, 4046947, 3593625, 3192384, 2896251, 2670233]
4853B670233j81579k11831j73906j24272j08259j40054q2778j04763j93352j1335
4843A338104k7096m9299j36150o7711o941j1920q1830l7366J9264p7256P3606
4832I35405P3630n4754j2246k9087n9422p0844m6919o3987p0102j1260m6986L0669
4820E74097j0510j3031k8895m4466l4441n2023o4410l05j1409k7061L9761j3455
4808C13852o2924r266L4422l1522l452K1844N645M0445j4090m2j2703K001J5997
4795C00207k6194j9659l2438M6624k2906n0825J5696m3121J9088L5776n0884q953
4783A62411J6320N0560l5855k9044J1762n999n4268k4084K5893M6346k8138N9579
4771A95483j6671j13201m257r162n3527J9177M8033L4398M159K4488l401n3099
$$ y = [2670233, 2488654, 2276823, 2102917, 1978645, 1870386, 1730332, 1647554, 1542791, 1349439, 1338104, 1311008, 1261709, 1125559, 1057848, 1050907, 1038987, 957157, 919791, 939055, 861799, 935405, 1009035, 954281, 942035, 912948, 853526, 782682, 735763, 671776, 601674, 590414, 543428, 574097, 563587, 550556, 521661, 477195, 442754, 390731, 326321, 326016, 314607, 287546, 327307, 313852, 250928, 241662, 276084, 244562, 241110, 262954, 268599, 309044, 294954, 294912, 282209, 284210, 300207, 274013, 254354, 221916, 268540, 245634, 194809, 210505, 167384, 186472, 222248, 171364, 162411, 178731, 229291, 193436, 164392, 176154, 170155, 115887, 91803, 117696, 164042, 135904, 195483, 178812, 65611, 61354, 52192, -1335, 17842, 65875, 100273, 104432, 128920, 125519, 72420]
4759G2420j5572N465M5453N7690l7010l4342l009J3620k1472m8788K801J8130
4747E5386M1572m4116k2113Q596K8187j4757K2530K7719J8086l6448O7005L1165
4735A82812l706l2785k1326m5524k0730j0897k1561L7958p531o4765K7251j4138
4723E058K0730k5503j4736J11978j0668k9000K1354j106n5194M3634M2526K0831
4711A29904l2683P717k331l0699k8812Q789l207m5211O2381n986o1726j2496O2508
4698D8148P0773o9725m0043K6710k1989O0351J959l5555k0309Q9472k7134j4318
4686F8340j5778k0676J2563K9725R006m8644R1354n7920p0353K1568J9320N890
4674D4395M6736K6552n1305L9716M709n6057O013j2892N0030k2316k4505K1617
$$ y = [72420, 56848, 62313, 107766, 165456, 128446, 94104, 91095, 104715, 83243, 34455, 37256, 55386, 96958, 52842, 30729, 39325, 67512, 52755, 75285, 103004, 121090, 84642, 151647, 182812, 179106, 146321, 124995, 79471, 58741, 47844, 26283, 64241, 56710, -8055, 19196, 5058, 25788, 285, -14451, 97527, 86859, 57859, 79213, 78107, 22913, 66547, 109073, 129904, 97221, 104938, 102607, 71908, 43096, 51885, 48678, 3467, 65848, 59862, -1864, -14360, 48148, 118921, 49196, 9153, 35863, 13874, 74225, 76184, 40629, 20320, 109792, 82658, 68340, 52562, 31886, 44449, 74174, 83180, 34536, 125890, 67970, -2383, 19185, 38505, 44395, 91131, 117683, 66378, 106094, 110803, 54746, 60759, 47867, 97897, 75581, 51076, 72693]
4662G2693M8169k1421n2582R80K4789J7850P538K2244l59m4176L6259M9359K6908
4649A88251r2869n6274K8337J00976L2926j2332m353q4824r256K8942Q948N7777
4637A86249l897k9648m6319O671p092q998N1179p1040j3485K2471m3249N4108
4625I6950j001j4772n1720J0154P9263j548Q753l3639N5057j2190o4795l511L1123
4612I8124k3222J9811J0381n2682K0392J2144P357M2251o1292N1359Q582k3585
4600A09620m7959K0965R0070L2747k3636k2312m7553k4780o868J31j6789K7859
4588I1495J2703n3319Q2865q374l4622r705N8774k6388j3417M0091M7137m0329
4576A46911o9096N699L5849N2304n8366Q673O1684J4695j3456q922l3371M258
$$ y = [72693, 120862, 99441, 46859, 47839, 72628, 90478, 98016, 120260, 119901, 75725, 111984, 161343, 188251, 95382, 39108, 67445, 168421, 201347, 189015, 184662, 99838, 90582, 119524, 128472, 186249, 182352, 152704, 106385, 113056, 105964, 96966, 148145, 77105, 63620, 86091, 42842, 96950, 95949, 81177, 29457, 39611, 118874, 117326, 126079, 92440, 147497, 135307, 70512, 67001, 98124, 74902, 94713, 105094, 52412, 72804, 84948, 92305, 134556, 73264, 124623, 133205, 109620, 61661, 82626, 172696, 205443, 181807, 159495, 111942, 87162, 80294, 80425, 63636, 91495, 104198, 50879, 133744, 125370, 90748, 81043, 139817, 113429, 100012, 140103, 187240, 146911, 77815, 83514, 119363, 171667, 113301, 121974, 183658, 198353, 184897, 175975, 142604, 146862]
4564A46862l9514j0542J1462K9704M9519q471o244j8885J1360K5719o0962q8408
4552D1600Q348M8492J0591N4261o7172k2265j0705k4201N5545j5672L7608l4055
4540H2375J4051n1491M0990k5765j620N7810L6734k5235m0463Q5718j05836q2993
4528a5725N6667j7081j0607N956N315P4053j7336n4032O0402P013l451l398N8955
4515A46731O8979q7954m7348O5593l3916n5399L3767N6025r2162J7771L5697M0151
4503A47935n8548m0245O2665k1396k7813K9887k1780l0276K8913R148J3483j6717
4491G5256j581n9112J5663K2982K4095L8237k166m0333K5121l1763J9380o5068
4479B0711N3595J4873M6192k1836m7990k3069N9440q767J6707K7857n5165n2674
$$ y = [146862, 107348, 96806, 108268, 137972, 187491, 179020, 172776, 153891, 165251, 190970, 130008, 41600, 49948, 98440, 109031, 163292, 96120, 73855, 63150, 38949, 94494, 78822, 116430, 82375, 96426, 44935, 85925, 60160, 58540, 116350, 153084, 127849, 87386, 173104, 67268, -15725, 40942, 23861, 13254, 19210, 24525, 98578, 81242, 27210, 87612, 94625, 91174, 87776, 146731, 215710, 127756, 80408, 146001, 112085, 56686, 90453, 146478, 54316, 72087, 107784, 147935, 89387, 49142, 111807, 90411, 62598, 92485, 70705, 40429, 69342, 78490, 91973, 75256, 73675, 14563, 30226, 53208, 77303, 115540, 113374, 73041, 98162, 66399, 85779, 20711, 74306, 89179, 135371, 113535, 65545, 42476, 101916, 93149, 109856, 137713, 82548, 29874]
4467B9874j2468O7672p32K6575l8775L9386K3891K6073M7836q3126j0680M0932
4455A56458P266M6757l4134q8721O9084q111o1257J5645K5908k8692j4901L9093
4443A24395L8595n4995l0944P643J0570l0313J745K5647M7550P174k4192j747
4431A21128l3173O5853J0528l445J6585L1539L96K801q7895p612J2962K2368K2302
4418A74337j2539n6724O612K3320K2294k8498J5417k1155j051J09572l7927k0567
4406A73091K3919m5782j2216r946N315r171K3126N7060l4362J6842Q775o8390
4394A28261L1727Q889j386J8527Q637j8720k5200L4489k5037q1107J04211j1521
4382A71770J2409k3952n4265O5605j8282M6867M4364m2205o0602l9389M2164K6342
$$ y = [29874, 17406, 85078, 84346, 110921, 72146, 111532, 135423, 161496, 209332, 126206, 115526, 156458, 163724, 210481, 176347, 87626, 156710, 148599, 87342, 102987, 128895, 100203, 85302, 124395, 162990, 107995, 77051, 84694, 95264, 64951, 66696, 92343, 139893, 147067, 122875, 121128, 87955, 153808, 164336, 160891, 177476, 209015, 209411, 212212, 124317, 116705, 129667, 152035, 174337, 161798, 105074, 111686, 135006, 157300, 128802, 144219, 123064, 122013, 231585, 193658, 173091, 197010, 151228, 139012, 129066, 134381, 125210, 148336, 205396, 171034, 187876, 196651, 128261, 159988, 168877, 167491, 186018, 194655, 175935, 150735, 185224, 160187, 79080, 183291, 171770, 184179, 160227, 105962, 171567, 153285, 200152, 244516, 202311, 141709, 102320, 144484, 170826]
4370A70826M760k5940L1192m1467L5626l0412l9192J2330O5189K535j7197R924
4358A78174L3801M4161l4780Q724m4807n9341L9541R587K4034k1302q8162p656
4346H1974j4637N0152L9077J6869k8343n7799n3732M1040L5118K513n3638L0506
4334H9100k8202J4415q4740k1184L4918L8152J0737O7682n1852n4718P3360N222
4322I2890l722M223R36n8776m512M8922L0758K9635p8475K3651M2038k5535o7878
4309C4155R579K9660K6880l9704l8768P2119l5545O3876Q5548n6171k0437k0067
4297A11125J5373m5458k652N928q330r0008K3858O6929M4653O234m560N6547m1719
4284A37920O254j4398o760r801M4134R4012o688j4548L5827K0967l8689r8513
$$ y = [170826, 175586, 149646, 180838, 139371, 174997, 144585, 105393, 117723, 182912, 185447, 168250, 178174, 211975, 256136, 221356, 230080, 185273, 125932, 165473, 175060, 199094, 177792, 89630, 81974, 67337, 117489, 156566, 173435, 145092, 87293, 33561, 74601, 109719, 112232, 58594, 89100, 60898, 75313, -9427, -30611, 4307, 42459, 53196, 120878, 69026, 14308, 87668, 92890, 89168, 93391, 94327, 35551, 31039, 79961, 110719, 140354, 61879, 85530, 127568, 102033, 34155, 43734, 73394, 100274, 60570, 21802, 93921, 58376, 122252, 207800, 151629, 131192, 111125, 126498, 81040, 78388, 84316, 75986, -14022, 9836, 76765, 121418, 127652, 123092, 179639, 137920, 144174, 129776, 123016, 113215, 157349, 251361, 244673, 230125, 265952, 286919, 248230, 149717]
4272A49717k64j9410N2064n3891L0655j1573l1485n2365l6252L289J8361O8426
4260A17272n9503J2912K4527k3919J975K0861m0273k386K1364l1345O562k2845
4248B5202J7851l459n217o7273L0571j3391j1610P3137M6522J5920n1390P1865
4236A28728n0651q001J1189k2074O0600m7147k490k196l0838K503L7988N7085
4224A34696l8888j930n9211k2351N4413J493k3918k5285J4581j01m2288j8112
4212b6901R6498N0162m7450j10724p806J04640O3329P117Q635o8108K8132J0283
4200A07807k9300J607L9960P720j314K6317j1532N26r6306K8053N9982m8195M6673
4187A31998o6298M322N1198J2743o367l9254N0180m5731j8077k276J4669M8189
$$ y = [149717, 149453, 130043, 182107, 128216, 158871, 147298, 115813, 63448, 27196, 30485, 48846, 117272, 57769, 70681, 95208, 71289, 73264, 94125, 53852, 51466, 72830, 41485, 48047, 25202, 43053, 39594, 34377, -32896, -2325, -15716, -27326, 45811, 92333, 108253, 56863, 128728, 78077, 70076, 81265, 59191, 119791, 72644, 70154, 67958, 37120, 39623, 77611, 134696, 95808, 93878, 34667, 12316, 66729, 68222, 44304, 19019, 33600, 33499, -8789, -26901, 69597, 119759, 72309, -38415, -46221, 58419, 121748, 128865, 137500, 69392, 97524, 107807, 78507, 80114, 120074, 127794, 126480, 152797, 141265, 141791, 45485, 73538, 133520, 85325, 131998, 65700, 70022, 121220, 133963, 127596, 88342, 138522, 92791, 74714, 72438, 87107, 135296]
4175A35296m0220k2914K029L1537j3919p9760j2253O7754O5506J3313k4852n0860
4163G0657J487M1796O1434L2496j08011o310Q5926p868q9306m0569M804N8145
4151A04681J7710R639l883n8622M6317l7851m1117L4793R3072l0524K5024p5773
4139H3466j7533L1135K5139Q630k2214l8437n167N1828L6895n8222N674R8539
4127A99733P71l7213q8867P709M2566n3558l2751N7270M5843K4239k1646m1129
4115A02967m2727j841N7517O461j170L009n866L5579k827l055j3483J3913K9073
4102A77550n5318K3962j6683k032O459p963M4349j3443J7734j0682N484K2393
4090A91810m7493L4765J881K5153R676m1296l1985J9962J9950j1361O0983l6299
$$ y = [135296, 95076, 72162, 74191, 105728, 91809, 12049, -204, 67550, 133056, 146369, 121517, 70657, 72144, 113940, 175374, 207870, 99859, 93549, 179475, 171607, 82301, 41732, 46536, 104681, 122391, 132030, 128147, 69525, 115842, 77991, 36874, 71667, 164739, 134215, 159239, 83466, 65933, 97068, 122207, 130837, 108623, 70186, 65019, 116847, 153742, 95520, 101194, 199733, 200504, 163291, 74424, 82133, 124699, 71141, 38390, 95660, 141503, 165742, 144096, 102967, 60240, 58399, 115916, 122377, 121207, 124216, 118350, 153929, 151102, 148047, 134564, 148477, 177550, 122232, 146194, 129511, 127479, 133938, 125975, 170324, 156881, 174615, 163933, 169417, 191810, 144317, 179082, 180963, 206116, 215792, 174496, 142511, 162473, 182423, 171062, 232045, 195746]
4078A95746m9960j5001M0153M9121m938k0376j7685J7374M2865J6113K6673J6237
4066B96322k4892m6133r2844M6863M8164k0497l0080Q4946n0179k1454P5285l7995
4054B27506o8661k7730J3306j8958Q7126K7545k547J5846L7312K628K7066k3889
4042B96550m7796r2035J877O6668J0624n862K2577m1122M9817K480J6109J2552
4030B92439K530j4762l6961O1106L6171N935o4867m3083J9382N1692L3732L2113
4018C75427l9653j4866J817L9051J7019l1687K7396l4953N1352j3271K1675l065
4006C96242L3932j7314l6365R171L5523K0966J3779l940n4384L8780K6091J3999
3994D76480k555o77L673m6200N0549J9042J5246l2171j9492M4029O5565L0702
$$ y = [195746, 145786, 130785, 170938, 220059, 215121, 194745, 177060, 194434, 237299, 253412, 280085, 296322, 271430, 225297, 132453, 179316, 227480, 206983, 176903, 261849, 211670, 190216, 265501, 227506, 158845, 131115, 144421, 125463, 212589, 240134, 237587, 253433, 290745, 293373, 320439, 296550, 248754, 156719, 158596, 225264, 235888, 230026, 252603, 211481, 261298, 263778, 279887, 292439, 294969, 280207, 243246, 304352, 340523, 346458, 281591, 238508, 257890, 309582, 343314, 375427, 335774, 320908, 322725, 361776, 378795, 347108, 374504, 339551, 390903, 377632, 399307, 396242, 430174, 412860, 376495, 385666, 421189, 442155, 455934, 451994, 397610, 436390, 462481, 476480, 473925, 473248, 476921, 430721, 481270, 500312, 515558, 483387, 463895, 507924, 573489, 604191]
3982F04191P682O120m4934l2806j1828J4247M9660Q6100J5521Q5491k4580M2139
3970G97003M0481M5147o3209M1640J7165M9374Q9840L7605J667l0856N073L9388
3958A070318j1610M2254K8028J24929J22281j0644Q801J9252L0320M3649P7952
3947A545530J3548O7524R9210M5871J00457L8216L2964P0300L0245J17538J09390
3936B270793q195O0292Q6592L0318J54422R0152R1688N9221n210J36523P2920
3925C039516P2247J06057Q5433L0617L0505K4174r149k5792k184Q2172K0956n7046
3913C397506k503l3121q7032m8380k0309j10246j00537k2674n7497n4436n9435
3902B801336j37158p5179j45944r5837o8648j1957l4024j49367M064o7524p9369
$$ y = [604191, 611873, 617993, 573059, 540253, 528425, 542672, 592332, 678432, 693953, 779444, 754864, 797003, 837484, 882631, 819422, 861062, 878227, 927601, 1017441, 1055046, 1056713, 1025857, 1030930, 1070318, 1058708, 1100962, 1128990, 1253919, 1376200, 1365556, 1374357, 1393609, 1423929, 1467578, 1545530, 1559078, 1626602, 1725812, 1771683, 1872140, 1910356, 1943320, 2013620, 2043865, 2161403, 2270793, 2262598, 2322890, 2409482, 2439800, 2594222, 2684374, 2776062, 2835283, 2830073, 2966596, 3039516, 3111763, 3217820, 3303253, 3333870, 3364375, 3388549, 3379400, 3353608, 3351424, 3433596, 3454552, 3397506, 3395003, 3361882, 3274850, 3226470, 3206161, 3095915, 2995378, 2972704, 2915207, 2860771, 2801336, 2664178, 2588999, 2443055, 2347218, 2278570, 2266613, 2232589, 2083222, 2087286, 2019762, 1940393]
3891A940393j9035m067r6261n6228j9633p5381l7840n7968r5561N836p4700l7268
3879A372287q9148L1080l3733k3738O0693p2913p422k3528n1117N1554j07020
3868A106995m6352j9301K7393L0139N915j0083n9314J1728J1332O64O535n3805
3856A011846m9064J9471O125n4110n5693m0241K5163L3071j0362q5256P098P2001
3844H80049J1904j0906n0577M5588o1074m4016K2785N50J6133j4693M0929K1726
3832H58398J7854M398j6391O4012L0202l1595j4694k852n4867K8284k0152M4667
3820I07264l9366m6096P693J1250L8077Q059M168J6604k1521j0887L4015N3939
3808I63199k4268L5347j4737K070P4235m3923R8444J1113j3418K7787K8264L2908
$$ y = [1940393, 1921358, 1917291, 1821030, 1764802, 1745169, 1669788, 1631948, 1573980, 1478419, 1484255, 1409555, 1372287, 1283139, 1314219, 1280486, 1256748, 1317441, 1244528, 1237106, 1213578, 1162461, 1214015, 1106995, 1060643, 1041342, 1068735, 1098874, 1104789, 1094706, 1035392, 1047120, 1058452, 1059116, 1065651, 1011846, 962782, 982253, 988378, 934268, 878575, 838334, 863497, 896568, 886206, 800950, 808048, 880049, 891953, 881047, 830470, 876058, 814984, 770968, 793753, 794303, 810436, 795743, 836672, 858398, 876252, 880650, 864259, 928271, 958473, 926878, 912184, 909332, 854465, 882749, 862597, 907264, 867898, 821802, 829495, 840745, 878822, 886881, 891049, 907653, 886132, 875245, 909260, 963199, 938931, 974278, 959541, 961611, 1035846, 991923, 1090367, 1101480, 1088062, 1115849, 1144113, 1177021]
3796A177021O959N8956r314m8000o2089o6721J0969l8994K4022J3211K4532Q427
3784A098979N9801n4722J0032P6155j6001N6318k9268Q6955Q9777J0603k8146
3773A360483J21539K8417J8091o1013l0782j0098j3572k1114M2555N710M6701
3762A486917J7108M1320O6978K511m2790k7668l8943n4028J0555j37136j100r487
3750A314237J197R4318j5911k0703J6633J03887N1179k7052L535P9570j3269L4218
3738A621839R9280K5083M0551m4261K1414m7473j0751o404k0819p2589J3684r167
3726A610387o3078j7798K681n3278r6575M3815J3350n5949m0175l6313K5843j0682
3714A322228R0990o0839j1514M9401m3080K2156J9323N0799L1040K7885l9934
$$ y = [1177021, 1183980, 1242936, 1233622, 1185622, 1123533, 1056812, 1067781, 1028787, 1052809, 1066020, 1090552, 1098979, 1158780, 1104058, 1114090, 1190245, 1174244, 1230562, 1201294, 1288249, 1378026, 1388629, 1360483, 1482022, 1510439, 1528530, 1467517, 1436735, 1426637, 1413065, 1391951, 1434506, 1440216, 1486917, 1504025, 1545345, 1612323, 1614834, 1572044, 1544376, 1505433, 1451405, 1461960, 1324824, 1323724, 1314237, 1315434, 1409752, 1393841, 1373138, 1389771, 1493658, 1544837, 1517785, 1521320, 1600890, 1587621, 1621839, 1721119, 1746202, 1786753, 1742492, 1763906, 1716433, 1705682, 1699278, 1678459, 1605870, 1619554, 1610387, 1547309, 1529511, 1532192, 1478914, 1382339, 1426154, 1439504, 1383555, 1343380, 1307067, 1332910, 1322228, 1413218, 1352379, 1340865, 1390266, 1347186, 1369342, 1388665, 1439464, 1470504, 1498389, 1458455]
3703A458455r600N3454r864m8335M1835m3728p2704p3867l8333O3008m5014j8633
3691A256674J0072l6540p4768m1364K980L1312m7914r26m0528p0414p1439n51
3679I16594O6966k3677m8400P2491N8716l1689L722q745P349L4511k0087n3743
3667I74008P439J7535P052m5887o5680m2221L4604j2013L7362Q7p3665j338q169
3654H29114l7094o8964j7192K5616L4420L6955j7785n4606P474k92k8100L1525
3642G41071K2963j8030n9636M1583j2736j4052j3588n88m493q0673O556L6755
3630F45132K7439M9151l6145j6099J9235J3837j5396N7521P9071j6458K3826j5393
3618H15721o4660L8799K7526o500K0111L8384k8537M3933k1042K2070J2266N2712
$$ y = [1458455, 1448855, 1502309, 1492445, 1444110, 1485945, 1442217, 1369513, 1295646, 1257313, 1320321, 1275307, 1256674, 1266746, 1230206, 1155438, 1114074, 1117054, 1148366, 1100452, 1099526, 1058998, 988584, 917145, 916594, 983560, 959883, 911483, 983974, 1042690, 1011001, 1014723, 1005978, 1013327, 1047838, 1027751, 974008, 981447, 998982, 1006034, 960147, 894467, 852246, 886850, 874837, 912199, 912286, 838621, 837283, 829114, 792020, 723056, 705864, 731480, 765900, 802855, 785070, 730464, 737938, 737646, 709546, 741071, 764034, 746004, 686368, 727951, 715215, 701163, 687575, 686987, 682494, 601821, 608377, 645132, 672571, 721722, 685577, 669478, 688713, 702550, 687154, 744675, 823746, 807288, 831114, 815721, 751061, 789860, 817386, 810886, 830997, 869381, 840844, 884777, 863735, 885805, 898071, 950783]
3606I50783M1694k7577J961L6587p701m2763M5063o8823N1526J5916K0452n5698
3594I61420L159M1677M6940p0212p009M6758l7062L789P9801N4621K0893Q746
3582A153521K3294K056m957N8849N8327L2252N2912n186Q2539q327l881N2543
3570A493942p0933K1014J4882k7460m9626L290N2440j558k844K2485M722M9338
3558A509692K6102k386N6808l5986o9324Q6848Q9946M2698j5096J52517O8017
3547A909836R0279N0043J6717N9571L9377j0598q001K5581l0412p7098j2197m653
3535B048445j9127p399p1434l8998J2338m5149P651k5213l739j7708k6566N9568
3523A872669l9558R1931N8771K9979O8484k6773R6353Q9371K5705M4611J1687
$$ y = [950783, 992477, 964900, 966861, 1003448, 995747, 952984, 998047, 929224, 980750, 996666, 1017118, 961420, 964579, 1006256, 1053196, 982984, 975975, 1022733, 985671, 989460, 1069261, 1123882, 1144775, 1153521, 1176815, 1178871, 1173914, 1232763, 1291090, 1323342, 1376254, 1371068, 1453607, 1445280, 1441399, 1493942, 1423009, 1444023, 1458905, 1431445, 1381819, 1385109, 1437549, 1435991, 1433147, 1455632, 1460354, 1509692, 1535794, 1533408, 1590216, 1554230, 1484906, 1571754, 1661700, 1704398, 1689302, 1841819, 1909836, 2000115, 2050158, 2066875, 2126446, 2165823, 2155225, 2147224, 2172805, 2142393, 2065295, 2053098, 2048445, 2029318, 2021919, 1950485, 1911487, 1923825, 1878676, 1886327, 1861114, 1857375, 1839667, 1813101, 1872669, 1833111, 1925042, 1983813, 2013792, 2082276, 2055503, 2151856, 2241227, 2266932, 2311543, 2323230]
3512B323230J4160M5632Q5303Q8732M373J3839L8675O238K5193l4497j17446m5477
3500B447955Q697K85m9690J8568m4958M8874M0350o0551O2616K0946n4690P6865
3488B515267J01174O8995Q0944R1421Q2274K1136m8047K1114J64874J64703K06825
3477C470680R3045R5130N0035J07870M6048P0112J2927K2373L055P2675N795j1301
3465D038444N7768N8204N1459O7503K9294J34403R5551R6354J33224J78747J89767
3454E130718J99631L13750K84347K49109K48568L27282M31416M36530M32093M32743
3444H486187M08395N26793N22012M09368L52822K91990K85330J90740O536j31463
3434A1348710j98316k38465l06130l55355n65134o37216o13605n43577n52185
$$ y = [2323230, 2337390, 2383022, 2468325, 2557057, 2561430, 2575269, 2613944, 2620182, 2645375, 2610878, 2493432, 2447955, 2456652, 2456937, 2407247, 2425815, 2380857, 2429731, 2470081, 2409530, 2472146, 2493092, 2438402, 2515267, 2616441, 2685436, 2766380, 2857801, 2940075, 2961211, 2913164, 2934278, 3099152, 3263855, 3470680, 3563725, 3658855, 3708890, 3816760, 3862808, 3932920, 3945847, 3968220, 3971275, 4043950, 4049745, 4038444, 4096212, 4154416, 4205875, 4273378, 4302672, 4437075, 4532626, 4628980, 4762204, 4940951, 5130718, 5330349, 5644099, 5928446, 6177555, 6426123, 6753405, 7184821, 7621351, 8053444, 8486187, 8894582, 9421375, 9943387, 10352755, 10705577, 10997567, 11282897, 11473637, 11480173, 11348710, 11150394, 10911929, 10605799, 10250444, 9685310, 9048094, 8434489, 7890912, 7338727]
3425G338727m38826l48407k88676j53114j00319j16092j6413R490J26795J35394
3415F148559J53995K82780K74388K63199L80537N14786O61661P44276Q14408Q85192
3405A1123781R80887O00337K25187n3257j29633l11885n50502q03003j005557
3396A0076355r64748r57806q36544p34902n57908m48776k77906k63809k20392
3387D813564j92001q0095n9901o8178L0718j02233P8311J18491J2918P1717J56426
3376D779737K25202L48589L58249L91750L09164O5387n0451k05439j60690k67633
3366E793865l70144l40490m48891m45763l53952l66554k95930l08316j58280j56220
3356B549325j27551j84870j29913r5705p933q2014r4126j02505j13874M745o9489
$$ y = [7338727, 6899901, 6551494, 6262818, 6109704, 6009385, 5893293, 5876880, 5886370, 6013165, 6148559, 6302554, 6585334, 6859722, 7122921, 7503458, 8018244, 8679905, 9424181, 10238589, 11123781, 12104668, 12705005, 12930192, 12876935, 12747302, 12435417, 11884915, 11081912, 10076355, 9111607, 8153801, 7317257, 6582355, 6024447, 5575671, 5297765, 5033956, 4813564, 4621563, 4541468, 4481567, 4413389, 4444107, 4341874, 4420185, 4538676, 4551594, 4623311, 4779737, 5004939, 5353528, 5711777, 6103527, 6412691, 6478078, 6427627, 6222188, 6061498, 5793865, 5423721, 5083231, 4634340, 4188577, 3834625, 3468071, 3172141, 2863825, 2705545, 2549325, 2421774, 2236904, 2106991, 2011286, 2003353, 1921339, 1827213, 1724708, 1610834, 1615579, 1546090]
3345A546090K378k5543l0855o6514l2981q825L3758m8593k9021j6700m8050n2145
3333A222999m3552o7807j97M2890k2919j3492k6573n3614j3951R338k2464k91
3321A010367k6688m7049J314N747m1761o2291o0067M7054L6669m4360n1601L1768
3309G99102J6478O462J8284k2699p327l233J697j3984l4889L3574L1702n8560
3297G66607k8889J5648K2202o496n7273l0263L2369J9318L7965M2949l3534o0360
3285G20243o5764k5644J5929j2141L2344M0186Q246M6414q025M757n7419o4682
3273F34444R579J9410k7481m0287M9900O4361L2916r7160k0445M7395M1538n5397
3261F58773k6378L7314O707n592o7581Q02K9885Q879J6237K2288j875o5905j5634
$$ y = [1546090, 1548468, 1522925, 1492070, 1425556, 1392575, 1383750, 1417508, 1368915, 1339894, 1323194, 1275144, 1222999, 1179447, 1111640, 1111443, 1154333, 1131414, 1117922, 1091349, 1037735, 1023784, 1033122, 1010658, 1010367, 983679, 936630, 937944, 943691, 901930, 839639, 779572, 826626, 863295, 818935, 767334, 799102, 815580, 822042, 840326, 817627, 810300, 807067, 808764, 794780, 759891, 793465, 825167, 766607, 737718, 753366, 775568, 769072, 711799, 681536, 713905, 733223, 771188, 814137, 780603, 720243, 654479, 628835, 644764, 632623, 664967, 705153, 713399, 759813, 751788, 756545, 699126, 634444, 644023, 663433, 635952, 595665, 645565, 709926, 742842, 645682, 625237, 672632, 714170, 658773, 632395, 669709, 676416, 670824, 603243, 604045, 633930, 642809, 659046, 681334, 679459, 613554, 597920]
3248E97920L7101q760P77Q8254J8840p4602o408K1339j3921Q77M2014J884K0869
3235G26184r688m4048K9070j9457O2304K5032L727l8473j8295P366O3441k1233
3223G65930O7376N0053m9010K2464J6907K7114j8604L8918Q791j8726n769P1706
3211I77150N1574J9445L5206Q7523O1872R0533p90P7534M5554L5260O4868J14652
3199A660381J01643L451J37688J82669J54202J90011J83008J97806J39051M7705
3189B997615J6047m7610l2000l3023j51507j02236n3375Q549n981o9447m4427
3178B482605l6872J5917q3568n845m2554k7478P0338M7824Q7052P9544O1727J31488
3166B780178J15872J04431J81205J37425J52306L50357L79951K24390J68592M0569
$$ y = [597920, 635021, 626261, 627038, 715292, 734132, 659530, 653122, 674461, 660540, 661417, 703431, 705315, 726184, 716496, 672448, 701518, 682061, 744365, 769397, 773124, 734651, 716356, 723722, 787163, 765930, 833306, 883359, 834349, 856813, 873720, 900834, 882230, 921148, 929939, 911213, 905444, 977150, 1028724, 1048169, 1083375, 1170898, 1232770, 1323303, 1322513, 1400047, 1445601, 1480861, 1545729, 1660381, 1762024, 1765475, 1903163, 2085832, 2240034, 2430045, 2613053, 2810859, 2949910, 2997615, 3013662, 2966052, 2934052, 2901029, 2749522, 2647286, 2593911, 2602460, 2596479, 2527032, 2482605, 2445733, 2461650, 2378082, 2372237, 2329683, 2302205, 2372543, 2420367, 2507419, 2586963, 2648690, 2780178, 2896050, 3000481, 3181686, 3319111, 3471417, 3821774, 4201725, 4426115, 4594707, 4635276]
3156D635276p9412k48900k19049j21709k14906j31363k0491j2587k3459j11155
3146C452245j42771j47745j01362j78468j27234r9458l6849l1436k2326p9516
3136B485080n5738K9889M4073J01533L5186M4031K3393P4466M1981J21151N1435
3125B996480r432K1966N271n0131k2014j55844j27155L457j7911P8735j5195k9856
3113B678371k9755j1469m0314j8660J8336o640K4486o5333J8052j284p752m833
3101B553205o8890k2139p2287o5759o1965j08148q3650n9720J1852N455n934k6979
3089A995041o788R169n7292k9163M3105K8809O509L0807l840K9073M405j3735
3077B036100l1909L5235K3248j1739L8724L5132p2966r7253j7186p8229p0288
$$ y = [4635276, 4555864, 4306964, 4087915, 3966206, 3751300, 3619937, 3599446, 3586859, 3563400, 3452245, 3309474, 3161729, 3060367, 2881899, 2754665, 2655207, 2618358, 2586922, 2564596, 2485080, 2429342, 2459231, 2503304, 2604837, 2640023, 2684054, 2707447, 2781913, 2823894, 2945045, 2996480, 2987048, 3009014, 3014285, 2964154, 2942140, 2786296, 2659141, 2662598, 2644687, 2723422, 2708227, 2678371, 2648616, 2637147, 2596833, 2578173, 2596509, 2589869, 2614355, 2549022, 2567074, 2565790, 2558038, 2553205, 2484315, 2462176, 2389889, 2324130, 2262165, 2154017, 2070367, 2010647, 2022499, 2027954, 2022020, 1995041, 1988253, 1997422, 1940130, 1910967, 1954072, 1982881, 1989390, 2020197, 2016357, 2045430, 2049835, 2036100, 2004191, 2039426, 2062674, 2050935, 2089659, 2124791, 2051825, 1954572, 1937386, 1859157, 1788869]
3066A788869j11596k3602p2253l2536l6495m1226j9558L1782l9231n2773L813
3055A395194J5413J3328o4331L3184k9409j0505p9615l7211l6986o3390m9040
3044A086632l0029K4467n244o4270q6618L2107m9570m6931k2082l5349l8123k2340
3032G42650m307l831o1335p479K752O0639l3258n4142J3280L920K7721m8256p6363
3019E61991p9919K5999J0591O4448k0701n8729j6932Q848K9871J4645J2240k7306
3007E25046p2274k1943J6966o7803q584P332l7574M925N0674J6304o6370m6632
2995C00067L7610j1092j1757K4414L754l1433l4982l7579M4627L1939k7205L3209
2983C21572n7157j4160O4149p68j06619L3786J4840N0899r005J5268l0391n9786
$$ y = [1788869, 1677273, 1653671, 1581418, 1548882, 1512387, 1471161, 1451603, 1483385, 1444154, 1391381, 1395194, 1410607, 1423935, 1359604, 1392788, 1363379, 1352874, 1273259, 1236048, 1199062, 1135672, 1086632, 1056603, 1081070, 1075826, 1011556, 924938, 957045, 907475, 860544, 838462, 803113, 764990, 742650, 738343, 734512, 673177, 665698, 668450, 729089, 695831, 641689, 654969, 658889, 686610, 638354, 561991, 482072, 508071, 518662, 583110, 562409, 503680, 486748, 495596, 525467, 540112, 552352, 525046, 452772, 430829, 447795, 379992, 371408, 378740, 341166, 346091, 396765, 413069, 346699, 300067, 337677, 326585, 314828, 339242, 342996, 311563, 276581, 239002, 283629, 315568, 288363, 321572, 264415, 250255, 314404, 313636, 207017, 240803, 255643, 306542, 297537, 312805, 282414, 222628]
2971B22628J4869p5529O639P3750K0051l7216j4564K4056l1820K5651m3757m0191
2959A44567k714N1927M8396j5820q3205k0730P0641N2583l9855j0014k4233j91
2947A71352q69n4004M9796o2891k0606M256l8858O3648p685k3076m1889N2651
2935I1825K1542k7059m3263L4827N6962p0343L3643n5197J38R337l4472m8989
2923c1049Q8857l75K5467J0914k4224j8013J2086M9505k0318m5689p0152L1444
2911H453K7746l3050L7289K1535j7231k6042j7233j2135l5473J3438N8102K9615
2899E5014M236J7069M1331n4857M6718p5034k4793M0860P616K5750J156m4666
2887D0400m4052p667P9322L4527j780M2803J4918L5302o6695j6478p194O328m013
$$ y = [222628, 237497, 161968, 168607, 242357, 262408, 225192, 210628, 234684, 202864, 228515, 184758, 144567, 141853, 193780, 242176, 226356, 143151, 122421, 193062, 245645, 205790, 195776, 171543, 171352, 170483, 116479, 166275, 103384, 82778, 87034, 48176, 111824, 104139, 81063, 39174, 91825, 113367, 86308, 43045, 77872, 134834, 64491, 98134, 42937, 43075, 52412, 17940, -31049, 57808, 57433, 82900, 93814, 69590, 51577, 63663, 113168, 92850, 47161, -22991, 8453, 36199, 3149, 40438, 61973, 44742, 18700, 1467, -10668, -46141, -32703, 25399, 55014, 59250, 76319, 117650, 62793, 109511, 34477, 9684, 50544, 58160, 83910, 85066, 40400, -3652, -11319, 68003, 102530, 100750, 143553, 158471, 193773, 127078, 110600, 103406, 109734, 105721]
2874A05721j3966L0375l9108p6719o633L9435K0345l8938K6447j0844n5031J7817
2862a099k6019Q920K9894L2258J185L2054n7465n4553j1458J3451L30M8632J0064
2849B6194q787k4125l7768P9435K9057k0338n6501M0977O2741o020k9204m3573
2837A2088l925K2260m2506P3662R975m1411L300j7804N369K0978j2546R805m101
2824C5144l6034j0643O1727j12101m4379N8045N630N1536K3626m9871R5456M0271
2812A18407n1099j30m6097k7200R0993K6542l3404l6045l4047K9392n9730j9897
2800d2315K8961P0062L0955l2221l9056n6324M840n3858K6161J7357j3216j1627
2788g0281M8684N170k7308M3792j2568N351n754l0969l0383j318M3621M1902l5262
$$ y = [105721, 91755, 122130, 83022, 6303, -330, 39105, 59450, 20512, 46959, 36115, -18916, -1099, -27118, -18198, 11696, 43954, 45139, 77193, 19728, -34825, -46283, -32832, -32502, 16130, 26194, 17407, -6718, -44486, 34949, 64006, 43668, -12833, 28144, 90885, 84865, 55661, 12088, 8163, 30423, -12083, 61579, 71554, 30143, 33443, 15639, 21008, 41986, 29440, 39245, 35144, -890, -11533, 50194, -61907, -106286, -48241, -42611, 8925, 32551, -17320, 78136, 118407, 67308, 67178, 21081, -6119, 84874, 111416, 78012, 41967, 7920, 37312, -22418, -42315, -13354, 56708, 87663, 55442, 16386, -39938, -35098, -88956, -62795, -45438, -58654, -70281, -21597, -16427, -43735, 57, -12511, -7160, -12914, -43883, -74266, -75584, -31963, 9939, -25323]
2775b5323K186Q517l3222O0577P0008m6717k6359l3109r832L3136k4792m9830
2763g4760n0994O4927L1581k2089M9177l2738p394l0636k975l989N6902k0393
2751d3381N479J3268j9697j4556n8749K2586l1144O7480K3553m2305M0288m0650
2739g7828j7160K7686j8213l467J8262q062N179M8673M298J3206K7010L515j1332
2726A1767p4900o55K2344M1121p0897K9566N4741o5301k4940j3523N215J2940
2714g2522L3866J0508m9259q374Q460j7067N5483m1193L4109O1159j5800l7802
2702c8432K8962l0976n0854L9630L7291j2846j2532k2260L5716P1629q4702j7594
2690e6968r362k6702J993N4761L0727k0729k310r466p86k2428o088Q960J9558
$$ y = [-25323, -23137, -14620, -47842, 12735, 82743, 36026, 9667, -23442, -33274, -138, -24930, -74760, -125754, -60827, -29246, -51335, -2158, -34896, -42290, -72926, -75901, -79890, -22988, -43381, -37902, -24634, -44331, -58887, -117636, -95050, -126194, -58714, -35161, -77466, -37178, -77828, -94988, -67302, -85515, -88982, -70720, -78782, -73603, -24930, -20632, -7426, 19584, 23099, 11767, -63133, -63788, -41444, -323, -71220, -41654, 13087, -52214, -77154, -90677, -85462, -72522, -38656, -28148, -77407, -85781, -77321, -94388, -38905, -80098, -45989, 15170, -630, -38432, -9470, -40446, -91300, -51670, -14379, -27225, -39757, -62017, -26301, 45328, -39374, -56968, -66330, -93032, -91039, -36278, -5551, -26280, -28590, -38056, -38842, -61270, -67358, -58398, -38840]
2677c8840m539J2185m0528j726q455K7298O1241Q524L415m3865k9907L7307l9882
2664e7772l7205K7501k7191J0636j122J2491L914L0842M3010o1656n2899O1128
2652d8323Q0302o9975L0292L1698o532R666k0233n4643l4771N1421k1555K5310
2640b7343m0953Q405k4932K5069L9636L7869j4370p6525n0128j0703J3123J4831
2628a06021M8366o9197o3117O3669O7303l3367K0409K7352N3933J6087o5074M6817
2616G160k8918m4456N723Q3370o0219p717j5868k8650L6546o788K4156p785j1781
2603e5227J3476O2454Q9333j5901q2439o4308n9302P3531k3043Q018l5552O335
2591h2625J7553p256J0392L5354J692j0511N1979k0278j8066N6306l9643o421
$$ y = [-38840, -43379, -31194, -71722, -73448, -81903, -54605, 6636, 15160, 18575, -25290, -55197, -17890, -57772, -94977, -67476, -94667, -84031, -85153, -72662, -68748, -37906, 5104, -56552, -109451, -48323, 31979, -37996, -7704, 23994, 17462, 27128, 6895, -47748, -82519, -31098, -52653, -27343, -68296, -59891, -84823, -59754, -20118, 17751, 3381, -73144, -123272, -133975, -120852, -106021, -57655, -126852, -189969, -126300, -58997, -92364, -71955, -44603, 9330, 25417, -39657, 7160, -21758, -66214, -60491, 22879, -37340, -45057, -60925, -89575, -53029, -59817, -35661, -43446, -55227, -41751, 20703, 110036, 94135, 11696, -52612, -111914, -38383, -61426, -53408, -88960, -82625, -65072, -72328, -61936, -26582, -24890, -35401, 16578, -3700, -21766, 34540, -5103, -11524]
2579a1524J1071L7395l1085l6643q21j2997M2263M4665n5165k9809L5753j2029
2567a8926J8979p1395M8120J5188o5668K1818K2728N5483n5890k6386O33M7134
2555h182J9184k9012n343K3875l5600m1073J4150r064l637j5411J3907m2833Q7624
2542c1415K0360n2384P1956k3849R640k0207m1992L5961k8372L7242o799J2838
2530a7021k2399K6031m4135j6449N507j7984k3856N9829l076m7832N723N0428
2518d5234L0123m4027L1152m1574K3211o8285j1130L3371k64K1411n040M6525
2506b9761o6426R268M9667O177J5080O070k7869j3365l9114M6495K7242m0030
2494e6566K0005N279M2246m0168j7579J0405K443J8452M6228m4167j0764m3781
$$ y = [-11524, -453, 36942, 5857, -30786, -31607, -44604, -2341, 42324, -12841, -42650, -6897, -18926, 53, -71342, -23222, -8034, -73702, -51884, -29156, 26327, -29563, -55949, -55316, -8182, 11002, -18010, -23353, 522, -35078, -76151, -62001, -71065, -74702, -90113, -76206, -119039, -31415, -11055, -63439, 8517, -15332, -5692, -25899, -67891, -31930, -60302, -23060, -29859, -17021, -39420, -13389, -57524, -73973, -68466, -86450, -110306, -50477, -53553, -101385, -95662, -45234, -15111, -59138, -27986, -69560, -46349, -114634, -125764, -92393, -92657, -71246, -76286, -29761, -96187, -86919, -37252, -31075, -15995, -9925, -37794, -51159, -90273, -43778, -16536, -56566, -36561, -31282, 10964, -29204, -46783, -36378, -33935, -15483, 30745, -13422, -24186, -67967]
2482f7967L1328L6940k1652l3375q952K4161J3116l0842N4139o7033k7783L4637
2470f3283J6096k8640j691J10403L9038q102m9389l4896J0102J8999k1491N698
2458g156j0145L6266k0405l4350n3288L5800J7943q385O336L5002L5739k4203
2446I154L7144l7915R17n318K0059m2581o3792j8567Q0282P7019m1833o71k6883
2433a2985L4193m508J2387j9523M4069m7083j460M9666o517p643M175J6872n8829
2420B814J8325N597r273L477j3790r542m1596P2312N942m7316j7013Q566O8205
2407D6708n882k6681j2548M492l1414L8967j1932l1309L2567K0178l684j04132
$$ y = [-67967, -36639, 301, -21351, -54726, -63678, -39517, -26401, -57243, -3104, -70137, -97920, -63283, -47187, -75827, -77518, 32885, 71923, 63821, 14432, -20464, -10362, 8637, -12854, -7156, -17301, 18965, -1440, -35790, -89078, -53278, -35335, -43720, -37384, -2382, 33357, 9154, 46298, 8383, 9300, 3982, 24041, -18540, -82332, -100899, -20617, 56402, 14569, 13898, -12985, 21208, 16700, 29087, 9564, 53633, 6550, 5090, 54756, 48239, 40596, 44771, 61643, 2814, 21139, 26736, 17463, 20940, 7150, -2392, -43988, 28324, 34266, -13050, -30063, -21497, 46708, 40826, 14145, 1597, 6089, -25325, 13642, 1710, -29599, 2968, 23146, 19462, -84670]
$$ [...]
##END NTUPLES=NMR SPECTRUM
##END=
