##TITLE=1H_CG-1220
 CDCl3
 8 sc, 
 29.11.2024
##JCAMPDX= 6.0         $$ Bruker NMR JCAMP-DX V2.0
##DATA TYPE= NMR SPECTRUM
##DATA CLASS= NTUPLES
##ORIGIN= UXNMR, Bruker Analytische Messtechnik GmbH
##OWNER= root
$$ XWIN-NMR		Version 3.5
$$ Fri Nov 29 13:55:15 2024 Russian Standard Time (UT+4h)  she@DPX200
##.OBSERVE FREQUENCY= 200.1315
##.OBSERVE NUCLEUS= ^1H
##.ACQUISITION MODE= SIMULTANEOUS
##.ACQUISITION SCHEME= undefined
##.AVERAGES= 8
##.DIGITISER RES= 18
##SPECTROMETER/DATA SYSTEM= spect
##.PULSE SEQUENCE= zg30
##.SOLVENT NAME= CD3CN
##.SHIFT REFERENCE= (INTERNAL, CD3CN, 0, 19.471)
##AUDIT TRAIL= $$ (NUMBER, WHEN, WHO, WHERE, WHAT)
$$ ##TITLE= Audit trail, XWIN-NMR		Version 3.5
$$ ##JCAMPDX= 5.01
$$ ##ORIGIN= Bruker BioSpin GmbH
$$ ##OWNER= she
$$ F:/spectra/data/she/nmr/H-F/1/pdata/1/auditp.txt
$$ ##AUDIT TRAIL=  $$ (NUMBER, WHEN, WHO, WHERE, WHAT)
(   1,<2024-11-29 13:54:18.35 +0400>,<she>,<DPX200>,
      <created by zg, POWCHK disabled, PULCHK disabled
       configuration hash MD5:
       00 E9 B6 7A A2 85 ED C7 34 08 36 98 17 FE 4E 26
       data hash MD5: 16K
       25 42 47 B7 78 D6 EF 14 5D D5 27 22 C0 9C 5F CE>)
(   2,<2024-11-29 13:54:20.43 +0400>,<she>,<DPX200>,
      <Start of raw data processing
       efp BC_mod = 2 LB = 0.24 FT_mod = 6 PKNL = 1 PHC0 = -26716.05 PHC1 = 13.18744 SI = 16K 
       data hash MD5: 16K
       5B 47 2C A2 13 FF 1E 6A 50 CC 46 58 78 71 91 50>)
(   3,<2024-11-29 13:54:34.89 +0400>,<she>,<DPX200>,
      <pk PHC0 = -0.9370443 PHC1 = 0 
       data hash MD5: 16K
       C3 92 45 18 D8 88 89 A6 76 19 5C 61 5A B7 55 B4>)
(   4,<2024-11-29 13:54:37.95 +0400>,<she>,<DPX200>,
      <abs ABSG = 5 
       data hash MD5: 16K
       37 78 EE E9 9A 44 94 B3 12 56 3C EB 3F EE 25 DC>)
$$ ##END=
$$ 
$$ hash MD5
$$ 2C 56 F8 E3 46 78 17 69 8A DE 1B B8 94 58 40 28
##$RELAX= 
##$RELAX= 
##$RELAX= 
##$RELAX= 
##$RELAX= 
##$RELAX= 
$$ Bruker specific parameters
$$ --------------------------
##$DU= <F:/spectra>
##$EXPNO= 1
##$NAME= <H-F>
##$PROCNO= 1
##$TYPE= <nmr>
##$USER= <she>
##$AMP= (0..31)
100 100 100 100 100 100 100 100 100 100 100 100 100 100 100 100 100 100 
100 100 100 100 100 100 100 100 100 100 100 100 100 100 
##$AQSEQ= 0
##$AQ_mod= 1
##$AUNM= <au_zg>
##$AUTOPOS= <>
##$BF1= 200.13
##$BF2= 200.13
##$BF3= 200.13
##$BF4= 200.13
##$BF5= 200.13
##$BF6= 200.13
##$BF7= 200.13
##$BF8= 200.13
##$BYTORDA= 1
##$CFDGTYP= 0
##$CFRGTYP= 5
##$CHEMSTR= <none>
##$CNST= (0..31)
1 1 145 1 1 1 1 1 1 1 1 1 1 1 1 1 1 1 1 1 1 1 1 1 1 1 1 1 1 1 1 1 
##$CPDPRG= <>
##$CPDPRG1= <>
##$CPDPRG2= <>
##$CPDPRG3= <>
##$CPDPRG4= <mlev>
##$CPDPRG5= <mlev>
##$CPDPRG6= <mlev>
##$CPDPRG7= <mlev>
##$CPDPRG8= <mlev>
##$CPDPRGB= <>
##$CPDPRGT= <>
##$D= (0..31)
0 1.2 0 0 0 0 0 0 0 0.06 0 0.03 0 0 0 0 0.0002 0 0 0 0 0 0 0 0 0 0 0 0 
0 0 0 
##$DATE= 1732874057
##$DBL= (0..7)
120 120 120 120 120 120 120 120 
##$DBP= (0..7)
150 150 150 150 150 150 150 150 
##$DBP07= 0
##$DBPNAM0= <>
##$DBPNAM1= <>
##$DBPNAM2= <>
##$DBPNAM3= <>
##$DBPNAM4= <>
##$DBPNAM5= <>
$$ [...]
##$SUBNAM3= <"">
##$SUBNAM4= <"">
##$SUBNAM5= <"">
##$SUBNAM6= <"">
##$SUBNAM7= <"">
##$SUBNAM8= <"">
##$SUBNAM9= <"">
##$SW= 24.0689530833862
##$SWIBOX= (0..15)
0 0 2 0 0 0 0 0 0 0 0 0 0 0 0 0 
##$SW_h= 4816.95568400771
##$TD= 16384
##$TD0= 1
##$TE= 0
##$TE2= 300
##$TE3= 300
##$TEG= 300
##$TL= (0..7)
0 120 120 120 120 120 120 120 
##$TP= (0..7)
150 150 150 150 150 150 150 150 
##$TP07= 0
##$TPNAME0= <>
##$TPNAME1= <>
##$TPNAME2= <>
##$TPNAME3= <>
##$TPNAME4= <>
##$TPNAME5= <>
##$TPNAME6= <>
##$TPNAME7= <>
##$TPOAL= (0..7)
0.5 0.5 0.5 0.5 0.5 0.5 0.5 0.5 
##$TPOFFS= (0..7)
0 0 0 0 0 0 0 0 
##$TUNHIN= 0
##$TUNHOUT= 0
##$TUNXOUT= 0
##$USERA1= <user>
##$USERA2= <user>
##$USERA3= <user>
##$USERA4= <user>
##$USERA5= <user>
##$V9= 5
##$VALIST= <valist>
##$VCLIST= <CCCCCCCCCCCCCCC>
##$VD= 0
##$VDLIST= <DDDDDDDDDDDDDDD>
##$VPLIST= <PPPPPPPPPPPPPPP>
##$VTLIST= <TTTTTTTTTTTTTTT>
##$WBST= 1024
##$WBSW= 4
##$XGAIN= (0..3)
0 0 0 0 
##$XL= 0
##$YL= 0
##$YMAX_a= 304093
##$YMIN_a= -159363
##$ZGOPTNS= <>
##$ZL1= 120
##$ZL2= 120
##$ZL3= 120
##$ZL4= 120
##$ABSF1= 19.36812
##$ABSF2= -4.70101
##$ABSG= 5
##$ABSL= 3
##$ALPHA= 0
##$AQORDER= 0
##$ASSFAC= 0
##$ASSFACI= 0
##$ASSFACX= 0
##$ASSWID= 0
##$AUNMP= <proc_1d>
##$AZFE= 0.1
##$AZFW= 0.1
##$BCFW= 0
##$BC_mod= 2
##$BYTORDP= 0
##$COROFFS= 0
##$CY= -3
##$DATMOD= 1
##$DC= 0
##$DFILT= <>
##$DTYPP= 0
##$F1P= 0
##$F2P= 0
##$FCOR= 1
##$FTSIZE= 16384
##$FT_mod= 6
##$GAMMA= 0
##$GB= 0
##$INTBC= 1
##$INTSCL= 2.524811e-10
##$ISEN= 128
##$LB= 0.24
##$LEV0= 0
##$LPBIN= 0
##$MAXI= 10000
##$MC2= 0
##$MEAN= 0
##$ME_mod= 0
##$MI= 1.114404
##$NCOEF= 0
##$NC_proc= -7
##$NLEV= 6
##$NOISF1= 3.799351
##$NOISF2= 2.8
##$NSP= 0
##$NTH_PI= 0
##$NZP= 0
##$OFFSET= 19.47096
##$PC= 1
##$PHC0= -26716.99
##$PHC1= 13.18744
##$PH_mod= 1
##$PKNL= yes
##$PPARMOD= 0
##$PSCAL= 0
##$PSIGN= 0
##$REVERSE= no
##$SF= 200.13001175297
##$SI= 16384
##$SIGF1= 3
##$SIGF2= 2
##$SINO= 5.538805
##$SIOLD= 16384
##$SREGLST= <1H.CDCl3>
##$SSB= 0
##$STSI= 16384
##$STSR= 0
##$SW_p= 4816.95568400771
##$SYMM= 0
##$S_DEV= 0
##$TDeff= 16384
##$TDoff= 0
##$TI= <>
##$TILT= no
##$TM1= 0
##$TM2= 0
##$TOPLEV= 0
##$USERP1= <user>
##$USERP2= <user>
##$USERP3= <user>
##$USERP4= <user>
##$USERP5= <user>
##$WDW= 1
##$XDIM= 16384
##$YMAX_p= 359443352
##$YMIN_p= -686563
$$ End of Bruker specific parameters
$$ ---------------------------------
##NTUPLES= NMR SPECTRUM
##VAR_NAME=  FREQUENCY,     SPECTRUM/REAL,   SPECTRUM/IMAG
##SYMBOL=    X,             R,               I
##VAR_TYPE=  INDEPENDENT,   DEPENDENT,       DEPENDENT
##VAR_FORM=  AFFN,          ASDF,            ASDF
##VAR_DIM=   16384,         16384,           16384
##UNITS=     HZ,            ARBITRARY UNITS, ARBITRARY UNITS
##FACTOR=    0.29402158847633, 1,            1
##FIRST=     3896.72357713492, 0,            0
##LAST=      -920.23210687279, 0,            0
##MIN=       -920.23210687279, -686563,      0
##MAX=       3896.72357713492, 359443352,    0
$$ Real data points
##PAGE= N=1
##DATA TABLE= (X++(R..R)), XYDATA
$$ [...]
$$ plain form
6782 1417359 1335467 1414782 1601777 1683680 1607844 1374729 1532920 1457652 1291581 1054812
6772 1054812 1149980 1117990 1283797 1273401 1259631 886730 884857 1105977 1151343 1043856 1006149
6761 1006149 598433 278955 778706 1048035 1130174 989376 953333 699525 957497 1010824
6751 1010824 1010469 860963 741220 487928 537513 791059 965161 998602 869614 849472 711030
6740 711030 826923 759383 812152 991283 1339390 1140996 784366 1160057 1349061 851685
6730 851685 887438 1092029 1436711 1682880 1741011 1625587 1993413 2223268 1993064 1999858
6720 1999858 2063521 1984203 2092404 2149687 2300842 2293088 1958615 1857974 1651475 1521955
6710 1521955 1452412 1333175 1066185 1147697 968418 929718 1165991 1258907 1153109 1079410
$$ packed form
6782A417359q1892P9315J86995Q1903p5836k33115J58191p5268j66071k36769
6772A054812R5168l1990J65807j0396j3770l72901j873K21120M5366j07487l7707
6761A006149m07716l19478M99751K69329Q2139j40798l6043k53808K57972N3327
6751A010824l55j49506j19743k53292M9585K53546J74102L3441j28988k0142j38442
6740G11030J15893o7540N2769J79131L48107j98394l56630L75691J89004m97376
6730H51685L5753K04591L44682K46169N8131j15424L67826K29855k30204O794
6720A999858O3663p9318J08201N7283J51155p754l34473j00641k06499j29520
6710A521955o9543j19237k66990Q1512j79279l8700K36273R2916j05798p3699
$$ plain form
6700 1079410 992003 883757 932782 1004360 928950 702800 908010 1211368 864636 799219
6690 799219 723426 1097655 1228842 1045434 1272854 1161021 816338 1025594 881609 937450
6680 937450 495813 799924 894969 1184288 956413 483419 609825 586389 499901 701137
6670 701137 820129 614479 700067 670060 1037172 541901 585431 586745 405718 423540 382054
6659 382054 169306 554457 555729 156779 284135 484212 721385 703292 1013308 792103
6649 792103 517158 305924 522336 397689 454859 412831 -18514 -35073 279395 488981
6639 488981 592373 534714 573366 837313 656948 403983 680912 719578 551788 224747
6629 224747 64691 443444 429601 574996 668188 538937 538280 663185 472359 417494 232343
$$ packed form
6700A079410q7407j08246M9025P1578p5410k26150K05210L03358l46732o5417
6690G99219p5793L74229J31187j83408K27420j11833l44683K09256j43985N5841
6680I37450m41637L04111R5045K89319k27875m72994J26406k3436q6488K01236
6670G01137J18992k05650Q5588l0007L67112m95271M3530J314j81027J7822m1486
6659C82054k12748L85151J272l98950J27356K00077K37173j8093L10016k21205
6649G92103k74945k11234K16412j24647N7170m2028m31345j6559L14468K09586
6639D88981J03392n7659L8652K63947j80365k52965K76929L8666j67790l27041
6629B24747j60056L78753j3843J45395R3192j29251o57J24905j90826n4865j85151
$$ plain form
6618 232343 210529 482445 458289 600272 517234 482126 378863 29891 202266 127116 380248
6607 380248 336875 587972 857738 829858 607410 524650 447010 292425 511541 600025 733303
6596 733303 648164 459888 619193 720703 813015 734905 414883 561745 460042 207685
6586 207685 409429 372222 374536 359355 476601 721269 533533 364673 145517 249712
6576 249712 148593 178587 315571 234680 666915 612266 371319 514357 291298 447619
6566 447619 530447 481562 368680 192373 553623 413593 624546 373361 466672 997323
6556 997323 665431 679160 772733 842690 531473 355026 494546 763761 613883 450561
6546 450561 518377 300077 493070 667417 688049 423577 510693 630858 838159 695088
$$ packed form
6618B32343k1814K71916k4156J41983q3038l5108j03263l48972J72375p5150K53132
6607C80248m3373K51097K69766k7880k22448q2760p7640j54585K19116Q8484J33278
6596G33303q5139j88276J59305J01510R2312p8110l20022J46862j01703k52357
6586B07685K01744l7207K314j5181J17246K44668j87736j68860k19156J04195
6576B49712j01119K9994J36984q0891M32235n4649k40947J43038k23059J56321
6566D47619Q2828m8885j12882j76307L61250j40030K10953k51185R3311N30651
6556I97323l31892J3729R3573O9957l11217j76447J39520K69215j49878j63322
6546D50561O7816k18300J92993J74347K0632k64472Q7116J20165K07301j43071
$$ plain form
6536 695088 801640 996011 935967 989946 783060 752568 824165 797057 465731 512033 702881
6525 702881 655380 624820 313896 296520 415954 448072 223437 348765 441454 855758 882391
6514 882391 597657 620216 658070 731995 607664 798623 657859 781104 779067 692285 572822
6503 572822 680464 753457 565510 553179 495040 631003 704772 690954 929280 758792 328428
6492 328428 448297 304041 639581 608794 456178 506393 539773 652080 701036 746668 609922
6481 609922 653824 577987 600905 407205 823573 575176 468712 641579 880817 720784
6471 720784 540188 715159 683915 565378 418836 131221 -40946 489939 799142 551242
6461 551242 571823 504659 429335 410299 430330 437004 635699 893536 827849 747720 718058
$$ packed form
6536F95088J06552J94371o0044N3979k06886l0492P1597k7108l31326M6302J90848
6525G02881m7501l0560l10924j7376J19434L2118k24635J25328R2689M14304K6633
6514H82391k84734K2559L7854P3925j24331J90959j40764J23245k037q6782j19463
6503E72822J07642P2993j87947j2331n8139J35963P3769j3818K38326j70488m30364
6492C28428J19869j44256L35540l0787j52616N0215L3380J12307M8956M5632j36746
6481F09922M3902p5837K2918j93700M16368k48397j06464J72867K39238j60033
6471G20784j80596J74971l1244j18537j46542k87615j72167N30885L09203k47900
6461E51242K0581o7164p5324j9036K0031O674J98695K57837o5687q0129k9662
$$ plain form
6450 718058 672898 604301 596018 1004733 929974 488541 499005 722444 808110 730730 713522
6439 713522 1087158 1195185 925960 1102801 1028268 796791 874270 1125680 1127194 1071202 886994
6428 886994 985692 1004204 1162358 1087500 1268541 1272860 1248520 983703 740205 888047 909516
6417 909516 786109 1196770 1272589 1241606 1422585 1168785 1106932 997349 1230503 1495579
6407 1495579 1206285 886221 901632 1356982 1641613 1387150 1434361 1519003 1396514 1447658
6397 1447658 1274375 1460627 1334288 1370851 1523327 1553190 1716728 1583414 1790878 1987377
6387 1987377 1794176 1752934 1781654 1773852 1849765 2007905 2086106 2155636 1988892 1549178 1912224
6376 1912224 1414830 1328454 1521294 1378203 1414024 1508808 1717501 1696364 1488655 1655488
$$ packed form
6450G18058m5160o8597q283M08715p4759m41433J0464K23439Q5666p7380j7208
6439G13522L73636J08027k69225J76841p4533k31477P7479K51410J514n5992j84208
6428H86994R8698J8512J58154p4858J81041M319k4340k64817k43498J47842K1469
6417I09516j23407M10661P5819l0983J80979k53800o1853j09583K33154K65076
6407A495579k89294l20064J5411M55350K84631k54463M7211Q4642j22489N1144
6397A447658j73283J86252j26339L6563J52476K9863J63538j33314K07464J96499
6387A987377j93201m1242K8720p802P5913J58140P8201O9530j66744m39714L63046
6376A912224m97394q6376J92840j43091L5821R4784K08693k1137k07709J66833
$$ plain form
6366 1655488 1913467 1849398 1870017 1783428 1600869 1954074 1721519 1705238 2021170 1990641
6356 1990641 1900570 1672498 1595886 1797522 1946346 1897108 1768621 1739727 1961219 2074946
6346 2074946 1782464 1931162 2045085 2421496 2333595 2499905 2415568 2716709 2593018 2251648
6336 2251648 2532289 2793932 2860992 2846359 3146970 3405342 3384085 3103827 3174531 3311701
6326 3311701 3240314 3193326 3048653 2949152 2995216 2996426 2909628 2678245 3161393 3002570 3055180
6315 3055180 3293058 3221591 2967022 2636780 2793563 3039757 2899502 3004696 3098094 2692550
6305 2692550 2431512 2653300 2530501 2831133 3029892 2830173 2695618 2804721 2756038 2905573
6295 2905573 2914741 3112584 2869458 2836472 2980814 3425012 3245626 3246082 3675243 3505211 3318942
$$ packed form
6366A655488K57979o4069K0619q6589j82559L53205k32555j6281L15932l0529
6356A990641r0071k28072p6612K01636J48824m9238j28487k8894K21492J13727
6346B074946k92482J48698J13923L76411q7901J66310q4337L01141j23691l41370
6336B251648K80641K61643O7060j4633L00611K58372k1257k80258P0704J37170
6326C311701p1387m6988j44673r9501M6064J210q6798k31383M83148j58823N2610
6315C055180K37878p1467k54569l30242J56783K46194j40255J05194R3398m05544
6305B692550k61038K21788j22799L00632J98759j99719j34555J09103m8683J49535
6295B905573R168J97843k43126l2986J44342M44198j79386M56M29161j70032j86269
$$ plain form
6284 3318942 3580388 3584585 3562826 3695833 3952296 4222217 4363018 4536020 4339096 4718654
6274 4718654 4838425 5306358 5335654 5413241 5620340 5783181 5979033 6116077 6077853 6165576
6264 6165576 6602039 6540844 6466681 7225651 7918071 8442527 8879411 9515186 10172454 10500697
6254 10500697 10439910 9644357 8959023 8171706 7776803 7061694 7094399 6866177 6453841 6321649
6244 6321649 6625292 6559888 6978981 6697723 6569858 7096875 7158630 7161644 6978746 7155079
6234 7155079 7067639 7275109 7296891 7792036 7934570 7727405 8019485 8755319 8855907 9421655
6224 9421655 9666259 9948914 10147630 10411174 10721596 10734367 10888464 11206679 11631280 11875378
6214 11875378 12094224 12113302 12441934 12712458 12887596 13452715 13913156 14240381 14710546 15632557
$$ packed form
6284C318942K61446M197k1759J33007K56463K69921J40801J73002j96924L79558
6274D718654J19771M67933K9296P7587K07099J62841J95852J37044l8224Q7723
6264F165576M36463o1195p4163P58970O92420N24456M36884O35775O57268L28243
6254A0500697o0787p95553o85334p87317l94903p15109L2705k28222m12336j32192
6244F321649L03643o5404M19093k81258j27865N27017O1755L014j82898J76333
6234G155079q7440K07470K1782M95145J42534k07165K92080P35834J00588N65748
6224I421655K44604K82655J98716K63544L10422J2771J54097L18215M24601K44098
6214A1875378K18846J9078L28632K70524J75138N65119M60441L27225M70165R22011
$$ plain form
6204 15632557 16022782 16561899 17623975 18099990 19159228 20710334 21824432 23130472 24889103
6195 24889103 26727486 28916805 30425907 31815061 33423478 34749816 36018517 36946737
6187 36946737 37006877 36784365 36610551 36081972 35452686 35318880 35740989 36717198 38115842
6178 38115842 40257253 42523420 45415686 48581994 51411677 54130608 55774667 57401627
6170 57401627 58736245 59072291 58436822 56498218 53621495 50466968 47397538 44414025
6162 44414025 42150132 40315034 39305960 39566458 39406577 40170809 41311034 42033160 42839993
6153 42839993 43198614 43414838 43327680 42530290 41158543 39213452 37193612 34786878 32404997
6144 32404997 30645391 29175105 27729698 26415014 24674449 23808360 22978041 22565491 22216951
$$ packed form
6204A5632557L90225N39117J062076M76015J059238J551106J114098J306040J758631
6195B4889103J838383K189319J509102J389154J608417J326338J268701R28220
6187C6946737O0140k22512j73814n28579o29286j33806M22109R76209J398644
6178C8115842K141411K266167K892266L166308K829683K718931J644059J626960
6170E7401627J334618L36046o35469j938604k876723l154527l069430k983513
6162D4414025k263893j835098j009074K60498j59881P64232J140225P22126Q06833
6153D2839993L58621K16224q7158p97390j371747j945091k019840k406734k381881
6144C2404997j759606j470286j445407j314684j740565q66089q30319m12550l48540
$$ plain form
6135 22216951 21869299 21305320 20699378 20217230 19668658 19256613 18875987 18455807 18419389 18304121
6125 18304121 17855087 18222314 18793957 18891063 18717647 18804811 18571165 18128592 17701259 17438295
6115 17438295 16919977 16312421 16206602 16326643 16222297 16287569 16188191 16350599 16901674 16934039
6105 16934039 17586928 18232729 18944643 19761283 19914479 20088850 19851461 18862438 17818531
6096 17818531 17367945 16942576 17135708 16917913 16657572 16829238 17226655 17593449 17422325
6087 17422325 17373036 17553483 17702112 17731425 18225471 18516664 18582517 18393924 17956412 17373151
6077 17373151 16891499 16273228 16004595 16038270 16195183 16752868 17012755 17098962 17011602 16827269
6067 16827269 16275992 15302518 14321461 13716576 13002299 12759395 12538367 12218770 11958281
$$ packed form
6135B2216951l47652n63979o05942m82148n48572m12045l80626m20180l6418j15268
6125A8304121m49034L67227N71643R7106j73416Q7164k33646m42573m27333k62964
6115A7438295n18318o07556j05819J20041j04346O5272r9378J62408N51075L2365
6105A6934039O52889O45801P11914Q16640J53196J74371k37389r89023j043907
6096A7818531m50586m25369J93132k17795k60341J71666L97417L66794j71124
6087A7422325m9289J80447J48629K9313M94046K91193O5853j88593m37512n83261
6077A7373151m81652o18271k68633L3675J56913N57685K59887Q6207q7360j84333
6067A6827269n51277r73474r81057o04885p14277k42904k21028l19597k60489
$$ plain form
6058 11958281 12041768 11777494 11895581 11352598 11410637 11338169 11060627 11275854 11276253 10789784
6048 10789784 10214754 9736994 9163975 8533090 8411554 8130021 7703219 7626354 7367397 6757261
6038 6757261 6508936 6658135 6461369 6283690 6158320 6313380 6099450 6162797 5597298 5361632
6028 5361632 5515673 5452857 5301064 5138930 5067114 5349041 5108035 5081581 4953603 4843281
6018 4843281 4887306 4825058 4685822 4532362 4576921 4220822 4434690 4576710 4561566 4639178
6008 4639178 4615473 4387709 4468932 4671653 4520742 4380427 4324831 3879860 3832798 3974464
5998 3974464 3863218 3668303 4042761 4127044 4058011 4097492 4091677 4305018 4466737 4359344
5988 4359344 4035545 4184154 4022657 3943518 4060074 4205811 4264167 3843267 3867932 3755463
$$ packed form
6058A1958281Q3487k64274J18087n42983N8039p2468k77542K15227L99m86469
6048A0789784n75030m77760n73019o30885j21536k81533m26802p6865k58957o10136
6038F757261k48325J49199j96766j77679j25370J55060k13930O3347n65499k35666
6028E361632J54041o2816j51793j62134p1816K81927k41006k6454j27978j10322
6018D843281M4025o2248j39236j53460M4559l56099K13868J42020j5144P7612
6008D639178k3705k27764Q1223K02721j50911j40315n5596m44971m7062J41666
5998C974464j11246j94915L74458Q4283o9033L9481n815K13341J61719j07393
5988D359344l23799J48609j61497p9139J16556J45737N8356m20900K4665j12469
$$ plain form
5978 3755463 3835535 3707297 3848884 4024504 4354195 3992003 3627009 3772910 3838970 3766891
5968 3766891 3328026 3653350 3892223 3961337 4052371 4118104 4123172 4104239 4112964 4329159 4402314
5957 4402314 4522020 4533357 4515503 4618125 4879012 4873433 5158085 5090678 4732989 4804349 4879771
5946 4879771 5037784 5088171 5183304 5144299 4929063 5261319 5560665 5654368 5537732 5504772
5936 5504772 5446196 6012685 6126329 6085355 6065422 6511618 6605769 6391940 6163299 6373625
5926 6373625 6638036 6280994 6202597 5997284 5846592 5919325 5620688 5608917 5698835 6161721
5916 6161721 6358965 6508312 6364132 6519825 6770583 6698767 6701734 7036744 7343740 7082561
5906 7082561 6491572 6325697 6341462 5934714 5723196 5961438 5834181 5583003 5662616 5958789
$$ packed form
5978C755463Q0072j28238J41587J75620L29691l62192l64994J45901O6060p2079
5968C766891m38865L25324K38873O9114R1034O5733N068j8933Q725K16195P3155
5957D402314J19706J1337j7854J02622K60887n579K84652o7407l57689P1360P5422
5946D879771J58013N0387R5133l9005k15236L32256K99346R3703j16636l2960
5936E504772n8576N66489J13644m0974j9933M46196R4151k13829k28641K10326
5926F373625K64411l57042p8397k05313j50692P2733k98637j1771Q9918M62886
5916F161721J97244J49347j44180J55693K50758p1816K967L35010L06996k61179
5906G082561n90989j65875J5765m06748k11518K38242j27257k51178P9613K96173
$$ plain form
5896 5958789 6225446 6066357 6085704 6029668 6298527 6390406 6658454 6477345 6624278 6616342
5886 6616342 6595519 6403755 6125066 5931949 5607639 5756975 6110162 5896383 5644312 5933370
5876 5933370 6223343 6293178 6350772 6603782 6661585 6674951 6739513 6258290 6264180 6742380 6532778
5865 6532778 6519496 6707086 6770781 6908808 7053439 7272403 7190406 7367951 7730506 7966210
5855 7966210 8163925 8213905 8471453 8578604 9011713 9283318 9618223 10229971 10446647 10875328
5845 10875328 11170406 11150247 11016990 11172036 10882120 10689359 11124805 11247963 11273466 11160927
5835 11160927 11134840 11380791 11589837 12257139 12644131 13628549 14071268 14511792 15026133 15525162
5825 15525162 15783622 15892863 15536459 15089945 14605476 14107226 13774067 13680736 13506024 13217207
$$ packed form
5896E958789K66657j59089J9347n6036K68859R1879K68048j81109J46933p936
5886F616342k0823j91764k78689j93117l24310J49336L53187k13779k52071K89058
5876E933370K89973O9835N7594K53010N7803J3366O4562m81223N890M78200k09602
5865F532778j3282J87590O3695J38027J44631K18964q1997J77545L62555K35704
5855G966210J97715M9980K57548J07151M33109K71605L34905O11748K16676M28681
5845A0875328K95078k0159j33257J55046k89916j92761M35446J23158K5503j12539
5835A1160927k6087K45951K09046O67302L86992R84418M42719M40524N14341M99029
5825A5525162K58460J09241l56404m46514m84469m98250l33159r3331j74712k88817
$$ plain form
5815 13217207 13203978 13495332 13758088 13879186 14366243 15305746 15656421 15798843 16150567 16361194
5805 16361194 16400154 16450319 16831953 16680716 16975181 17015769 16802936 17113629 17491153 18088473
5795 18088473 19056666 19918168 21368967 22881221 24547306 26348257 27933725 28360792 28071316
5786 28071316 27444565 26386177 25217010 24477313 24175207 24164126 24077762 24455647 24800744
5777 24800744 25387660 26491269 27958505 29850858 31725855 34191870 37207149 39227240
5769 39227240 39683789 38488116 36231871 33767686 31504043 29727927 28426456 27787848
5761 27787848 27067298 26371416 26233943 26701693 26942598 27572582 28620070 29653330 31203994
5752 31203994 33299992 35019993 36088342 36739312 36458173 35912157 34675413 32810772 30749430
$$ packed form
5815A3217207j3229K91354K62756J21098M87057R39503L50675J42422L51724K10627
5805A6361194L8960N0165L81634j51237K94465M0588k12833L10693L77524N97320
5795A8088473R68193Q61502J450799J512254J666085J800951J585468M27067k89476
5786B8071316o26751j058388j169167p39697l02106j1081q6364L77885L45097
5777B4800744N86916J103609J467236J892353J874997K466015L015279K020091
5769C9227240M56549j195673k256245k464185k263643j776116j301471o38608
5761B7787848p20550o95882j37473M67750K40905O29984J047488J033260J550664
5752C1203994K095998J720001J068349O50970k81139n46016j236744j864641k061342
$$ plain form
5743 30749430 28968895 27821391 27064026 26207104 25922260 25658849 25964893 26455878 27185621
5734 27185621 28473835 29971883 31903044 33954993 35403771 36054328 35887725 35092385 33578079
5725 33578079 31493266 29043605 26785085 24797347 23796197 23454858 22778200 22466698 22249529
5716 22249529 22571894 22763003 23355445 23828981 24251988 25201597 25159948 24632633 24117899 22621554
5706 22621554 21645008 20531602 19292521 18288773 17989895 17217459 16690376 16556430 16168629
5697 16168629 16183821 16041786 15633174 15853453 16184759 16479036 16524769 16527495 17341901 17831311
5687 17831311 17875146 17863492 17594941 17490024 17167826 16750852 16749065 16719144 16539618 16235000
5677 16235000 16519016 16532955 16787862 17540056 17819744 18262569 18295036 19087612 19838238 20680748
$$ packed form
5743C0749430j780535j147504p57365q56922k84844k63411L06044M90985P29743
5734B7185621J288214J498048J931161K051949J448778O50557j66603p95340j514306
5725C3578079k084813k449661k258520j987738j001150l41339o76658l11502k17169
5716B2249529L22365J91109N92442M73536M23007R49609m1649n27315n14734j496345
5706B2621554r76546j113406j239081j003748k98878p72436n27083j33946l87801
5697A6168629J5192j42035m08612K20279L31306K94277M5733K726Q14406M89410
5687A7831311M3835j1654k68551j04917l22198m16974j787k9921j79526l04618
5677A6235000K84016J3939K54907P52194K79688M42825L2467P92576P50626Q42510
$$ plain form
5667 20680748 21711511 22364227 23020103 23799525 24297417 24606236 25007046 25173486 24679286
5658 24679286 23929633 23340146 22531124 21681748 21503750 21483776 21602013 21532302 21692138 22086785
5648 22086785 22425675 23446786 24234628 25317965 26631203 28083490 29200972 30267640
5640 30267640 30270016 29844534 28586101 27137521 25854057 24924071 24004161 23539364 23040365
5631 23040365 22709192 22538885 22825223 23006909 23056560 23159201 23598187 23755855 24268366 24710461
5621 24710461 24974531 25243468 25185999 24758780 23611861 22869386 22045335 20973778 20717711
5612 20717711 20297063 20279976 20509342 20407624 20634230 20740911 20777634 21073353 21474607 21541603
5602 21541603 21522645 21726646 22163680 21772394 21179013 20939785 20336014 19941804 19541730 19018003
$$ packed form
5667B0680748J030763O52716O55876P79422M97892L08819M00810J66440m94200
5658B4679286p49653n89487q09022q49376j77998j9974J18237o9711J59836L94647
5648B2086785L38890J021111P87842J083337J313238J452287J117482J066668
5640C0267640K376m25482j258433j448580j283464r29986r19910m64797m98999
5631B3040365l31173j70307K86338J81686M9651J02641M38986J57668N12511M42095
5621B4710461K64070K68937n7469m27219j146919p42475q24051j071557k56067
5612B0717711m20648j7087K29366j01718K26606J06681L6723K95719M01254O6996
5602B1541603j8958K04001M37034l91286n93381k39228o03771l94210m00074n23727
$$ plain form
5592 19018003 18638630 18860798 19207218 19117668 19927927 20341506 20440306 21072715 21469818 21653259
5582 21653259 21771368 21834172 22498174 22914092 23238296 23499756 23448344 23676413 23956888 23693953
5572 23693953 23616134 23633194 23847667 24041743 24208807 24169092 23777442 23540772 23563385 23492927
5562 23492927 23876711 24208612 24920415 26097269 26730167 27581702 28728195 29556503 29996182
5553 29996182 30620541 30959491 30474138 30209426 29571522 28689833 27874187 27441990 26646890
5544 26646890 26297609 25925057 25505560 25420733 25088013 25038207 25146125 25269502 25417581 25510295
5534 25510295 25503205 25519190 25889589 26002822 26353354 26757229 27756427 28607728 29151275 29568934
5524 29568934 29894432 29711827 29692887 29588822 29632250 30010408 30340966 31047108 31439721 32261060
$$ packed form
5592A9018003l79373K22168L46420q9550Q10259M13579R8800O32409L97103J83441
5582B1653259J18109O2804O64002M15918L24204K61460n1412K28069K80475k62935
5572B3693953p7819J7060K14473J94076J67064l9715l91650k36670K2613p0458
5562B3492927L83784L31901P11803J176854O32898Q51535J146493Q28308M39679
5553B9996182O24359L38950m85353k64712o37904q81689q15646m32197p95100
5544B6646890l49281l72552m19497q4827l32720m9806J07918J23377J48079R2714
5534B5510295p090J5985L70399J13233L50532M03875R99198Q51301N43547M17659
5524B9568934L25498j82605j8940j04065M3428L78158L30558P06142L92613Q21339
$$ plain form
5514 32261060 33626271 34817056 36430112 38518369 40536503 43240778 45967729 49013273
5506 49013273 50674577 51166696 50803312 49010524 46526497 44744278 43220409 41938260
5498 41938260 41238072 40948134 41351181 41797163 42374126 43666145 45238270 47237217 49715049
5489 49715049 51543435 52689977 53136065 53046841 52703711 53199795 53727672 54901300 56919244
5480 56919244 58585166 60780617 62730094 64215756 64456024 63767007 61520939 57900313
5472 57900313 53138340 48384293 44350259 41501147 39011777 37051331 35887986 35089257
5464 35089257 34523538 33987860 33515993 32533695 31555422 30654669 29285591 28056796 26875390
5455 26875390 25572662 24632086 23648174 22993933 22373018 22034560 21517883 21053428 20398990
$$ packed form
5514C2261060J365211J190785J613056K088257K018134K704275K726951L045544
5506D9013273J661304M92119l63384j792788k484027j782219j523869j282149
5498D1938260p00188k89938M03047M45982N76963J292019J572125J998947K477832
5489D9715049J828386J146542M46088q9224l43130M96084N27877J173628K017944
5480E6919244J665922K195451J949477J485662K40268o89017k246068l620626
5472E7900313m761973m754047m034034k849112k489370j960446j163345p98729
5464C5089257n65719n35678m71867r82298r78273r00753j369078j228795j181406
5455B6875390j302728r40576r83912o54241o20915l38458n16677m64455o54438
$$ plain form
5446 20398990 20123795 20154005 20064260 20072591 20068128 20181144 20006989 19684837 19484918 19423138 18910584
5435 18910584 18242299 18165010 18229842 18239591 18434676 18734990 19688358 20159427 20734392 22003021
5425 22003021 23094987 24010793 24397486 24476292 23906283 22549007 21767826 21171497 20248418
5416 20248418 19773396 20100439 20365091 20651233 21384046 22011143 23094798 24138336 24353583
5407 24353583 24964843 24638299 24054807 23119304 22525607 21717765 21238248 21144057 20873856 20881893
5397 20881893 20998825 21560540 22165794 23062115 23949035 24489449 24741266 24050125 23423692
5388 23423692 22880107 21136313 20082198 19226151 18721795 18213051 17905645 18059422 18299257
5379 18299257 18787753 19245003 19524591 19923375 19459720 18809519 17785911 16580895 15835711
$$ packed form
5446B0398990k75195L0210q9745Q331m463J13016j74155l22152j99919o1780n12554
5435A8910584o68285p7289O4832R749J95085L00314R53368M71069N74965J268629
5425B2003021J091966R15806L86693P8806n70009j357276p81181n96329r23079
5416B0248418m75022L27043K64652K86142P32813O27097J083655J043538K15247
5407B4353583O11260l26544n83492r35503n93697q07842m79517r4191k70201Q037
5397B0881893J16932N61715O05254Q96321Q86920N40414K51817o91141o26433
5388B3423692n43585j743794j054115q56047n04356n08744l07406J53777K39835
5379A8299257M88496M57250K79588L98784m63655o50201j023608j205016p45184
$$ plain form
5370 15835711 15136222 14976337 14399722 13869012 13707644 13173831 12736988 12523698 12446836 12405555
5360 12405555 11901157 11912013 11835023 11395935 11253317 10504972 9878572 9715162 9559625 9400470
5350 9400470 9314593 9219440 9215515 9171741 8995773 9016070 9300093 9140411 8993772 8893941 8653222
5339 8653222 8406708 8382511 7943913 7671072 7719558 7817321 7522170 7600370 7510496 7267225
5329 7267225 7301890 7071138 7021921 7449055 7814084 7710639 7620407 7518032 7584398 7855968
5319 7855968 8180768 8770485 8667573 8999335 9396828 9820080 10260686 10660040 11004282 11286622
5309 11286622 11660476 11909600 12428787 12930175 13776159 14205215 13757445 13361388 12904205
5300 12904205 12520959 12056587 11706786 11636923 11372154 11981179 12381035 13023522 13787180 14767597
$$ packed form
5370A5835711o99489j59885n76615n30710j61368n33813m36843k13290p6862m1281
5360A2405555n04398J0856p6990m39088j42618p48345o26400j63410j55537j59155
5350I400470q5877r5153l925m3774j75968K0297K84023j59682j46639r9831k40719
5339H653222k46514k4197m38598k72841M8486R7763k95151P8200q9874k43271
5329G267225L4665k30752m9217M27134L65029j03445r0232j02375O6366K71570
5319G855968L24800N89717j02912L31762L97493M23252M40606L99354L44242K82340
5309A1286622L73854K49124N19187N01388Q45984M29056m47770l96057m57183
5300A2904205l83246m64372l49801o9863k64769O09025L99856O42487P63658R80417
$$ plain form
5290 14767597 15231528 15600594 15673923 15235516 14596728 13772792 12659758 12231989 11439857
5281 11439857 10419541 9968673 9771637 9231971 9071512 9141166 9271749 9711528 9835963
5272 9835963 9773738 9738082 9692162 9155018 8688878 8210136 8121266 7677483 7158264 6699058
5262 6699058 6620127 6544332 5984775 5746480 5902033 5641653 5472981 5340064 5479387 5404992
5252 5404992 5194828 5007147 5006241 5195395 5517267 5295816 5489567 5552380 5187457 5445528
5242 5445528 5573582 5344706 5251085 5539666 5362491 4909377 4966654 5343391 5385711 5457729
5232 5457729 5387854 5571741 5301934 5674237 5519860 5328226 5373597 5462379 5482534 5541225
5222 5541225 5555004 6031808 5879279 5463487 5695200 5805783 5473429 5384362 5571254 5727584
$$ packed form
5290A4767597M63931L69066P3329m38407o38788q23936j113034m27769p92132
5281A1439857j020316m50868j97036n39666j60459O9654J30583M39779J24435
5272I835963o2225l5656m5920n37144m66140m78742q8870m43783n19219m59206
5262F699058p8931p5795n59557k38295J55553k60380j68672j32917J39323p4395
5252E404992k10164j87681r06J89154L21872k21451J93751O2813l64923K58071
5242E445528J28054k28876r3621K88581j77175m53114N7277L76737M2320P2018
5232E457729o9875J83887k69807L72303j54377j91634M5371Q8782K0155N8691
5222E541225J3779M76804j52529m15792K31713J10583l32354q9067J86892J56330
$$ plain form
5212 5727584 5744737 5726213 6118839 6263268 6210047 6178384 6386458 6358998 6307953 6394657 6847956
5201 6847956 6591447 6416421 6594397 6770374 6647186 6799628 6842555 7320427 7287981 7449204
5191 7449204 7492763 7517996 7914488 8061142 8137300 8279733 8144603 8566922 9119637 9564202
5181 9564202 9769552 9949231 10106519 10420536 10773375 10659713 10665081 10406480 10845437 11009169
5171 11009169 10931495 10987207 11207460 11194885 10999494 11009322 10570036 10113166 10384578 10186350
5161 10186350 10169860 10322369 10436130 10422863 10685051 11211838 11809214 12307759 12784591 13583051
5151 13583051 14051633 14531128 14858460 14743564 14832018 15104352 15180632 14797254 14777693 14848174
5141 14848174 14866328 14421680 14078557 13950550 13146347 12406976 11713594 10999899 10671390 10326149
$$ packed form
5212E727584J7153j8524L92626J44429n3221l1663K08074k7460n1045Q6704M53299
5201F847956k56509j75026J77976J75977j23188J52442M2927M77872l2446J61223
5191G449204M3559K5233L96492J46654P6158J42433j35130M22319N52715M44565
5181I564202K05350J79679J57288L14017L52839j13662N368k58601M38957J63732
5171A1009169p7674N5712K20253j2575j95391R828m39286m56870K71412j98228
5161A0186350j6490J52509J13761j3267K62188N26787N97376M98545M76832P98460
5151A3583051M68582M79495L27332j14896Q8454K72334P6280l83378j9561P0481
5141A4848174J8154m44648l43123j28007q04203p39371o93382p13695l28509l45241
$$ plain form
5131 10326149 9787542 9874279 9849475 9733423 9790877 9805778 9842946 10329669 10582000 10640772
5121 10640772 11061554 11132138 10681636 10766074 10651158 10473213 10617672 10547738 10549933 10315265
5111 10315265 9875023 9615051 9217028 8975465 8827143 8264153 8112890 7811166 7328049
5102 7328049 7069666 6971222 6825929 6848476 6965086 6950962 6737920 6725147 7023312 7091250
5092 7091250 6746657 6981918 6838559 6745259 6591094 6340153 6588691 6948419 6779571 6646059
5082 6646059 6891331 7079385 7123385 7019169 7164275 7114616 7148946 7196369 7133966 7345169
5072 7345169 7341852 7613557 7685483 8075661 8349706 8430193 8281100 8067447 8420500 8630000
5062 8630000 8935553 8835749 8783716 8829197 8961408 8972021 9152538 9358511 9718035 9874487
$$ packed form
5131A0326149n38607Q6737k4804j16052N7454J4901L7168M86723K52331N8772
5121A0640772M20782P0584m50502Q4438j14916j77945J44459o9934K195k34668
5111A0315265m40242k59972l98023k41563j48322n62990j51263l01724m83117
5102G328049k58383r8444j45293K2547J16610j4124k13042j2773K98165O7938
5092G091250l44593K35261j43359r3300j54165k50941K48538L59728j68848j33512
5082F646059K45272J88054M4000j04216J45106m9659L4330M7423o2403K11203
5072G345169l317K71705P1926L90178K74045Q0487j49093k13653L53053K09500
5062H630000L05553r9804n2033M5481J32211J0613J80517K05973L59524J56452
$$ plain form
5052 9874487 10175992 10200918 10420121 10628514 10635176 10275164 10715000 10711380 10377608 10573634
5042 10573634 11113786 11201455 11211420 11808328 12191490 12724529 13082296 13373044 13488109 13710704
5032 13710704 13079972 12734034 12523783 12464095 12221740 11793037 12033844 11916272 11840591 12130702
5022 12130702 12289306 12412546 12659408 12892272 13256114 13649982 13931405 14805948 15295909
5013 15295909 15427883 15798118 15924516 15976967 15651398 15548698 15416391 15123295 15166580 15487452
5003 15487452 15254007 15387585 15568674 16004196 16645815 16841155 16947857 17151130 17429523
4994 17429523 18003937 18450054 18872420 19410367 20195765 20966506 21479914 22602463 23850504
4985 23850504 25040974 26287321 28071332 30252813 32501304 35540452 40718096 45965011
$$ packed form
5052I874487L01505K4926K19203K08393O662l60012M39836l620l33772J96026
5042A0573634N40152Q7669R965N96908L83162N33039L57767K90748J15065K22595
5032A3710704o30732l45938k10251n9688k42355m28703K40807j17572p5681K90111
5022A2130702J58604J23240K46862K32864L63842L93868K81423Q74543M89961
5013A5295909J31974L70235J26398N2451l25569j02700j32307k93096M3285L20872
5003A5487452k33445J33578J81089M35522O41619J95340J06702K03273K78393
4994A7429523N74414M46117M22366N37947P85398P70741N13408J122549J248041
4985B3850504J190470J246347J784011K181481K248491L039148N177644N246915
$$ plain form
4977 45965011 49843540 52840597 52911066 50274873 45910622 41107609 37054309 34219951
4969 34219951 32141166 30689464 29564613 29114592 29319565 29765337 30120674 30486146 31305934
4960 31305934 32503172 33328943 33649216 34377882 34684960 34690751 34080259 33366598 32540780 31537065
4950 31537065 30440756 29260363 28009689 26900224 26311761 26049176 25526290 25532714 25397325
4941 25397325 25678881 25506683 24861767 24559121 24182840 23572310 23086802 22708639 22238337
4932 22238337 21834233 21806044 21904903 21738202 22028227 22662110 23516473 24569863 25703546
4923 25703546 26665310 27011012 27025168 26780183 26121704 24695332 23314224 21972928 20630240
4914 20630240 19582657 18232980 17375485 16907115 16434009 15863628 15423394 15158596 14834762
$$ packed form
4977D5965011L878529K997057P0469k636193m364251m803013m053300k834358
4969C4219951k078785j451702j124851m50021K04973M45772L55337L65472Q19788
4960C1305934J197238Q25771L20273P28666L07078N791o10492p13661q25818j003715
4950C1537065j096309j180393j250674j109465n88463k62585n22886O424j35389
4941B5397325K81556j72198o44916l02646l76281o10530m85508l78163m70302
4932B2238337m04104k8189R8859j66701K90025O33883Q54363J053390J133683
4923B5703546R61764L45702J4156k44985o58479j426372j381108j341296j342688
4914B0630240j047583j349677q57495m68370m73106n70381m40234k64798l23834
$$ plain form
4905 14834762 14779072 14600567 13982214 13923574 13590666 13629145 13595468 13197067 13334272 13407756
4895 13407756 13083580 12897833 13367640 13260388 13173107 13079464 12965386 13219801 13668085 13946625
4885 13946625 14185525 14095752 14423847 14854431 14867852 14763417 14964561 15270657 15510081 15517544
4875 15517544 15570775 16143023 16312359 16622412 16940946 17696957 17947024 18706708 18848971 19263836
4865 19263836 19895098 20578493 21478054 21852254 22588216 23336014 24318405 25573015 26975885
4856 26975885 28784823 31336445 33928618 37328802 41862353 46866495 51052936 53230895
4848 53230895 52552182 50412532 47342891 45501762 45192564 45141612 46009094 46406642 45717216
4839 45717216 44024746 41287813 38084909 35380512 33286921 31664229 30759636 29653013
$$ packed form
4905A4834762n5690j78505o18353n8640l32908L8479l3677l98401J37205P3484
4895A3407756l24176j85747M69807j07252q7281r3643j14078K54415M48284K78540
4885A3946625K38900q9773L28095M30584J3421j04435K01144L06096K39424P463
4875A5517544N3231N72248J69336L10053L18534P56011K50067P59684J42263M14865
4865A9263836O31262O83395Q99561L74200P35962P47798R82391J254610J402870
4856B6975885J808938K551622K592173L400184M533551N004142M186441K177959
4848E3230895o78713k139650l069641j841129l09198n0952Q67482L97548o89426
4839D5717216j692470k736933l202904k704397k093591j622692r04593j106623
$$ plain form
4831 29653013 29040503 27954262 26902408 26315059 25590771 25512922 25726398 26155255 26990368
4822 26990368 27835024 28289580 27973622 26430672 24957499 23328284 21722540 20471953 19323035
4813 19323035 18148101 17653299 16981160 16366084 16104182 16022035 15560758 15009540 14911858 14481347
4803 14481347 14467877 14088347 13903995 13602091 13532558 13478262 13035656 12791534 12517513 12877745
4793 12877745 12782829 12565465 12522807 12559126 12502619 12476010 12385625 12373529 12522639 12532675 12620486
4782 12620486 12586270 12683193 12809069 12452382 12594998 12533710 12695456 12969046 13133708 13004599
4772 13004599 13106701 13212087 13239221 13282161 13389330 13645364 14090425 14570549 14613860 14987165
4762 14987165 15336564 15564199 15733138 16261554 16488019 16949962 17225891 17586403 18160683
$$ packed form
4831B9653013o12510j086241j051854n87349p24288p7849K13476M28857Q35113
4822B6990368Q44656M54556l15958j542950j473173j629215j605744j250587j148918
4813A9323035j174934m94802o72139o15076k61902q2147m61277n51218r7682m30511
4803A4481347j3470l79530j84352l01904o9533n4296m42606k44122k74021L60232
4793A2877745r4916k17364m2658L6319n6507k6609r0385j2096J49110J0036Q7811
4782A2620486l4216R6923J25876l56687J42616o1288J61746K73590J64662j29109
4772A3004599J02102J05386K7134M2940J07169K56034M45061M80124M3311L73305
4762A4987165L49399K27635J68939N28416K26465M61943K75929L60512N74280
$$ plain form
4753 18160683 18403157 18519038 18806401 18709110 18579824 18596860 18346810 18465715 18766120 18803751
4743 18803751 18830605 19248743 19768247 20351936 21465886 22067161 23084051 24331547 25162400
4734 25162400 25873395 26599811 27803656 28787175 30463491 32411252 34663560 36648622 37437802
4725 37437802 37932949 36868957 35575443 34276613 32564961 31769039 30546769 29532205
4717 29532205 28261706 27091184 26191086 25251664 24388867 24280421 23941076 23843345 23685663
4708 23685663 23601688 24243870 24421761 24730238 25124366 25617016 26125345 26841761 27627461 28692281
4698 28692281 30275760 31917581 33895809 36199859 38678314 40635028 41664536 41954660
4690 41954660 41108105 39833976 38418998 37206277 36004177 34856577 33492763 32428027
$$ packed form
4753A8160683K42474J15881K87363r7291j29286J7036k50050J18905L00405L7631
4743A8803751K6854M18138N19504N83689J113950O01275J016890J247496Q30853
4734B5162400P10995P26416J203845R83519J676316J947761K252308J985062P89180
4725C7437802M95147j063992j293514j298830j711652p95922j222270j014564
4717B9532205j270499j170522r00098r39422q62797j08446l39345r7731j57682
4708B3685663q3975O42182J77891L08477L94128M92650N08329P16416P85700J064820
4698B8692281J583479J641821J978228K304050K478455J956714J029508K90124
4690D1954660q46555j274129j414978j212721j202100j147600j363814j064736
$$ plain form
4682 32428027 31007356 30091553 29261968 29227907 29202862 29532427 29839050 29972544 30955515 31604298
4672 31604298 32821064 34471793 36412631 38886805 41490365 44515473 48072836 52270494
4664 52270494 57383021 63903976 72157311 81227853 89385598 92927851 90818788 83052253
4656 83052253 72162270 61890857 53500697 46700175 40965727 36661518 33551913 30963068
4648 30963068 28464386 26460734 25114541 23715317 22419288 21285604 20587623 20068512
4640 20068512 19607567 19198324 18374761 17873561 17329098 16858940 16302902 15718478 15031093
4631 15031093 15029647 14737668 14204728 14077052 13424612 12930107 12588394 12832708 12286722 11882976
4621 11882976 12134361 12270882 11799685 11269671 11275601 11021281 10982353 11048538 11205561 11303849
$$ packed form
4682C2428027j420671r15803q29585l4061k5045L29565L06623J33494R82971O48783
4672C1604298J216766J650729J940838K474174K603560L025108L557363M197658
4664E2270494N112527O520955Q253335R070542Q157745L542253k109063p766535
4656H3052253j0889983j0271413q390160o800522n734448m304209l109605k588845
4648C0963068k498682k003652j346193j399224j296029j133684o97981n19111
4640B0068512m60945m09243q23563n01200n44463m70158n56038n84424o87385
4631A5031093j446k91979n32940j27676o52440m94505l41713K44314n45986m03746
4621A1882976K51385J36521m71197n30014N930k54320l8928O6185J57023R8288
$$ plain form
4611 11303849 10717447 10857629 10531513 10587044 10295548 10165779 10498661 10311425 10494121 10395022
4601 10395022 10463913 10324315 10060039 9958390 9808334 9869406 10131453 10193615 10314052 10234193
4591 10234193 10295649 10538819 10643552 10779052 11061243 10906950 11046703 11623496 11572456 11543407
4581 11543407 12061275 12527912 12750271 12996323 12994759 12925340 12863622 12607882 12214196 12189184
4571 12189184 12167957 12080178 12457855 12447152 12349057 12646711 13141296 13127020 13999819 14551153
4561 14551153 14952855 15562269 16014417 16926674 18382289 19258855 20203754 20724486 20922931
4552 20922931 20954581 20715797 20359425 20060846 19737718 19618098 20098942 19962604 20012763 19815028
4542 19815028 19459083 19088591 18769441 18562697 18365419 17979232 17876300 18175642 18949388
$$ packed form
4611A1303849n86402J40182l26116N5531k91496j29769L32882j87236J82696r9099
4601A0395022O8891j39598k64276j01649j50056O1072K62047O2162J20437p9859
4591A0234193O1456K43170J04733J35500K82191j54293J39753N76793n1040k9049
4581A1543407N17868M66637K22359K46052j564o9419o1718k55740l93686k5012
4571A2189184k1227q7779L77677j0703r8095K97654M94585j4276Q72799N51334
4561A4551153M01702O09414M52148R12257J455615Q76566R44899N20732J98445
4552B0922931L1650k38784l56372k98579l23128j19620M80844j36338N0159j97735
4542A9815028l55945l70492l19150k06744j97278l86187j02932K99342P73746
$$ plain form
4533 18949388 19218903 19477470 19756419 19306480 19137361 18441185 17708802 17346016 16431867
4524 16431867 15919566 15623444 15606121 15641177 15378584 15329338 15823241 16041210 16212222 16187859
4514 16187859 16060943 16175223 16509887 16837379 16975199 17391002 17918177 17904969 18222814 18285552
4504 18285552 17534458 17324183 16957677 16977921 17475187 17364056 17094826 17049375 16595901 16050571
4494 16050571 15374348 14768362 14307263 14083930 14130125 14102148 13950862 13762240 13943194 14360115
4484 14360115 14883586 15336039 15450038 15852086 16163421 16255121 16044692 15806966 15688447 15198095
4474 15198095 15334504 15549014 15511572 15571599 15813733 15521975 15167291 14620382 14527322 14229926
4464 14229926 14136535 14312908 14469220 14106903 14476783 14633373 14898766 15424513 15494927 15615903
$$ packed form
4533A8949388K69515K58567K78949m49939j69119o96176p32383l62786r14149
4524A6431867n12301k96122j7323L5056k62593m9246M93903K17969J71012k4363
4514A6187859j26916J14280L34664L27492J37820M15803N27175j3208L17845O2738
4504A8285552p51094k10275l66506K0244M97266j11131k69230m5451m53474n45330
4494A6050571o76223o05986m61099k23333M6195k7977j51286j88622J80954M16921
4484A4360115N23471M52453J13999M02048L11335R1700k10429k37726j18519m90352
4474A5198095J36409K14510l7442O0027K42134k91758l54684n46909r3060k97396
4464A4229926r3391J76373J56312l62317L69880J56590K65393N25747P0414J20976
$$ plain form
4454 15615903 16261176 16431361 16699647 16309969 16000737 15708170 15450348 14973597 14284327
4445 14284327 14094435 13880164 13839590 13451940 13847056 13923107 14234004 14512691 14537721 14774451
4435 14774451 15339050 15504555 15567838 15873466 16445660 17021321 17960178 18381926 18667926 19049754
4425 19049754 19393273 19543038 19580694 19595961 19445321 19132559 18705499 18010789 17637369 17262761
4415 17262761 16767942 16514390 16519232 16294519 16261957 16388538 16482315 16579999 16851198 16542136
4405 16542136 16550121 16500509 16316839 16206715 16275569 16116651 16234689 16663984 17135200 17235288
4395 17235288 17469817 17496499 17563478 17303399 17170041 16723041 16562247 16213391 16145939 15954451
4385 15954451 16321806 16283432 16139097 16208519 16405081 16427420 16469568 16681144 16441376 16417765
$$ packed form
4454A5615903O45273J70185K68286l89678l09232k92567k57822m76751o89270
4445A4284327j89892k14271m0574l87650L95116P6051L10897K78687K5030K36730
4435A4774451N64599J65505O3283L05628N72194N75661R38857M21748K86000L81828
4425A9049754L43519J49765L7656J5267j50640l12762m27060o94710l73420l74608
4415A7262761m94819k53552M842k24713l2562J26581R3777R7684K71199l09062
4405A6542136P985m9612j83670j10124O8854j58918J18038M29295M71216J00088
4395A7235288K34529K6682O6979k60079j33358m47000j60794l48856o7452j91488
4385A5954451L67355l8374j44335O9422J96562K2339M2148K11576k39768k3611
$$ plain form
4375 16417765 16151775 16176141 15908991 15107241 14775047 14919077 14563339 14776228 14337399 13924612
4365 13924612 13810671 13923352 13621951 13629241 13706367 13672856 13426316 13479680 13524459 13521513 13604314
4354 13604314 13607710 13698561 13823103 14052927 14118398 14363079 14689825 14324670 14276794 14013873
4344 14013873 13922687 13221425 12997405 13238451 13359068 13341656 13255705 13250151 13307019 13261072 13405754
4333 13405754 13522296 13600671 13416829 13496440 13495535 13500670 13649985 13610855 13744726 13856887 13720472
4322 13720472 13670766 13450227 13723189 14263606 14278794 14021564 14048217 13802191 14100806 13981591
4312 13981591 13759314 13989551 14212322 14410895 14178134 14343736 14366603 14457527 14485122 14470794
4302 14470794 14877198 14560331 14734124 14814134 14789364 14919726 14904912 14915565 14627948 14969457
$$ packed form
4375A6417765k65990K4366k67150q01750l32194J44030l55738K12889m38829m12787
4365A3924612j13941J12681l01401P290P7126l3511k46540N3364M4779k946Q2801
4354A3604314L396R0851J24542K29824O5471K44681L26746l65155m7876k62921
4344A4013873r1186p01262k24020K41046J20617j7412q5951n554N6868m5947J44682
4333A3405754J16542P8375j83842P9611r05N135J49315l9130J33871J12161j36415
4322A3720472m9706k20539K72962N40417J5188k57230K6653k46026K98615j19215
4312A3981591k22277K30237K22771J98573k32761J65602K2867R0924K7595j4328
4302A4470794M06404l16867J73793Q0010k4770J30362j4814J0653k87617L41509
$$ plain form
4292 14969457 14685148 15010332 14989863 14721520 14840434 15009050 14939245 14868558 15045532 15234627
4282 15234627 15078469 14952366 14776908 14847082 14976493 15097269 14936783 14951105 15152786 15291863
4272 15291863 15341413 15408933 15508729 15612936 15648705 15664798 15482546 15716746 15885512 15834277
4262 15834277 15582582 15318471 15644150 15768897 15588263 15509341 15333281 15154875 15161386 15223923
4252 15223923 14999772 15024001 14876116 14896431 14817310 14529878 14673809 14369491 14548166 14534427
4242 14534427 14213661 14312060 14103254 13943533 14180419 14382370 14072664 14067133 14283784 14133709
4232 14133709 14327321 14170810 14147160 14198952 14116581 14215521 14239081 14191362 14592256 14572934 14281730
4221 14281730 13852304 14213207 14552297 14544308 14562200 14500407 14796484 14499760 14854008 14587988
$$ packed form
4292A4969457k84309L25184k0469k68343J18914J68616o9805p0687J76974J89095
4282A5234627j56158j26103j75458P0174J29411J20776j60486J4322K01681J39077
4272A5291863M9550O7520R9796J04207L5769J6093j82252K34200J68766n1235
4262A5834277k51695k64111L25679J24747j80634p8922j76060j78406O511O2537
4252A5223923k24151K4229j47885K0315p9121k87432J43931l04318J78675j3739
4242A4534427l20766R8399k08806j59721K36886K01951l09706n531K16651j50075
4232A4133709J93612j56511k3650N1792q2371R8940K3560m7719M00894j9322k91204
4221A4281730m29426L60903L39090p989J7892o1793K96077k96724L54248k66020
$$ plain form
4211 14587988 14516692 15046358 14813174 14995164 15183682 15127076 15220532 15249481 15500195 15595687
4201 15595687 15480458 15453860 15391586 15419147 15294943 15837571 16117053 16111885 16115387 16240740 16192220
4190 16192220 16254107 16543815 16833959 16894891 16804091 16984264 16661965 16598162 17170466 17385848
4180 17385848 17495810 17136730 17265289 17507665 17509712 17479467 17607423 17844530 17559621 17914235
4170 17914235 17755846 17944715 18138974 18169632 18078695 18373705 18573640 18849047 18715071 18445906
4160 18445906 18761568 18881673 19292422 19078895 18784239 18940723 18889304 18450209 18790368 19200407
4150 19200407 18980858 19160233 19248689 19438472 19371559 19303377 19783402 19924213 19814904 20002950
4140 20002950 20176987 20731917 20520043 20670029 20499305 20562738 20721908 20830511 20930436 21086765
$$ packed form
4211A4587988p1296N29666k33184J81990J88518n6606R3456K8949K50714R5492
4201A5595687j15229k6598o2274K7561j24204N42628K79482n168L502J25353m8520
4190A6192220O1887K89708K90144O0932r0800J80173l22299o3803N72304K15382
4180A7385848J09962l59080J28559K42376K047l0245J27956K37107k84909L54614
4170A7914235j58389J88869J94259L0658r0937K95010J99935K75407j33976k69165
4160A8445906L15662J20105M10749k13527k94656J56484n1419m39095L40159M10039
4150A9200407k19549J79375Q8456J89783o6913o8182M80025J40811j09309J88046
4140B0002950J74037N54930k11874J49986j70724O3433J59170J08603R9925J56329
$$ plain form
4130 21086765 20925604 21070108 21029063 21192265 21517231 21324817 21626785 21721424 21879012 21590909
4120 21590909 22058222 22514258 22533185 22561244 22578225 22617967 22978012 22977377 23245642 23371808 23647754
4109 23647754 23924679 24051890 24391613 24640805 24720602 25162518 25333918 25520626 26013830 26484755
4099 26484755 26707458 26852482 26847594 27101108 27477052 28102743 28232747 28422368 28553489 29013254
4089 29013254 29039112 29355179 30119675 30712706 30888941 31015566 31453670 31847378 32171521 32546456
4079 32546456 33253028 33621099 33902623 34207919 34534238 35046168 35997367 36355465 37017536
4070 37017536 37766629 38068760 38519815 39068503 39401918 40048454 40669979 41369993 42104116
4061 42104116 42627842 43052208 43509239 44374395 45086058 45797718 46919922 47588482 48696831
$$ packed form
4130B1086765j61161J44504m1045J63202L24966j92414L01968R4639J57588k88103
4120B1590909M67313M56036J8927K8059J6981L9742L60045o35K68265J26166K75946
4109B3647754K76925J27211L39723K49192P9797M41916J71400J86708M93204M70925
4099B6484755K22703J45024m888K53514L75944O25691J30004J89621J31121M59765
4089B9013254K5858L16067P64496N93031J76235J26625M38104L93708L24143L74935
4079C2546456P06572L68071K81524L05296L26319N11930R51199L58098O62071
4070C7017536P49093L02131M51055N48688L33415O46536O21525P00014P34123
4061D2104116N23726M24366M57031Q65156P11663P11660J122204O68560J108349
$$ plain form
4052 48696831 50006609 50786207 51652933 52735978 53756948 55101756 56096635 57344851 58820916
4043 58820916 59673623 60852707 62045615 63106013 64581199 65906323 66999205 68361017
4035 68361017 69793779 71467165 72994270 74395754 76008660 77766081 79650502 81550092
4027 81550092 83279575 85569732 87631602 89606331 92204121 94505446 96610605 98708237
4019 98708237 101471102 103603899 105866640 108274539 110732897 113463358 115854009 118597041
4011 118597041 121939564 125160301 128551114 131919174 135915664 140390413 144689905 149291161
4003 149291161 154582898 160627523 166701731 173698523 181566679 189875696 198801360 209106084
3995 209106084 220156119 231956655 244896834 259285605 274953594 291266410 307534418
$$ packed form
4052D8696831J309778P79598Q66726J083045J020970J344808R94879J248216J476065
4043E8820916Q52707J179084J192908J060398J475186J325124J092882J361812
4035F8361017J432762J673386J527105J401484J612906J757421J884421J899590
4027H1550092J729483K290157K061870J974729K597790K301325K105159K097632
4019I8708237K762865K132797K262741K407899K458358K730461K390651K743032
4011A18597041L342523L220737L390813L368060L996490M474749M299492M601256
4003A49291161N291737O044625O074208O996792P868156Q309017Q925664J0304724
3995B09106084J1050035J1800536J2940179J4388771J5667989J6312816J6268008
$$ plain form
3988 307534418 323730398 338855407 350828700 358377079 359443352 352896000 340258595
3981 340258595 323429011 304948932 287304219 270950859 256814965 244117130 232838315
3974 232838315 223011393 214582264 207021828 199796461 194009910 188434553 183553154 179230979
3966 179230979 175048988 171129595 167429474 163887257 160120752 156742513 153241538 149545044
3958 149545044 146203408 142211983 138311618 134579822 130949092 126966940 123341036 119738985
3950 119738985 116247541 113168935 109939289 106830758 103668880 101061924 98669760 96372624
3942 96372624 94347930 92180450 89964213 88133864 86092032 84063104 82355539 80504751
3934 80504751 78721229 77171258 75825665 74336456 72965377 71716990 70479400 69327480
$$ packed form
3988C07534418J6195980J5125009J1973293P548379J066273o547352j2637405
3981C40258595j6829584j8480079j7644713j6353360j4135894j2697835j1278815
3974B32838315r826922q429129p560436p225367n786551n575357m881399m322175
3966A79230979m181991l919393l700121l542217l766505l378239l500975l696494
3958A49545044l341636l991425l900365l731796l630730l982152l625904l602051
3950A19738985l491444l078606l229646l108531l161878k606956k392164k297136
3942I6372624k024694k167480k216237j830349k041832k028928j707565j850788
3934H0504751j783522j549971j345593j489209j371079j248387j237590j151920
$$ plain form
3926 69327480 68228165 67036116 65880094 65152876 64435848 63690067 62419830 61494709 60643096
3917 60643096 59893906 58899185 58405190 57665027 56519054 55800689 55300463 54479747 54157588
3908 54157588 53346695 52400753 51593343 51030549 50923655 49926886 49366538 48815469 48263518
3899 48263518 47361221 46945272 46500438 45827619 45173747 44848248 44793193 44338128 43826050 43411723
3889 43411723 42741519 42306522 42223334 41507235 41285446 41246864 40788782 40374661 40133935 39551308
3879 39551308 39670406 39521235 38634808 38390341 38558950 38117115 37798933 37808352 37910170 37600882
3869 37600882 37753430 37454707 36952289 36939613 36795816 36668922 36392223 36317055 36019964 35777257
3859 35777257 35375200 35146376 34958465 34747939 34793010 34466362 34073680 33592625 33199357 33229482
$$ packed form
3926F9327480j099315j192049j156022p27218p17028p45781j270237r25121q51613
3917F0643096p49190r94721m93995p40163j145973p18365n00226q20716l22159
3908E4157588q10893r45942q07410n62794j06894r96769n60348n51069n51951
3899D8263518r02297m15949m44834o72819o53872l25499n5055m55065n12078m14327
3889D3411723o70204m34997q3188p16099k21789l8582m58082m14121k40726n82627
3879C9551308J19098j49171q86427k44467J68609m41835l18182R419J01818l09288
3869C7600882J52548k98723n02418j2676j43797j26894k76699p5168k97091k42707
3859C5777257m02057k28824j87911k10526M5071l26648l92682m81055l93268L0125
$$ plain form
3849 33229482 32819222 32540223 32214353 32244546 31800407 31635118 31141958 31123560 30968840 30688968
3839 30688968 30589266 30358767 30133523 29779522 29730084 29460075 29072381 28716064 28596799 28106242
3829 28106242 27918968 27892904 27470891 27314301 27081732 26947239 26552004 26852123 26753711 26460287
3819 26460287 26610575 26514566 26437614 26555167 26391726 26402108 26464672 26570675 26652928 26728044
3809 26728044 26983336 26790650 26728723 26984539 26966995 26772479 27228286 27358523 27677282 27757397
3799 27757397 28031368 28303819 28879984 29030786 28794908 29213747 29497513 29860287 30296875
3790 30296875 30784718 31299195 31944348 32120828 32654671 32762470 33010821 33486921 33851702
3781 33851702 34346947 34721582 35364230 35421341 35947578 36728991 37397778 37893712 38660703 39038704
$$ packed form
3849C3229482m10260k78999l25870L0193m44139j65289m93160j8398j54720k79872
3839C0688968r9702k30499k25244l54001m9438k70009l87694l56317j19265m90557
3829B8106242j87274k6064m22013j56590k32569j34493l95235L00119r8412k93424
3819B6460287J50288r6009p6952J17553j63441J0382O2564J06003Q2253P5116
3809B6728044K55292j92686o1927K55816j7544j94516M55807J30237L18759Q0115
3799B7757397K73971K72451N76165J50802k35878M18839K83766L62774M36588
3790C0296875M87843N14477O45153J76480N33843J07799K48351M76100L64781
3781C3851702M95245L74635O42648N7111N26237P81413O68787M95934P66991L78001
$$ plain form
3771 39038704 40156882 41018019 41676507 42940647 44122171 44918864 45998323 47292000 48726421
3762 48726421 50287435 51908398 53283213 54759496 56283805 58064885 60087032 62218814
3754 62218814 64150936 66098674 68387845 70394268 72301401 73546627 74996382 76143377
3746 76143377 77606109 78360141 79802953 81399194 83254299 85427944 87931523 90171302
3738 90171302 93036852 96602875 100199098 104434593 109002878 113769559 118195282 122460284
3730 122460284 126226774 128242011 127659859 125892327 122748372 119259880 115636079 113497566
3722 113497566 111924670 111305431 111795768 112974777 114406421 116618596 119489705 122679576
3714 122679576 125758276 128863581 132050141 134567011 135745759 136349028 135930162 133985880
$$ packed form
3771C9038704J118178Q61137O58488J264140J181524P96693J079459J293677J434421
3762D8726421J561014J620963J374815J476283J524309J781080K022147K131782
3754F2218814J932122J947738K289171K006423J907133J245226J449755J146995
3746G6143377J462732P54032J442812J596241J855105K173645K503579K239779
3738I0171302K865550L566023L596223M235495M568285M766681M425723M265002
3730A22460284L766490K015237n82152j767532l143955l488492l623801k138513
3722A13497566j572896o19239M90337J179009J431644K212175K871109L189871
3714A22679576L078700L105305L186560K516870J178748O03269m18866j944282
$$ plain form
3706 133985880 130617349 126258217 121588150 116570072 111399025 107417815 103846988 101349488
3698 101349488 99730020 97977505 97608664 97545365 97504280 96868041 96527900 95369902 93462728
3689 93462728 91304367 88431175 84657897 80513403 76431885 72291463 68468285 65038719
3681 65038719 61966441 58966131 56017468 53963189 51823619 50137377 48634154 46962762
3673 46962762 45406859 44285769 43017308 41507948 40183882 38860408 37479497 35982520
3665 35982520 34654311 33798293 32378457 31192262 30306250 29367800 28388538 27351544 26687205
3656 26687205 25886055 25185507 24758932 23938576 23255242 22220641 21861378 21636849 21186333
3647 21186333 20744233 20229997 19693747 19576054 19043176 18636928 18464078 17721926 17511857
$$ packed form
3706A33985880l368531m359132m670067n018078n171047l981210l570827k497500
3698A01349488j619468j752515l68841o3299m1085o36239l40141j157998j907174
3689I3462728k158361k873192l773278m144494m081518m140422l823178l429566
3681F5038719l072278l000310k948663k054279k139570j686242j503223j671392
3673D6962762j555903j121090j268461j509360j324066j323474j380911j496977
3665C5982520j328209q56018j419836j186195q86012r38450r79262j036994o64339
3656B6687205q01150p00548m26575q20356o83334j034601l59263k24529m50516
3647B1186333m42100n14236n36250j17693n32878m06248j72850p42152k10069
$$ plain form
3638 17511857 17256828 16776643 16495791 16032393 15349795 15163735 14196760 13835672 13651763
3629 13651763 13345351 12757684 12659732 12466141 12170562 12205299 11751561 11782761 11393535 11227485
3619 11227485 11031815 10920818 10598944 10372952 10403080 9662345 9339138 9219072 8736106 8668962
3609 8668962 8728151 8367812 8216013 8038807 7570378 7523375 7821216 7664061 7384603 7313192
3599 7313192 7187156 6771319 6235120 6489508 6523104 6327384 6099850 5781938 6092375 6007060
3589 6007060 5785474 5562632 5544806 5619684 5452783 5166551 4982967 4982300 5041739 5243473 4894832
3578 4894832 4761559 5273508 4900547 4911283 4808679 4594209 4415249 4418254 4265654 4257348
3568 4257348 4316606 4484546 4538184 4329035 4292816 4328848 4315729 4270040 4050286 4015307 4137182
$$ packed form
3638A7511857k55029m80185k80852m63398o82598j86060r66975l61088j83909
3629A3651763l06412n87667r7952j93591k95579L4737m53738L1200l89226j66050
3619A1227485j95670j10997l21874k25992L0128p40735l23207j20066m82966o7144
3609H668962N9189l60339j51799j77206m68429m7003K97841j57155k79458p1411
3599G313192j26036m15837n36199K54388L3596j95720k27534l17912L10437q5315
3589F007060k21586k22842j7826P4878j66901k86232j83584o67N9439K01734l48641
3578D894832j33273N11949l72961J0736j02604k14470j78960L005j52600q306
3568D257348N9258J67940N3638k09149l6219L6032j3119m5689k19754l4979J21875
$$ plain form
3557 4137182 4011700 3660402 3867196 3730385 3830562 3690680 3730280 3961813 3858657 3680659
3547 3680659 3288494 3361608 3559604 3804780 3723735 3440005 3300548 3691958 3440047 3350251
3537 3350251 3093000 3045729 3151824 3505828 3404470 3327326 3406998 3404906 3201909 3043369
3527 3043369 3374460 3152454 3023307 3268722 3272779 3121837 3410851 3288401 3059176 2802075
3517 2802075 2603460 3102263 3016137 2957876 3087864 2786569 2682405 2930942 3093904 2843695
3507 2843695 2716144 3068292 2852385 2745413 2624903 2501366 2561463 2440515 2684917 2691105
3497 2691105 2751337 2512829 2596522 2373546 2354198 2512831 2631387 2698641 2705427 2487202 2172757
3486 2172757 2319705 2508490 2322707 2350899 2457032 2064357 2236826 2320527 2298430 1927718
$$ packed form
3557D137182j25482l51298K06794j36811J00177j39882L9600K31533j03156j77998
3547C680659l92165P3114J97996K45176q1045k83730j39457L91410k51911q9796
3537C350251k57251m7271J06095L54004j01358p7144P9672k092k02997j58540
3527C043369L31091k22006j29147K45415M057j50942K89014j22450k29225k57101
3517B802075j98615M98803q6126n8261J29988l01295j04164K48537J62962k50209
3507B843695j27551L52148k15907j06972j20510j23537O0097j20948K44402O188
3497B691105O0232k38508Q3693k22976j9348J58633J18556O7254O786k18225l14445
3486B172757J46948J88785j85783K8192J06133l92675J72469Q3701k2097l70712
$$ plain form
3476 1927718 1867233 2063011 1982521 1649616 1813415 1747951 1895556 2139821 1793135 1904507
3466 1904507 1989956 2194453 2250607 1935027 1800246 1741966 1629473 1639306 1712670 1608752 1467411
3455 1467411 1457218 1232721 1466470 1257688 1421162 1601368 1467148 1603520 1319980 1620719
3445 1620719 1607311 1795389 1602407 1662638 1425374 1411371 1422729 1484630 1688222 1228276
3435 1228276 1022193 1154162 1239792 1229237 1024293 1246169 1124376 1190536 1298863 1186893
3425 1186893 1179606 1038877 1155131 886096 1208061 1266650 1083504 1030173 1224377 1155008
3415 1155008 1323243 1524029 1268663 1206582 1208527 1390272 1025043 817118 985135 933546
3405 933546 742446 533895 689096 977937 809287 833868 1158179 1224528 1009940 899463
$$ packed form
3476A927718o0485J95778q0490l32905J63799o5464J47605K44265l46686J11372
3466A904507Q5449K04497N6154l15580j34781n8280j12493R833P3364j03918j41341
3455A467411j0193k24497K33749k08782J63474J80206j34220J36372k83540L00739
3445A620719j3408J88078j92982O0231k37264j4003J1358O1901K03592m59946
3435A228276k06083J31969Q5630j0555k04944K21876j21793O6160J08327j11970
3425A186893p287j40729J16254k69035L21965N8589j83146n3331J94204o9369
3415A155008J68235K00786k55366o2081J945J81745l65229k07925J68017n1589
3405I33546j91100k08551J55201K88841j68650K4581L24311O6349k14588j10477
$$ plain form
3395 899463 1296201 1033335 718824 830501 678414 871788 841880 759181 852110 772802
3385 772802 589003 508363 653425 677031 984847 986370 909457 791978 665777 496842 509995
3374 509995 656293 698119 748591 804999 431519 412144 640955 971027 831502 741897 624418
3363 624418 728242 673046 622898 566362 228497 206195 280002 472124 346396 441842 598451
3352 598451 489102 237599 282429 537384 303577 261865 448488 431815 288406 -30770
3342 -30770 150008 291670 699094 471561 455139 384478 436345 267991 216989 448586 258502
3331 258502 167579 286172 437793 429859 413094 319554 158602 84526 224364 252032 491335
3320 491335 419325 415107 253447 250623 399605 390739 471132 315483 193438 144657 96470
$$ packed form
3395H99463L96738k62866l14511J11677j52087J93374k9908q2699R2929p9308
3385G72802j83799q0640J45062K3606L07816J523p6913j17479j26201j68935J3153
3374E09995J46298M1826N0472N6408l73480j9375K28811L30072j39525q9605j17479
3363F24418J03824n5196n0148n6536l37865k2302P3807J92122j25728R5446J56609
3352E98451j09349k51503M4830K54955k33807m1712J86623j6673j43409l19176
3342c0770J80778J41662M07424k27533j6422p0661N1867j68354n1002K31597j90084
3331B58502r0923J18593J51621p934j6765r3540j60952p4076J39838K7668K39303
3320D91335p2010m218j61660k824J48982q866Q0393j55649j22045m8781m8187
$$ plain form
3309 96470 -223681 58846 65544 53523 304698 232270 2651 234094 355276 39027 155474
3298 155474 55191 264417 240371 58583 -43593 319594 200592 230875 259038 -606
3288 -606 -149027 374741 76744 82341 487787 306415 -17720 141902 424711 538400 475368
3277 475368 332829 4517 214145 93868 75361 367701 289658 19177 54792 235370
3267 235370 522303 290002 203891 651073 88317 87458 329232 203551 204003 342699 320007
3256 320007 187688 166741 395676 336057 429780 310141 262112 63630 350434 190620
3246 190620 380182 517324 539365 518381 469800 335862 363878 338228 495467 273237 178443
3235 178443 188605 206065 280102 312581 405814 506820 425247 349690 425254 451379 493806
$$ packed form
3309I6470l20151K82527O698j2021K51175p2428k29619K31443J21182l16249J16447
3298A55474j00283K09226k4046j81788j02176L63187j19002L0283K8163k59644
3288f06j48421N23768k97997N597M05446j81372l24135J59622K82809J13689o3032
3277D75368j42539l28312K09628j20277j8507K92340p8043k70481L5615J80578
3267B35370K86933k32301q6111M47182n62756q59K41774j25681M52J38696k2692
3256C20007j32319k0947K28935n9619R3723j19639m8029j98482K86804j59814
3246A90620J89562J37142K2041k0984m8581j33938K8016k5650J57239k22230r4794
3235A78443J0162J7460P4037L2479R3233J01006q1573p5557P5564K6125M2427
$$ plain form
3224 493806 669602 631184 166226 426656 482233 429776 83147 356668 359242 215658 314190
3213 314190 410628 464195 311987 453752 195798 586828 682349 603618 437700 684083
3203 684083 604282 677132 593096 639482 795812 1039729 987921 601318 998870 1199532 1027339
3192 1027339 758579 1061140 1087524 1041707 1241474 1573174 1584945 1490697 1484600 1751529 1807188
3181 1807188 1787502 1595124 1761980 1724043 1272286 1653817 1820182 1980360 1859358 1639215
3171 1639215 1719562 1920468 2190622 2771471 2746468 2674862 2855698 2853712 3092567 3082582 3214127
3160 3214127 3076611 3096312 3187874 3216948 3485780 3688996 3980660 4225608 4636470 4640330
3150 4640330 5053053 5562157 6134189 6624674 6968721 7567222 8424914 9155410 10084052 11002813
$$ packed form
3224D93806J75796l8418m64958K60430N5577n2457l46629K73521K574j43584R8532
3213C14190R6438N3567j52208J41765k57954L91030R5521p8731j65918K46383
3203F84083p9801P2850q4036M6386J56330K43917n1808l86603L97552K00662j72193
3192A027339k68760L02561K6384m5817J99767L31700J1771r4248o097K66929N5659
3181A807188j9686j92378J66856l7937m51757L81531J66365J60178j21002k20143
3171A639215Q0347K00906K70154N80849k5003p1606J80836j986K38855r985J31545
3160C214127j37516J9701R1562K9074K68832K03216K91664K44948M10862L860
3150D640330M12723N09104N72032M90485L44047N98501Q57692P30496R28642R18761
$$ plain form
3140 11002813 12103447 12983038 13950317 15566218 17985983 20671101 24419954 29207677
3132 29207677 36174313 44075284 46729280 45238283 37860975 29850516 23736873 19492510
3124 19492510 16102796 13530706 11705400 10499754 9765060 8960917 8567333 7749173 6750267
3115 6750267 5987940 5201887 5103482 4503546 4576539 4036044 3874663 3769468 3648304 3686545
3105 3686545 3575413 3671340 3123679 3042030 2574736 2655466 2241490 2225528 2464951 2290348
3095 2290348 2342425 2324735 2318385 2102173 1677578 1726210 1667919 1756123 1618031 1823966 1775911
3084 1775911 1726918 1328860 1330808 1399486 1121725 1010033 1100339 765369 672416 558386 948681
3073 948681 767586 797492 1041549 658263 747640 471395 547736 526738 701386 813901
$$ packed form
3140A1002813J100634Q79591R67279J615901K419765K685118L748853M787723
3132B9207677O966636P900971K653996j490997p377308q010459o113643m244363
3124A9492510l389714k572090j825306j205646p34694q04143l93584q18160r98906
3115F750267p62327p86053r8405n99936P2993n40495j61381j05195j21164L8241
3105C686545j11132R5927n47661q1649m67294Q0730m13976j5962K39423j74603
3095B290348N2077j7690o350k16212m24595M8632n8291Q8204j38092K05935m8055
3084A775911m8993l98058J948O8678k77761j11692R0306l34970r2953j14030L90295
3073I48681j81095K9906K44057l83286Q9377k76245P6341k0998J74648J12515
$$ plain form
3063 813901 607814 639610 1024852 728094 429987 384553 426102 759443 268715 389822
3053 389822 466374 463752 627384 526755 355165 84155 58422 181870 417059 266873
3043 266873 378958 519558 391159 143905 353686 637749 444505 192813 178836 -94861
3033 -94861 -50210 281936 102093 63966 264036 -34551 7850 -132835 -25748 174326
3023 174326 18754 186696 304545 96222 102889 302725 487070 114392 -150620 64217
3013 64217 229473 -29154 216906 281687 192410 180953 -35856 10416 52502 174445 444389
3002 444389 105780 176944 65005 -223396 -268189 -381298 -147294 -274873 31329 -136574
2992 -136574 -225267 -138565 158424 -122326 -63358 -91067 119590 -75953 -16042 71882 -701
$$ packed form
3063H13901k06087L1796L85242k96758k98107m5434M1549L33341m90728J21107
3053C89822P6552k622J63632j00629j71590k71010k5733J23448K35189j50186
3043B66873J12085J40600j28399k47254K09781K84063j93244k51692j3977k73697
3033i4861M4651L32146j79843l8127K00070k98587M2401j40685J07087K00074
3023A74326j55572J67942J17849k08323O667J99836J84345l72678k65012K14837
3013F4217J65256k58627K46060O4781q9277j1457k16809M6272M2086J21943K69944
3002D44389l38609P1164j11939k88401m4793j13109K34004j27579L06202j67903
2992a36574q8693Q6702K96989k80750N8968k7709K10657j95543N9911Q7924p2583
$$ plain form
2981 -701 23862 162340 4174 66926 -105931 -591773 -141392 -93254 21098 343040 58388
2970 58388 196091 115839 13284 120635 303179 -31253 -93105 -103944 -172706 61870 -285997
2959 -285997 -306949 16126 83885 -13782 -29996 -377975 -253263 78871 80965 -33809 98508
2948 98508 151689 -253292 -86332 13909 -37762 -36360 -111713 354745 290708 263305 154681
2937 154681 108246 -242340 -464926 -238176 -83856 286893 90371 -9332 606250 370066
2927 370066 298527 235515 86504 169088 -28948 57276 38186 147649 285447 221184 157885
2916 157885 87491 -251877 -33655 187640 117288 -127533 89748 94813 -237177 -78414
2906 -78414 302124 78509 32471 180020 343370 167799 -116432 47390 -8665 260656
$$ packed form
2981g01K4563J38478j58166O2752j72857m85842M50381M8138J14352L21942k84652
2970E8388J37703q0252j02555J07351J82544l34432o1852j0839o8762K34576l47867
2959b85997k0952L23075O7759r7667j6214l47979J24712L32134K094j14774J32317
2948I8508N3181m04981J66960J00241n1671J402p5353M66458o4037k7403j08624
2937A54681m6435l50586k22586K26750J54320L70749j96522r9703O15582k36184
2927C70066p1539o3012j49011Q2584j98036Q6224j9090J09463J37798o4263o3299
2916A57885p0394l39368K18222K21295p0352k44821K17281N065l31990J58763
2906g8414L80538k23615m6038J47549J63350j75571k84231J63822n6055K69321
$$ plain form
2896 260656 432375 262416 47093 138499 -20061 -136040 -62366 189182 120651 -86637
2886 -86637 213709 263786 303009 485451 33406 114640 146348 60889 -91572 -73165 -270085
2875 -270085 -227511 -35549 54663 -100808 -113677 -245318 -13739 64012 18885 83909 214687
2864 214687 -65657 -154578 113462 3417 48589 293425 144322 160045 229581 -62116
2854 -62116 -338004 -217248 62690 143909 -96293 -279791 -85311 -48879 -284702 -24893
2844 -24893 -313029 -133496 -170553 -132125 -146848 -134722 5228 90316 -20182 -116141 -3911
2833 -3911 -306408 -258240 -255661 87917 -216831 -278959 -100561 -42922 -137898 67065 90157
2822 90157 -104711 2285 -11920 -337444 -331017 -227323 185650 -10064 58433 5630 -50311
$$ packed form
2896B60656J71719j69959k15323R1406j58560j15979P3674K51548o8531k07288
2886h6637L00346N0077L9223J82442m52045Q1234L1708q5459j52461J8407j96920
2875b70085M2574J91962R0212j55471j2869j31641K31579P7751m5127O5024J30778
2864B14687k80344q8921K68040j10045M5172K44836j49103J5723O9536k91697
2854f2116k75888J20756K79938Q1219k40202j83498J94480L6432k35823K59809
2844b4893k88136J79533l7057L8428j4723J2126J39950Q5088j10498r5959J12230
2833c911l02497M8168K579L43578l04748o2128J78398N7639r4976K04963K3092
2822I0157j94868J06996j4205l25524O427J03694M12973j95714O8497n2803n5941
$$ plain form
2811 -50311 112641 161690 -48566 37739 -252614 -177831 159485 314493 -51330 -286720
2801 -286720 -412866 -59594 133101 -123262 -192524 34934 -61889 -259133 -441152 -532795
2791 -532795 -322482 -546141 -238916 -98741 43790 -19929 209774 336284 104931 22910
2781 22910 38902 91444 -84366 -491845 -406777 121401 196500 -39371 -96941 3934 190888
2770 190888 -6223 -72773 -2202 -103156 -127072 202943 286377 81209 -56280 12580 -231912
2759 -231912 -514299 -162367 -247931 -304844 -271509 -18738 32559 82440 40917 -58013 46217
2748 46217 85245 38326 -146683 -250001 -176773 64796 -67599 162624 21227 -90077
2738 -90077 -69703 88437 123470 -137109 -240346 -468068 -267428 -305882 -160388 -300037
$$ packed form
2811e0311J62952M9049k10256Q6305k90353P4783L37316J55008l65823k35390
2801b86720j26146L53272J92695k56363o9262K27458r6823j97244j82019r1643
2791e32795K10313k23659L07225J40175J42531o3719K29703J26510k31353q2021
2781B2910J5992N2542j75810m07479Q5068N28178P5099k35871n7570J00875J86954
2770A90888j97111o6550P0571j00954k3916L30015Q3434k05168j37489O8860k44492
2759b31912k82387L51932q5564n6913L3335K52771N1297M9881m1523r8930J04230
2748D6217L9028m6919j85009j03318P3228K41569j32395K30223j41397j11304
2738i0077K0374J58140L5033k60579j03237k27722K00640l8454J45494j39649
$$ plain form
2728 -300037 -263156 -37150 -471612 -577133 -278205 -361861 -415844 -320781 -181310 -251460 -436733
2717 -436733 -221185 100411 116026 63107 -201286 -111227 173258 144681 79359 -231322 -221039
2706 -221039 -145418 -95745 -391426 -50034 111876 -104495 82853 -143941 -224095 -144441
2696 -144441 -57213 -136192 70 -176100 5113 100408 -67167 -19487 -65725 -185568 -248639
2685 -248639 -45322 -109318 57378 -91140 -46971 -4545 -29246 166774 271640 3486
2675 3486 -88670 35778 162188 16751 -93462 -190750 -332005 -295718 -147309 -249031 -50532
2664 -50532 -174587 -544472 -137129 151082 134249 -6808 -132277 -340854 -328927 -220891
2654 -220891 -70632 -94454 101642 16746 179391 370346 621258 457799 -174326 124502
$$ packed form
2728c00037L6881K26006m34462j05521K98928q3656n3983R5063J39471p0150j85273
2717d36733K15548L21596J5615n2919k64393R0059K84485k8577o5322l10681J0283
2706b21039P5621M9673k95681L41392J61910k16371J87348k26794q0154P9654
2696a44441Q7228p8979J36262j76170J81213R5295j67575M7680m6238j19843o3071
2685b48639K03317o3996J66696j48518M4169M2426k4701J96020J04866k68154
2675C486r2156J24448J26410j45437j10213r7288j41255L6287J48409j01722J98499
2664e0532j24055l69885M07343K88211j6833j41057j25469k08577J1927J08036
2654b20891J50259k3822J96096q4896J62645J90955K50912j63459o32125K98828
$$ plain form
2644 124502 116204 144173 -30519 -79149 -36560 -190597 -185849 54971 -95105 -90084 -179372
2633 -179372 -243134 -219568 -298318 -180705 -95537 -76927 -222687 -352875 -306620 -37222 209355
2622 209355 276380 36273 162988 36429 -306103 -213018 -92860 -1325 16762 -168355
2612 -168355 -15280 -253029 -85535 -43887 -236607 -238810 -23742 6781 129787 31746 49990
2601 49990 -147136 -54950 60968 -351456 -315540 -283502 -325471 -419637 -137508 11454 247056
2590 247056 233896 336660 -211706 -73435 -205742 -359132 -248869 -238972 -14399 -60912
2580 -60912 -118737 36858 36395 -113568 -309442 -247215 -113249 -119994 -313626 212540 87144
2569 87144 128234 272477 113085 258883 66150 -159762 58146 101894 -201129 -19327
$$ packed form
2644A24502q298K7969j74692m8630M2589j54037M748K40820j50076N021q9288
2633a79372o3762K3566p8750J17613Q5168J8610j45760j30188M6255K69398K46577
2622B09355O7025k40107J26715j26559l42532R3085J20158R1535J8087j85117
2612a68355J53075k37749J67494M1648j92720k203K15068L0523J23006r8041J8244
2601D9990j97126R2186J15918m12424L5916L2038m1969r4166K82129J48962K35602
2590B47056j3160J02764n48366J38271j32307j53390J10263R897K24573m6513
2580f0912n7825J55595m63j49963j95874O2227J33966o745j93632N26166j25396
2569H7144M1090J44243j59392J45798j92733k25912K17908M3748l03023J81802
$$ plain form
2559 -19327 -120744 -299076 -336258 -144797 -164611 21643 7696 -93821 127576 166744 131025
2548 131025 89812 -132186 -157322 27390 -54745 -213059 -286918 -436272 -95880 -80696 138826
2537 138826 127340 47912 -7796 223555 172150 135315 -195661 -222609 -49265 97399 164315
2526 164315 217281 52996 -121219 -191294 -331382 -348801 -492651 -285239 -196625 -147416 -263600
2515 -263600 -120628 107775 187904 -172908 -441027 34770 36056 -153677 -47135 253143
2505 253143 423040 385627 315470 73837 -102259 119131 -6589 -187321 -97422 159575
2495 159575 68991 261177 246541 128047 318992 59714 -179183 -46807 79757 210540
2485 210540 -14835 -124912 13311 149775 126994 -29839 -33223 7683 347263 121695
$$ packed form
2559a9327j01417j78332l7182J91461j9814J86254j3947j01517K21397L9168l5719
2548A31025m1213k21998k5136J84712q2135j58314p3859j49354L40392J5184K19522
2537A38826j1486p9428n5708K31351n1405l6835l30976k6948J73344J46664O6916
2526A64315N2966j64285j74215p0075j40088j7419j43850K07412Q8614M9209j16184
2515b63600J42972K28403Q0129l60812k68119M75797J286j89733J06542L00278
2505B53143J69897l7413p0157k41633j76096K21390j25720j80732Q9899K56997
2495A59575r0584J92186j4636j18494J90945k59278k38897J32376J26564J30783
2485B10540k25375j10077J38223J36464k2781j56833l384M0906L39580k25568
$$ plain form
2475 121695 73717 134872 -104068 -389087 -262352 -132939 -61397 12726 110300 56989 -168998
2464 -168998 -254096 -174879 -360879 -196302 149954 15917 68880 139786 186942 -3976 64303
2453 64303 231450 158633 120118 188055 124361 -240177 107653 126835 -105042 -108540 -319733
2442 -319733 61483 107034 -6265 10450 94068 211577 42905 -126135 -130586 330549 11448
2431 11448 -42164 -112683 100288 79142 -149914 -181546 -236653 -363223 -54532 153816 -154105
2420 -154105 -141606 -354373 -230204 -117208 -105430 47875 90180 256535 167409 336798
2410 336798 171153 -140840 -401062 -248885 -132286 -80924 -37039 26171 195594 349187
2400 349187 440369 203871 -113688 -248168 -99244 104097 92945 -29263 -21941 376831
$$ packed form
2475A21695m7978O1155k38940k85019J26735J29413P1542P4123R7574n3311k25987
2464a68998q5098P9217j86000J64577L46256j34037N2963P0906M7156j90918O8279
2453F4303J67147p2817l8515O7937o3694l64538L47830J9182k31877l498k11193
2442c19733L81216M5551j13299J6715Q3618J17509j68672j69040m451M61135l19101
2431A1448n3612p0519K12971k1146k29056l1632n5107j26570L08691K08348l07921
2420a54105J2499k12767J24169J12996J1778J53305M2305J66355q9126J69389
2410C36798j65645l11993k60222J52177J16599N1362M3885O3210J69423J53593
2400C49187R1182k36498l17559j34480J48924K03341j1152j22208P322L98772
$$ plain form
2390 376831 129342 53269 -140711 -82748 248925 -90200 -134596 -27873 117119 -203558
2380 -203558 -124751 -36402 -125209 96812 120757 -210325 38467 39481 290974 242640 292063
2369 292063 247278 76613 300310 -183222 -329486 -258666 -144399 264232 -78600 -212467
2359 -212467 -304413 -7705 -130505 71345 106432 88091 81983 56471 79463 -104327 -131348
2348 -131348 73298 122863 -296395 -448773 -138655 -49921 -108458 161140 69434 90512 133357
2337 133357 119760 -88118 -112360 13327 -14871 -4163 -124221 -219954 -264938 -28535 -14701
2326 -14701 -273034 -71818 -87557 -135495 -69630 3790 433632 174276 -76940 166881 214736
2315 214736 41620 113258 -81593 -42919 -40230 -355795 -117776 -171498 205257 82623 22796
$$ packed form
2390C76831k47489p6073j93980N7963L31673l39125m4396J06723J44992l20677
2380b03558P8807Q8349q8807K22021K3945l31082K48792J014K51493m8334M9423
2369B92063m4785j70665K23697m83532j46264P0820J14267M08631l42832j33867
2359b12467r1946K96708j22800K01850L5087j8341o108k5512K2992j83790k7021
2348a31348K04646M9565m19258j52378L10118Q8734n8537K69598r1706K1078M2845
2337A33357j3597k07878k4242J25687k8198J0708j20058r5733m4984K36403J3834
2326a4701k58333K01216j5739m7938O5865P3420M29842k59356k51216K43821M7855
2315B14736j73116P1638j94851L8674K689l15565K38019n3722L76755j22634n9827
$$ plain form
2304 22796 -22747 -128312 -31835 -22495 -76695 -114627 -367384 -379607 -350987 -243437 154860
2293 154860 -25850 -136445 -146099 -146328 266527 469468 290186 -112950 2690 146781 -14928
2282 -14928 -20970 -111779 -298405 -20858 1284 305087 91431 -38732 -214973 -68736 94079
2271 94079 -127161 46182 100081 -13911 -68125 -50131 7974 186504 70249 175763 -84041
2260 -84041 -150462 -96766 -29386 -13867 -43803 3923 51839 89069 132650 -95718 15723
2249 15723 302881 67519 38966 185510 -168215 -33716 15963 -11406 -121286 58314
2239 58314 -167346 -174526 107277 313353 188263 -18273 89224 16357 182466 -80173
2229 -80173 29860 165207 180503 -5702 49298 119328 -324305 41529 413790 -151430
$$ packed form
2304B2796m5543j05565R6477R340n4200l7932k52757j2223K8620J07550L98297
2293A54860j80710j10595r654k29M12855K02941j79282m03136J15640J44091j61709
2282a4928o042r0809j86626K77547K2142L03803k13656j30163j76241J46237J62815
2271I4079k21240J73343N3899j13992n4214J7994N8105J78530j16255J05514k59804
2260h4041o6421N3696O7380J5519k9936M7726M7916L7230M3581k28368J11441
2249A5723K87158k35362k8553J46544l53725J34499M9679k7369j09880J79600
2239E8314k25660p180K81803K06076j25090k06536J07497p2867J66109k62639
2229h0173J10033J35347J5296j86205N5000P0030m43633L65834L72261n65220
$$ plain form
2219 -151430 9857 49486 -24048 128812 -118025 251750 119449 3001 263948 -27203
2209 -27203 -127909 -132820 -177671 -43770 286518 131050 -225919 -37171 -225167 -305838 -149316
2198 -149316 -109832 -78264 248266 216554 154195 76377 99750 316487 302878 -93580 43851
2187 43851 -86547 86022 -49296 64888 -45873 -31791 152610 112372 61223 -25994 272611
2176 272611 -220061 16738 67714 346875 119610 36710 -80697 55923 89095 -68725
2166 -68725 -443263 -52018 193284 90866 -42861 -114826 108199 73951 73990 -236756 96100
2155 96100 306928 217787 -25069 157834 142781 131739 -73892 -213620 59603 -71330
2145 -71330 -201224 128967 430162 -15408 -267321 -294240 -217009 87504 46972 -86100
$$ packed form
2219a51430J61287L9629p3534J52860k46837L69775j32301j16448K60947k91151
2209b7203j00706m911m4851J33901L30288j55468l56969J88748j87996q0671J56522
2198a49316L9484L1568L26530l1712o2359p7818K3373K16737j3609l96458J37431
2187D3851j30398J72569j35318J14184j10761J4082J84401m0238n1149q7217K98605
2176B72611m92672K36799N0976K79161k27265q2900j17407J36620L3172j57820
2166f8725l74538L91245K45302j02418j33727p1965K23025l4248L9l10746L32856
2155I6100K10828q9141k42856J82903j5053j1042k05631j39728K73223j30933
2145g1330j29894L30191L01195m45570k51913k6919P7231L04513m0532j33072
$$ plain form
2135 -86100 126837 266041 43994 -334424 -186958 -288039 -351117 -161958 -247810 -141247
2125 -141247 -57287 -306742 -15269 16241 15046 -68213 -228204 127720 -58799 19258 220369
2114 220369 146560 -214362 -349538 38620 150344 129545 -242716 -113706 77732 55125
2104 55125 188590 157838 -152323 -223337 35671 53334 5982 -131661 -324423 -313326 -251399
2093 -251399 -269220 -29757 160259 47187 282206 517433 -26165 26123 -10019 41741
2083 41741 -155260 -73379 142671 91144 126789 151024 117039 -65794 -246933 -132180 77846
2072 77846 -8143 -15164 -19436 -65929 -248962 245560 212527 -130136 -118443 -291381 -160224
2061 -160224 -285147 69960 177503 118329 295786 106347 -27030 4980 355586 116814
$$ packed form
2135h6100K12937J39204k22047l78418J47466j01081o3078J89159q5852J06563
2125a41247Q3960k49455K91473L1510j195q3259j59991L55924j86519P8057K01111
2114B20369p3809l60922j35176L88158J11724k0799l72261J29010J91438k2607
2104E5125J33465l0752l10161p1014K59008J7663m7352j37643j92762J1097O1927
2093b51399j7821K39463J90016j13072K35019K35227n43598N2288l6142N1760
2083D1741j97001Q1881K16050n1527L5645K4235l3985j82833j81139J14753K10026
2072G7846q5989p021m272m6493j83033M94522l3033l42663J1693j72938J31157
2061a60224j24923L55107J07543n9174J77457j89439j33377L2010L50606k38772
$$ plain form
2051 116814 238821 113916 26545 -58385 -42931 -37749 -448687 -205483 -86407 194653 9333
2040 9333 -175973 -164340 -139141 -168338 -243044 -130213 -53972 -22312 -36484 -158594 -406016
2029 -406016 -153606 132757 235835 125308 110602 134807 296396 94612 -213801 -71038
2019 -71038 -109950 -264556 -267971 -94675 -40646 125923 148933 165110 160563 219071 264299 118856
2007 118856 136997 -75703 51445 323807 -111197 -100310 -145956 -137757 169350 148277 80177
1996 80177 -176523 22830 194642 244120 144932 79076 82742 -119726 -98422 -130763 -53054
1985 -53054 108799 261805 -183238 -204218 -159426 164829 -16279 -257384 -180083 -229538 58331
1974 58331 229270 -124228 204050 394209 -239371 -22411 -89898 110103 329064 68370
$$ packed form
2051A16814J22007j24905q7371q4930J5454N182m10938K43204J19076K81060j85320
2040I333j85306J1633K5199k9197p4706J12831P6241L1660j4172j22110k47422
2029d06016K52410K86363J03078j10527j4706K4205J61589k01784l08413J42763
2019g1038l8912j54606l415J73296N4029J66569K3010J6177m547N8508M5228j45443
2007A18856J8141k12700J27148K72362m35004J0887m5646Q199L07107k1073o8100
1996H0177k56700J99353J71812M9478r9188o5856L666k02468K1304l2341P7709
1985e3054J61853J53006m45043k0980M4792L24255j81108k41105P7301m9455K87869
1974E8331J70939l53498L28278J90159o33580K16960o7487K00001K18961k60694
$$ plain form
1964 68370 -53322 152532 73021 220684 -19097 -91820 238276 43771 30240 19553 132070
1953 132070 70398 -178529 40777 -17134 4995 10871 168626 78290 -19570 -85777 -182716
1942 -182716 161188 230218 151965 211955 110699 132262 126141 -872 -265658 -381233 -79934
1931 -79934 -106810 -296303 -43322 154838 -2340 54141 -83477 -142055 -12705 183079
1921 183079 9549 -53212 58438 -230995 -276689 -317012 -65672 -119875 -283079 -147133
1911 -147133 -199098 25656 -35452 191232 66615 -62737 156689 -110526 -238751 -90679
1901 -90679 -175491 -18569 9694 -117232 -292994 -268695 -168997 248681 151962 289857 160304
1890 160304 -16667 142828 -155390 91437 49933 -90743 -110488 -116758 -261953 -222200 -353970
$$ packed form
1964F8370j21692K05854p9511J47663k39781p2723L30096j94505j3531j0687J12517
1953A32070o1672k48927K19306n7911K2129N876J57755r0336r7860o6207r6939
1942a82716L43904O9030p8253N9990j01256K1563o121j27013k64786j15575L01299
1931g9934k6876j89493K52981J98160j57178N6481j37618n8578J29350J95784
1921A83079j73530o2761J11650k89433m5694m0323K51340n4203j63204J35946
1911a47133n1965K24754o1108K26684j24617j29352K19426k67215j28225J48072
1901i0679q4812J56922K8263j26926j75762K4299R9698M17678r6719J37895j29553
1890A60304j76971J59495k98218K46827m1504j40676j9745o270j45195L9753j31770
$$ plain form
1879 -353970 -351117 72000 176267 142679 167569 185248 -97708 -26491 -62153 163897 169366
1868 169366 -140064 -92449 -55346 -26843 -339726 -157006 -398968 -77015 319859 137563
1858 137563 123592 282419 303782 349455 128416 -27047 -144501 -36064 -250533 -137276
1848 -137276 -27635 104569 23203 -119567 45443 -130180 -114742 143217 58127 6369
1838 6369 71443 -2286 -117355 -73810 -106635 116103 6157 -14169 86055 -286868 -276142
1827 -276142 -270856 -140035 -76632 68969 310378 245566 58082 -65513 144284 242804 -357265
1816 -357265 -65439 -9961 81558 67720 85911 75981 154883 285575 -126235 -110360 -237396
1805 -237396 -152181 -155260 -351687 -16690 -170965 9612 97071 -44944 1449 -46866 23223
$$ packed form
1879c53970K853M23117J04267l3588K4890J7679k82956P1217l5662K26050N469
1868A69366l09430M7615L7103K8503l12883J82720k41962L21953L96874j82296
1858A37563j3971J58827K1363M5673k21039j55463j17454J08437k14469J13257
1848a37276J09641J32204q1366j42770J65010j75623J5438K57959q5090n1758
1838F369O5074p3729j15069M3545l2825K22738j09946k0326J00224l72923J0726
1827b76142N286J30821O3403J45601K41409o4812j87484j23595K09797R8520o00069
1816c57265K91826N5478R1519j3838J8191r930P8902J30692m11810J5875j27036
1805b37396Q5215l079j96427L34997j54275J80577Q7459j42015M6393m8315P0089
$$ plain form
1794 23223 -55981 98693 187403 326399 109012 47346 18988 -245995 -103601 -130919 179759
1783 179759 -26374 109727 303610 106032 -129067 -228803 34546 85548 -74043 204101
1773 204101 19999 1125 -134469 -107941 159887 134803 -191316 -245336 -51279 -28906 306464
1762 306464 200705 -19008 -233844 -178713 -151222 -256910 -69318 -89537 -142274 68630
1752 68630 -65731 137688 321525 172336 134147 235683 -6529 -52827 -59452 -45377 8021
1741 8021 108937 123829 313344 12982 325185 134862 4588 141495 199207 23800
1731 23800 -219114 84793 -223001 -154730 13494 60184 100912 9117 413690 310517 276502
1720 276502 344775 103063 -48962 -2862 -2724 -212261 134115 -43006 128176 158276 -1926
$$ packed form
1794B3223p9204J54674Q8710J38996k17387o1666k8358k64983J42394k7318L10678
1783A79759k06133J36101J93883j97578k35099r9736K63349N1002j59591K78144
1773B04101j84102j8874j35594K6528K67828k5084l26119n4020J94057K2373L35370
1762C06464j05759k19713k14836N5131K7491j05688J87592k0219n2737K10904
1752F8630j34361K03419J83837j49189l8189J01536k42212m6298o625J4075N3398
1741H021J00916J4892J89515l00362L12203j90323j30274J36907N7712j75407
1731B3800k42914L03907l07794O8271J68224M6690M0728r1795M04573j03173l4015
1720B76502O8273k41712j52025M6100J38k09537L46376j77121J71182L0100j60202
$$ plain form
1709 -1926 -89576 137426 -211995 -223053 -107847 -154087 -198235 -71167 495546 106459 137363
1698 137363 299709 396 82008 -33372 -40779 -81415 24208 -174976 -422961 1409
1688 1409 285212 -1456 -83035 22773 -79369 -51931 128303 -28261 -230431 -208678 130758
1677 130758 350524 69531 -58940 -72474 49594 122836 163395 72133 91457 -71965 150187
1666 150187 124681 -30676 28394 -173697 -97785 -108335 68229 612815 208361 7826
1656 7826 -167792 -305997 -359198 -342956 -341362 -73801 -31904 -63494 -11032 82153 238866
1645 238866 112591 120037 -23088 96090 130367 114756 170906 199425 -53545 -28051 -54697
1634 -54697 -184801 -102070 135884 123535 194061 206076 121687 -65329 -54007 14605 -119610
$$ packed form
1709a926q7650K27002l49421j1058J15206m6240m4148J27068N66713l89087L0904
1698A37363J62346k99313Q1612j15380p407m0636J05623j99184k47985M24370
1688A409K83803k86668q1579J05808j02142K7438J80234j56564k02170K1753L39436
1677A30758K19766k80993j28471j3534J22068P3242M0559r1262J9324j63422K22152
1666A50187k5506j55357N9070k02091P5912j0550J76564N44586m04454k00535
1656G826j75618j38205n3201J6242J594K67561M1897l1590N2462R3185J56713
1645B38866j26275P446j43125J19178L4277j5611N6150K8519k52970K5494k6646
1634e4697j30104Q2731K37954j2349P0526J2015q4389j87016J1322O8612j34215
$$ plain form
1623 -119610 -138175 -283958 -74505 27665 -22248 30907 151183 217305 105436 165983 64189
1612 64189 104108 256471 -102563 -61489 -26523 -108248 -116772 -55863 -11087 -172141 -180710 -156267
1600 -156267 -98878 6090 -21938 -135158 -237953 -331067 -360144 -162996 -160760 -332806 141379
1589 141379 286659 151887 146136 152845 296632 427207 220918 -113494 -3238 174344
1579 174344 237982 211207 260179 52682 97757 -48913 -114717 165993 76316 -79024 -43745
1568 -43745 183515 177005 -29031 -40536 378597 219896 192997 -142129 -391846 -405743 -245678
1557 -245678 53800 -122387 42989 237834 146551 140499 -102473 3696 106846 15809
1547 15809 489038 355145 454088 301313 71950 245422 11696 43800 340994 206423
$$ packed form
1623a19610j8565j45783K09453J02170m9913N3155J20276O6122j11869O0547j01794
1612F4189L9919J52363l59034M1074L4966q1725q524O0909M4776j61054q569K4443
1600a56267N7389J04968k8028j13220j02795r3114k9077J97148K236j72046M74185
1589A41379J45280j34772n751O709J43787J30575k06289l34412J10256J77582
1579A74344O3638k6775M8972k07497M5075j46670o5804K80710q9677j55340L5279
1568d3745K27260o510k06036j1505M19133j58701k6899l35126k49717j3897J60065
1557b45678K99478j76187J65376J94845r1283o052k42972J06169J03150r1037
1547A5809M73229j33893R8943j52775k29363J73472k33726L2104K97194j34571
$$ plain form
1537 206423 208480 361298 111268 75846 -111611 -278308 -65244 298816 92089 9089
1527 9089 135820 237282 104384 -21027 273481 313655 394967 350384 194406 71528 309220
1516 309220 188456 21804 94169 115490 -48690 -161939 -21649 34422 -54901 58109
1506 58109 -71235 85716 -225322 -183064 19785 154641 193470 -79875 37935 -196993
1496 -196993 -230496 96601 175105 -134373 -28089 78233 68537 74261 113126 -105882 13892
1485 13892 35057 134617 271507 13872 -117104 167961 -125922 -476818 -483953 -172700 -108360
1474 -108360 -123504 130381 -44052 -207117 -363464 -440997 -358984 -151906 74023 207365
1464 207365 237396 85615 140397 -179437 -12374 91268 -109167 -44433 73065 6293
$$ packed form
1537B06423K057J52818k50030l5422j87457j66697K13064L64060k06727q3000
1527I089J26731J01462j32898j25411K94508M0174Q1312m4583j55978j22878K37692
1516C09220j20764j66652P2365K1321j64180j13249J40290N6071q9323J13010
1506E8109j29344J56951l11038M2258K02849J34856L8829k73345J17810k34928
1496a96993l3503L27097P8504l09478J06284J06322r696N724L8865k19008J19774
1485A3892K1165R9560J36890k57635j30976K85065k93883l50896p135L11253O4340
1474a08360j5144K53885j74433j63065j56347p7533Q2013K07078K25929J33342
1464B07365L0031j51781N4782l19834J67063J03642k00435O4734J17498o6772
$$ plain form
1454 6293 -114029 -181664 -24906 -42081 -228501 167513 -41273 68702 29872 20515 39349
1443 39349 -150974 -14570 99831 -141416 -180150 -294566 -163229 331692 121869 185154
1433 185154 208386 98096 -46229 -185029 -70335 54964 -97266 -73692 266213 -22363
1423 -22363 203448 214375 202180 252057 238812 -51180 -198172 -66068 -110045 165298 35303
1412 35303 -215168 -397747 -499108 -423140 -276832 31679 81763 39301 -109630 -61108 -166705
1401 -166705 14635 41772 -33625 -104472 -146181 -231189 -278873 -336504 -166047 110152 88944
1390 88944 -210756 -61943 114187 160545 19880 -393263 -28192 -139880 -23240 118219
1380 118219 159169 353148 230840 -361829 -342898 -150408 -133282 94890 176198 -102025
$$ packed form
1454F293j20322o7635J56758j7175j86420L96014k08786J09975l8830r357J8834
1443C9349j90323J36404J14401k41247l8734j14416J31337M94921k09823O3285
1433A85154K3232j10290j44325j38800J14694J25299j52230K3574L39905k88576
1423b2363K25811J0927j2195M9877j3245k89992j46992J32104m3977K75343j29995
1412C5303k50471j82579j01361P5968J46308L08511N0084m2462j48931M8522j05597
1401a66705J81340K7137p5397p0847m1709q5008m7684n7631J70457K76199k1208
1390H8944k99700J48813J76130M6358j40665m13143L65071j11688J16640J41459
1380A18219M0950J93979j22308n92669J8931J92490J7126K28172Q1308k78223
$$ plain form
1370 -102025 -292914 -285008 -25883 76836 408005 216220 -195553 -199400 -66389 -51374 -251915
1359 -251915 -267125 -168866 -292303 -82598 -20333 -199694 104399 81982 85813 177227 -79867
1348 -79867 -184257 -245798 -538176 -259050 -152691 -197876 34402 -56545 -19152 -118748 -135945
1337 -135945 -329891 -450197 -109561 146573 157155 166580 126933 -9024 199484 308522
1327 308522 143244 69170 -103944 -29871 89314 66242 -103679 -134248 -549904 -87602
1317 -87602 53122 -55186 281612 -9295 -113691 -142818 -107684 -237991 94976 -63138
1307 -63138 -56519 -262625 -37697 36696 71757 -90432 -192313 -53911 80079 442020 99436
1296 99436 85708 75656 183389 134554 -29954 231174 47906 -346663 -311458 145492 210515
$$ packed form
1370a02025j90889P906K59125J02719L31169j91785m11773l847J33011J5015k00541
1359b51915j5210R8259j23437K09705O2265j79361L04093k2417L831R1414k57094
1348g9867j04390o1541k92378K79126J06359m5185K32278r0947L7393r9596j7197
1337a35945j93946j20306L40636K56134J0582R425l9647j35957K08508J09038
1327C08522j65278p4074j73114P4073J19185k3072j69921l0569m15656M62302
1317h7602J40724j08308L36798k90907j04396k9127L5134j30307L32967j58114
1307f3138O619k06106K24928P4393L5061j62189j01881J38402J33990L61941l42584
1296I9436j3728j0052J07733m8835j64508K61128j83268l94569L5205M56950O5023
$$ plain form
1285 210515 137520 31572 -47924 85671 132945 74635 -207865 -78932 -35350 -59393 -86349
1274 -86349 54512 289556 -62133 4212 -52049 -21761 -38185 238801 187945 41554 -275640
1263 -275640 -321934 9943 -34275 17584 -103656 260041 11803 -264419 -83954 376166
1253 376166 167818 69863 -61786 -130673 -214267 158624 7708 -203276 -328113 -312190
1243 -312190 -149749 -99611 -358 -15870 112247 -166298 102095 143076 -160020 -77732 -173348
1232 -173348 -313856 32590 16240 99874 -124880 37309 -88060 -102751 -11782 99607
1222 99607 67367 212689 -84807 -4267 -219695 -72831 39474 79855 30395 62076 306571
1211 306571 -57371 85248 25513 -20973 24109 447454 449699 137076 47048 146723 55974
$$ packed form
1285B10515p2995j05948p9496J33595M7274n8310k82500J28933M3582k4043k6956
1274h6349J40861K35044l51689O6345n6261L0288j6424K76986n0856j46391l17194
1263b75640m6294L31877m4218N1859j21240L63697k48238k76222J80465M60120
1253C76166k08348r7955j31649o8887q3594L72891j50916k10984j24837J5923
1243c12190J62441N0138R9253j5512J28117k78545K68393M0981l03096Q2288r5616
1232a73348j40508L46446j6350Q3634k24754J62189j25369j4691R0969J11389
1222I9607l2240J45322k97496Q0540k15428J46864J12305M0381m9460L1681K44495
1211C06571l63942J42619n9735m6486M5082M23345K245l12623r0028R9675r0749
$$ plain form
1200 55974 120869 63106 565953 456412 418691 373453 107585 -45790 20837 -92000 -55548
1189 -55548 -220498 33361 97154 -67751 51206 -134385 -14279 -239313 62337 192775
1179 192775 92812 98966 59128 161443 -256103 -307150 -98419 -73220 187153 242127 152939
1168 152939 264704 161063 -110583 93463 173476 -23582 -63430 14838 150790 135985
1158 135985 69748 37626 36411 85276 -172645 -54166 -182838 -39987 -256520 -236014 -349645
1147 -349645 -117440 -78215 -188779 -258399 -88607 242151 43682 130477 -272411 5460
1137 5460 227845 67145 -344844 -220436 -292459 -258939 -518012 -399678 127488 174948 26167
1126 26167 306831 216299 212660 230912 174750 -25682 -300953 -128470 -79297 -124136 -31509
$$ packed form
1200E5974O4895n7763N02847j09541l7721m5238k65868j53375O6627j12837L6452
1189e5548j64950K53859O3793j64905J18957j85591J20106k25034L01650J30438
1179A92775r9963O154l9838J02315m17546n1047K08731K5199K60373N4974q9188
1168A52939J11765j03641k71646K04046Q0013j97058l9848P8268J35952j4805
1158A35985o6237l2122j215M8865k57921J18479j28672J42851k16533K0506j13631
1147c49645K32205L9225j10564o9620J69792L30758j98469Q6795m02888K77871
1137E460K22385j60700m11989J24408p2023L3520k59073J18334N27166M7460j48781
1126B6167K80664r0532l639J8252n6162k00432k75271J72483M9173m4839R2627
$$ plain form
1115 -31509 -21132 111643 68140 102969 61036 -126282 -288109 -234791 -215359 -117148 -201057
1104 -201057 -119378 49911 141818 140552 176025 23636 -24929 -22991 -434610 -305577 -269373
1093 -269373 -72345 -22779 296108 -124873 -33620 -2664 5803 58200 388089 283682 208506
1082 208506 128662 156293 143343 -50703 -119084 -271120 49314 289494 -101569 35668
1072 35668 216976 225312 47414 79396 49113 -120436 -52936 87562 316351 400866 334990
1061 334990 293766 207645 -110873 117831 157652 -159483 67990 21633 117484 68121 -61438
1050 -61438 -187686 -95783 58297 -10830 198371 91641 141332 124462 -41348 54963 229463
1039 229463 247589 423335 243728 -74371 -230710 3344 -64451 52607 173035 407510
$$ packed form
1115c1509J0377J32775m3503L4829m1933j87318j61827N3318J9432R8211q3909
1104b01057Q1679J69289R1907j266L5473j52389m8565J938m11619J29033L6204
1093b69373J97028M9566L18887m20981R1253L0956Q467N2397L29889j04407p5176
1082B08506p9844K7631j2950j94046o8381j52036L20434K40180l91063J37237
1072C5668J81308Q336j77898L1982l0283j69549O7500J40498K28789Q4515o5876
1061C34990m1224q6121l18518K28704L9821l17135K27473m6357R5851m9363j29559
1050f1438j26248R1903J54080o9127K09201j06730M9691j6870j65810R6311J74500
1039B29463J8126J75746j79607l18099j56339K34054o7795J17058J20428K34475
$$ plain form
1029 407510 216223 38557 -42585 -102981 -64270 75857 38006 175357 240532 232146 488144
1018 488144 237880 120951 423253 172502 97211 58264 91524 -9128 -144117 82169
1008 82169 42683 -112608 104371 321200 -126072 -73442 -143444 -202462 -134984 8318 334908
997 334908 348895 59148 26767 -142603 -38013 95789 75921 204051 -90852 -223670
$$ packed form
1029D07510j91287j77666q1142o0396L8711J40127l7851J37351O5175q386K55998
1018D88144k50264j16929L02302k50751p5291l8947L3260j00652j34989K26286
1008H2169l9486j55291K16979K16829m47272N2630p0002n9018O7478J43302L26590
997C34908J3987k89747l2381j69370J04590J33802j9868J28130k94903j32818
$$ [...]
##END NTUPLES=NMR SPECTRUM
##END=
