##TITLE=1H_CG-1220-1
 CDCl3
 8 sc, 
 29.11.2024
##JCAMPDX= 6.0         $$ Bruker NMR JCAMP-DX V2.0
##DATA TYPE= NMR SPECTRUM
##DATA CLASS= NTUPLES
##ORIGIN= UXNMR, Bruker Analytische Messtechnik GmbH
##OWNER= root
$$ XWIN-NMR		Version 3.5
$$ Fri Nov 29 14:02:31 2024 Russian Standard Time (UT+4h)  she@DPX200
##.OBSERVE FREQUENCY= 200.1315
##.OBSERVE NUCLEUS= ^1H
##.ACQUISITION MODE= SIMULTANEOUS
##.ACQUISITION SCHEME= undefined
##.AVERAGES= 8
##.DIGITISER RES= 18
##SPECTROMETER/DATA SYSTEM= spect
##.PULSE SEQUENCE= zg30
##.SOLVENT NAME= CD3CN
##.SHIFT REFERENCE= (INTERNAL, CD3CN, 0, 19.4313)
##AUDIT TRAIL= $$ (NUMBER, WHEN, WHO, WHERE, WHAT)
$$ ##TITLE= Audit trail, XWIN-NMR		Version 3.5
$$ ##JCAMPDX= 5.01
$$ ##ORIGIN= Bruker BioSpin GmbH
$$ ##OWNER= she
$$ F:/spectra/data/she/nmr/H-F/1/pdata/1/auditp.txt
$$ ##AUDIT TRAIL=  $$ (NUMBER, WHEN, WHO, WHERE, WHAT)
(   1,<2024-11-29 14:01:11.28 +0400>,<she>,<DPX200>,
      <created by zg, POWCHK disabled, PULCHK disabled
       configuration hash MD5:
       00 E9 B6 7A A2 85 ED C7 34 08 36 98 17 FE 4E 26
       data hash MD5: 16K
       23 44 8F 27 43 51 13 66 15 27 07 0B 9F 3D 7F 8D>)
(   2,<2024-11-29 14:01:14.39 +0400>,<she>,<DPX200>,
      <Start of raw data processing
       efp BC_mod = 2 LB = 0.24 FT_mod = 6 PKNL = 1 PHC0 = -26716.99 PHC1 = 13.18744 SI = 16K 
       data hash MD5: 16K
       A7 1B 8B 43 09 DB D7 D6 85 CF A8 FC 6B CF 42 87>)
(   3,<2024-11-29 14:01:32.23 +0400>,<she>,<DPX200>,
      <pk PHC0 = -1.667893 PHC1 = 2.4 
       data hash MD5: 16K
       C2 FD 69 97 55 B5 80 8E AD A7 E8 48 53 E0 25 FA>)
(   4,<2024-11-29 14:01:35.73 +0400>,<she>,<DPX200>,
      <abs ABSG = 5 
       data hash MD5: 16K
       B9 E0 AF C3 36 14 E1 DD 02 93 38 3E 19 23 8B AC>)
$$ ##END=
$$ 
$$ hash MD5
$$ C6 42 7C 01 FB F7 7C E5 C8 43 12 56 41 C9 ED B7
##$RELAX= 
##$RELAX= 
##$RELAX= 
##$RELAX= 
##$RELAX= 
##$RELAX= 
$$ Bruker specific parameters
$$ --------------------------
##$DU= <F:/spectra>
##$EXPNO= 1
##$NAME= <H-F>
##$PROCNO= 1
##$TYPE= <nmr>
##$USER= <she>
##$AMP= (0..31)
100 100 100 100 100 100 100 100 100 100 100 100 100 100 100 100 100 100 
100 100 100 100 100 100 100 100 100 100 100 100 100 100 
##$AQSEQ= 0
##$AQ_mod= 1
##$AUNM= <au_zg>
##$AUTOPOS= <>
##$BF1= 200.13
##$BF2= 200.13
##$BF3= 200.13
##$BF4= 200.13
##$BF5= 200.13
##$BF6= 200.13
##$BF7= 200.13
##$BF8= 200.13
##$BYTORDA= 1
##$CFDGTYP= 0
##$CFRGTYP= 5
##$CHEMSTR= <none>
##$CNST= (0..31)
1 1 145 1 1 1 1 1 1 1 1 1 1 1 1 1 1 1 1 1 1 1 1 1 1 1 1 1 1 1 1 1 
##$CPDPRG= <>
##$CPDPRG1= <>
##$CPDPRG2= <>
##$CPDPRG3= <>
##$CPDPRG4= <mlev>
##$CPDPRG5= <mlev>
##$CPDPRG6= <mlev>
##$CPDPRG7= <mlev>
##$CPDPRG8= <mlev>
##$CPDPRGB= <>
##$CPDPRGT= <>
##$D= (0..31)
0 1.2 0 0 0 0 0 0 0 0.06 0 0.03 0 0 0 0 0.0002 0 0 0 0 0 0 0 0 0 0 0 0 
0 0 0 
##$DATE= 1732874470
##$DBL= (0..7)
120 120 120 120 120 120 120 120 
##$DBP= (0..7)
150 150 150 150 150 150 150 150 
##$DBP07= 0
##$DBPNAM0= <>
##$DBPNAM1= <>
##$DBPNAM2= <>
##$DBPNAM3= <>
##$DBPNAM4= <>
$$ [...]
##$SUBNAM3= <"">
##$SUBNAM4= <"">
##$SUBNAM5= <"">
##$SUBNAM6= <"">
##$SUBNAM7= <"">
##$SUBNAM8= <"">
##$SUBNAM9= <"">
##$SW= 24.0689530833862
##$SWIBOX= (0..15)
0 0 2 0 0 0 0 0 0 0 0 0 0 0 0 0 
##$SW_h= 4816.95568400771
##$TD= 16384
##$TD0= 1
##$TE= 0
##$TE2= 300
##$TE3= 300
##$TEG= 300
##$TL= (0..7)
0 120 120 120 120 120 120 120 
##$TP= (0..7)
150 150 150 150 150 150 150 150 
##$TP07= 0
##$TPNAME0= <>
##$TPNAME1= <>
##$TPNAME2= <>
##$TPNAME3= <>
##$TPNAME4= <>
##$TPNAME5= <>
##$TPNAME6= <>
##$TPNAME7= <>
##$TPOAL= (0..7)
0.5 0.5 0.5 0.5 0.5 0.5 0.5 0.5 
##$TPOFFS= (0..7)
0 0 0 0 0 0 0 0 
##$TUNHIN= 0
##$TUNHOUT= 0
##$TUNXOUT= 0
##$USERA1= <user>
##$USERA2= <user>
##$USERA3= <user>
##$USERA4= <user>
##$USERA5= <user>
##$V9= 5
##$VALIST= <valist>
##$VCLIST= <CCCCCCCCCCCCCCC>
##$VD= 0
##$VDLIST= <DDDDDDDDDDDDDDD>
##$VPLIST= <PPPPPPPPPPPPPPP>
##$VTLIST= <TTTTTTTTTTTTTTT>
##$WBST= 1024
##$WBSW= 4
##$XGAIN= (0..3)
0 0 0 0 
##$XL= 0
##$YL= 0
##$YMAX_a= 848942
##$YMIN_a= -386355
##$ZGOPTNS= <>
##$ZL1= 120
##$ZL2= 120
##$ZL3= 120
##$ZL4= 120
##$ABSF1= 19.47097
##$ABSF2= -4.598162
##$ABSG= 5
##$ABSL= 3
##$ALPHA= 0
##$AQORDER= 0
##$ASSFAC= 0
##$ASSFACI= 0
##$ASSFACX= 0
##$ASSWID= 0
##$AUNMP= <proc_1d>
##$AZFE= 0.1
##$AZFW= 0.1
##$BCFW= 0
##$BC_mod= 2
##$BYTORDP= 0
##$COROFFS= 0
##$CY= -3
##$DATMOD= 1
##$DC= 0
##$DFILT= <>
##$DTYPP= 0
##$F1P= 0
##$F2P= 0
##$FCOR= 1
##$FTSIZE= 16384
##$FT_mod= 6
##$GAMMA= 0
##$GB= 0
##$INTBC= 1
##$INTSCL= 2.524811e-10
##$ISEN= 128
##$LB= 0.24
##$LEV0= 0
##$LPBIN= 0
##$MAXI= 10000
##$MC2= 0
##$MEAN= 0
##$ME_mod= 0
##$MI= 1.114404
##$NCOEF= 0
##$NC_proc= -6
##$NLEV= 6
##$NOISF1= 3.799351
##$NOISF2= 2.8
##$NSP= 0
##$NTH_PI= 0
##$NZP= 0
##$OFFSET= 19.4313
##$PC= 1
##$PHC0= -26718.66
##$PHC1= 15.58744
##$PH_mod= 1
##$PKNL= yes
##$PPARMOD= 0
##$PSCAL= 0
##$PSIGN= 0
##$REVERSE= no
##$SF= 200.130019692272
##$SI= 16384
##$SIGF1= 3
##$SIGF2= 2
##$SINO= 5.538805
##$SIOLD= 16384
##$SREGLST= <1H.CDCl3>
##$SSB= 0
##$STSI= 16384
##$STSR= 0
##$SW_p= 4816.95568400771
##$SYMM= 0
##$S_DEV= 0
##$TDeff= 16384
##$TDoff= 0
##$TI= <>
##$TILT= no
##$TM1= 0
##$TM2= 0
##$TOPLEV= 0
##$USERP1= <user>
##$USERP2= <user>
##$USERP3= <user>
##$USERP4= <user>
##$USERP5= <user>
##$WDW= 1
##$XDIM= 16384
##$YMAX_p= 460573275
##$YMIN_p= -409935
$$ End of Bruker specific parameters
$$ ---------------------------------
##NTUPLES= NMR SPECTRUM
##VAR_NAME=  FREQUENCY,     SPECTRUM/REAL,   SPECTRUM/IMAG
##SYMBOL=    X,             R,               I
##VAR_TYPE=  INDEPENDENT,   DEPENDENT,       DEPENDENT
##VAR_FORM=  AFFN,          ASDF,            ASDF
##VAR_DIM=   16384,         16384,           16384
##UNITS=     HZ,            ARBITRARY UNITS, ARBITRARY UNITS
##FACTOR=    0.29402158847633, 1,            1
##FIRST=     3888.78629346262, 0,            0
##LAST=      -928.169390545088, 0,           0
##MIN=       -928.169390545088, -409935,     0
##MAX=       3888.78629346262, 460573275,    0
$$ Real data points
##PAGE= N=1
##DATA TABLE= (X++(R..R)), XYDATA
$$ [...]
6816B007503j28461P959k1466j02661O4452M3164k4881j4693j51865o708j585
$$ 2007503 1879042 1887001 1865535 1762874 1827326 1870490 1845609 1830916 1679051 1672343 1670758
6805A670758J9786j57034Q9665M0936j72632p2150l3909R7340M824j35999j95655
$$ 1670758 1690544 1533510 1623175 1664111 1491479 1419329 1385420 1482760 1487584 1351585 1155930
6794A155930J26k3483L3250k4490j68412j6512l3163J56268J7187j71087J66715
$$ 1155930 1156056 1132573 1165823 1141333 972921 956409 923246 1079514 1096701 925614 1092329
6783A092329k71127J8874j0895l4319P8477k65726R2815J04912k4695M6131q4526
$$ 1092329 821202 840076 829181 794862 873339 607613 700428 805340 780645 826776 742250
6772G42250j7257k2332l4601K07836j03515r6274K6373q96P5044J14237j88418
$$ 742250 724993 702661 668060 875896 772381 676107 702480 701584 776628 890865 702447
6761G02447j54901j40837R4847L22794j2769j65098j14141l5374J29642J3175
$$ 702447 547546 406709 501556 824350 811581 646483 532342 496968 626610 639785
6751F39785N3086M8735j7901p9332j2144J42902r9497j30240J2990j36678K14883
$$ 639785 692871 741606 723705 644373 632229 775131 675634 545394 558384 421706 636589
6740F36589m575K6043q3249K3618M1089k8622N3137O1577K3031l399K2806j6514
$$ 636589 632014 658057 574808 598426 639515 610893 664030 725607 748638 745239 768045 751531
6728G51531J01869l7518o9830L8174r3074r8002O5420M5112M9197L5707m7870
$$ 751531 853400 815882 746052 784226 691152 593150 658570 703682 752879 788586 740716
6717G40716J14050L987l5684m1043M9903L316o6219j05151M8663j01473J62073
$$ 740716 854766 858753 823069 782026 831929 835245 769026 663875 712538 611065 773138
6706G73138j207J13043K5696j32048j8977j20856R6197j00352m2734M7624K16527
$$ 773138 771931 884974 910670 778622 759645 638789 734986 634634 591900 639524 856051
6695H56051o3466J25061R11J00701J29569n4421j34730l4557K7279n855j49759
$$ 856051 792585 917646 918557 1019258 1148827 1094406 959676 925119 952398 946543 796784
6684G96784N5165J18659R0617k6702Q5120j72395P0416O6355J19350P786P6532
$$ 796784 851949 970608 1061225 1034523 1119643 947248 1017664 1084019 1203369 1211155 1287687
6673A287687p5432J2001J4705K9517j57581P4604k5865J53600R0671r5361o8524
$$ 1287687 1212255 1224256 1238961 1268478 1110897 1185501 1159636 1313236 1403907 1308546 1240022
6662A240022o0623K2410M9421j7691k4606j7002J0740M792P0029N9394n9443N2410
$$ 1240022 1179399 1201809 1251230 1233539 1208933 1191931 1202671 1207463 1277492 1336886 1277443 1329853
6650A329853k1965J48369k4800j11178R5957R4756r6623P4183R1297R0693j81898
$$ 1329853 1307888 1456257 1431457 1320279 1416236 1510992 1414369 1488552 1579849 1670542 1488644
6639A488644J84994P7144L2560l7472O8520j81952k2390K2695J06752j29812k6599
$$ 1488644 1673638 1750782 1783342 1745870 1814390 1632438 1610048 1632743 1739495 1609683 1583084
6628A583084l608K02887J9180k23903K12552j19192J17446r7920M6591j05346
$$ 1583084 1579476 1782363 1801543 1577640 1790192 1671000 1788446 1690526 1737117 1631771
6618A631771p5041N2263l6484l0739L6506J57628O4862n4776k9669J28097n3147
$$ 1631771 1556730 1608993 1572509 1541770 1578276 1735904 1800766 1745990 1716321 1844418 1791271
6607A791271L0906J34355j57286L964J20547j00058K00668J03778m4733l1249
$$ 1791271 1822177 1956532 1799246 1803210 1923757 1823699 2024367 2128145 2083412 2052163
6597B052163J18706j0016j8014L2754K25293j21894J0289J89726J10031M50n0249
$$ 2052163 2170869 2160853 2142839 2175593 2400886 2278992 2289281 2479007 2589038 2589488 2539239
6586B539239R2650P9451J31225J98444J27783J60735J65202k7875J53000L26864
$$ 2539239 2631889 2711340 2842565 3041009 3168792 3329527 3494729 3466854 3619854 3946718
6576C946718J21596K94022K48779L15741L59833L77654M75252N83351N69419N31397
$$ 3946718 4068314 4362336 4611115 4926856 5286689 5664343 6139595 6722946 7292365 7823762
6566G823762M93521M06855L73214O7551j77611l96863p38393p48477l97692p92672
$$ 7823762 8317283 8724138 9097352 9164903 8987292 8590429 7852036 7103559 6705867 5913195
6556E913195o12655l62258l65501k45851m16287k44179j88111k16669q5777r8982
$$ 5913195 5300540 4938282 4572781 4326930 3910643 3666464 3478353 3261684 3175907 3076925
6546C076925j19393j09471k25919O5531o9853m3220r4750j15592L3329n6104r1330
$$ 3076925 2957532 2848061 2622142 2687673 2617820 2574600 2479850 2364258 2397587 2341483 2250153
6535B250153j94537J9813l9344q3903j70369j75329r4340K01271j73095n3052
$$ 2250153 2055616 2075429 2036085 1952182 1781813 1606484 1512144 1713415 1540320 1487268
6525A487268J30047m6425q4046M7378O3323O0719j31595L0385k6073k569l6362
$$ 1487268 1617315 1570890 1486844 1534222 1597545 1658264 1526669 1557054 1530981 1528412 1492050
6514A492050M8940N4017n8494M416p0842j16961J12186J24050O0486p8553k7663
$$ 1492050 1540990 1595007 1536513 1540929 1470087 1353126 1465312 1589362 1649848 1571295 1543632
6503A543632R2849n802J12707j01775k2006q9312j09453J21928j00523j08250
$$ 1543632 1636481 1630679 1743386 1641611 1619605 1530293 1420840 1542768 1442245 1333995
6493A333995O1955j30629J39414m0224k4143j8254K8433j00775J11582K2050M1331
$$ 1333995 1395950 1265321 1404735 1364511 1340368 1322114 1350547 1249772 1361354 1383404 1424735
6482A424735r9652m0763Q2177q9445L9765k4641j48386K1933P7674j7403l8348
$$ 1424735 1325083 1284320 1366497 1277052 1316817 1292176 1143790 1165723 1243397 1225994 1187646
6471A187646p8707J62822R5039j14515N5730l9443k6308l1666p1236M2517K1971
$$ 1187646 1108939 1271761 1366800 1252285 1308015 1268572 1242264 1210598 1139362 1181879 1203850
6460A203850K21892M5422l05079j3554J00130k0012j6876o8778K4319J4956J66677
$$ 1203850 1425742 1471164 1166085 1152531 1252661 1232649 1215773 1146995 1171314 1186270 1352947
6449A352947j66928J23266n3338P9335j21894p0292J8221J64809M7372j88902
$$ 1352947 1186019 1309285 1255947 1335282 1213388 1143096 1161317 1326126 1373498 1184596
6439A184596N7625K5624j74916r6712k1365R9298L2747l0935Q2096r4348J72080
$$ 1184596 1242221 1267845 1092929 996217 974852 1074150 1106897 1075962 1158058 1063710 1235790
6428A235790J1848j72379J39985P4669P517M5744M8357J3621L5104j2090j80956
$$ 1235790 1247638 1075259 1215244 1289913 1297430 1343174 1391531 1405152 1440256 1428166 1247210
6417A247210P8539J67891k3769P3272o9916q6982N8698p4729p186n5449R1603
$$ 1247210 1325749 1493640 1469871 1543143 1473227 1386245 1444943 1370214 1363028 1307579 1399182
6406A399182O2643p9479o8288J4381N9947l205O9841J51865j44076k14901K7744
$$ 1399182 1461825 1382346 1314058 1328439 1388386 1385181 1455022 1606887 1462811 1247910 1275654
6395A275654Q6069L2411m2471K8827j38570J41822l4453k4147k7354j02800k9685
$$ 1275654 1361723 1394134 1351663 1380490 1241920 1383742 1349289 1325142 1297788 1194988 1165303
6384A165303J4346K09695k0444l2826n5891O5259Q7312N8378r0494l5993K7429
$$ 1165303 1179649 1389344 1368900 1336074 1280183 1345442 1432754 1491132 1400638 1364645 1392074
6373A392074K2503R5969J99343k51933n8034J37523l499P5010Q1391j32190m6400
$$ 1392074 1414577 1510546 1709889 1457956 1399922 1537445 1533946 1608956 1690347 1558157 1511757
6362A511757R153J8772j8077O3430L7301r301n8836p8923J2707P6959j23162k1561
$$ 1511757 1520910 1539682 1521605 1585035 1622336 1613035 1554199 1475276 1487983 1564942 1441780 1420219
6350A420219P6930K02656N9081k5763R8343k9807L1600j3189l2908R5302P1267
$$ 1420219 1497149 1699805 1758886 1733123 1831466 1801659 1833259 1820070 1787162 1882464 1953731
6339A953731Q4525j12419l9385J36986O4377p2965j13163n218L7261p3167O1897
$$ 1953731 2038256 1925837 1886452 2023438 2087815 2014850 1901687 1896469 1933730 1860563 1922460
6328A922460j11462J10778K00627j93104L498J35981j51479K6180J90951O1429
$$ 1922460 1810998 1921776 2122403 1929299 1932797 2068778 1917299 1943479 2134430 2195859
6318B195859J22833j26858j3354o5027J277k7985K3797K1356m5921J27993j7217
$$ 2195859 2318692 2191834 2178480 2113453 2114730 2086745 2110542 2131898 2085977 2213970 2196753
6307B196753R132j42069p5918J66749n8492j16802J45996j49163O5712K67122
$$ 2196753 2205885 2063816 1987898 2154647 2096155 1979353 2125349 1976186 2041898 2309020
6297B309020k5692O281p8573o422J0557j00310l6123Q5708Q302j24126n8776J08502
$$ 2309020 2283328 2289609 2211036 2204614 2215171 2114861 2078738 2164446 2172748 2048622 1989846 2098348
6285B098348j20851O3286o3358N5851J1864o6650P0096J28039M2812j11640k269
$$ 2098348 1977497 2040783 1977425 2033276 2045140 1978490 2048586 2176625 2219437 2107797 2105528
6274B105528J96486K9979j68774m9519O9797P396R0578n0921K2650j58415L249
$$ 2105528 2302014 2331993 2163219 2113700 2183497 2190893 2281471 2230550 2253200 2094785 2098034
6263B098034R8664j2928J0397M3233q4577J54085M9884L7075N7097m9899r147
$$ 2098034 2196698 2183770 2194167 2237400 2152823 2306908 2356792 2393867 2450964 2401065 2391918
6252B391918m9425k1318N8953N3293J12068l5508q2876m1134o3339R7229J13270
$$ 2391918 2342493 2321175 2380128 2433421 2545489 2509981 2427105 2385971 2322632 2419861 2533131
6241B533131R7794N5602j7475o7531J45050m9830j71824N4295J56350L4030p2939
$$ 2533131 2630925 2686527 2669052 2601521 2746571 2696741 2524917 2579212 2735562 2769592 2696653
6230B696653J24161O4300l6470O5118P4717J70643n7148r4148R2063J52846n4063
$$ 2696653 2820814 2885114 2848644 2913762 2988479 3159122 3101974 3007826 3099889 3252735 3198672
6219C198672o7690J02454J8025K04949J21387j22208J36010J94314m3660m885
$$ 3198672 3130982 3233436 3251461 3456410 3577797 3455589 3591599 3785913 3742253 3737368
6209C737368J58738k28820Q1657J13759p432J22795R4575P4930n6469L5142J75651
$$ 3737368 3896106 3667286 3748943 3862702 3855270 3978065 4072640 4147570 4091101 4126243 4301894
6198D301894j2844R2464K15849O2604N9585K52282L5261M0175O6170J51269o9014
$$ 4301894 4289050 4381514 4597363 4659967 4719552 4971834 5007095 5047270 5113440 5264709 5195695
6187E195695M4567K85921K31536L1383m132L28366J16615J63465R7571R1341Q2987
$$ 5195695 5240262 5526183 5757719 5789102 5784970 6113336 6229951 6393416 6490987 6582328 6665315
6176F665315R0598K54009p2107J23715L46722K05341R7830J34492J11433M4829
$$ 6665315 6755913 7009922 6937815 7061530 7408252 7613593 7711423 7845915 7957348 8002177
6166H002177J78946K30130J16538J46896K41372P7149K22289J72344L29101K48577
$$ 8002177 8181123 8411253 8527791 8674687 8916059 8993208 9215497 9387841 9716942 9965519
6156I965519K14009K85843K51666L86716K1291M8972M13195L59685L23894K97534
$$ 9965519 10179528 10465371 10717037 11103753 11125044 11174016 11587211 11946896 12270790 12568324
6146A2568324L22991L81704M63931O64754L87190N08318L39622N05791L90744
$$ 12568324 12891315 13273019 13736950 14401704 14788894 15297212 15636834 16142625 16533369
6137A6533369K93375L55359L92592K83767M19088N30374M95818L98785O24808
$$ 16533369 16826744 17182103 17574695 17858462 18277550 18807924 19303742 19702527 20327335
6128B0327335O79701P41570J054583R66395J043133J346502J323793J142341J027780
$$ 20327335 21007036 21748606 22803189 23769584 24812717 26159219 27483012 28625353 29653133
6119B9653133J076543J005522J234415J311698J644778K104425K222127K637809
$$ 29653133 30729676 31735198 32969613 34281311 35926089 38030514 40252641 42890450
6111D2890450L141540L789646L650885L303052K456776J634175M82772l63622
$$ 42890450 46031990 49821636 53472521 56775573 59232349 60866524 61349296 60985674
6103F0985674j225998j302049j107877r96121n11570m3543P96035J472487K112066
$$ 60985674 59759676 58457627 57349750 56353629 55842059 55798516 56594551 58067038 60179104
6094F0179104L066890L992839M960048N826927O805060O233939M835329K248155
$$ 60179104 63245994 67238833 72198881 78025808 84830868 91064807 95900136 98148291
6086I8148291k47313k806208n004821n974623o512825o274707n023222m015854
$$ 98148291 97900978 95094770 90089949 84115326 77602501 71327794 66304572 62288718
6078F2288718l235385k181224j236789o41004K13836R57054J832778K106019K053917
$$ 62288718 59053333 56872109 55635320 54994316 55208152 56165206 57997984 60104003 62157920
6069F2157920J820244O58180p53307j852283k944950l691898m294556m233723
$$ 62157920 63978164 64636344 63883037 62030754 59085804 55393906 51099350 46865627
6061D6865627l561579l412405k826152k277545k046535j699788j394842j257038
$$ 46865627 43304048 39891643 37065491 34787946 32741411 31041623 29646781 28389743
6053B8389743q95327p45557n66683p38928m98016l80918n08354n40946m05163
$$ 28389743 27494416 26748859 26182176 25443248 24945232 24564314 24055960 23515014 23109851
6044B3109851n47876o54069m55709n04338m94460n42738o96854o47173q71751
$$ 23109851 22561975 21907906 21452197 20947859 20453399 19910661 19213807 18566634 17694883
6035A7694883m20321m01523n31998l11849k54151j63692r6884l66256l74525l30783
$$ 17694883 17274562 16873039 16341041 16029192 15775041 15611349 15514465 15148209 14773684 14442901
6025A4442901k04129m69635k09556n34848l56193k63022m94997m40732m34647
$$ 14442901 14238772 13769137 13559581 13024733 12668540 12405518 11910521 11469789 11035142
6016A1035142l62627n26374m39559l39267l90159k90144k92525k73890l24392
$$ 11035142 10672515 10146141 9706582 9367315 8977156 8687012 8394487 8120597 7796205
6007G796205j16433j73115k16096o8811k01893j46716k58333l7699j84722j83012
$$ 7796205 7679772 7506657 7290561 7221750 7019857 6873141 6614808 6577109 6392387 6209375
5997F209375j33064O1386k21902J17000k98211Q035K6901j97557N4761r0754J32377
$$ 6209375 6076311 6137697 5915795 6032795 5734584 5742619 5769520 5571963 5626724 5535970 5668347
5986E668347M3415Q456k7888j6015k0204j45539k3768j70740k65025r6448O1923
$$ 5668347 5711762 5720218 5692330 5676315 5656111 5510572 5486804 5316064 5051039 4954591 5016514
5975E016514J6056K6688j04375l6197P2578O021P6464N5641J36928J63195L1542
$$ 5016514 5032570 5059258 4954883 4918686 4991264 4997285 5073749 5129390 5266318 5429513 5461055
5964E461055M7805j05131K6936j23027k74936k38692j43488j67706L0535L6642
$$ 5461055 5508860 5403729 5430665 5307638 5032702 4794010 4650522 4482816 4513351 4549993
5954D549993n0177L7973P3327j35967j94478J06845j6431O0690N4027o7434Q3411
$$ 4549993 4499816 4537789 4611116 4475149 4280671 4387516 4371085 4431775 4485802 4418368 4501779
5943D501779J25414q121j94686j45118j52988j21018J47598l1240K7837p085k8690
$$ 4501779 4627193 4619072 4424386 4279268 4126280 4005262 4152860 4121620 4149457 4142372 4113682
5932D113682j41209n9478j2053J13209o2284p9675J49889p985R499M3626k8879
$$ 4113682 3972473 3912995 3900942 4014151 3951867 3872192 4022081 4014096 4023595 4067221 4038342
5921D038342J55085j62787q3615l3225J98560J02867K0995o2629K1506N1634K54768
$$ 4038342 4193427 4030640 3947025 3913800 4112360 4215227 4236222 4173593 4195099 4246733 4501501
5910D501501l291o7864m795q3431J58158J16519J1291J31813m1223p0192J26976
$$ 4501501 4498210 4430346 4425551 4342120 4500278 4616797 4628088 4759901 4718678 4648486 4775462
5899D775462J56664M7220J98735J04873J68603N1842R3512J13634K2218K1660
$$ 4775462 4932126 4979346 5178081 5282954 5451557 5503399 5596911 5710545 5732763 5754423
5889E754423P9899K82631P0152K21339J11968P7711J33046K51119J30483J82490
$$ 5754423 5834322 6116953 6187105 6408444 6520412 6598123 6731169 6982288 7112771 7295261
5879G295261J41429J51857R2077K78708L54768J58158L25149L46867K61288J26202
$$ 7295261 7436690 7588547 7680624 7959332 8314100 8472258 8797407 9144274 9405562 9531764
5869I531764K12584K67277K92690L65616K34874J60864L55088L94459M10756M23576
$$ 9531764 9744348 10011625 10304315 10669931 10904805 11065669 11420757 11815216 12225972 12649548
5859A2649548N25682L22279N80858P37023M12617N14775M97776O65614P55411
$$ 12649548 13175230 13497509 14078367 14815390 15228007 15742782 16240558 16906172 17661583
5850A7661583P50494O19748P50167Q68300J005714J068181J271977J482803J596361
$$ 17661583 18412077 19031825 19781992 20650292 21656006 22724187 23996164 25478967 27075328
5841B7075328J601081K199398K132463K404333K713727L087897L417880L206161
$$ 27075328 28676409 30875807 33008270 35412603 38126330 41214227 44632107 47838268
5833D7838268K853037K176844J412691O20549r0367m21287p52648n86508l60311
$$ 47838268 50691305 52868149 54280840 54901389 54811022 54389735 53637087 53050579 52690268
5824E2690268N6252P76000J216066J952381K445740L069187L941180M672734N712267
$$ 52690268 52746520 53522520 54738586 56690967 59136707 62205894 66147074 70819808 76532075
5815G6532075N714122N329332L948397K077437j24884k320662m041881m857705
$$ 76532075 82246197 87575529 91523926 93601363 93476479 91155817 87113936 82256231
5807H2256231n356112n348702m661149l792075k681562k086138j343181n55431
$$ 82256231 76900119 71551417 66890268 63098193 60416631 58330493 56987312 56431881
5799E6431881J9403M81566J056286J587360J398460Q63950M8827q52048j824525
$$ 56431881 56451284 56932850 57989136 59576496 60974956 61838906 61887733 61035685 59211160
5790E9211160k979104l270675l842619m006547l606160l506993k933223k548651
$$ 59211160 56232056 52961381 49118762 45112215 41506055 37999062 35065839 32517188
5782C2517188k254515j993824j799840j532655j412844j196844j341881j017924
$$ 32517188 30262673 28268849 26469009 24936354 23523510 22326666 20984785 19966861
5774A9966861r23682o57617m85803o86481m76546o69323n43813n16159m90029
$$ 19966861 19043179 18385562 17899759 17213278 16736732 16067409 15523596 15007437 14517408
5765A4517408m98173k65527p0215m16419n01862k46265k37179l84764j68224k83834
$$ 14517408 14019235 13753708 13683493 13267074 12765212 12518947 12281768 11897004 11728780 11444946
5755A1444946M989q9764j94227q9152n4183j05633k56803q4675j15876j6433q4441
$$ 11444946 11449935 11360171 11165944 11076792 11022609 10916976 10660173 10575498 10459622 10443189 10358748
5744A0358748m665p1391j77265J9012P9253L1526j30124l2930k2225K000M2770
$$ 10358748 10354083 10282692 10105427 10124439 10203692 10235218 10105094 10072164 10049939 10051939 10094709
5733A0094709N061M8228N8067j44075M4311o3617J05349O3460R2997P4289N0983
$$ 10094709 10099770 10147998 10206065 10061990 10106301 10042684 10148033 10211493 10304490 10378779 10429762
5722A0429762J80111J58119n5683J47338K07428J22134N0036J00675q200J34687
$$ 10429762 10609873 10767992 10712309 10859647 11067075 11189209 11239245 11339920 11331720 11466407
5712A1466407R1063N3154K15878R3313K53721O9657J56537K49403J6429O8056
$$ 11466407 11557470 11610624 11826502 11919815 12173536 12243193 12399730 12649133 12665562 12733618
5702A2733618J07722L39320L03374K40447K06995M59935K07126K38817K56105
$$ 12733618 12841340 13180660 13484034 13724481 13931476 14391411 14598537 14837354 15093459
5693A5093459L68827L11553L65776L43459M18796K42292L42456M46679L62232
$$ 15093459 15462286 15773839 16139615 16483074 16901870 17144162 17486618 17933297 18295529
5684A8295529K05188L33251L10797N15156K88715M72784N85840L51688P24596
$$ 18295529 18500717 18833968 19144765 19659921 19948636 20421420 21007260 21358948 22083544
5675B2083544L18232P37760Q47236P53926R90489Q15226R57830J396053J194124
$$ 22083544 22401776 23139536 23986772 24740698 25731187 26546413 27504243 28900296 30094420
5666C0094420J573886J490096J553829J618016J889815K036426K179519K318862
$$ 30094420 31668306 33158402 34712231 36330247 38220062 40256488 42436007 44754869
5658D4754869K630385L010807L403584M293472M752329M701872L997355K660090
$$ 44754869 47385254 50396061 53799645 58093117 62845446 67547318 71544673 74204763
5650G4204763J754880N1319j185908j766124j747952j427338p39072Q0444O98460
$$ 74204763 75959643 76010962 74825054 73058930 71310978 69883640 69144568 69225012 69923472
5641F9923472J421606J872665K310154L207890M197882N295510O729035P416934
$$ 69923472 71345078 73217743 75527897 78735787 82933669 88229179 94958214 102375148
5633A02375148O223470L979211J353051j819635m839134o527342p320234o753596
$$ 102375148 108598618 112577829 113930880 112111245 107272111 100744769 93424535 86670939
5625H6670939n628922m438742l074985k228043j641739r72148p56939r1015K71199
$$ 86670939 81042017 76603275 73528290 71300247 69658508 68686360 67929421 67838406 68109605
5616F8109605R75104J613122J528529R25366j3264q14935j967347l061964l351466
$$ 68109605 69084709 70697831 72226360 73151726 73138462 72323527 70356180 67294216 63942750
5607F3942750l281021k906981k360946j821504j463761j367463j102071q61265
$$ 63942750 60661729 57754748 55393802 53572298 52108537 50741074 49639003 48777738
5599D8777738p38027p44006o57086n13554m39582k17143M8609J87405L35687N32236
$$ 48777738 48039711 47295705 46638619 46125065 45685483 45468340 45516949 45704354 46040041 46572277
5589D6572277O45660P98035J425425J317814J832069J950965K436390K985655
$$ 46572277 47217937 48015972 49441397 50759211 52591280 54542245 56978635 59964290
5581E9964290L173236L581743M287071M788712N271652N828533O496214P140086
$$ 59964290 63137526 66719269 71006340 75795052 81066704 86895237 93391451 100531537
5573A00531537P383359P728067P655027P308336O604717N586757L678850J249391
$$ 100531537 107914896 115642963 123297990 130606326 137211043 142797800 146476650 147726041
5565A47726041j932046m608831o624818p684785q234166q550088q497924q197979
$$ 147726041 145793995 141185164 134560346 126875561 118641395 110091307 101593383 93395404
5557I3395404p390964o507349n509740m629440l730184l099313k799858k247310
$$ 93395404 86004440 79497091 73987351 69357911 65627727 62528414 59728556 57481246
5549E7481246j832334j505657j403753j436169j115565j165115r82674r99776
$$ 57481246 55648912 54143255 52739502 51303333 50187768 49022653 48039979 47040203
5541D7040203r49317r97272q88869p62037p05020o30892n64958l59200j33064
$$ 47040203 46090886 45093614 44204745 43442708 42737688 42106796 41541838 41182638 41049574
5532D1049574j38558J4431J38374M72112M49906R22429O96870Q43540J350882
$$ 41049574 40911016 40925447 41063821 41535933 41985839 42908268 43605138 44448678 45799560
5523D5799560J097924J829094K155513K488912K852194L379331L654157L955627
$$ 45799560 46897484 48726578 50882091 53371003 56223197 59602528 63256685 67212312
5515F7212312L519170K739137J582481K83827q89206j942467k220406k244473
$$ 67212312 70731482 73470619 75053100 75336927 74447721 72505254 70284848 68040375
5507F8040375j831571j399395p58493k4589R73742J573281K385300L436019M365384
$$ 68040375 66208804 64809409 64050916 64026327 65000069 66573350 68958650 72394669 76760053
5498G6760053N711683O612296O334167M834162K474982j96428l089914n251755
$$ 76760053 82471736 89084032 95418199 100252361 102727343 102530915 99441001 94189246
5490I4189246o591014p103340o397618n429653m622721l401699k525026j807460
$$ 94189246 87598232 80494892 74097274 68667621 64044900 60643201 58118175 56310715
5482E6310715j170021o30501q4456N45173J131282J130316Q91464Q4150m98728
$$ 56310715 55140694 54510193 54425737 54970910 56102192 57232508 58123972 58208122 57709394
5473E7709394j660985k485617l211261l580725l519347l083889k826361k438021
$$ 57709394 56048409 53562792 50351531 46770806 43251459 40167570 37341209 34903188
5465C4903188k020687j757240j521658j317573j106233j316201j004890j171200
$$ 34903188 32882501 31125261 29603603 28286030 27179797 25863596 24858706 23687506
5457B3687506j117174r85250r21131q25462o29033o31437n73160m54318n87491
$$ 23687506 22570332 21585082 20663951 19838489 19209456 18578019 18004859 17550541 16963050
5448A6963050l75070l87101l69202o11619l24903o4485m01484m65040k32713l14134
$$ 16963050 16587980 16200879 15831677 15220058 14895155 14830670 14429186 13964146 13731433 13417299
5438A3417299m08908k96919l77263m29648l33654j67409k43785l10297m03883
$$ 13417299 13008391 12711472 12334209 11904561 11570907 11403498 11159713 10849416 10445533
5429A0445533k18536k03854m7204m07332k87984j01008l6595p4768j40198j93356
$$ 10445533 10226997 10023143 9975939 9568607 9280623 9179615 9143020 9068252 8928054 8734698
5419H734698m189j13213K7173j85079n2147J01467r5258p8289j20935n2048J15808
$$ 8734698 8730509 8617296 8644469 8459390 8407243 8508710 8413452 8335163 8214228 8162180 8277988
5408H277988p7373j03844j12348j94872j53001j31135j31873k055j9512l5204
$$ 8277988 8200615 8096771 7984423 7789551 7636550 7505415 7373542 7371487 7351975 7316771
5398G316771k2769j90957P6932J29199o3104j11357Q1658k9644M925L3822k850
$$ 7316771 7294002 7103045 7179977 7309176 7246072 7134715 7216373 7186729 7191654 7225476 7222626
5387G222626j22437j39645j93255j01094j0557k419n5970j45666m2868l13189
$$ 7222626 7100189 6960544 6767289 6666195 6655638 6653219 6597249 6451583 6408715 6095526
5377F095526o5610J46076K5303R60j55823P9697q0202m6008j45408P4650j4419
$$ 6095526 6029916 6175992 6201295 6202255 6046432 6126129 6045927 5999919 5854511 5929161 5914742
5366E914742j47854r8256P9029j82040l2456O8034p7526l7191m6249r2104Q6948
$$ 5914742 5766888 5668632 5747661 5565621 5533165 5601199 5523673 5486482 5440233 5348129 5435077
5355E435077J73296j51150k20299K56075J10949j7225r7748K2235Q2380K7904
$$ 5435077 5608373 5457223 5236924 5492999 5603948 5586723 5488975 5511210 5593590 5621494
5345E621494k9688L2997l2371j28004P6527M8563K23392K6191n8314J15118J646
$$ 5621494 5591806 5624803 5592432 5464428 5540955 5589518 5812910 5839101 5780787 5895905 5897551
5334E897551J08535J17374p6277j2669J19907k6856J55415j66072R4598N8250
$$ 5897551 6006086 6123460 6047183 6034514 6154421 6127565 6282980 6116908 6211506 6269756
5324F269756R3151M2074N7394Q4101J10349K29449J78022J19735J63159L02007
$$ 6269756 6362907 6404981 6462375 6546476 6656825 6886274 7064296 7184031 7347190 7649197
5314G649197J93266M23520L84322L66334M25079K06024K26011K36233Q3849j44680
$$ 7649197 7842463 8265983 8650305 9016639 9441718 9647742 9873753 10109986 10193835 10049155
5304A0049155l01772J26625p2761K06801J88602L6108K25305J09818J54437K65633
$$ 10049155 9747383 9874008 9801247 10008048 10196650 10232758 10458063 10567881 10722318 10987951
5294A0987951J51907J12863Q9189L81656K59634O0284o3715k35620l9450r3448
$$ 10987951 11139858 11252721 11341910 11723566 11983200 12043484 11979769 11744149 11704699 11611251
5284A1611251j36628o3892N7219K08727K92011J47104J91304M15740M0693O0761
$$ 11611251 11474623 11410731 11467950 11676677 11968688 12115792 12307096 12722836 12763529 12824290
5274A2824290J23756P1482O352j11281O5440j30972m56928l48212l12341n73618
$$ 12824290 12948046 13019528 13025880 12914599 12980039 12849067 12392139 12043927 11731586 11157968
5264A1157968p37152n85261m06625l12697k32907k48236k67808Q173j05638J00484
$$ 11157968 10420816 9835555 9428930 9116233 8883326 8635090 8367282 8375455 8269817 8370301
5254H370301K4233O9326J54023J92883L8152R0085j89257l7167k36734l2986j72306
$$ 8370301 8394534 8463860 8617883 8810766 8848918 8939003 8749746 8712579 8475845 8442859 8270553
5243H270553j65200j91143k01636k52049l03744k06655l27503m1928j02608j60872
$$ 8270553 8105353 7914210 7712574 7460525 7156781 6950126 6622623 6580695 6478087 6317215
5233F317215j77957L809l73305j35901r719L6027j5690l04710M1114J45556O9707
$$ 6317215 6139258 6143067 5769762 5633861 5624142 5660169 5644479 5339769 5380883 5526439 5596146
5222E596146n3671q6337l7552j04726o7592Q2941j3528o0576K02636K5999k01855
$$ 5596146 5542475 5456138 5418586 5313860 5246268 5329209 5315681 5255105 5457741 5483740 5281885
5211E281885q122J0860m6449k9144J0639k6128l2195j1729j9560m770J5061L4235
$$ 5281885 5273763 5284623 5238174 5209030 5219669 5193541 5161346 5149617 5130057 5125287 5140348 5174583
5199E174583j93205L1784P2192j00714l0502M5762N1172m3794j19854K165L3472
$$ 5174583 4981378 5013162 5085354 4984640 4954138 4999900 5051072 5007278 4887424 4889589 4923061
5188D923061J8226l3028J33901j46715J52933P3280j26057J27103O1343k3078
$$ 4923061 4941287 4908259 5042160 4895445 5048378 5121658 4995601 5122704 5184047 5160969
5178E160969j33864o5592k0607j12152k592P3884O0919j02261k7979J0268M3678
$$ 5160969 5027105 4961513 4940906 4828754 4826162 4900046 4960965 4858704 4830725 4840993 4884671
5167D884671O3632q5987J80978j04512j7452j17303Q6782J40480J79784O271l3499
$$ 4884671 4948303 4862316 5043294 4938782 4921330 4804027 4890809 5031289 5211073 5217344 5183845
5156E183845r2964j12880J15595r4835J24822L4001J79676q0783R6256k5993J62721
$$ 5183845 5090881 4978001 5093596 4998761 5123583 5157584 5337260 5256477 5352733 5326740 5489461
5145E489461r6535J02246R8766l4234J10893l9003o5710J50247m400J91304K8544
$$ 5489461 5392926 5495172 5593938 5559704 5670597 5631594 5565884 5716131 5711731 5903035 5931579
5134E931579J1480J01788R697Q7520K18282j43862R078J46426K21499J79962p2006
$$ 5931579 5943059 6044847 6054544 6142064 6360346 6216484 6225562 6371988 6593487 6773449 6701443
5123F701443J31121J08620M3366P6845N2047K7601K54388J29203K80018j39292
$$ 6701443 6832564 6941184 6984550 7061395 7113442 7141043 7395431 7524634 7804652 7665360
5113G665360K95258J89054K00344R7166J32442J04960L66367J5758L1947J56935
$$ 7665360 7960618 8149672 8350016 8447182 8579624 8684584 9050951 9066709 9098656 9255591
5103I255591J18239J53139K87609J22119J49867K89304K9150J72509K54060K36311
$$ 9255591 9373830 9526969 9814578 9936697 10086564 10375868 10405018 10577527 10831587 11067898
5093A1067898K28336J17238J37130L99134L06273M61109K70825L53211M77751
$$ 11067898 11296234 11413472 11550602 11949736 12256009 12717118 12987943 13341154 13818905
5084A3818905M39509L55650N42614L87182M58490K82764L77442M73676N60751
$$ 13818905 14258414 14614064 15156678 15543860 16002350 16285114 16662556 17136232 17696983
5075A7696983O30353L92193L45884N8485J60841j52164j84009m20547m36341l47338
$$ 17696983 18327336 18719529 19065413 19123898 19284739 19132575 18948566 18528019 18091678 17744340
5065A7744340m14900k72250l61487k25940l00528j20067n723m0216L1130J92417
$$ 17744340 17329440 17057190 16695703 16469763 16169235 16049168 16043445 16003229 16034359 16226776
5055A6226776j2663J47437L16525K95216M91708M38730O03308P02896O11636P78142
$$ 16226776 16214113 16361550 16678075 16973291 17464999 17903729 18507037 19209933 19821569 20599711
5045B0599711P77050Q88869J169006Q75063P58115N94642M65329J26858M323m49882
$$ 20599711 21376761 22265630 23434636 24309699 25067814 25662456 26127785 26254643 26258966 25809084
5035B5809084l46639l73311m72662k88284k96057J35170Q0132R8607M1448N17612
$$ 25809084 25462445 25089134 24616472 24328188 24032131 24167301 24247433 24346040 24387488 24905100
5025B4905100M50085N10800N50253L57421P32193P61272P60629Q63071J120236
$$ 24905100 25355185 25865985 26416238 26773659 27505852 28267124 29027753 29890824 31011060
5016C1011060J209245J046617J398710J513239J200233J306142J119343J391708
$$ 31011060 32220305 33266922 34665632 36178871 37379104 38685246 39804589 41196297
5008D1196297J211264J252217J239595J593260J679243J882206J918151J529291
$$ 41196297 42407561 43659778 44899373 46492633 48171876 50054082 51972233 53501524
5000E3501524J584578J290037J209340J211089J331502J399878J656629J923168
$$ 53501524 55086102 56376139 57585479 58796568 60128070 61527948 63184577 65107745
4992F5107745K521889K792711L369025M030212M624898N025307N124028M835085
$$ 65107745 67629634 70422345 73791370 77821582 82446480 87471787 92595815 97430900
4984I7430900L691620J450901o31810j809664j345011r86909l0764J250994K282654
$$ 97430900 101122520 102573421 101941611 100131947 98786936 97800027 97769263 99020257 101302911
4975A01302911L507265M136127M521622M245182L351936K002347N59656r46052
$$ 101302911 104810176 108946303 113467925 117713107 121065043 123067390 123627046 122680994
4967A22680994k054263k553328k322855j850216j063231j38196L56750J016029
$$ 122680994 120626731 118073403 115750548 113900332 112837101 112698905 113055655 114071684
4959A14071684R93737P65465M87340k55243p72679j575762j795768k280786k680317
$$ 114071684 115065421 115830886 116318226 116062983 115290304 113714542 111918774 109637988 106957671
4950A06957671k143005k002894j851867j610974j460677j118556r86225j144265
$$ 106957671 104814666 102811772 100959905 99348931 97888254 96769698 95783473 94639208
4942I4639208j402655k067037k342321k627349k779632k935489k802906k435989
$$ 94639208 93236553 91169516 88827195 86199846 83420214 80484725 77681819 75245830
4934G5245830k310730k154713k094902j777643j578559j458308j394112j167263
$$ 75245830 72935100 70780387 68685485 66907842 65329283 63870975 62476863 61309600
4926F1309600j112566j400389j286644j011541j116854r34224q17479n96231p45385
$$ 61309600 60197034 58796645 57510001 56498460 55381606 54447382 53629903 53033672 52288287
4917E2288287m58453n26633n94162n31039m32484l93328k94537k92723R2305K29923
$$ 52288287 51829834 51303201 50709039 50178000 49745516 49352188 49057651 48764928 48857233 49087156
4907D9087156L08743N52941P22435O30418M97627K95857l60863n13970o08905
$$ 49087156 49395899 49948840 50671275 51301693 51799320 52095177 51734314 51220344 50611439
4898E0611439m85766l97821l23015L0371Q2044J68497L00131M17736N61819N35882
$$ 50611439 50125673 49727852 49404837 49435208 49517252 49685749 49985880 50403616 50965435 51501317
4888E1501317O89832O63825Q35287R77062J257024J233372J510710J603027J871950
$$ 51501317 52191149 52854974 53690261 54667323 55924347 57157719 58668429 60271456 62143406
4879F2143406K215316K328204K790861K647469K731198L189584L738071M056467
$$ 62143406 64358722 66686926 69477787 72125256 74856454 78046038 81784109 85840576
4871H5840576M919785N375695N775080O341727P116054Q285283R537478J1276228
$$ 85840576 90760361 96136056 101911136 108252863 115368917 123654200 133191678 144467906
4863A44467906J3517491J5827611J8462277K1049191K1739753J7959666P860446
$$ 144467906 157985397 173813008 192275285 213324476 235064229 253023895 260884341
4856B60884341p547430k0529568k5737106k5232247k2562626j9323352j5693470
$$ 260884341 253336911 232807343 207070237 181837990 159275364 139952012 124258542
4849A24258542j2665618j0185423q176511o660112n602402m716107m049802l637122
$$ 124258542 111592924 101407501 93230990 86570878 80968476 76252369 72202567 68565445
4841F8565445l232907k852411k803092k391731k127107j746262j463734j506444
$$ 68565445 65332538 62480127 59677035 57285304 55158197 53411935 51948201 50441757
4833E0441757j564457j352428j313776j049445j166229j073066j122788j067553
$$ 50441757 48877300 47524872 46211096 45161651 43995422 42922356 41799568 40732015
4825D0732015j172732p63815o92431p06872m01803m56466k74408j33465r3800
$$ 40732015 39559283 38795468 38103037 37396165 36994362 36537896 36263488 36130023 36036223
4816C6036223l32040r1222n0738m5659K20908K79356L40086K28623N44220M29616
$$ 36036223 35704183 35612961 35562223 35516564 35737472 36016828 36356914 36585537 37129757 37559373
4806C7559373P60488N85749O12737M92931O01662O65496N92908O79620L97313
$$ 37559373 38319861 38905610 39518347 40011278 40612940 41278436 41871344 42550964 42948277
4797D2948277L66517J16527j21035o49170q32855q49295p54239m42969k93495
$$ 42948277 43314794 43431321 43310286 42661116 41828261 40978966 40224727 39781758 39488263
4788C9488263M8445K24053O00029J254459J271846J500026K012021K034414K187689
$$ 39488263 39536708 39760761 40360790 41615249 42887095 44387121 46399142 48433556 50621245
4779E0621245K161419K154682K589617L146797L865438M510965M100869J295230
$$ 50621245 52782664 54937346 57526963 60673760 64539198 69050163 73151032 74446262
4771G4446262k452350n662577p002089o686795n586530m600068l719018l007135
$$ 74446262 71993912 66331335 59329246 52642451 47055921 42455853 38736835 35729700
4763C5729700k328489j782264j463929j423612j329618r90649p43300q21446p98250
$$ 35729700 33401211 31618947 30155018 28731406 27401788 26411139 25667839 24846393 24048143
4754B4048143m54401l92723o10102n56530k40469j90207l72193k68316j02466
$$ 24048143 23593742 23201019 22590917 22034387 21793918 21603711 21231518 20963202 20860736
4745B0860736K26889L06960J57082q056k1039m47081m23949o46068o63493o43321
$$ 20860736 21087625 21394585 21551667 21543611 21522572 21075491 20651542 20005474 19341981 18698660
4735A8698660o03781l42896k51523j19572j16268l5435k60725m46766n95309o54155
$$ 18698660 18094879 17751983 17500460 17380888 17264620 17229185 16968460 16521694 15926385 15272230
4725A5272230m98493l34207m46569l62259k70722k25827j87589j17291k3316j25189
$$ 15272230 14773737 14439530 13992961 13630702 13359980 13134153 12946564 12829273 12805957 12680768
4715A2680768j04099J08504J05953R2833K78404J8502j52714j57879j78460k07522
$$ 12680768 12576669 12685173 12791126 12883959 13162363 13180865 13028151 12870272 12691812 12484290
4705A2484290j23023p8352j70082J42957P3650p5649J72704k70834j62967l17116
$$ 12484290 12361267 12282915 12112833 12255790 12329440 12253791 12426495 12155661 11992694 11675578
4695A1675578k26955m09706n79592j82393K5153j97266j11966j29659j76999K30994
$$ 11675578 11448623 11038917 10459325 10276932 10302085 10104819 9992853 9863194 9686195 9917189
4685I917189K15605J32194n6588r1125k59475l06287j73806k74428j44428k90899
$$ 9917189 10132794 10264988 10208400 10117275 9857800 9551513 9377707 9103279 8958851 8667952
4675H667952j88925j75774l6376o2366j63947M3076n7672j8402M9248P7397P0738
$$ 8667952 8479027 8303253 8266877 8204511 8040564 8083640 8025968 8007566 8056814 8134211 8204949
4664H204949j52760M5704K3066J69157K69134p671J45474R1591p1626n6860J12215
$$ 8204949 8052189 8097893 8120959 8290116 8559250 8551579 8697053 8788644 8717018 8660158 8772373
4653H772373K455l1622j04930k11063j62256n9535K5905j09912j9786K6141j88801
$$ 8772373 8774828 8743206 8638276 8427213 8264957 8205422 8231327 8121415 8101629 8127770 7938969
4642G938969J24053K0465N7297M7766k8077J9519K6533J6011K962Q3807J62249
$$ 7938969 8063022 8083487 8140784 8188550 8160473 8179992 8206525 8222536 8225498 8309305 8471554
4631H471554J04621l5517k55215K407k06140j21997l38578j60434j08032k47500
$$ 8471554 8576175 8540658 8285443 8287850 8081710 7959713 7621135 7460701 7352669 7105169
4621G105169J4795j87417L8411J10832m9998j52361k48664K491j12047m379j18119
$$ 7105169 7119964 6932547 6970958 7081790 7031792 6879431 6630767 6633258 6521211 6516832 6398713
4610F398713j9992m2522N6508j3644J97524L3909N1044k8166J56362M0467k2962
$$ 6398713 6378721 6336199 6392707 6379063 6576587 6610496 6661540 6633374 6789736 6830203 6807241
4599F807241R1804L654r7950p64k4283J31819j28580j62820J07793K941j49664
$$ 6807241 6899045 6902699 6804749 6803985 6779702 6911521 6782941 6620121 6727914 6730855 6581191
4588F581191J27759J98711j5858P3168Q6566N843j28343O3921j71696J8949j14892
$$ 6581191 6708950 6907661 6891803 6964971 7051537 7057380 6929037 6992958 6821262 6840211 6725319
4577F725319K18163q5388N2899j1487Q0311N3717J22573M7555k2141O2646J44056
$$ 6725319 6943482 6858094 6910993 6899506 6979817 7033534 7156107 7203662 7181521 7244167 7388223
4566G388223J78986m2588K66322J55257N8746J57500P0304O5298P8211J775K23135
$$ 7388223 7567209 7524621 7790943 7946200 8004946 8162446 8232750 8298048 8376259 8378034 8601169
4555H601169K26429K11350J55890R4647L97350K37887K15980L33639J48114J00453
$$ 8601169 8827598 9038948 9194838 9289485 9686835 9924722 10140702 10474341 10622455 10722908
4545A0722908J61504r7416M7413J85153O9930J42751J00132L58431M31426K59519
$$ 10722908 10884412 10786996 10834409 11019562 11089492 11232243 11332375 11690806 12122232 12381751
4535A2381751M27334M07534L24161K08560L24946J98066O2975j60740q7139k60972
$$ 12381751 12809085 13216619 13540780 13749340 14074286 14272352 14335327 14174587 14087448 13826476
4525A3826476j94655j63582k00524k08218R5441j20524J10165K48848L38957K79932
$$ 13826476 13631821 13468239 13267715 13059497 13154938 13034414 13144579 13393427 13732384 14012316
4515A4012316K08773L06708L08608N00265L63250m3362k35185m03442m80499m67129
$$ 14012316 14221089 14527797 14836405 15336670 15699920 15656558 15421373 15017931 14537432 14070303
4505A4070303n73270m56601n53819j98312r5080j55994j71402j023N1127P3772
$$ 14070303 13497033 13040432 12486613 12288301 12193221 12037227 11865825 11864802 11915929 11989701
4495A1989701P9948J93352J09043l5397j25767j54579M0195n8828J7757K24710
$$ 11989701 12069649 12263001 12372044 12336647 12210880 12056301 12096496 12037668 12055425 12280135
4485A2280135K22336p2736k18416Q0915Q7824q7869j48427M6277j69459j17915
$$ 12280135 12502471 12429735 12211319 12292234 12380058 12292189 12143762 12190039 12020580 11902665
4475A1902665R203J97738K00493R2978Q1768J15564J7545m6088J77918q930j53531
$$ 11902665 11911868 12109606 12310099 12403077 12484845 12600409 12617954 12571866 12749784 12740854 12587323
4464A2587323J03322k18082k39035j33423l51050j83236K7168j10012n6771p1594
$$ 12587323 12690645 12472563 12233528 12100105 11749055 11565819 11592987 11482975 11426204 11354610
4454A1354610O1211O202M081R3710M1875P4851O9765L71484m6805J94487M84528
$$ 11354610 11415821 11422023 11426104 11519814 11561689 11636540 11706305 12077789 12030984 12225471 12709999
4443A2709999L21626K15890L60421K08484J27186L4347k5928j75624l34775q0567
$$ 12709999 13031625 13247515 13607936 13816420 13943606 13977953 13952025 13776401 13441626 13361059
4433A3361059r2707Q99j11526l2184N4813k07853j32342K03149M6526J5538J0664
$$ 13361059 13268352 13269251 13157725 13125541 13180354 12972501 12840159 13043308 13089834 13105372 13116036
4422A3116036N3406P3603J80628L9653J1972R395j2505J10757K22797L05014K02960
$$ 13116036 13169442 13243045 13423673 13463326 13475298 13484693 13472188 13582945 13805742 14110756 14313716
4411A4313716K01996J17839J98394L12524K55954J11750K75715M83692M00093
$$ 14313716 14515712 14633551 14831945 15144469 15400423 15512173 15787888 16271580 16671673
4402A6671673N13247N33410N26631P73635Q37537Q48280J135788J104902J050365
$$ 16671673 17184920 17718330 18244961 19018596 19856133 20704413 21840201 22945103 23995468
4393B3995468O20187j26665q62209j141959j257281j268772j022655j016175p33583
$$ 23995468 24615655 24488990 23626781 22484822 21227541 19958769 18936114 17919939 17186356
4384A7186356n27210o24098m14569m36856k36977m50088k58136k88538j53443
$$ 17186356 16659146 16035048 15620479 15183623 14946646 14496558 14238422 13949884 13796441
4375A3796441j93187j96423j88494k44058j26637j17005k5385l9664J10563l7838
$$ 13796441 13603254 13406831 13218337 12974279 12847642 12730637 12705252 12665588 12776151 12738313
4365A2738313L2710j2823j45713M1904l1863N6414R4452j26674P7595K18132J0666
$$ 12738313 12771023 12758200 12612487 12654391 12622528 12678942 12773394 12646720 12724315 12942447 12953113
4354A2953113J23251M0364J10213J53566M9278R9258J34935K60972J56942J38386
$$ 12953113 13076364 13116728 13226941 13380507 13429785 13529043 13663978 13924950 14081892 14220278
4344A4220278K7416L22752Q2612K84617L86727K25537J65106K76439J29870K22138
$$ 14220278 14247694 14570446 14653058 14937675 15324402 15549939 15715045 15991484 16121354 16343492
4334A6343492J61593j73148l5650j51290r5535j98478j59163R304k09176j09338
$$ 16343492 16505085 16331937 16296287 16144997 16049462 15850984 15691821 15701125 15491949 15382611
4324A5382611j62884K10157k60225L0544o9806J49796O7936m7859j37747Q40J60784
$$ 15382611 15219727 15429884 15169659 15200203 15130397 15280193 15348129 15300270 15162523 15163363 15324147
4313A5324147r2889n0206J43500l0077M4782J1900J6253J2452l7129J54836j32819
$$ 15324147 15231258 15181052 15324552 15294475 15339257 15351157 15367410 15379862 15342733 15497569 15364750
4302A5364750j9827N8196L8118O3195J61798o1351K13535J9963J25815Q3825j08331
$$ 15364750 15344923 15403119 15441237 15504432 15666230 15604879 15818414 15838377 15964192 16048017 15939686
4291A5939686N2302J24032j1503J25857n6347m6293J82435J58350j5513j13732
$$ 15939686 15991988 16116020 16104517 16230374 16174027 16127734 16310169 16468519 16453006 16339274
4281A6339274Q7273j39378J02750J4569p8307J00357J9058j15225j76267K44607
$$ 16339274 16426547 16287169 16389919 16404488 16326181 16426538 16445596 16330371 16154104 16398711
4271A6398711j6846j2449n5900L6842K5526P6729J4525O559P625N1277K71020
$$ 16398711 16381865 16369416 16313516 16350358 16375884 16452613 16467138 16473697 16481322 16532599 16803619
4260A6803619p5022p7627Q4242J67867p1994o282J7677J39610J76751L51K25634
$$ 16803619 16728597 16650970 16735212 16903079 16831085 16824803 16842480 16982090 17158841 17159192 17384826
4249A7384826K7927N3903J37370r454K56308K48912J3300R7834J08364J17080
$$ 17384826 17412753 17466656 17604026 17594572 17850880 18099792 18113092 18210926 18319290 18436370
4239A8436370n8622J46592J37423K17213J59432J81794J10948J35160j15504K53493
$$ 18436370 18377748 18524340 18661763 18878976 19038408 19220202 19331150 19466310 19350806 19604299
4229A9604299J46644q7628J33255K68837R5257J36511K8071K68168Q3346M313
$$ 19604299 19750943 19663315 19796570 20065407 20160664 20297175 20325246 20593414 20676760 20681073
4219B0681073K51777J84632J69395N4440J80504L3301P2741O1805j15589J18386
$$ 20681073 20932850 21117482 21286877 21341317 21521821 21555122 21627863 21689668 21574079 21692465
4209B1692465J66459q170K53078p6470Q4448Q9803o0696J69071R6928M7420J74021
$$ 21692465 21858924 21850754 22103832 22027362 22111810 22201613 22140917 22309988 22406916 22454336 22628357
4198B2628357j6860J33224J93152J38991J12253l4705P3962L40601q5101J58503
$$ 22628357 22611497 22744721 22937873 23076864 23189117 23154412 23228374 23568975 23483874 23642377
4188B3642377k578J6500J39208m1098j0086K06634l2326o5880O7539p7028P5693
$$ 23642377 23639799 23656299 23795507 23754409 23744323 23950957 23918631 23852751 23920290 23843262 23918955
4177B3918955J34128M6527K19887J24470Q1272m6228J13780L01434J39620M0124
$$ 23918955 24053083 24099610 24319497 24443967 24525239 24479011 24592791 24894225 25033845 25073969
4167B5073969J67078J70136L7157N0837J37787k675J04251P4089J93248J81538
$$ 25073969 25241047 25411183 25448340 25499177 25636964 25634289 25738540 25812629 26005877 26187415
4157B6187415M0884K54468J44910J6429J21979M01535P1163J32386J8699L94549
$$ 26187415 26228299 26482767 26627677 26644106 26766085 27167620 27238783 27371169 27389868 27784417
4147B7784417K90335J36253K001J60994K0641L07558K07957J24739J96314K02885
$$ 27784417 28074752 28211005 28213006 28374000 28394641 28702199 28910156 29034895 29231209 29434094
4137B9434094M23046J73952K12867K66766L92662K19802L02016L92891L95713
$$ 29434094 29857140 30031092 30243959 30510725 30903387 31123189 31425205 31818096 32213809
4128C2213809L09835N22844L16717K59174N98336L33486K60154M88541N24051
$$ 32213809 32523644 33046488 33363205 33622379 34220715 34554201 34814355 35302896 35826947
4119C5826947L64776N69730L53352K55877N91305O73047N67207O55915M03723
$$ 35826947 36191723 36761453 37114805 37370682 37961987 38635034 39202241 39858156 40261879
4110D0261879M84667O73257L82419O20926P14677Q07161O05384P71256O67266
$$ 40261879 40746546 41419803 41802222 42423148 43137825 43944986 44550370 45321626 45988892
4101D5988892O63486P17748P44796P17251J002266N78754P67150R96423Q22208
$$ 45988892 46652378 47370126 48114922 48832173 49834439 50413193 51180343 52176766 52998974
4092E2998974R48343Q98424P97229J022431J225072J090752J068483J158119J207179
$$ 52998974 53947317 54845741 55642970 56665401 57890473 58981225 60049708 61207827 62415006
4083F2415006J079863J429153J428026J309710J486948J619366J656844J563224
$$ 62415006 63494869 64924022 66352048 67661758 69148706 70768072 72424916 73988140
4075G3988140J441741J736652J810553J682633J564084J641810J665877J787090
$$ 73988140 75429881 77166533 78977086 80659719 82223803 83865613 85531490 87318580
4067H7318580J908975K060714J912597J971682K095827K433202K296946K504602
$$ 87318580 89227555 91288269 93200866 95172548 97268375 99701577 101998523 104503125
4059A04503125K720758K464392K473600K781914K785852L006238K905045K850974
$$ 104503125 107223883 109688275 112161875 114943789 117729641 120735879 123640924 126491898
4051A26491898K984218K972798K950964K948284K955514L004435L037224L207554
$$ 126491898 129476116 132448914 135399878 138348162 141303676 144308111 147345335 150552889
4043A50552889L183897L200849L611547L678112L857128M024748M311800M722221
$$ 150552889 153736786 156937635 160549182 164227294 168084422 172109170 176420970 181143191
4035A81143191N006732N272066N879431O427267O971636P460585Q501887R023474
$$ 181143191 186149923 191421989 197301420 203728687 210700323 218160908 226662795 235686269
4027B35686269J0107186J0868561J1886217J3013568J4032034J5029433J6387218
$$ 235686269 245793455 256662016 268548233 281561801 295593835 310623268 327010486
4020C27010486J7134614J8062539J8535665J8446286J7794330J6306133J3448307
$$ 327010486 344145100 362207639 380743304 399189590 416983920 433290053 446738360
4013D46738360R414886M420029j386764p556922j2900810j6088687j7526377j7581744
$$ 446738360 456153246 460573275 459186511 451629589 438728779 422640092 405113715 387531971
4005C87531971j6677266j5528998j4374743j2837296j1769203j0467465r672795
$$ 387531971 370854705 355325707 340950964 328113668 316344465 305877000 296204205
3998B96204205q899802q316428q046501p864516p619692p601310p487824p639956
$$ 296204205 287304403 278987975 270941474 263076958 255457266 247855956 240368132 232728176
3990B32728176p138073p041150o811149o682844o466460o291574o148670o071372
$$ 232728176 225590103 218548953 211737804 205054960 198588500 192296926 186148256 180076884
3982A80076884n791092n454821n160694m787720m677384m255244l853104l710730
$$ 180076884 174285792 168830971 163670277 158882557 154205173 149949929 146096825 142386095
3974A42386095l500335l306040l273317l079835l132267k975848k989243k729555
$$ 142386095 138885760 135579720 132306403 129226568 126094301 123118453 120129210 117399655
3966A17399655k494916k520303k478766k257172k175623k052137k025359j992710
$$ 117399655 114904739 112384436 109905670 107648498 105472875 103420738 101395379 99402669
3958I9402669j670363j752971j667944j417719j568867j479838j082011j083062
$$ 99402669 97732306 95979335 94311391 92893672 91324805 89844967 88762956 87679894
3950H7679894p89846j113274j135473j463851j583364j469183j544749j237298
$$ 87679894 86890048 85776774 84641301 83177450 81594086 80124903 78580154 77342856
3942G7342856j119180j174533r72141j076090r48581r24039r62590q13057r00876
$$ 77342856 76223676 75049143 74077002 73000912 72052331 71128292 70165702 69352645 68451769
3933F8451769r44330p25166p89610p96076n26805o16501n35249n34701p78962
$$ 68451769 67507439 66782273 65992663 65196587 64669782 64053281 63518032 62983331 62204369
3924F2204369o77468o98135q44091o52601p43251o90991m24668o88911n90690
$$ 62204369 61526901 60828766 59984675 59332074 58588823 57897832 57473164 56784253 56193563
3915E6193563o00304n96044n32379k88859n12721m88771j79028n40987m15719
$$ 56193563 55593259 54997215 54464836 54175977 53663256 53174485 52995457 52454470 52038751
3906E2038751k89808m23156l22915k31580m44035j86843m56454k32133l35573
$$ 52038751 51748943 51325787 51002872 50771292 50327257 50140414 49683960 49451827 49116254
3897D9116254k53558j70610k72717k70909m23402l73522k12961k31226k29516
$$ 49116254 48862696 48692086 48419369 48148460 47725058 47351536 47138575 46907349 46677833
3888D6677833m98241j84262m48679n88355m41030l19589l14328n50144l53869
$$ 46677833 46179592 45995330 45546651 44958296 44517266 44197677 43883349 43333205 42979336
3879D2979336k82951l93567j54415o13215m38106m12109l39840j75106k17611
$$ 42979336 42696385 42302818 42148403 41535188 41097082 40684973 40345133 40170027 39952416
3870C9952416k85187k88548l81511j83390j56055m30090m29263k05675k88354
$$ 39952416 39667229 39378681 38997170 38813780 38657725 38227635 37798372 37592697 37304343
3861C7304343m34964l67415l65237k82112l50613j33980k71594n09535m0841k58075
$$ 37304343 36869379 36501964 36136727 35854615 35504002 35370022 35098428 34588893 34548052 34289977
3851C4289977k56866R5714j54864o4833j52558j01231j3273m3831P951N9611J18369
$$ 34289977 34033111 34128825 33973961 33909128 33756570 33655339 33642066 33598235 33606186 33665797 33784166
3840C3784166Q5799q9216L7495p7182K01367l2927J68780O4512K75744K24903
$$ 33784166 33869965 33780749 33818244 33741062 33942429 33909502 34078282 34142794 34418538 34643441
3830C4643441K73252M05554J64490M44129K98272L68175M97238L49676L27734
$$ 34643441 34916693 35322247 35486737 35930866 36229138 36597313 37094551 37444227 37771961
3821C7771961M87344N66961M79355N46107N69186N12365N83550N77292O36877
$$ 37771961 38259305 38826266 39305621 39851728 40420914 40933279 41516829 42094121 42730998
3812D2730998Q31447M66139M75391O64765P10939M26913R64107O79103O93418
$$ 42730998 43562445 44028584 44503975 45168740 45879679 46306592 47270699 47949802 48643220
3803D8643220J016294Q08849Q78883J021917J113122R83982J260570J153198J473230
$$ 48643220 49659514 50468363 51347246 52369163 53482285 54466267 55726837 56880035 58353265
3794E8353265J410851J322296J453224J664351J871343J796316J915564K053269
$$ 58353265 59764116 61086412 62539636 64203987 66075330 67871646 69787210 71840479
3786G1840479K251448K322374K281395K352034K450016K474587K528950K526667
$$ 71840479 74091927 76414301 78695696 81047730 83497746 85972333 88501283 91027950
3778I1027950K361082K283280K078016K007827J737726J951644J921992K247197
$$ 91027950 93389032 95672312 97750328 99758155 101495881 103447525 105369517 107616714
3770A07616714K610294K458048L023331L112286L558437L942789M252927M515771
$$ 107616714 110227008 112685056 115708387 118820673 122379110 126321899 130574826 135090597
3762A35090597M628125M786579M594375M293601L733961K861836J756173K92691
$$ 135090597 139718722 144505301 149099676 153393277 157127238 159989074 161745247 162037938
3754A62037938j076749k129851k529575k368750j584089p87263j63195O72188
$$ 162037938 160961189 158831338 156301763 153933013 152348924 151561661 151398466 152070654
3746A52070654J144002K008297K317835K281879K595997K457934J969531J526290
$$ 152070654 153214656 155222953 157540788 159822667 162418664 164876598 166846129 168372419
3738A68372419Q80246M0803r52644k172323l095270l732546m166478m295961m604390
$$ 168372419 169252665 169293468 168340824 166168501 163073231 159340685 155174207 150878246 146273856
3729A46273856m333359l685353l284929k696477k134289j859511j395156j533096
$$ 146273856 141940497 138255144 134970215 132273738 130139449 128279938 126884782 125351686
3721A25351686j441975j919152k311812k656046l256287l641798m086473m546557
$$ 125351686 123909711 121990559 119678747 117022701 113766414 110124616 106038143 101491586
3713A01491586m766881m730739m372778m277605l979091l678784l172542k873720
$$ 101491586 96724705 91993966 87621188 83343583 79364492 75685708 72513166 69639446
3705F9639446k737742k312840k170069j864725j770239j719332j796540j515366
$$ 69639446 66901704 64588864 62418795 60554070 58783831 57064499 55267959 53752593
3697E3752593j495799j685217j737016j649993j694940j529103j514668j343024
$$ 53752593 52256794 50571577 48834561 47184568 45489628 43960525 42445857 41102833
3689D1102833j440852j309388j196290j184941j155209j055367r17048q68919
$$ 41102833 39661981 38352593 37156303 35971362 34816153 33760786 32843738 31974819
3681C1974819r19978o64447q11283n92742n65466p71773m87682n87754m68421
$$ 31974819 31054841 30390394 29579111 28986369 28420903 27649130 27161448 26573694 26105273
3672B6105273o10596o06807l55287q16381o62083l63898o00265m92200n18768
$$ 26105273 25494677 24887870 24532583 23716202 23054119 22690221 22089956 21597756 21078988
3663B1078988n20478n60552p05267n28952m34498l75954k66417m06509l97660
$$ 21078988 20558510 19997958 19292691 18763739 18329241 17953287 17686870 17280361 16882701
3654A6882701k38706k84044k99231m06790j44156k97322m82553k73707l68715
$$ 16882701 16643995 16359951 16060720 15653930 15509774 15212452 14729899 14456192 14087477
3645A4087477k37167j96085m08264k63657l22176l41713l49749m06790k70218
$$ 14087477 13850310 13654225 13245961 12982304 12660128 12318415 11968666 11561876 11291658
3636A1291658j53504l60411m12428j43244k02847j33869j22887j42815m41382
$$ 11291658 11138154 10777743 10365315 10222071 10019224 9885355 9762468 9619653 9178271
3627I178271J045j9347l53456j42703j09218j86327j98910k51122j85398j400
$$ 9178271 9179316 9159969 8806513 8663810 8554592 8368265 8169355 7918233 7732835 7731435
3617G731435j64618k08439j31733o4406l06963K6721L2211j01865m3568k76614
$$ 7731435 7566817 7358378 7226645 7162239 6855276 6881997 6914208 6812343 6768775 6492161
3607F492161J05102j64027m7717q9288o1862K341j80366j04431J26976o6635j66809
$$ 6492161 6597263 6433236 6385519 6296231 6234369 6236710 6056344 5951913 6078889 6012254 5845445
3596E845445k3322q9229j97044j42326L9591r9120r694j65373n2274m3274N6785
$$ 5845445 5822123 5732894 5535850 5393524 5433115 5333995 5324301 5158928 5106654 5063380 5120165
3585E120165j12974j53161P0738j82679J05954j4874j20837M953j11915N9271
$$ 5120165 5007191 4854030 4924768 4742089 4848043 4833169 4712332 4717285 4605370 4664641
3575D664641k8963j93539r1O4119k4622k64249K09840l6270l668j50834j26830
$$ 4664641 4635678 4442139 4442048 4506167 4481545 4217296 4427136 4390866 4387198 4236364 4109534
3564D109534L9182J40593j27197j13597P043j63817J22710l3020l451l2969J60234
$$ 4109534 4148716 4289309 4162112 4048515 4055558 3891741 4014451 3981431 3977980 3945011 4105245
3553D105245o7091j00077p4765o2109J8295j9899N8366K2035j28749l5001M6324
$$ 4105245 4038154 3938077 3863312 3801203 3819498 3799599 3857965 3880000 3751251 3716250 3762574
3542C762574J12239j65418j10488N0535j71775N4438r303R3345n2041Q9970j48930
$$ 3762574 3874813 3709395 3598907 3649442 3477667 3532105 3522802 3616147 3564106 3654076 3505146
3531C505146j32768P9740N6469l5464o9425M7796r6528l0188l0805j04779r75
$$ 3505146 3372378 3452118 3508587 3473123 3403698 3451494 3354966 3324778 3293973 3189194 3188219
3520C188219K6745J0523O5988n0178m4903j6436j3297j35074j76664j36731P586
$$ 3188219 3214964 3225487 3291475 3241297 3196394 3179958 3166661 3031587 2854923 2718192 2725778
3509B725778Q8876J0460j39725k5980j22693j02307Q531O4588m559l1596K3408
$$ 2725778 2814654 2825114 2685389 2659409 2536716 2434409 2442940 2507528 2502969 2471373 2494781
3498B494781q0414l7312M770q0513q0357k9545j31699K2770J00741j39339L3659
$$ 2494781 2414367 2377055 2381825 2301312 2220955 2191410 2059711 2082481 2183222 2043883 2077542
3487B077542j33l5266r1831K13432K7963k03076j72420Q37l6463Q5762q7771n3240
$$ 2077542 2077409 2042143 1950312 2163744 2191707 1988631 1816211 1817048 1780585 1866347 1778576 1725336
3475A725336m9606K3376N3239m4112j91813J67301r0362J30074J29736r5931n3975
$$ 1725336 1675730 1699106 1752345 1708233 1516420 1683721 1593359 1723433 1853169 1757238 1703263
3464A703263p6358L3816j0774N402j05110L1120N3256j97207L205Q9611j74103
$$ 1703263 1626905 1660721 1649947 1655349 1550239 1581359 1634615 1437408 1440613 1530224 1356121
3453A356121M188o8106J19595j10155j23847R2220J15499j68566k5624M4174l8899
$$ 1356121 1360309 1292203 1411798 1301643 1177796 1270016 1385515 1216949 1191325 1235499 1196600
3442A196600J04477o9629j9084l4978j02621J5498J22315R6206J235j14830j90712
$$ 1196600 1301077 1231448 1212364 1177386 1074765 1090263 1212578 1308784 1310019 1195189 1004477
3431A004477Q4966m780l2404O7222O703P7610k74440k3759J03501p8533j4841
$$ 1004477 1089443 1084663 1052259 1119481 1126184 1203794 929354 905595 1009096 930563 915722
3420I15722N8776J07480j65272K4689j56072o6717J78342m2342j93316m3368O4846
$$ 915722 974498 1081978 916706 941395 785323 718606 896948 854606 661290 617922 682768
3409F82768p7324n8228J60319M7487K8071n0702j40977l0399m3688J8047k0443
$$ 682768 605444 547216 707535 755022 783093 732391 591414 561015 517327 535374 514931
3398E14931o7726J345P9116K157p294J34799j16273r124N8564q0890k9025J6073
$$ 514931 447205 448550 527666 529823 522529 657328 541055 531931 590495 509605 480580 496653
3386D96653j18980K2752L903J091J0847J31018o5594q0302k37706J74400O9485
$$ 496653 377673 400425 404328 405419 416266 547284 481690 401388 163682 338082 407567
3375D07567P2170p5687j04951o514p086R7041j49632j972m6658L4312n549o5099
$$ 407567 479737 404050 299099 292585 285499 382540 232908 230936 184278 218590 213041 147942
3363A47942j2528J49000L0731O0224p2513J32392L1684l1872j42432q8023J37189
$$ 147942 135414 284414 315145 375369 302856 435248 466932 435060 292628 204605 341794
3352C41794r66j51017r300K1404M0210j7874m8176j6469O5562J15302k59375J07966
$$ 341794 340828 189811 180511 201915 242125 224251 176075 159606 225168 340470 81095 189061
3340A89061P1417j75280M3362j22604K5895P243Q5184M7418J3571m3423j15962
$$ 189061 260478 85198 128560 5956 31851 39094 124278 171696 185267 141844 25882
3329B5882J04898j5145J38792j31578K4115M7188q3508j7936P4476k7188j0528
$$ 25882 130780 115635 254427 122849 146964 194152 110644 92708 167184 139996 129468
3318A29468K4648q6909k2678o6635P4925J30000o2026l5864l1593q496m622j287
$$ 129468 154116 67207 44529 -22106 52819 182819 120793 84929 53336 44840 40218 38931
3306C8931J63538j89567k5620J59339j14704K5630N6635N0660m6630L1890j11742
$$ 38931 202469 12902 -12718 146621 31917 57547 114182 164842 118212 150102 38360
3295C8360n0426l2488P6197P5355k29441J13119n6126m6198K07493o2480j46341
$$ 38360 -12066 -44554 31643 106998 -122443 -9324 -65450 -111648 95845 33365 -112976
3284a12976M2744J15495Q1414j947o8626p8298J2386j55403J15813P8853N2002
$$ -112976 -70232 45263 126677 124730 56104 -22194 -9808 -165211 -49398 29455 81457
3273H1457p2315j80885q1009J81369J40605q3301M6433j54340m6885R6659O9303
$$ 81457 9142 -171743 -252752 -71383 69222 -14079 32354 -121986 -168871 -72212 -2909
3262b909J03111M3545j17908J94384j79271j09567J31591p7406j27452k5523J5562
$$ -2909 100202 143747 25839 220223 40952 -68615 62976 -14430 -141882 -167405 -151843
3251a51843J80720j12967j24222J84251J4142Q0902k6036n0998J6378O8099j2386
$$ -151843 28877 -84090 -208312 -24061 -9919 70983 44947 -6051 10327 78426 66040
3240F6040J32780n6923l3591r6465J84945n682r7315K7901K4725K3875P7759L8568
$$ 66040 198820 141897 108306 11841 196786 191104 93789 121690 146415 170290 248049 286617
3228B86617M988j7991O8616p3891j89272J64070K6276Q5500J1022O4618j3887
$$ 286617 291605 273614 342230 268339 79067 243137 269413 354913 365935 430553 416666
3217D16666k41489J83321K4367R7080M4537J23906K4740j96026K9212P6999k9232
$$ 416666 175177 358498 382865 479945 524482 648388 673128 477102 506314 583313 554081
3206E54081N4871J20789L9687j18307l2717L1648O9491J57763J04593p4290J12174
$$ 554081 608952 729741 769428 651121 618404 650052 719543 877306 981899 907609 1019783
3195A019783J11436M0743j52176J04214M60K52790n0966q3169J7722P8768p110
$$ 1019783 1131219 1171962 1019786 1124000 1124460 1377250 1326284 1243115 1260837 1339605 1332495
3184A332495R9305L8027j8156K94295K37329Q088N6079J65687K51673K91086K17551
$$ 1332495 1431800 1469827 1451671 1745966 1983295 1991383 2047462 2213149 2464822 2755908 2973459
3173B973459M11660K36701L05690N55107M41441N14792N82651N78801Q64925J045313
$$ 2973459 3385119 3621820 3927510 4482617 4924058 5438850 6021501 6600302 7465227 8510540
3163H510540J176106J312480J498970J706219J308126J381098K49626k361411
$$ 8510540 9686646 10999126 12498096 14204315 15512441 16893539 17143165 14781754
3155A4781754j990551j922072j577658j453269j012125r64632n01425n87891k61452
$$ 14781754 12791203 10869131 9291473 7838204 6826079 5861447 5360022 4772131 4510679
3146D510679m20868m28827j54050j30965m07143k40180k75710j36538j23514j93565
$$ 4510679 4089811 3660984 3506934 3375969 2968826 2728646 2452936 2316398 2192884 1999319
3136A999319q2592j33084k04909j0952P3306j62394k58929R6268o0698q5820o0733
$$ 1999319 1916727 1783643 1578734 1567782 1641088 1478694 1219765 1316033 1255335 1169515 1108782
3125A108782p3435p2516m6114J89885m9089k65815p5754N3347n6100J3359M0625
$$ 1108782 1035347 962831 916717 1106602 1057513 791698 715944 769291 713191 726550 767175
3114G67175k5697o4490P8390K9087j5671l0500j01189j13149m6314J241J9706
$$ 767175 741478 676988 755378 784465 768794 738294 637105 523956 477642 478883 498589
3103D98589j62777P297l869O7037o5272j3290r5056J24066l9573r1463R052J10985
$$ 498589 335812 343109 339240 406277 341005 327715 232659 356725 317152 225689 234741 345726
3091C45726o7642j21909N5316K1746n9916O2285J0440j38278q4342N6230q6116
$$ 345726 278084 156175 211491 233237 173321 235606 246046 107768 23426 79656 -6460
3080f460J34354q8792O3943j1286j43698K1942J53854Q9290k72239O9677J10916
$$ -6460 127894 39102 103045 91759 -51939 -29997 123857 213147 -59092 10585 121501
3069A21501j14559m7202J35098r4633J32992m8707m6584j3081j48807O6274j47619
$$ 121501 6942 -40260 94838 205 133197 84490 37906 24825 -123982 -57708 -205327
3058b05327Q6495P9979J66904j45832l3532m1901k9562Q7644j06758J42497j79339
$$ -205327 -118832 -38853 128051 -17781 -51313 -93214 -122776 -35132 -141890 607 -178732
3047a78732L0007O5831n2654O1318k4562K00191q8163p038j25281j0229p2344
$$ -178732 -148725 -82894 -135548 -74230 -98792 101399 13236 6198 -119083 -129312 -201656
3036b01656o2560P7910J57666j51577m785R3006n3335O9836Q21j05789M9293J3983
$$ -201656 -264216 -186306 -28640 -180217 -185002 -91996 -145331 -75495 -74674 -180463 -131170 -117187
3024a17187p8720O9978k8275J53686q6794r0532J9193p0445J81664J06122j39445
$$ -117187 -195907 -125929 -154204 -518 -87312 -177844 -158651 -229096 -47432 58690 -80755
3013h0755L1621m9955L5813K324J2890m6305L0250O0489k19611M1595J14400m7019
$$ -80755 -49134 -99089 -63276 -60952 -48062 -94367 -64117 -3628 -223239 -181644 -67244 -114263
3001a14263o6779j00112L4930M8050J42420r2097K31284j49897k04031M6423J99287
$$ -114263 -181042 -281154 -246224 -198174 -55754 -147851 83433 -66464 -270495 -224072 -24785
2990b4785m1233j77291J1427J9128K4041R6320j73732J67618L9922j10233R746
$$ -24785 -66018 -243309 -231882 -212754 -188713 -92393 -266125 -98507 -58585 -168818 -159072
2979a59072l5202J25793l3997l7694p9537J8802K61112J14538j88903N0074k33607
$$ -159072 -194274 -68481 -102478 -140172 -219709 -200907 60205 174743 -14160 35914 -197693
2968a97693m3673M9100J52940k2157j09080K3541q073K8793K8744o1401J64308
$$ -197693 -241366 -192266 -39326 -61483 -170563 -147022 -155095 -126302 -97558 -158959 5349
2957E349j83618N9050r731N8607r4634j1066M525J49059j84899p144K755r2904
$$ 5349 -178269 -119219 -128950 -70343 -164977 -176043 -171518 -22459 -207358 -214502 -211747 -304651
2945c04651J01580J13958K1189R574j1382q1340o9044l9679J97706N9628j14735
$$ -304651 -203071 -89113 -67924 -58350 -69732 -151072 -220116 -259795 -62089 -2461 -117196
2934a17196J38798r8116j06261k4053q8573N1705q0631K27674K7867J02000j77736
$$ -117196 21602 -76514 -182775 -206828 -295401 -243696 -324327 -96653 -68786 33214 -144522
2923a44522N3044p4185j6166p3361L4304J84744n1937l0236Q0708J9728M8264
$$ -144522 -91478 -165663 -181829 -255190 -220886 -36142 -88079 -118315 -37607 -17879 30385
2912C0385j50680O4474l9701r8886J58963n5194r2369R145o6474K0466j7996O7506
$$ 30385 -120295 -55821 -95522 -194408 -35445 -90639 -183008 -173863 -240337 -219871 -237867 -170361
2900a70361Q9996J3018r3777P5200j35604j4837K90574k47715j03645J44590N1566
$$ -170361 -80365 -67347 -161124 -85924 -221528 -236365 54209 -193506 -297151 -152561 -100995
2889a00995K7499o7848M3066Q1055j3274j57545L3902K6884K4762M3721Q744m8897
$$ -100995 -73496 -141344 -98278 -17223 -30497 -188042 -154140 -127256 -102494 -58773 -50029 -98926
2877i8926q147L3337R1883r3311m2723r5875J02033l3887j14405R8327p1446K21110
$$ -98926 -107073 -73736 18147 -75164 -117887 -213762 -111729 -145616 -260021 -161694 -233140 -12030
2865a2030R1559j01489Q1194j60888Q6556q7116O3495m5617j96673m2715J26707
$$ -12030 79529 -21960 59234 -101654 -15098 -102214 -38719 -84336 -281009 -323724 -197017
2854a97017K8921q2941O034J39913j5780O0769N267J1506O3900J8777O7846j34714
$$ -197017 -168096 -251037 -245003 -105090 -120870 -60101 -54834 -43328 20572 39349 107195 -27519
2842b7519j20953n4299r6575J35689N2246k9729J51914k20115k2853J77630Q2082
$$ -27519 -148472 -202771 -299346 -163657 -111411 -141140 10774 -209341 -232194 -54564 27518
2831B7518J3192n8151j50220k636J09121L5346p2205K6073k09105K07722k4416
$$ 27518 40710 -17441 -167661 -170297 -61176 -25830 -98035 -71962 -281067 -73345 -97761
2820i7761l8499j0484J07159k09802k9823M3583j8463K6237J21339N5010n666
$$ -97761 -136260 -146744 -39585 -249387 -279210 -235627 -254090 -227853 -106514 -51504 -57170
2809e7170O4708j4627j50282m5083J27698q3669j19179J00862J41180M5332k1437
$$ -57170 7538 -7089 -157371 -202454 -74756 -158425 -277604 -176742 -35562 9770 -11667
2798a1667k0502j02837p1467L0305L7617j031l9704M5940K297k60122R573L0183
$$ -11667 -32169 -135006 -206473 -176168 -138551 -139582 -179286 -133346 -131049 -391171 -381598 -351415
2786c51415J43414J73745j32269L1163l8400J26559L8399j77583N4770r1894M9668
$$ -351415 -208001 -34256 -166525 -135362 -173762 -47203 -8804 -186387 -131617 -223511 -173843
2775a73843Q894J29409n2099K0118j40587P8834J12177j02090P1038K6967q1598
$$ -173843 -164949 -35540 -87639 -67521 -208108 -129274 -17097 -119187 -48149 -21182 -102780
2764a02780Q3826Q6077k64200o0897O2362K7343j4218k0480k9468m1917Q1459
$$ -102780 -18954 67123 -197077 -257974 -195612 -168269 -182487 -202967 -232435 -274352 -192893
2753a92893Q2313k7305N3166j7322o6391j24167K3387M3570J30601M9994L5290
$$ -192893 -110580 -137885 -84719 -102041 -168432 -292599 -269212 -225642 -95041 -45047 -9757
2742i757J14390o0253j23204l2186L436m5060J15573j45469J59145J1764j69559
$$ -9757 104633 44380 -78824 -111010 -107574 -152634 -37061 -182530 -23385 -11621 -181180
2731a81180O457p9903R057J31040R6564q3380j6198j71713J34183P4427n5821
$$ -181180 -174723 -254626 -245569 -114529 -17965 -101345 -117543 -289256 -155073 -80646 -136467
2720a36467q1344J36161P3286j37073j11827M0325j1779P1884j20013p1449J14936
$$ -136467 -217811 -81650 -8364 -145437 -257264 -216939 -228718 -156834 -276847 -348296 -233360
2709b33360K3994O4294l3879n0732J299Q3032K00921o8740j03378j00298l3036
$$ -233360 -209366 -145072 -178951 -229683 -228384 -145352 55569 -13171 -116549 -216847 -249883
2698b49883N3335K44767r2597j32616J8277l9641J7229P6802m4984j1764K6266
$$ -249883 -196548 48219 -44378 -176994 -158717 -198358 -181129 -104327 -149311 -161075 -134809
2687a34809n8712q1280o076N9009m5995o2746J83717j17205K55820K8546j56307
$$ -134809 -193521 -274801 -280877 -221868 -267863 -330609 -146892 -264097 -8277 20269 -136038
2676a36038O050l4182m0025P4443O276k9500P1747P4904K9019p1313j59999M3382
$$ -136038 -129988 -164170 -204195 -129752 -123476 -152976 -81229 -6325 22694 -48619 -208618 -165236
2664a65236n5327N0840R4852k7302J76474j62694r1847l2578O3476J3370Q7651
$$ -165236 -220563 -169723 -74871 -102173 74301 -88393 -180240 -212818 -149342 -135972 -48321
2653d8321l5169j82120o26M9644J71658K9852q4622m675l6920J14340J2453j325
$$ -48321 -83490 -265610 -266236 -216592 -44934 -15082 -99704 -104379 -141299 -26959 -14506 -15831
2641a5831k25902n294J4730l2899JJ84660K5282o0725j090m3700k6311k837O8396
$$ -15831 -241733 -247027 -232297 -265196 -265195 -80535 -55253 -115978 -117068 -160768 -187079 -189916 -121520
2628a21520n201L4714n1936J17353l2940j62483M9996k2052R5470O708j43628
$$ -121520 -126721 -92007 -143943 -26590 -59530 -222013 -172017 -194069 -98599 -91891 -235519
2617b35519P9156P641j21133n7145N1506J23421n043J30466n268J2776n0543j7794
$$ -235519 -156363 -148722 -269855 -327000 -275494 -152073 -157116 -26650 -31918 -19142 -69685 -87479
2605h7479n8021O3934j15110J07605n238j6146J13830j72091o0705N316J75891
$$ -87479 -145500 -81566 -196676 -89071 -94309 -110455 3375 -168716 -229421 -224105 -48214
2594d8214o1104Q4652p0495j02854N6658Q2951m5803j17151J33079q7162j4534
$$ -48214 -109318 -24666 -95161 -198015 -141357 -58406 -104209 -221360 -88281 -175443 -189977
2583a89977K39131p8224Q3927m7863j9974k0921j23800L690J37519Q8662r2514
$$ -189977 49154 -29070 54857 6994 -12980 -33901 -157701 -154011 -16492 72170 -20344
2572b0344Q7928j75515P376J40920O0642k29352r0931J08086o4156n8975J80017
$$ -20344 67584 -107931 -100555 40365 101007 -128345 -219276 -111190 -175346 -234321 -54304
2561e4304l0146j07141k7764j0250O7457J02732J6670l1940r0023k0666P7470
$$ -54304 -84450 -191591 -219355 -229605 -162148 -59416 -42746 -74686 -164709 -185375 -107905
2550a07905q4158l7728N3933r3030P9133l9735j08310O9592M1754M0511N9807
$$ -107905 -192063 -229791 -175858 -268888 -189755 -229490 -337800 -268208 -226454 -185943 -126136
2539a26136J15081l6600n9906M770j03433K4113K06108l1213l1633j7086o7408
$$ -126136 -11055 -47655 -107561 -102791 -206224 -182111 23997 -7216 -38849 -55935 -123343
2528a23343k27576J59848K04603j25137J60089r2219M0179K037r8315P2507j39747
$$ -123343 -350919 -191071 13532 -111605 48484 -43735 -3556 -1519 -99834 -27327 -167074
2517a67074j7849J9149J07262M189N3353k0323j38830K8057J61094n2106r4723
$$ -167074 -184923 -165774 -58512 -54323 -970 -21293 -160123 -132066 29028 -23078 -117801
2506a17801q8959J7098J17605p5380K7256r4189J4861J11841q1965P7098K3823
$$ -117801 -206760 -189662 -72057 -147437 -120181 -214370 -199509 -87668 -169633 -92535 -68712
2495f8712j11829Q4153O5951l695j02897o3173J24572J21230q1244L2319j10678
$$ -68712 -180541 -96388 -30437 -34132 -137029 -200202 -75630 45600 -35644 -3325 -114003
2484a14003K0714P3682k5848l7767M7188R260o6005K0041q2941J16743j50548
$$ -114003 -93289 -19607 -45455 -83222 -36034 -26774 -92779 -72738 -155679 -38936 -189484
2473a89484K2892J9340J51478j71354K3609k9512J06922r2002J37339J35580j05146
$$ -189484 -166592 -147252 4226 -167128 -143519 -173031 -66109 -158111 -20772 114808 9662
2462I662m0557k3521K955m3819Q1884n8477N178j04184N0732p9394k8652O1353
$$ 9662 -30895 -54416 -51461 -95280 -13396 -71873 -66695 -170879 -120147 -199541 -228193 -166840
2450a66840J39213Q7945o3122J9638p8913K9362j8948J8693R9800q8994o3251
$$ -166840 -27627 60318 -2804 16834 -62079 -32717 -51665 -32972 66828 -22166 -85417
2439h5417J7081q4012K0492K7159j18989l300M3723p2267L3214n7415Q0214R0491
$$ -85417 -68336 -152348 -131856 -104697 -223686 -226986 -183263 -255530 -222316 -279731 -199517 -109026
2427a09026j55338O8742P5434n3940R0703j05218p852R2321j02524P7190o0850
$$ -109026 -264364 -195622 -120188 -174128 -83425 -188643 -196495 -104174 -206698 -129508 -190358
2416a90358J19111j02587j72052O5708J29649j41783J22021P8462j14832J05524
$$ -190358 -71247 -173834 -345886 -280178 -150529 -292312 -170291 -91829 -206661 -101137
2406a01137N1822l2983o335q2784P4573k8961L706j6603o4673k0301J71616P0592
$$ -101137 -49315 -82298 -88633 -171417 -96844 -125805 -122099 -138702 -203375 -223676 -52060 18532
2394A8532p0434J16423M9739k7966l592p95j56245j3533N511j41111M8859n4720
$$ 18532 -51902 64521 114260 86294 82702 81907 -74338 -87871 -82360 -223471 -174612 -229332
2382b29332Q0887J69110p398q0451j15122j60731K83051J9655K3506P358q702
$$ -229332 -148445 20665 13267 -67184 -182306 -343037 -59986 -40331 -16825 -9467 -18169
2371a8169o7745R8735j625r8602L1755m1466J06106j9594l2695j34113Q9627j4527
$$ -18169 -85914 12821 11196 -87406 -55651 -97117 8989 -10605 -43300 -177413 -87786 -102313
2359a02313R485J0548J62428j49124l0843k1823M7842l2606J52529n9715m5898
$$ -102313 -92828 -82280 80148 -68976 -99819 -121642 -73800 -106406 46123 -13592 -59490
2348e9490J72540j12470l7658q5009j41992k0460J67541J80065j27260j18740
$$ -59490 113050 580 -37078 -122087 -264079 -284539 -116998 63067 -64193 -182933
2338a82933J20369K5845k3955Q2329n3803J04842J36210q8788K3412L420j39768
$$ -182933 -62564 -36719 -60674 21655 -32148 72694 208904 120116 143528 146948 7180
2327G180r2275m6781N0710P032P5152m7776q7680L6404J04799l5644k34727P0924
$$ 7180 -85095 -131876 -81166 -74134 1018 -46758 -134438 -98034 6765 -28879 -263606 -192682
2315a92682o1115K05188L5932l0993L652J4148J6597k09873R4376q7493K16870
$$ -192682 -253797 -48609 -12677 -43670 -40018 -25870 -9273 -219146 -124770 -212263 4607
2304D607o2052Q365J7988P671R0922q0277L0257k2842J20934j11780r5869J0756
$$ 4607 -57445 -49080 -31092 -23421 67501 -12776 17481 -5361 115573 3793 -92076 -81320
2292h1320J91800j1321k09172j3734J33398m2556q824m9890P5160n2005M9223
$$ -81320 110480 99159 -110013 -123747 9651 -32905 -41729 -91619 -16459 -68464 -19241
2281a9241P8283o5062j85479j6901p722J47821k9478j8786N2734k17061R4025
$$ -19241 59042 -6020 -191499 -208400 -216122 -68301 -97779 -116565 -63831 -280892 -186867
2270a86867Q3391L4569J93851l07089M1060J80926o1108M7652p1593m4199J01180
$$ -186867 -103476 -68907 124944 -182145 -141085 39841 -21267 26385 -45208 -89407 11773
2259A1773L4726K0514M1734j40850q081L0319k6613K4003p0641q1932J70097m1292
$$ 11773 46499 67013 108747 -32103 -40184 -9865 -36478 -12475 -83116 -165048 5049 -36243
2247c6243q9699l0889M6856j10644K18764L1703l8188j15689j15198J7860r5742
$$ -36243 -125942 -156831 -109975 -220619 -1855 29848 -8340 -124029 -239227 -221367 -317109
2236c17109K76543J79258j95073l2474j8496J31267L2209K5028r7517j46151K58491
$$ -317109 -40566 138692 -56381 -88855 -107351 23916 56125 81153 -16364 -162515 95976
2225I5976l1746q2876j95141l9454P6517K58391o5683j01061J31942R6619n1743
$$ 95976 64230 -18646 -213787 -253241 -176724 81667 15984 -85077 46865 143484 91741
2214I1741O0988j77123j05964J29624j74928J4464O7387k2291N7795L9246j8456
$$ 91741 152729 -24394 -130358 -734 -175662 -161198 -93811 -116102 -58307 -19061 -37517
2203c7517Q033k3523m4130k7601J1228P1287J89633k40692m9507J7220P0242K58
$$ -37517 -29484 -53007 -97137 -124738 -113510 -42223 147410 -93282 -142789 -125569 -55327 -55069
2191e5069o9727j4166K7659J00540R6434M1994O2655m3977Q3456k26376N2689
$$ -55069 -124796 -138962 -111303 -10763 85671 127665 190320 146343 229799 3423 56112
2180E6112M4281o8033N5931l1162O6114j12899q6810n887l3816R3364j50479j6420
$$ 56112 100393 32360 88291 57129 123243 10344 -76466 -82353 -116169 -22805 -173284 -189704
2168a89704J08201J2494j3493J4991J06759j37341J961K5072J1203j37347J43891
$$ -189704 -81503 -69009 -82502 -67511 39248 -98093 -96132 -71060 -59857 -197204 -53313
2157e3313J46314l3138j37077P0910n876J0390j7605n0699J05909j60837j4730
$$ -53313 93001 59863 -77214 -6304 -12180 -1790 -19395 -70094 35815 -125022 -139752
2146a39752J44777M659R0147j17886r6223J3846L1715q896O2143K7698j79534
$$ -139752 5025 9684 99831 -18055 -114278 -100432 -68717 -77613 -15470 12228 -167306
2135a67306J3992J0160J76423K4461p3029N5825j65336n1137J79275L1565J45054
$$ -167306 -153314 -143154 33269 57730 -15299 40526 -124810 -175947 3328 34893 179947
2124A79947j50250l7592j0150J17954m4673n1318j93584Q6326P8103k1603m5277
$$ 179947 29697 -7895 -18045 99909 55236 3918 -189666 -103340 -25237 -46840 -92117
2113i2117k1656N8763j59414J47989J21053k4307j25413P7891j20129P9525k0689
$$ -92117 -113773 -55010 -214424 -66435 54618 30311 -95102 -17211 -137340 -57815 -78504
2102g8504K740l1319j1426N8632J14609j01849k7421R3239j42162k7981J33574
$$ -78504 -75764 -107083 -118509 -59877 54732 -47117 -74538 18701 -123461 -151442 -17868
2091a7868O6233l9413j16291J29064j28684p8391P0140J60828j46475N2359J6834
$$ -17868 48365 8952 -107339 21725 -106959 -185350 -115210 45618 -100857 -48498 -31664
2080c1664j76806J2470N0031P9003L6872L9171j78729K2944J74280J7041l0961
$$ -31664 -208470 -196000 -145969 -66966 -30094 9077 -169652 -146708 27572 44613 13652
2069A3652J33728j35773j81659J03394N7140J102p1187k5593R3002j415o8730
$$ 13652 147380 11607 -170052 -66658 -9518 -8416 -79603 -105196 -12194 -13609 -82339
2058h2339j3305N3040L4974J4712M1838j78887o8352Q6045K6681M5963k2461R3056
$$ -82339 -95644 -42604 -7630 7082 48920 -129967 -198319 -112274 -85593 -39630 -62091 30965
2046C0965J23248j05762k2831r085K7571q4996L9856p5082q983J80585j05635
$$ 30965 154213 48451 25620 16535 44106 -40890 -1034 -76116 -85099 95486 -10149
2035a0149j2188J06197r0647m7806K1052J23032j22029l3405N7590j18663l623
$$ -10149 -22337 83860 -6787 -54593 -33541 89491 -32538 -65943 -8353 -127016 -130639
2024a30639p1772p9803Q0084R4117J97286J23132j50014o1575Q7620M8192j16259
$$ -130639 -202411 -282214 -202130 -108013 89273 212405 62391 816 88436 136628 20369
2013B0369P9030l7212n0609l5322N379q2435Q2982M4445M89k2309j6160j5800
$$ 20369 99399 62187 11578 -23744 -18365 -100800 -17818 26627 27116 4807 -11353 -27153
2001b7153n2786J78506O807l8323J5399q9951o301j26245K6557R7871N5657j7073
$$ -27153 -79939 98567 105374 67051 82450 -7501 -13802 -140047 -113490 -15619 40038 22965
1989B2965n7751K9567O5321K553r4192m0303J10125j08487J64704j57262j64845
$$ 22965 -34786 -5219 60102 62655 -31537 -71840 38285 -70202 94502 -62760 -227605
1978b27605P5496P0209P3928r1439R5723R1406j35070j7423M0182n842j52359
$$ -227605 -152109 -81900 -7972 -99411 -3688 87718 -47352 -64775 -24593 -30435 -182794
1967a82794M5207R7421K6627O1157q9175n0234P22K0060L219O4657O9140j28980
$$ -182794 -137587 -40166 -13539 47618 -41557 -91791 -91069 -71009 -67790 -3133 66007 -62973
1955f2973K4368q8582J42639p308l1989R3278j19066j25209K06178j08159j27844
$$ -62973 -38605 -127187 15452 8144 -23845 69433 -49633 -174842 31336 -76823 -204667
1944b04667O9321J60464J22554j52093Q0069N812o8618O947m5517L8488J01934
$$ -204667 -135346 25118 147672 -4421 75648 81460 12842 19789 -25728 12760 114694
1933A14694k68007M43Q4355J13835J04751j3185l7904l16358K7071K8635m1017
$$ 114694 -153313 -152870 -68515 45320 150071 136886 98982 -217376 -190305 -161670 -202687
1922b02687J78037O671n8304J4444R7313j55447J14133o9667n2530J33721k1361
$$ -202687 -24650 -17979 -76283 -61839 35474 -119973 -5840 -75507 -128037 5684 -15677
1911a5677J0412M2882j57769J57588R9674K8103k25135l1082l6137j5023O0288
$$ -15677 -5265 37617 -120152 37436 137110 165213 -59922 -91004 -127141 -142164 -81876
1900h1876r3311J89540k3524R3082o7952k6505k7709j0095J45389j14942K5199
$$ -81876 -175187 14353 -9171 83911 15959 -10546 -38255 -48350 97039 -17903 7296
1889G296k3762N7597j20610k6226P812J4794K34759q6334k7843o0370L7669Q1280
$$ 7296 -16466 41131 -79479 -105705 -97893 -83099 151660 65326 37483 -22887 14782 96062
1877I6062m5514j28121L6780J48922j12276n260k7914M5690m8381R5217l6921
$$ 96062 50548 -77573 -40793 108129 -4147 -9407 -37321 8369 -40012 55205 18284
1866A8284O0630l1817m8847J6368l3524N7463l531m0960N7711P1046K4772J59
$$ 18284 78914 47097 -1750 14618 -18906 38557 35026 -5934 51777 122823 147595 147754
1854A47754j39654j07192J34619J34308j21977j11818M5640j56785J1325K49053
$$ 147754 8100 -99092 35527 169835 47858 -63960 -18320 -175105 -163780 85273
1844H5273K5639r3838P4077K23469j78695q8308p1662l2367J0503J77039L3859
$$ 85273 110912 17074 91151 314620 135925 47617 -24045 -56412 -45909 131130 164989
1833A64989k03422o1563J56448P5677o5924j43901m4450J01733J8920l8050Q0497
$$ 164989 -38433 -99996 56452 132129 66205 -77696 -122146 -20413 -1493 -39543 40954
1822D0954n5460L27P6817j19175q7628O2630Q6528J1787r3431J1145P5155r2009
$$ 40954 -14506 -14179 62638 -56537 -144165 -81535 4993 16780 -76651 -65506 9649 -82360
1810h2360J64242L5959q0908J00206L7189k4819k1217j03513J16528p4814O4213
$$ -82360 81882 117841 36933 137139 174328 149509 128292 24779 141307 66493 130706
1799A30706j46122O3584m0117M0855r2395K9940J26284L522N388r9646o3759P7919
$$ 130706 -15416 48168 8051 48906 -43489 -13549 112735 116257 121645 21999 -41760 36159
1787C6159P7212n6100K16254k28429n2415J95994J20809k23608R4273m4856r876
$$ 36159 113371 57271 273525 45096 -7319 188675 309484 85876 180149 135293 125417
1776A25417j13688M9474j05723p2444J64806J22090j42253J5304R6644l5464l0745
$$ 125417 11729 61203 -44520 -116964 47842 169932 27679 42983 139627 104163 73418
1765G3418p0039k5949m9856K8692m132J29080O562J42052L2451j71942J56154
$$ 73418 3379 -22570 -72426 -43734 -47866 81214 87776 229828 262279 90337 246491
1754B46491o5019n3148j06763O3917j9381K0761Q432j12672L372n1747J01898
$$ 246491 181472 128324 21561 85478 66097 86858 95290 -17382 -14010 -65757 36141
1743C6141L8856q3184n2570J0288O015M6240K03980m8629p6934K6979p3702L243
$$ 36141 74997 -8187 -60757 -50469 -44454 1786 205766 157137 80203 107182 33480 36723
1731C6723L7276J00036k65156m6361J73999m2238l0538K4834J34422O9807j08387
$$ 36723 73999 174035 -91121 -137482 36517 -5721 -36259 -11425 122997 192804 84417
1720H4417j37812N0268O0295n5085L2415n0687n7995L9915J70921j10796k50108
$$ 84417 -53395 -3127 57168 2083 34498 -16189 -74184 -34269 136652 25856 -224252
1709b24252J94235K26274L7148j6049j47452p7466J26266j23089j6665O0995j02109
$$ -224252 -30017 196257 233405 217356 69904 -7562 118704 -4385 -21050 39945 -62164
1698f2164q921J19103n9422r2363J02060j43322J22272l0531o655l5765P578O6297
$$ -62164 -71085 48018 -11404 -103767 -1707 -145029 -22757 -53288 -59943 -95708 -88130 -21833
1686b1833j4697k5920N856o604J39626J38226j45782N8815N2769J764j33540j01972
$$ -21833 -36530 -62450 -56594 -63198 76428 214654 68872 127687 180456 182220 48680 -53292
1674e3292R4373j8834Q1502r2774o9751O1209J35998q9159R8065M309k13597J3864
$$ -53292 41081 22247 103749 10975 -58776 2433 138431 49272 147337 151646 -61951 -48087
1662d8087j5949L7515J8346K4269L2962k9623j0566M4787p2093K8709L0587p164
$$ -48087 -64036 -26521 -8175 16094 49056 19433 8867 53654 -18439 10270 40857 33693
1650C3693j3008K03106j12502m3408j11407J3468K5684m8866L7166J10915l5756
$$ 33693 20685 223791 111289 67881 -43526 -30058 -4374 -53240 -16074 94841 59085
1639E9085j9717N2981k14777J27848j1598N9998p1042m6698K4460q6379J35079
$$ 59085 39368 92349 -122428 5420 -6178 53820 -17222 -63920 -39460 -125839 9240
1628I240J63337j76995N7404J12467m2973j42994k145L3468q8528N4527p2694
$$ 9240 172577 -4418 52986 165453 122480 -20514 -22659 10809 -77719 -23192 -95886
1617i5886J4295J82464q9501J18179N0142k15490K1771J76318R3382q4873p0371
$$ -95886 -81591 100873 11372 129551 179693 -35797 -14026 162292 255674 170801 100430
1606A00430L746q8358J67376l4747j12288R8358L0836k7340j86029o7479L7794
$$ 100430 104176 15818 183194 148447 36159 134517 165353 138013 -48016 -115495 -77701
1595g7701J59621j9096k1714J4131J1874l1044p0213M930j4585L471O9673n2122
$$ -77701 81920 62824 41110 55241 67115 36071 -34142 -29212 -43797 -40326 29347 -22775
1583b2775O7420J00471q2409j53077J58229l1816k02015K53595O6137j10868j75764
$$ -22775 44645 145116 62707 -90370 67859 36043 -165972 87623 153760 42892 -132872
1572a32872K1307R5270J04870L825j42826J54335K5519m4170N2131j67631k16049
$$ -132872 -111565 -16295 88575 92400 -50426 103909 129428 85258 137389 -30242 -246291
1561b46291J16710J05274Q7309K0655m8090n4167q748J48220J32363o9918l1384
$$ -246291 -129581 -24307 63002 83657 35567 -18600 -27348 120872 253235 183317 151933
1550A51933m8025l788j0535J8227j78766J43202r3836p952J10041r9169J10785
$$ 151933 103908 100120 89585 107812 -70954 72248 -21588 -29540 80501 -18668 92117
1539I2117p2206K0622O9277r4767L4245m0125J1347j57242k0690J52545k9742
$$ 92117 19911 40533 109810 15043 49288 9163 20510 -136732 -157422 -4877 -34619
1528c4619k8575K6482J16508J86871r0907j66493J60536O776l6754q2747P632
$$ -34619 -63194 -36712 79796 266667 175760 9267 169803 176579 139825 57078 64710
1517F4710j0212n9353k9568l0242K4668J1334K399N2131o2460p5308l4561K42767
$$ 64710 54498 -4855 -34423 -64665 -39997 -28663 -26264 25867 -36593 -111901 -146462 96305
1505I6305l3712j4646r6712J8161K9838J66188r8180j28512o744m354k0217j16215
$$ 96305 62593 47947 -48765 -30604 -766 165422 67242 -61270 -68014 -72368 -92585 -208800
1493b08800J10566K11603J798p9014o1271M9041R5631l932Q6040j63291j6277
$$ -208800 -98234 113369 115167 36153 -25118 23923 119554 115622 201662 38371 22094
1482B2094J43466J9948j17606j3124j22654p3605K71563j31524J30609j03137
$$ 22094 165560 185508 67902 54778 -67876 -141481 130082 -1442 129167 26030
1472B6030O3312j18051n7903J34623j48147p6529K1823J33964j14714J24906R2331
$$ 26030 89342 -28709 -86612 48011 -100136 -176665 -154842 -20878 -135592 -10686 81645
1461H1645n9255m3219n975P134J15986j56055j84523P1937K23962l6927j31668
$$ 81645 22390 -20829 -26804 -19670 96316 -59739 -244262 -172325 51637 14710 -116958
1450a16958N5114Q8497N1354M2786l5511R862l1485K7276Q8058J09341j80878
$$ -116958 -61844 26653 78007 120793 85282 95144 63659 90935 178993 288334 107456
1439A07456r0709O0875q7457p7310O8785O9734J933m4554k095P9731J97086N1515
$$ 107456 16747 77622 -9835 -87145 -18360 51374 53307 8753 6658 86389 283475 334990
1427C34990k12035j87279J297K46438l7672m1295O3200k14751O1741r2046J15319
$$ 334990 122955 -64324 -63027 183411 145739 104444 167644 -47107 14634 -77412 37907
1416C7907J28147j60323j89873J17748Q0355J9590m3707Q1087K1551k1505l6217
$$ 37907 166054 5731 -184142 -66394 13961 33551 -10156 70931 92482 70977 34760
1405C4760k8868R0773q6792q4335R3324J06965K9276J0475j8467N889K6805j09905
$$ 34760 5892 96665 9873 -74462 18862 125827 155103 165578 147111 153000 179805 69900
1393F9900m4957P952J21553L6687j96635R635J88121P1341m7597Q3619q4991k4568
$$ 69900 24943 32895 154448 191135 -5500 4135 192256 263597 216000 299619 214628 190060
1381A90060k5358Q8191K5627q4695j30733k5958L9642K0214m1147j70855R4931
$$ 190060 164702 252893 278520 193825 63092 37134 76776 96990 55843 -115012 -20081
1370b0081J11062m286k2446k1345Q895q642N894J6687j03950j1090J50462P7305
$$ -20081 90981 86695 64249 42904 51799 43157 49051 65738 -38212 -49302 101160 178465
1358A78465j34193j26310L3161j6620j4152k513J39884j07835j0759J6803k316
$$ 178465 44272 -82038 -48877 -65497 -79649 -82162 57722 -50113 -60872 -44069 -46385
1347d6385J06603o4795K7981L7806r140O699j48507N2660J65265j0296M8670q347
$$ -46385 60218 -4577 23404 61210 52070 58769 -89738 -37078 128187 117891 166561 158214
1335A58214j11794L1960q3272N2616M6917r3329p689M5896q687r9739l1135J65630
$$ 158214 46420 78380 -4892 47724 94641 1312 -6377 39519 30832 -68907 -100042 65588
1323F5588r0507N6206j18932N3080L6874j22547l516K67686K8179o3854k0774
$$ 65588 -24919 31287 -87645 -34565 2309 -120238 -123754 143932 172111 108257 87483
1312H7483j73683Q7951J411J28349q3635M494m2375m7031r9051J98494J75672
$$ 87483 -86200 1751 3162 131511 47876 52370 9995 -37036 -136087 62407 238079
1301B38079r2473p8196J20069M0511j76822N7110m3550K2627J5314R3200r6489
$$ 238079 145606 67410 187479 227990 51168 108278 64728 87355 102669 195869 99380
1290I9380n4163n5632K345M3136L3139r3809N6538Q1920K1855n6018o6520j03557
$$ 99380 45217 -10415 -8070 35066 68205 -25604 30934 112854 134709 78691 12171 -91386
1278i1386J20589J6812j16834Q0830k8358J10817J10884n643n7773j31145m3722
$$ -91386 29203 46015 -70819 10011 -18347 92470 203354 197711 139938 8793 -34929
1267c4929m5555J42385R7374M2300o8538q9331N1545q747m2093J3236R7999j56047
$$ -34929 -80484 61901 159275 201575 133037 43706 95251 86504 44411 57647 155646 -401
1255d01K3851M1096Q8782M9680l9828o9259N5123L9005l1226p8937P8592j31697
$$ -401 23450 64546 153328 203008 163180 93921 149044 188049 156823 77886 156478 24781
1243B4781Q213N7211o2846K4597m6894R5550L2253p7148n8801k4776L4121r0653
$$ 24781 32994 90205 27359 51956 5062 100612 132865 55717 -3084 -27860 6261 -84392
1231h4392m3694K90679l1131r2737J2593m6810p0347P2802P0170j82576l311J13182
$$ -84392 -128086 162593 131462 38725 51318 4508 -65839 6963 77133 -105443 -108754 4428
1219D428J32973O4110P559j21379p7678L6869o0540p2160k96n5463K21747l4550
$$ 4428 137401 201511 209070 87691 10013 46882 -13658 -85818 -86114 -141577 80170 45620
1207D5620N3058k45472J36543J50674K5569p3957j19506K6009k4096K49564j70847
$$ 45620 98678 -146794 -10251 140423 165992 92035 -27471 -1462 -25558 224006 53159
1196E3159p1733J75870k945k20431N5098R1824m5636R5475r7565J02319q3676
$$ 53159 -18574 157296 154351 -66080 -10982 80842 35206 130681 33116 135435 51759
1185E1759K7948k1064j37462J14004O4157m3471m3767o3027O17r7669l4891R1895
$$ 51759 79707 58643 -78819 35185 99342 55871 12104 -50923 -50306 -147975 -182866 -90971
1173i0971K30191k9168j43074m6666J05409J09266m0502n5602M4338j6902P842
$$ -90971 139220 110052 -33022 -79688 25721 134987 94485 38883 83221 66319 74161
1162G4161J7419Q9045m3703j6179K4336m2007O3947r1484r150R7394j08475o068
$$ 74161 91580 180625 136922 120743 145079 103072 167019 75535 66385 163779 55304 49236
1150D9236r6908Q7073q5391K690J22045J9025M2537r9752O2850K4477J01324o9179
$$ 49236 -47672 39401 -45990 -43300 78745 97770 140307 40555 103405 127882 229206 160027
1138A60027Q392m3087m0788p9203K7553p5838j471n6608N4092k9848J09698q3841
$$ 160027 168419 125332 84544 5341 32894 -42944 -44415 -101023 -46931 -76779 32919 -50922
1126e0922P1570r8703j3739r1577N4836K1994P3308m8960K92280j59981J12907
$$ -50922 20648 -78055 -91794 -183371 -128535 -106541 -33233 -82193 210087 50106 163013
1115A63013J26488j78101l5673o9038o2289p762Q9040P906r6588M1749O4694j368
$$ 163013 289501 111400 75727 6689 -55600 -63362 25678 33584 -63004 -21255 43439 42071
1103D2071j10075n989j48764J54043J04714j09694Q6203o8540J08093q8208N4232
$$ 42071 -68004 -73993 -222757 -68714 36000 -73694 12509 -56031 52062 -36146 18086
1092A8086M7205l7268J05376K1176j51297o5852O9930K16323j85130Q0468q5643
$$ 18086 65291 28023 133399 154575 3278 -62574 7356 223679 38549 119017 33374
1081C3374L5639K9208j55450k77J86510L3421k7456j82609j7236J8240M0620r5122
$$ 33374 69013 98221 -57229 -57506 129004 162425 134969 -47640 -64876 -46636 -6016 -101138
1069a01138M6305K46801j30632L5542j31854K0434q0861O4012Q5916k10492O0385
$$ -101138 -54833 191968 61336 96878 -34976 -14542 -95403 -31391 54525 -155967 -95582
1058i5582J42638K7157J0032K07528q7740o6847N7636j71554m0938l2364J09766
$$ -95582 47056 74213 84245 291773 204033 137186 194822 23268 -17670 -50034 59732
1047E9732K31007k25641q6869j1174J00938o2859N7416l4613L6511P5072r4896
$$ 59732 290739 65098 -21771 -32945 67993 5134 62550 27937 64448 139520 44624
1036D4624n1819Q6300Q7493l3103L9605j27005L1197o4102n1647M6382o096n0974
$$ 44624 -7195 79105 166598 133495 173100 46095 77292 13190 -38457 7925 1829 -49145
1024d9145j45454K51559P14j10455N641J38084o2715j442N3363j65561J82357
$$ -49145 -194599 56960 57674 -52781 -47140 90944 28229 26787 80150 -85411 96946
1013I6946K4468r9861l3559K7434o4423k441L0663P3594L5445O9050m8207j30889
$$ 96946 121414 21553 -12006 15428 -48995 -51436 -20773 52821 88266 157316 109109 -21780
1001b1780N3139j5171O5458J4329o5505J7546J21432p9325k4345m8912p7778J35928
$$ -21780 31359 16188 81646 95975 30470 48016 169448 90123 65778 16866 -60912 75016
989G5016O9197r5542j35051Q8549M0025N1724K5889M1408k3358J0238j28514o4742
$$ 75016 144213 48671 -86380 2169 42194 93918 119807 161215 137857 148095 19581 -45161
977d5161j54918K8797R2942J70176l5585r3884Q4558N9179m8498p6896m522J39464
$$ -45161 -200079 -171282 -78340 91836 56251 -37633 46925 106104 57606 -19290 -23812 115652
965A15652M389q9627K4171K6182j97312M6498J46460j11708J62140j2265o6865
$$ 115652 120041 30414 54585 80767 -116545 -70047 76413 -35295 126845 114580 47715
954D7715j05265k4300L3138J49542L3627m6482k03085K8087J07644K226P1656
$$ 47715 -57550 -81850 -48712 100830 134457 87975 -115110 -87023 20621 22847 94503
943I4503j93157L4644M6042N3207l5244m9873p5598o7746K04706K9525o6585j108
$$ 94503 -98654 -64010 -17968 35239 -5 -49878 -125476 -193222 11484 41009 -25576 -26684
931b6684J11157j12311n3170M8087l5165J12192R9263q4152j31953J36503L36
$$ -26684 84473 -27838 -81008 -32921 -68086 44106 143369 59217 -72736 63767 64103
920F4103j21373r8205J21644J06163p1414R2610n2891J01088r472M9942k86867
$$ 64103 -57270 -155475 -33831 72332 918 93528 40637 141725 132253 182195 -104672
909a04672N5704J74399j83257J04965J1747P369l3250j907P1547r780O0630j76132
$$ -104672 -48968 125431 -57826 47139 58886 66255 33005 31098 102645 92865 153495 -22637
$$ [...]
##END NTUPLES=NMR SPECTRUM
##END=
