##TITLE=1H_CG-1219
 CDCl3
 8 sc, 
 26.11.2024
##JCAMPDX= 6.0         $$ Bruker NMR JCAMP-DX V2.0
##DATA TYPE= NMR SPECTRUM
##DATA CLASS= NTUPLES
##ORIGIN= UXNMR, Bruker Analytische Messtechnik GmbH
##OWNER= root
$$ XWIN-NMR		Version 3.5
$$ Tue Nov 26 13:37:09 2024 Russian Standard Time (UT+4h)  she@DPX200
##.OBSERVE FREQUENCY= 200.1315
##.OBSERVE NUCLEUS= ^1H
##.ACQUISITION MODE= SIMULTANEOUS
##.ACQUISITION SCHEME= undefined
##.AVERAGES= 8
##.DIGITISER RES= 18
##SPECTROMETER/DATA SYSTEM= spect
##.PULSE SEQUENCE= zg30
##.SOLVENT NAME= D2O
##.SHIFT REFERENCE= (INTERNAL, D2O, 0, 19.4901)
##AUDIT TRAIL= $$ (NUMBER, WHEN, WHO, WHERE, WHAT)
$$ ##TITLE= Audit trail, XWIN-NMR		Version 3.5
$$ ##JCAMPDX= 5.01
$$ ##ORIGIN= Bruker BioSpin GmbH
$$ ##OWNER= she
$$ F:/spectra/data/she/nmr/H-F/1/pdata/1/auditp.txt
$$ ##AUDIT TRAIL=  $$ (NUMBER, WHEN, WHO, WHERE, WHAT)
(   1,<2024-11-26 13:35:27.50 +0400>,<she>,<DPX200>,
      <created by zg, POWCHK disabled, PULCHK disabled
       configuration hash MD5:
       00 E9 B6 7A A2 85 ED C7 34 08 36 98 17 FE 4E 26
       data hash MD5: 16K
       E4 AD D0 41 8B D8 49 EB 02 97 10 68 DE 79 DF 0A>)
(   2,<2024-11-26 13:35:29.96 +0400>,<she>,<DPX200>,
      <Start of raw data processing
       efp BC_mod = 2 LB = 0.24 FT_mod = 6 PKNL = 1 PHC0 = -26707.02 PHC1 = 10.18744 SI = 16K 
       data hash MD5: 16K
       B4 D1 2A A3 EF B2 7F 20 17 62 9B A0 BD 6E 3D BA>)
(   3,<2024-11-26 13:35:47.90 +0400>,<she>,<DPX200>,
      <pk PHC0 = -157.44 PHC1 = 0.5999999 
       data hash MD5: 16K
       BD 16 DF E2 F2 C9 31 18 F0 76 74 43 81 59 98 41>)
(   4,<2024-11-26 13:35:51.42 +0400>,<she>,<DPX200>,
      <abs ABSG = 5 
       data hash MD5: 16K
       4C BC CC C2 F4 1B 2F 17 11 C4 70 2F 61 8D F3 80>)
(   5,<2024-11-26 13:36:16.09 +0400>,<she>,<DPX200>,
      <pk PHC0 = -0.689622 PHC1 = 1 
       data hash MD5: 16K
       72 72 59 EE 4E 8E 7D E6 90 B8 1B 68 51 0F B7 31>)
(   6,<2024-11-26 13:36:19.56 +0400>,<she>,<DPX200>,
      <abs ABSG = 5 
       data hash MD5: 16K
       5F 32 34 48 06 B2 45 F6 CC 8C 65 6D 4C 32 F1 AD>)
$$ ##END=
$$ 
$$ hash MD5
$$ 6A F3 78 A5 24 30 5E ED 02 E6 9E 1B 2B FE 3B A4
##$RELAX= 
##$RELAX= 
##$RELAX= 
##$RELAX= 
##$RELAX= 
##$RELAX= 
$$ Bruker specific parameters
$$ --------------------------
##$DU= <F:/spectra>
##$EXPNO= 1
##$NAME= <H-F>
##$PROCNO= 1
##$TYPE= <nmr>
##$USER= <she>
##$AMP= (0..31)
100 100 100 100 100 100 100 100 100 100 100 100 100 100 100 100 100 100 
100 100 100 100 100 100 100 100 100 100 100 100 100 100 
##$AQSEQ= 0
##$AQ_mod= 1
##$AUNM= <au_zg>
##$AUTOPOS= <>
##$BF1= 200.13
##$BF2= 200.13
##$BF3= 200.13
##$BF4= 200.13
##$BF5= 200.13
##$BF6= 200.13
##$BF7= 200.13
##$BF8= 200.13
##$BYTORDA= 1
##$CFDGTYP= 0
##$CFRGTYP= 5
##$CHEMSTR= <none>
##$CNST= (0..31)
1 1 145 1 1 1 1 1 1 1 1 1 1 1 1 1 1 1 1 1 1 1 1 1 1 1 1 1 1 1 1 1 
##$CPDPRG= <>
##$CPDPRG1= <>
##$CPDPRG2= <>
##$CPDPRG3= <>
##$CPDPRG4= <mlev>
##$CPDPRG5= <mlev>
##$CPDPRG6= <mlev>
##$CPDPRG7= <mlev>
##$CPDPRG8= <mlev>
$$ [...]
##$SUBNAM3= <"">
##$SUBNAM4= <"">
##$SUBNAM5= <"">
##$SUBNAM6= <"">
##$SUBNAM7= <"">
##$SUBNAM8= <"">
##$SUBNAM9= <"">
##$SW= 24.0689530833862
##$SWIBOX= (0..15)
0 0 2 0 0 0 0 0 0 0 0 0 0 0 0 0 
##$SW_h= 4816.95568400771
##$TD= 16384
##$TD0= 1
##$TE= 0
##$TE2= 300
##$TE3= 300
##$TEG= 300
##$TL= (0..7)
0 120 120 120 120 120 120 120 
##$TP= (0..7)
150 150 150 150 150 150 150 150 
##$TP07= 0
##$TPNAME0= <>
##$TPNAME1= <>
##$TPNAME2= <>
##$TPNAME3= <>
##$TPNAME4= <>
##$TPNAME5= <>
##$TPNAME6= <>
##$TPNAME7= <>
##$TPOAL= (0..7)
0.5 0.5 0.5 0.5 0.5 0.5 0.5 0.5 
##$TPOFFS= (0..7)
0 0 0 0 0 0 0 0 
##$TUNHIN= 0
##$TUNHOUT= 0
##$TUNXOUT= 0
##$USERA1= <user>
##$USERA2= <user>
##$USERA3= <user>
##$USERA4= <user>
##$USERA5= <user>
##$V9= 5
##$VALIST= <valist>
##$VCLIST= <CCCCCCCCCCCCCCC>
##$VD= 0
##$VDLIST= <DDDDDDDDDDDDDDD>
##$VPLIST= <PPPPPPPPPPPPPPP>
##$VTLIST= <TTTTTTTTTTTTTTT>
##$WBST= 1024
##$WBSW= 4
##$XGAIN= (0..3)
0 0 0 0 
##$XL= 0
##$YL= 0
##$YMAX_a= 523314
##$YMIN_a= -731568
##$ZGOPTNS= <>
##$ZL1= 120
##$ZL2= 120
##$ZL3= 120
##$ZL4= 120
##$ABSF1= 19.34315
##$ABSF2= -4.725981
##$ABSG= 5
##$ABSL= 3
##$ALPHA= 0
##$AQORDER= 0
##$ASSFAC= 0
##$ASSFACI= 0
##$ASSFACX= 0
##$ASSWID= 0
##$AUNMP= <proc_1d>
##$AZFE= 0.1
##$AZFW= 0.1
##$BCFW= 0
##$BC_mod= 2
##$BYTORDP= 0
##$COROFFS= 0
##$CY= -3
##$DATMOD= 1
##$DC= 0
##$DFILT= <>
##$DTYPP= 0
##$F1P= 0
##$F2P= 0
##$FCOR= 1
##$FTSIZE= 16384
##$FT_mod= 6
##$GAMMA= 0
##$GB= 0
##$INTBC= 1
##$INTSCL= 2.524811e-10
##$ISEN= 128
##$LB= 0.24
##$LEV0= 0
##$LPBIN= 0
##$MAXI= 10000
##$MC2= 0
##$MEAN= 0
##$ME_mod= 0
##$MI= 1.114404
##$NCOEF= 0
##$NC_proc= -5
##$NLEV= 6
##$NOISF1= 3.799351
##$NOISF2= 2.8
##$NSP= 0
##$NTH_PI= 0
##$NZP= 0
##$OFFSET= 19.49006
##$PC= 1
##$PHC0= -26865.15
##$PHC1= 11.78744
##$PH_mod= 1
##$PKNL= yes
##$PPARMOD= 0
##$PSCAL= 0
##$PSIGN= 0
##$REVERSE= no
##$SF= 200.130007930317
##$SI= 16384
##$SIGF1= 3
##$SIGF2= 2
##$SINO= 5.538805
##$SIOLD= 16384
##$SREGLST= <1H.CDCl3>
##$SSB= 0
##$STSI= 16384
##$STSR= 0
##$SW_p= 4816.95568400771
##$SYMM= 0
##$S_DEV= 0
##$TDeff= 16384
##$TDoff= 0
##$TI= <>
##$TILT= no
##$TM1= 0
##$TM2= 0
##$TOPLEV= 0
##$USERP1= <user>
##$USERP2= <user>
##$USERP3= <user>
##$USERP4= <user>
##$USERP5= <user>
##$WDW= 1
##$XDIM= 16384
##$YMAX_p= 364666660
##$YMIN_p= -126724
$$ End of Bruker specific parameters
$$ ---------------------------------
##NTUPLES= NMR SPECTRUM
##VAR_NAME=  FREQUENCY,     SPECTRUM/REAL,   SPECTRUM/IMAG
##SYMBOL=    X,             R,               I
##VAR_TYPE=  INDEPENDENT,   DEPENDENT,       DEPENDENT
##VAR_FORM=  AFFN,          ASDF,            ASDF
##VAR_DIM=   16384,         16384,           16384
##UNITS=     HZ,            ARBITRARY UNITS, ARBITRARY UNITS
##FACTOR=    0.29402158847633, 1,            1
##FIRST=     3900.54602372206, 0,            0
##LAST=      -916.409660285651, 0,           0
##MIN=       -916.409660285651, -126724,     0
##MAX=       3900.54602372206, 364666660,    0
$$ Real data points
##PAGE= N=1
##DATA TABLE= (X++(R..R)), XYDATA
$$ [...]
8260A871304m622N124L4881J2623M2601L0740k7175J4486L5539J4507L3329K1765
$$ 1871304 1866682 1871806 1906687 1919310 1961911 1992651 1965476 1979962 2015501 2030008 2063337 2085102
8248B085102L6958P02M8858N5070K0595N1817q122O421M4729j5599J0393P8877
$$ 2085102 2122060 2122762 2171620 2226690 2247285 2299102 2290980 2297401 2342130 2326531 2336924 2415801
8236B415801L3106M1280M9160O6618J8527K7732M5862M0822O5648O9210J06795
$$ 2415801 2448907 2490187 2539347 2605965 2624492 2652224 2698086 2738908 2804556 2873766 2980561
8225B980561J48120R9072N5407J38616J09425J23879J06819J37374J05292R5924
$$ 2980561 3128681 3227753 3283160 3421776 3531201 3655080 3761899 3899273 4004565 4100489
8215D100489J27473M5425P0689J43133R3285J35044J00294K34999J12739J61730
$$ 4100489 4227962 4273387 4344076 4487209 4580494 4715538 4815832 5050831 5163570 5325300
8205E325300O3444L1603J16550J82774J23267J75819K43281L32020K59029L38791
$$ 5325300 5388744 5420347 5536897 5719671 5842938 6018757 6262038 6594058 6853087 7191878
8195G191878K57050J74456j47899n07422Q35160M01936K01778K65749K97840L17580
$$ 7191878 7448928 7623384 7475485 6968063 7803223 8205159 8406937 8672686 8970526 9288106
8185I288106K77725K22448J66613J47551J24567K56631K07707K72785L69155L81771
$$ 9288106 9565831 9788279 9954892 10102443 10227010 10483641 10691348 10964133 11333288 11715059
8175A1715059M27530M34745M25920M50502M52703M56179M96448O44316P14504
$$ 11715059 12142589 12577334 13003254 13453756 13906459 14362638 14859086 15503402 16217906
8166A6217906P33703P23729R05850R23240R43530R53414R75906R61123J236009
$$ 16217906 16951609 17675338 18581188 19504428 20447958 21401372 22377278 23338401 24574410
8157B4574410J436893J754493K126191K571340K820055L021176L441474L892477
$$ 24574410 26011303 27765796 29891987 32463327 35283382 38304558 41746032 45638509
8149D5638509L251594J850916N44567r05659k025147k727317l197288k313717
$$ 45638509 48890103 50741019 51285586 50379927 48354780 45627463 42430175 40116458
8141D0116458r59505M26046J467145J804070J648232J526745J028298R14132M40994
$$ 40116458 39156953 39582999 41050144 42854214 44502446 46029191 47057489 47971621 48412615
8132D8412615l21955n27430k10171R8901n68808j441115k278841k059301j778585
$$ 48412615 48090660 47563230 47353059 47451960 46883152 45442037 43163196 41103895 39325310
8123C9325310j809036k276601k437609k285712k146840k052606j973265j632715
$$ 39325310 37516274 35239673 32802064 30516352 28369512 26316906 24343641 22710926
8115B2710926j201929p80464o17666m50689l65193j73450K966J85589M12141N06941
$$ 22710926 21508997 20728533 20110867 19660178 19294985 19121535 19124501 19310090 19722231 20229172
8105B0229172O05191P58491R51235J233237J234130P21803J7030m72928m91413
$$ 20229172 20834363 21592854 22544089 23777326 25011456 25733259 25750289 25277361 24785948
8096B4785948l46699o29423j079581j449619j518957j225390q71191o67681m78779
$$ 24785948 24439249 23809826 22730245 21280626 19761669 18536279 17665088 16997407 16518628
8087A6518628l24430k98895k88069k18201j34850k08698q8425j24137l0988l875
$$ 16518628 16194198 15895303 15607234 15389033 15254183 15045485 14957060 14832923 14801935 14798060
8077A4798060k0134P6007J50073K64863L63068L75222M15221M49721N78152O09342
$$ 14798060 14777926 14853933 15004006 15268869 15631937 16007159 16422380 16872101 17450253 18059595
8067A8059595Q31091Q86618J198201J478036K009542K541245L616181K457163
$$ 18059595 18890686 19777304 20975505 22453541 24463083 27004328 30620509 33077672
8059C3077672N67873j710846k727486j743315q60651j5841K75725P88705J196094
$$ 33077672 33645545 31934699 29207213 27463898 26603247 26587406 26863131 27651836 28847930
8050B8847930J586998J450670J039892N01305L3712m58016r01022j164979q49142
$$ 28847930 30434928 31885598 32925490 33426795 33460507 33002491 32101469 30936490 30087348
8041C0087348j99589O50506J374962J813248J603563J046102M1894p19409j215016
$$ 30087348 29887759 30538265 31913227 33726475 35330038 36376140 36418034 35698625 34483609
8032C4483609j267819q14941k04057N39071J273566J885627K178790K055063J656729
$$ 34483609 33215790 32400849 32196792 32735863 34009429 35895056 38073846 40128909 41785638
8023D1785638J094808N36573l66770j458006k601335l306187l242249k541276
$$ 41785638 42880446 43417019 43050249 41592243 38990908 35684721 32442472 29901196
8015B9901196j712960q81155k09101L00496K40186r2752q93314j417848j409806
$$ 29901196 28188236 27307081 27097980 27398476 27638662 27545910 26652596 25234748 23824942
8006B3824942r60117n45959j81277K17058O18625J024784J038516P64927K05570
$$ 23824942 22864825 22318866 22137589 22354647 22973272 23998056 25036572 25801499 26007069
7997B6007069k03803l02473m21203r50383j508332k000403k007584j516649j022911
$$ 26007069 25803266 25500793 25079590 24129207 22620875 20620472 18612888 17096239 16073328
7988A6073328q26580m87674k53154L8677J27372j57055m97807q79987r49788p93776
$$ 16073328 15246748 14759074 14505920 14544597 14671969 14514914 14017107 13137120 12187332 11393556
7978A1393556n66628m87528l65707l08675k91871j97581k18673j47362j68151
$$ 11393556 10826928 10339400 9973693 9665018 9373147 9175566 8956893 8809531 8641380
7969H641380j56770j07529j06548j64281j45505q5704j99672k11264j84915j92210
$$ 8641380 8484610 8377081 8270533 8106252 7960747 7875043 7675371 7464107 7279192 7086982
7959G086982k72430k15047j80065j58029j39842j45291j24545r0536r2635n9095
$$ 7086982 6814552 6599505 6419440 6261411 6121569 5976278 5851733 5761197 5668562 5609467
7949E609467p4179L4551k2603q485j15124r5938n4884j09699m2046j5848K7937
$$ 5609467 5535288 5569839 5547236 5538751 5423627 5327689 5272805 5163106 5121060 5105212 5133149
7938E133149l9883n5797k0209k4666N295j9934p1970j76247j97581j01913j61832
$$ 5133149 5093266 5037469 5017260 4992594 4997889 4977955 4905985 4729738 4532157 4430244 4268412
7927D268412j15756n5173o6944q669m0355o5953r302J5414j426k583o349p9338
$$ 4268412 4152656 4097483 4030539 4021870 3981515 3915562 3906260 3921674 3920248 3917665 3911316 3831978
7915C831978k2092n0927j06122j27659q033j07991J9081p5284l5852m4158j01089
$$ 3831978 3809886 3758959 3652837 3525178 3517145 3409154 3428235 3352951 3317099 3272941 3171852
7904C171852j02132N8415q3619n2691J0853l1416j578j09930p3021m4273j00271
$$ 3171852 3069720 3128135 3044516 2991825 3002678 2971262 2969684 2859754 2786733 2742460 2642189
7893B642189l4157K4989M264J258M5378L3025j9392k3863J3372O4121N8996M1920
$$ 2642189 2608032 2633021 2637285 2638543 2683921 2716946 2697554 2673691 2687063 2751184 2810180 2852100
7881B852100R96j053j9029n6722l3314K1853k0401k4225m1149K3285j4722o065
$$ 2852100 2853096 2852043 2833014 2776292 2742978 2764831 2744430 2720205 2679056 2702341 2687619 2681554
7869B681554K4650O446n3890k6698O207j6124L6400M3104M585o8470m6098l0059
$$ 2681554 2706204 2712650 2658760 2632062 2638269 2622145 2658545 2701649 2706234 2637764 2591666 2561607
7857B561607N7129j6329j8250K3680l2921M0831P675J0361J3883M5657o005L7807
$$ 2561607 2618736 2602407 2584157 2607837 2574916 2615747 2623422 2633783 2647666 2693323 2687318 2725125
7845B725125k9060k6756j8219j9799M528L3431r239L6344J08130L8792M4966N2768
$$ 2725125 2696065 2669309 2651090 2631291 2635819 2669250 2660011 2696355 2804485 2843277 2888243 2941011
7833B941011O6957L0014J0978j9055K8987M492L0142J3650L1119N2686Q3224O0381
$$ 2941011 3007968 3037982 3048960 3029905 3058892 3063384 3093526 3107176 3138295 3190981 3274205 3334586
7821C334586L6034M6974L8996N4827Q6640M6252j9552J5115J5934P9098J2380
$$ 3334586 3370620 3417594 3456590 3511417 3598057 3644309 3624757 3639872 3655806 3734904 3747284
7810C747284Q5972O8285L9276o5911k4849l0750q7266j01147j4605o6580k7278
$$ 3747284 3833256 3901541 3940817 3874906 3850057 3819307 3732041 3630894 3616289 3549709 3522431
7799C522431k5002l4030j5188k0243J6119N6770Q9702O9050J0886M2247J32017
$$ 3522431 3497429 3463399 3448211 3427968 3444087 3500857 3590559 3659609 3670495 3712742 3844759
7788C844759Q4834O3914Q3621M6918k4528J6611J3422L4425m901L4490j792m895
$$ 3844759 3929593 3993507 4077128 4124046 4099518 4116129 4129551 4163976 4159075 4193565 4191773 4186878
7776D186878m7402r2057p9777r9856j11964j6261l0120j2457J3039l0509J4243
$$ 4186878 4139476 4047419 3967642 3867786 3755822 3739561 3709441 3696984 3710023 3679514 3693757
7765C693757P5300R1835J12931L3378k521M8585k2863n8627J191M1882l8713j5184
$$ 3693757 3769057 3860892 3973823 4007201 4004680 4053265 4030402 3971775 3972966 4014848 3976135 3960951
7753C960951m5278r3515q4137n9728q9830q0335p5867r2138j60852j23781r6545
$$ 3960951 3915673 3822158 3738021 3678293 3588463 3508128 3432261 3340123 3179271 3055490 2958945
7742B958945o9085m4433m3518m1345k4866L1881r275l4370k138O5446O9804M8108
$$ 2958945 2889860 2845427 2801909 2760564 2735698 2767579 2758304 2723934 2721796 2787242 2857046 2905154
7730B905154k7653R9405J1459k2704j5608j1849n8041J2390K8917j8222L0331
$$ 2905154 2877501 2976906 2988365 2965661 2950053 2938204 2880163 2892553 2921470 2903248 2933579
7719B933579n9322p0169o0941J9250p2926R128O3567l1320k5172m6764p8770o2478
$$ 2933579 2874257 2804088 2743147 2762397 2689471 2698599 2762166 2730846 2705674 2658910 2580140 2517662
7707B517662n6417o6832r8795l4559k6991m6841n5460j8892M2159p593k2441l0562
$$ 2517662 2461245 2394413 2295618 2261059 2234068 2187227 2131767 2112875 2155034 2147441 2125000 2094438
7695B094438k8945m1130m1227l2195l7864K370j0865k9770k8389k7394j1531K4822
$$ 2094438 2065493 2024363 1983136 1950941 1913077 1915447 1904582 1874812 1846423 1819029 1807498 1832320
7683A832320M8087j2188N9036L7090M7210N9917J19949J03003O3127J33181K7301
$$ 1832320 1880407 1868219 1927255 1964345 2011555 2071472 2191421 2294424 2357551 2490732 2518033
7672B518033r68q2898j23479j18194j31532q1803j7651n1212k2592k0902l3970
$$ 2518033 2517065 2434167 2310688 2192494 2060962 1979159 1961508 1910296 1887704 1866802 1832832
7661A832832n7600Q0897J0325M6282L4209K3460R6857k175M8720M9274J6939j4848
$$ 1832832 1775232 1856129 1866454 1912736 1946945 1970405 2067262 2065087 2113807 2163081 2180020 2165172
7649B165172p0995n8703k7216r2735n2711r2779r6690p7395o2018r7911r2592
$$ 2165172 2094177 2035474 2008258 1915523 1862812 1770033 1673343 1595948 1533930 1436019 1343427
7638A343427p4285l8658m2036j9224q0339M546o678o6534m2020L8951J8367o541
$$ 1343427 1269142 1230484 1188448 1169224 1088885 1093431 1086753 1020219 978199 1017150 1035517 1028976
7626A028976j8112m5431L9747K0716j1382O7615k0845K9932J5995K3308l5158
$$ 1028976 1010864 965433 1005180 1025896 1014514 1082129 1061284 1091216 1107211 1130519 1095361
7615A095361O4844M8287L5042Q6036n568m9354p2203j01134q2615n7159q937p6043
$$ 1095361 1160205 1208492 1243534 1329570 1324002 1274648 1202445 1101311 1018696 961537 952600 876557
7603H76557n2935l0726l1784L9630N566o9662n9901K4734m0280J6267m905j1669
$$ 876557 823622 792896 761112 800742 806308 736646 676745 701479 661199 677466 672561 660892
7591F60892n1418L9866k6292O494J7055j5527Q951j5389M4935J5366L2024K587
$$ 660892 609474 649340 623048 629542 646597 631070 640021 624632 669567 684933 716957 719544
7579G19544l22K2646k3315n3995j1917L0741o8585p6473r375N0793j5556p2308
$$ 719544 719222 741868 718553 664558 652641 683382 614797 538324 528949 579742 564186 491878
7567D91878M4953N0654l9136K2360j7555Q669m3379O8531m9247l7808l1192J0970
$$ 491878 536831 587485 548349 570709 553154 561823 518444 586975 537728 499920 468728 479698
7555D79698n962j1796K2590l3894k6853J3689k6504M768K0608j2103L1645j4080
$$ 479698 473736 461940 484530 450636 423783 437472 410968 415736 436344 424241 455886 441806
7543D41806O33L7570m2037n2434l6020L0608N6783m3535p116K2936l4491p477
$$ 441806 442439 480009 437972 385538 349518 380126 436909 393374 386258 409194 374703 367226
7531C67226K9319m7689J7656L7715j5583l13j8006L7721L3937R74n1659j0079
$$ 367226 396545 348856 366512 404227 388644 388331 370325 408046 441983 442957 391298 381219
7519C81219L6439j8764K4843k9105l1007k0038k1405k0943p104j5769J5634l3890
$$ 381219 417658 398894 423737 394632 363625 343587 322182 301239 294135 278366 294000 260110
7507B60110k1894l7099N5173p730m3694p82O244l6197k4371J137K1931J4524k1980
$$ 260110 238216 201117 256290 248560 204866 204084 210328 174131 149760 150897 172828 187352 165372
7494A65372j6145N368P1136p4268j2899M6073J1177M1579j033m7606j4955J4908
$$ 165372 149227 154595 225731 151463 138564 184637 195814 237393 236360 188754 173799 188707
7482A88707J5726J611l0656k186M930k5071J9498k1695J0094l184m10k3701p3445
$$ 188707 204433 206044 175388 173202 178132 153061 172559 150864 160958 157774 157364 133663 60218
7469F0218N1306q14K3579L1620p3985j2303J42Q972L5429K4703l1748o3184Q3335
$$ 60218 111524 110710 134289 165909 91924 79621 79763 88735 124164 148867 117119 53935 137270
7456A37270K6251J5312j5549l6452r341n072K5518p0916k5594j2102L2361L9314
$$ 137270 163521 178833 163284 126832 117491 112419 137937 67021 41427 29325 61686 101000
7444A01000l8902J2636l4586K4376M070K9950k7840R712J3883o0263r990j6858
$$ 101000 62098 74734 40148 64524 68594 98544 70704 80416 94299 34036 24046 7188
7432G188j1890k949L8348p404K1434j3654k5155j2803j8743l6698R4088K5022
$$ 7188 -4702 -7651 30697 23293 44727 31073 5918 -6885 -25628 -62326 31762 56784
7420E6784l149L7486n7361J6459l2061l3667O840M6424j9090k3343k2699N3983
$$ 56784 53635 91121 33760 50219 18158 -15509 -8669 37755 18665 -4678 -27377 26606
7408B6606J1835L643j1928o5288L1721K4046N5672l7731o4644J6135j797m688
$$ 26606 38441 42084 30156 -35132 -3411 20635 76307 38576 -26068 -9933 -11730 -16418
7396a6418L2860m9459M2993M0016m7828J4418K2196l3108K2735N1398l7321L2468
$$ -16418 16442 -33017 9976 49992 2164 16582 38778 5670 28405 79803 42482 74950
7384G4950j1280O988L6m0780m9606K8100J5858k224L2262j3952N965L0387l7039
$$ 74950 63670 70658 70694 29914 -19692 8408 24266 22042 54304 40352 46317 76704 39665
7371C9665L765r807J774J9109j0382R098K6692m5465K089n456K0247O021K9885
$$ 39665 43430 33623 35397 54506 44124 53222 79914 34449 36538 31082 51329 57350 87235
7358H7235l5736l5538N3105j7870J6836j2121N686j7127n7825M1421O6247m4466
$$ 87235 51499 15961 69066 51196 68032 55911 61597 44470 -13355 28066 94313 49847
7346D9847L826J8055J6231m8522K4447L2580l8858j8291J2112k4059J0754M5062
$$ 49847 53673 71728 87959 39437 63884 96464 57606 39315 51427 27368 38122 83184
7334H3184r909n5046O0848K7906l9680n8834L0707j5637J036K9058l3552K8993
$$ 83184 73275 18229 79077 106983 67303 8469 39176 23539 24575 53633 20081 49074
7322D9074o62o3380L0226K2379K9694l9790l2380K8242L3357j2851l5884K3668
$$ 49074 48412 -14968 15258 37637 67331 27541 -4839 23403 56760 43909 8025 31693
7310C1693m3959M2343k4942j5221R307j0386n156J5059j5253o143K1164J6477
$$ 31693 -12266 30077 5135 -10086 -779 -11165 -16321 -1262 -16515 -22658 -1494 14983
7298A4983r926o1817J6191J4237l7704M7948Q1235m2245m5263P565k5172j3236
$$ 14983 5057 -56760 -40569 -26332 -64036 -16088 65147 22902 -22361 -14796 -39968 -53204
7286e3204k2085O580l2049J4049K9081N6628J2911o6128K0629j0916K7058m2486
$$ -53204 -75289 -68709 -100758 -86709 -57628 -1000 11911 -54217 -33588 -44504 -17446 -59932
7274e9932l39L4503K0960n0281p011O0532M045l1686N171m6620K3589j1682M0973
$$ -59932 -60271 -25768 -4808 -55089 -62100 -1568 2477 -29209 -24038 -70658 -47069 -58751 -17778
7261a7778J2594J8526l2837M716k3983P698n972K079K4781l0576l157J7195j0419
$$ -17778 -5184 13342 -19495 -14779 -38762 -31064 -37036 -34957 -10176 -40752 -43909 -26714 -37133
7248c7133L896k2643N925N1099m1034J3806k1738N8640l4906M2521P828o7998
$$ -37133 -33237 -55880 -49955 1144 -39890 -26084 -47822 10818 -24088 18433 26261 -41737
7236d1737l6787L0503l1727N1815J1696K6925k6181J8078J1170o4228L1763k769
$$ -41737 -78524 -48021 -79748 -27933 -16237 10688 -15493 2585 13755 -50473 -18710 -21479
7224b1479L8355j363K6851m7145k8084M884j6184J8847k0967J4056J6710o0084
$$ -21479 16876 15513 42364 -4781 -32865 -27981 -44165 -25318 -46285 -32229 -15519 -75603
7212g5603K0590N5525n412L2229l2795K4719p278K2063J9811j6220P082M535l1383
$$ -75603 -55013 512 -4900 27329 -5466 19253 11975 34038 53849 37629 44711 49246 17863
7199A7863j268J8944K2249m2907K320k831N2678M7948n990o701j6187p344L298
$$ 17863 16595 35539 57788 14881 17201 14370 67048 114996 109006 102305 86118 78774 82072
7186H2072m8269L295k026M3195J4392K832J9759o09J3341Q811R0411m7517q249
$$ 82072 33803 37098 35072 78267 92659 95491 115250 114641 127982 136793 227204 179687 171438
7173A71438R5307J6126k4909K0282J7531P7841L4938o26L9978j2207l6571j0620
$$ 171438 266745 282871 257962 278244 295775 373616 408554 407928 447906 435699 399128 388508
7161C88508j184K6914m9091j0853K2996J1575M6288n506j2112m6047o850N8152
$$ 388508 387324 414238 365147 354294 377290 388865 435153 429647 417535 371488 364638 422790
7149D22790l9742K1262k0847k9858K0405l9604K6390M4221m9045J7459L9592k7575
$$ 422790 383048 404310 383463 353605 374010 334406 360796 405017 355972 373431 413023 385448
7137C85448J1292q026N604j5403K3578L8971o819N5609P1582L0418M9160O2740
$$ 385448 396740 388714 394318 378915 402493 441464 434645 490254 561836 592254 641414 704154
7125G04154Q6118P5744J8390J7852J02142K4601J0292j3233J7791P2506n0755
$$ 704154 790272 866016 884406 902258 1004400 1029001 1039293 1026060 1043851 1116357 1065602
7114A065602k5999J3700o8218m4406l2748l8676R855m4550r439q464l4523l2592
$$ 1065602 1039603 1053303 985085 940679 907931 869255 879110 834560 825121 816657 782134 749542
7102G49542j0424J686m7343L4539L1219m4456j231j8865L3614O840J2487j9134
$$ 749542 739118 740804 693461 728000 759219 714763 713532 694667 728281 735121 747608 728474
7090G28474J4497L8842j9985m8718K5633N9592P1797k1304J9390P060j2781Q826
$$ 728474 742971 781813 761828 713110 738743 798335 870132 848828 868218 875278 862497 871323
7078H71323N1223J7018k3398M4798P5958Q246k7777J2812K8154O278J075M9028
$$ 871323 922546 939564 916166 960964 1036922 1045168 1017391 1030203 1058357 1064635 1065710 1114738
7066A114738J4650j4904J4353N6732m8787R845K3815m7238M063o4406j8446M3542
$$ 1114738 1129388 1114484 1128837 1185569 1136782 1146627 1170442 1123204 1127267 1062861 1044415 1087957
7054A087957k7184l0343k6033n7524j00926m934l2128l3937p0895j9938K3358
$$ 1087957 1060773 1030430 1004397 946873 845947 841013 808885 774948 704053 684115 707473
7043G07473j26144n1590M470K6070l6773o8557j057k300o392N0739M524k8643
$$ 707473 581329 529739 534209 560279 523506 454949 453892 451592 445200 495939 500463 471820
7031D71820l4701o290L254m4472M6637K0789J5948n414O5196M4671m2823R04M0302
$$ 471820 437119 430829 434083 389611 436248 457037 472985 467571 532767 577438 534615 535519 575821
7018E75821M1417l5822K1744L4061O725R1l44m8127j1893m176m1305n2098K3325
$$ 575821 617238 581416 603160 637221 643946 644037 643693 595566 583673 579497 538192 486094 509419
7005E09419k4710j2953m0889j8300n2798M1327J7887k3164p888l2241K8306l1460
$$ 509419 484709 471756 430867 412567 359769 401096 418983 395819 387931 355690 383996 352536
6993C52536l5108M0790j4192m6461O9995o094l2036k1101L6933k1797p368O909
$$ 352536 317428 358218 344026 297565 367560 361466 329430 308329 345262 323465 316097 323006
6981C23006R0011m2284l5955M1204L6701R3560j952J7203k0964K2262J25481M8712
$$ 323006 413017 370733 334778 375982 412683 506243 504291 521494 500530 522792 648273 696985
6969F96985J27498O2656O6890N3882P7217j9202m1875K5247J1667N3108l6274
$$ 696985 824483 887139 954029 1007911 1085128 1065926 1024051 1049298 1060965 1114073 1077799
6958A077799j01018k3851r9161o7224r7360j15967l6215J0575p458n0917m296
$$ 1077799 976781 952930 853769 786545 689185 573218 537003 547578 540120 489203 484907
6947D84907k1025m3455k8074L7368j8784j012L0139l7418l2824L2270K3812K5649
$$ 484907 463882 420427 392353 429721 410937 409925 440064 402646 369822 402092 425904 451553
6935D51553N6151J8841L3371n6742Q974l535n4236P0938N3374K4738p86k7776
$$ 451553 507704 526545 559916 503174 512148 508613 454377 525315 578689 603427 602641 574865
6923E74865J1705K1011M064L4752J6594O3362K812l6303N2239Q1434N2823P971
$$ 574865 586570 607581 611645 646397 662991 726353 729165 692862 745101 826535 879358 887329
6911H87329r196M5490J01128J18098M4398M0453J19767K2997j3483L346N4019
$$ 887329 878133 923623 1024751 1142849 1187247 1227700 1347467 1370464 1356981 1360327 1414346
6900A414346L054M2700K4271k4840m2696n186n1065n063M4992l3524J5042k4185
$$ 1414346 1417400 1460100 1484371 1459531 1416835 1411649 1360584 1355521 1400513 1366989 1382031 1357846
6888A357846R413P9869K0212l5369M8721k3096J2782k5138K8150o8589l8598l2159
$$ 1357846 1367259 1447128 1467340 1431971 1480692 1457596 1470378 1445240 1473390 1404801 1366203 1334044
6876A334044p056n2311j8917m6010o5664j5317m845q935K9080m2217k9156k7475
$$ 1334044 1326988 1274677 1255760 1209750 1144086 1128769 1123924 1114989 1144069 1101852 1072696 1045221
6864A045221p033j1550M8571O7146K3026k846L4149N9220O2256O6944J6310k7602
$$ 1045221 1038188 1026638 1075209 1142355 1165381 1162535 1196684 1255904 1318160 1385104 1401414 1373812
6852A373812M4212O8440J7447R056N1648O6503M0941M3756l4695J2320k3799O3141
$$ 1373812 1418024 1486464 1503911 1512967 1564615 1631118 1672059 1715815 1681120 1693440 1669641 1732782
6840A732782j0056r7774k4246J3264o7000m2654o2496J2879k2845j9778K707n599
$$ 1732782 1722726 1624952 1600706 1613970 1546970 1504316 1441820 1454699 1431854 1412076 1414783 1409184
6828A409184r3350M2212N0578l1347M770J9832J530L0361r1957j8765o1219j309
$$ 1409184 1315834 1358046 1408624 1377277 1382047 1401879 1403409 1433770 1341813 1323048 1261829 1260520
6816A260520m922k4783K3705l0599n9022j4374N2640m033p91P164K8105l523M018
$$ 1260520 1255598 1230815 1254520 1223921 1164899 1150525 1203165 1199132 1198341 1205505 1233610 1230087 1234105
6803A234105K6106J669l6734J7488m736J7090K5316L4491q357M527O1808K7466
$$ 1234105 1260211 1261880 1225146 1242634 1237898 1254988 1280304 1314795 1306438 1310965 1372773 1400239
6791A400239M8623N5457M9043O2068P2808J01503Q2419O6302R0665L5854n1777
$$ 1400239 1448862 1504319 1553362 1615430 1688238 1789741 1872160 1938462 2029127 2064981 2013204
6780B013204n6258o1438k4380o252k0834p3751j30760j71092j17776p6598q8584
$$ 2013204 1956946 1895508 1871128 1864876 1844042 1770291 1639531 1468439 1350663 1274065 1185481
6769A185481j6959m0309p6099m5040J224M693n6150l3655m1598k4218p620L6516
$$ 1185481 1168522 1128213 1052114 1007074 1008298 1012991 956841 923186 881588 857370 849750 886266
6757H86266m6178L9903j7963n7293l5619J6631M8231q540N1949M0199J811N8415
$$ 886266 840088 879991 862028 804735 769116 785747 833978 825438 877387 917586 919397 977812
6745I77812P7113P4121J5748n5540j5906K2531j8213J0573j1026m1850o0657r1683
$$ 977812 1054925 1129046 1144794 1089254 1073348 1095879 1077666 1088239 1077213 1035363 974706 883023
6733H83023j13773j22427p2992o013p5485m1263n0572R988K11l3791Q97k2998
$$ 883023 769250 646823 573831 567818 492333 451070 400498 410486 410697 376906 377803 354805
6721C54805L1825J0999l0792q823l9336J4480j4585m2297q133m3094R862j5760
$$ 354805 386630 397629 366837 358014 318678 333158 318573 276276 268143 225049 234911 219151
6709B19151L4849m1089J435N3985J8447O693r2422k6489Q5921M4595o0572K3271
$$ 219151 254000 212911 214346 268331 286778 293471 201049 174560 260481 305076 244504 267775
6697B67775N0534n1401O4771J292K6576L248P9882J10302k1875l6134p8056q7706
$$ 267775 318309 266908 331679 332971 359547 362795 442677 552979 531104 494970 416914 329208
6685C29208j8103j2018K6961J3639n1683j6142l5007K6498j767j7296l103k256
$$ 329208 311105 299087 326048 339687 288004 271862 236855 263353 261586 244290 241187 238931
6673B38931n2443N9675K6317K9705k5845Q355M3385k4391k4918k5640j053j7724
$$ 238931 186488 246163 272480 302185 276340 284695 328080 303689 278771 253131 252078 234354
6661B34354M5609k6965O851r581j2672j9331j3040N3985P1716m0096K7035j2191
$$ 234354 279963 252998 259849 250268 237596 218265 205225 259210 330926 290830 317865 305674
6649C05674o0348m6220M180L0200P326l9960l3132J0590j7623J238K6894j4940
$$ 305674 245326 199106 203286 233486 240812 200852 167720 178310 160687 161925 188819 173879
6637A73879o0051m5362M9623p940J4047L345m5310p387m6857Q93L0556k5166o299
$$ 173879 113828 68466 118089 110149 124196 127541 82231 74844 27987 28880 59436 34270 27971
6624B7971j528j6375K5372N3634L078j9118J0612j5349n8825M065K0132M4525
$$ 27971 26443 10068 35440 89074 92152 73034 83646 68297 9472 13537 33669 78194
6612G8194l8144J0307K6555k2914K298K5546l6434k7407j9499K6857N151Q322
$$ 78194 40050 50357 76912 53998 56296 81842 45408 18001 -1498 25359 30510 38832
6600C8832L8564k2577J1388q9119L899M2103m365j7204k6470K0877j5412J4557
$$ 38832 77396 54819 66207 -22912 -19013 23090 18725 1521 -24949 -4072 -19484 -4927
6588d927l60M9263K067m4320M2150q567p0960J6687N4866r141k4053J1116K9897
$$ -4927 -5287 43976 46043 1723 43873 35306 -35654 -18967 35899 26758 2705 13821 43718
6575D3718p7212P453J6723k2090K1943L289P597Q370j9562K9468l5725l131p2142
$$ 43718 -33494 -26041 -9318 -31408 -9465 -6176 1421 9791 -9771 19697 -16028 -19159 -91301
6562i1301l5423Q3119K4098M5614l1169j8623J6718n7070j5843N9557n150L4768
$$ -91301 -126724 -43605 -19507 26107 -5062 -23685 -6967 -64037 -79880 -20323 -25473 9295
6550I295r879j7162q63j3585l0118L8202L762q1468K6148K5587M7469K0503P257
$$ 9295 -584 -17746 -18609 -32194 -62312 -24110 -20348 -101816 -75668 -50081 -2612 17891 25148
6537B5148l8752k8158j0844N0930k0003m9045O3746J8968m6823N0411n673m084
$$ 25148 -13604 -41762 -52606 -1676 -21679 -70724 -6978 11990 -34833 15578 9905 5821
6525E821J2761M7470m9196l0738J3118L0433k8921P086J3857M103j7980o623j5720
$$ 5821 18582 66052 16856 -13882 -764 29669 748 7834 21691 25794 7814 1191 -14529
6512a4529Q74K7709M3166j1673k4392J4495m9089o6455N0584J6347J4614L0803
$$ -14529 -13655 14054 57220 45547 21155 35650 -13439 -79894 -29310 -12963 1651 32454
6500C2454K5542k8766Q629m5094K7748o3306K3307M114k6448K5814O1678m4669
$$ 32454 57996 29230 37859 -7235 20513 -42793 -19486 -15372 -41820 -16006 45672 1003
6488A003n6250Q397M2425L6278p5057L4801k4579L4548k1150L8011k4769K6854
$$ 1003 -55247 -46850 -4425 31853 -43204 -8403 -32982 1566 -19584 18427 -6342 20512
6476B0512N54l1234J4317k2033j2943L8289l613r145j1335L8895o0004K762k1954
$$ 20512 21066 -10168 4149 -17884 -30827 7462 3849 -5296 -16631 22264 -37740 -34978 -56932
6463e6932j5289K5068N1925l961m73r946J6583n4220K1840N1856k6867k1158p511
$$ -56932 -72221 -47153 4772 811 338 -9608 6975 -47245 -25405 26451 -416 -21574 -29085
6450b9085l2569M1563k729k8541L477M3342Q234n9323j1219K9076k1904O6615
$$ -29085 -61654 -20091 -22820 -51361 -47884 -4542 3692 -55631 -66850 -37774 -59678 6937
6438F937N143m9998K5676J589J8325J2288n959l1793L0143l2975J4141K1343l8146
$$ 6937 12080 -37918 -12242 -10653 7672 19960 14001 -17792 12351 -20624 -6483 14860 -23286
6425b3286M0255N0686l467k4078k0215j218L3361m1547l7449M5796J9626n2311
$$ -23286 16969 67655 64188 40110 19895 18677 52038 10491 -26958 18838 38464 -13847
6413a3847k2003K3540k1770J0174J8985J7510J2826n2263M0205L163k8871K0179
$$ -13847 -35850 -12310 -34080 -23906 -4921 12589 25415 -26848 13357 16520 -12351 7828
6401G828J915N5804J6286J7017R050J1577M6023J396o7692k5752l0432J127J5976
$$ 7828 9743 65547 81833 98850 107900 119477 165500 166896 99204 73452 43020 44147 60123
6388F0123j7335J3609K2167l6073o686m2098J8556l0432j2648M4928p082J6079
$$ 60123 42788 56397 78564 42491 35805 -6293 12263 -18169 -30817 14111 7029 23108
6376B3108M0679j0436m8330j9365k929l525l4194o454K3427p754K631k3790L8378
$$ 23108 63787 53351 5021 -14344 -17273 -20798 -54992 -61446 -38019 -45773 -43142 -66932 -28554
6363b8554p568k2078M8831J8498k8595m4803L2570j9445k5068n646N7414K4665
$$ -28554 -36122 -58200 -9369 9129 -19466 -64269 -31699 -51144 -76212 -81858 -24444 221
6351B21l432j9661N238l3540M6968j875J3812K8758l3623J4328j4149K5293n6852
$$ 221 -3211 -22872 -17634 -51174 -4206 -6081 7731 36489 2866 17194 3045 28338 -28514
6338b8514n663M2959l2116K8141N1085j284p5051j7999O3282L9879o3480j0297
$$ -28514 -34177 8782 -23334 4807 55892 54608 -20443 -38442 24840 64719 1239 -9058
6326i058M166l1645N7341k7977r313J8137j138K045K0907n484m1229K0865N5j81
$$ -9058 -4892 -36537 20804 -7173 -16486 1651 513 2558 23465 17981 -23248 -2383 -2328 -2509
6312b509p578K456J2467J4171L444N266k3026k0601l1405M3692M8722k0098n3452
$$ -2509 -10087 -7631 4836 19007 22451 27717 4691 -15910 -47315 -3623 45099 25001 -28451
6299b8451Q11N0636L963M497O1989j4524o9763N3936l4714K8930J09M2870p2916
$$ -28451 -27640 22996 26959 31456 93445 78921 9158 63094 28380 57310 57419 100289 27373
6286B7373J9029M4011j0784j0719o7028K3543l013L4399K1470k934K3645J1926
$$ 27373 46402 90413 79629 68910 1882 25425 22412 56811 78281 75347 98992 110918
6274A10918p6935O9762L1142o0905K9524m479j8325L8249k9132P858J8234j9961
$$ 110918 33983 103745 134887 73982 103506 99027 80702 118951 89819 97677 115911 95950
6262I5950M8410J0946K8180L485k9015j3859L1991K8320M798L945J4424m92L6363
$$ 95950 144360 155306 183486 186971 157956 144097 176088 204408 209206 213151 227575 227083 263446
6249B63446K5469K232J6179K1597J6985k8638n426L3458k7367Q1999k6509P6103
$$ 263446 288915 291147 307326 328923 345908 317270 311844 345302 317935 399934 373425 449528
6237D49528K0353k34N3380q922L3079L3979l236M8959N8442L8667K1724N1114
$$ 449528 469881 469647 523027 514105 547184 581163 577927 626886 685328 723995 745719 796833
6225G96833N2308J2145p34N2310L1908O9173L8934Q7636J4479J10434J78349J47001
$$ 796833 849141 861286 860552 912862 944770 1013943 1052877 1140513 1154992 1265426 1443775 1590776
6213A590776J37607J08541J39149P2753l3589j33464j42996j49908j17587q3405
$$ 1590776 1728383 1836924 1976073 2048826 2015237 1881773 1738777 1588869 1471282 1387877
6203A387877j42408j07749q4773j43596q2792j52178J2043o4522r0937n320M8811
$$ 1387877 1245469 1137720 1052947 909351 826559 674381 686424 621902 530965 525645 574456
6192E74456o6556m64m3426l6106m5360k3129O899O221k320l6157k6290K1111q886
$$ 574456 507900 507436 464010 427904 382544 359415 366314 372535 370215 334058 307768 328879 319993
6179C19993m4361L0320p670j8199L2717j6287p86n282k322k7k5818O0797n206
$$ 319993 275632 305952 298282 280083 312800 296513 295727 290445 288123 288096 262278 323075 317869
6166C17869N797M0353p9612K2148p013R73K7161M2315K185l116K6904k5357K6823
$$ 317869 323666 364019 284407 306555 299542 300515 327676 369991 372176 369060 395964 370607 397430
6153C97430k2638M341L8677M5120O8555M2114J8163N5967J1381m1617L1688K7068
$$ 397430 374792 379133 417810 462930 531485 573599 591762 647729 659110 617493 649181 676249
6141F76249K1036p3674O5640k7753l8484J1288J1690m939k3627O6122p079R747
$$ 676249 697285 623611 689251 661498 623014 634302 645992 641053 617426 683548 676469 686216
6129F86216L6834P7597O1171L0204R883J1740L6460n2194p0147l0824Q298j6806
$$ 686216 723050 800647 861818 892022 901905 913645 950105 897911 827764 796940 805238 788432
6117G88432K8651M898k6767l6528m1969J7512j8235k9976j0065N9043k2346J9425
$$ 788432 817083 821981 795214 758686 716717 734229 715994 686018 675953 734996 712650 732075
6105G32075n822k3203M0109k4459m1684k4653k8563r6951P07P664R846l458L8298
$$ 732075 726253 703050 743159 718700 677016 652363 623800 526849 527556 535220 545066 541608 579906
6092E79906k0763l5758J1591k6351N084k4285J020J7706Q802J1347j8652l80P4120
$$ 579906 559143 523385 534976 508625 513709 489424 490444 508150 516952 528299 509647 509267 583387
6079E83387N0796j420L601K7354K2881J3335k4559N7147K4885L1674O887k5606
$$ 583387 634183 632763 636364 663718 686599 699934 675375 732522 757407 789081 795968 770362
6067G70362L6737N3685l0709j653P5191N4548M4607j0472L9462N9434M8065J3698
$$ 770362 807099 860784 830075 828422 903613 958161 1002768 992296 1031758 1091192 1139257 1152955
6055A152955P4375L0661N143Q2826J07807N1583L812R8549J3849J3189M3207Q3123
$$ 1152955 1227330 1257991 1263134 1345960 1453767 1505350 1509162 1607711 1621560 1634749 1677956 1761079
6043A761079Q0937M0256L0211K1554N0527M9579N2850O2529K2375O0022k0678
$$ 1761079 1842016 1882272 1912483 1934037 1984564 2034143 2086993 2149522 2171897 2231919 2211241
6032B211241N9536N8971P4980M2710Q3640Q6014M5333Q1148M2622K4196n808o628
$$ 2211241 2270777 2329748 2404728 2447438 2531078 2617092 2662425 2743573 2786195 2810391 2804583 2797955
6020B797955R459R1285Q5965J4172M9051M5529J45766O6047J33036J12036J02786
$$ 2797955 2807414 2898699 2984664 2998836 3047887 3093416 3239182 3305229 3438265 3550301 3653087
6009C653087P7386j29N7383j1353l9344P1603K8652k8103J0241O4856J38478J06984
$$ 3653087 3730473 3730344 3787727 3776374 3737030 3808633 3837285 3809182 3819423 3884279 4022757 4129741
5997D129741R7099J17899J37377O3746j4882r322j2567n8984p5853q6169q4238
$$ 4129741 4226840 4344739 4482116 4545862 4530980 4521658 4509091 4450107 4374254 4288085 4203847
5986D203847m0999R049L4218K494k2581L9295J8862K6872K7335j00876l9585q4570
$$ 4203847 4162848 4171897 4206115 4208609 4186028 4225323 4244185 4271057 4298392 4197516 4157931 4073361
5974D073361r9428q7422p3200j72233j43591n2691p3706q2520j03383q9458o5825
$$ 4073361 3973933 3886511 3813311 3641078 3497487 3444796 3371090 3288570 3185187 3095729 3029904
5963C029904n6749k3220o5052q9020q3989o5130j02863q2062l4160r1283n0521
$$ 3029904 2973155 2949935 2884883 2795863 2711874 2646744 2543881 2461819 2427659 2336376 2285855
5952B285855m8028m6238r4285m8802m5565l2222q4415q2372k4088k8425r6506
$$ 2285855 2237827 2191589 2097304 2048502 2002937 1970715 1886300 1803928 1779840 1751415 1654909
5941A654909m6217l9791j9407p6572n9100p4020k8733k8978n7340k8457j7257
$$ 1654909 1608692 1568901 1549494 1472922 1413822 1339802 1311069 1282091 1224751 1196294 1179037
5930A179037l7118n8282O299J5774l5097m502p4284k0333N6760l1112K405k4310
$$ 1179037 1141919 1083637 1089936 1105710 1070613 1066111 991827 971494 1028254 997142 999547 975237
5918I75237m1340k6951k142L8000m9431N1675m452k7023R749k733m7012J248K7974
$$ 975237 933897 906946 904804 942804 893373 945048 940596 913573 923322 920589 873577 874825 902799
5905I02799L698n118O1302O534m0100k5338o4037P1700N0466J0515M3267M339
$$ 902799 906497 901379 962681 969215 929115 903777 839740 911440 961906 972421 1015688 1020027
5893A020027N319k7411J2446r47L1096n234N672J7747K4359O5072O4452K5007
$$ 1020027 1025346 997935 1010381 1009434 1040530 1035296 1040968 1058715 1083074 1148146 1212598 1237605
5881A237605j9481n6509P6913K6468K1458P9106l667o213J2978k2246J3346J0436
$$ 1237605 1218124 1161615 1238528 1264996 1286454 1365560 1361893 1355680 1368658 1346412 1359758 1370194
5869A370194J6141N0862j0906N2312J8957N4917L3899j0264O522K9919L6800j813
$$ 1370194 1386335 1437197 1426291 1478603 1497560 1552477 1586376 1576112 1582634 1612553 1649353 1647540
5857A647540j7028m1283N2015j3324k1834q169q243K8501K6039k3424K8114J7149
$$ 1647540 1630512 1589229 1641244 1627920 1606086 1597917 1589674 1618175 1644214 1620790 1648904 1666053
5845A666053l2685n1375n7221M2039n6755L3256o9511j3121o4644p9781l894l200
$$ 1666053 1633368 1581993 1524772 1566811 1510056 1543312 1473801 1460680 1396036 1316255 1312361 1309161
5833A309161p9996n5327k3518k289j1506o7050N003k4980j04792k3649P547j1350
$$ 1309161 1229165 1173838 1150320 1148031 1136525 1069475 1074478 1049498 944706 921057 928604 917254
5821I17254j7986r743k1448q5141k4l3993l1538n8949l951M6823l3684k2391L1816
$$ 917254 899268 889525 868077 782936 782912 748919 717381 658432 654481 701304 667620 645229 677045
5808F77045l7569m6239M4015m074n8988L2506J698n7572k9057M4344l2814n1449
$$ 677045 639476 593237 637252 633178 574190 606696 608394 550822 521765 566109 533295 481846
5796D81846j4943k2737M2590m0680K0296J326n667L4249p605P219l1742M079J2238
$$ 481846 466903 444166 486756 446076 466372 467698 462031 496280 488675 495894 464152 468231 480469
5783D80469p2093L8842K188k8707J3302k479m1796K3499J4557j1039K0177l535
$$ 480469 408376 447218 449406 420699 434001 431522 389726 413225 427782 416743 436920 433385
5771D33385P714N5292R893n9528k7436M9878N5783L2959n2073j6065m8163P388
$$ 433385 441099 496391 506284 446756 419320 469198 524981 557940 505867 489802 441639 449027
5759D49027J6034m6184J4214L6027M069R35L4093K9890l5479m8140o1921M2782
$$ 449027 465061 418877 433091 469118 473187 474122 508215 538105 502626 454486 392565 435347
5747D35347P4919M8378n4269J9697O77J7849r569K7778o3487k1342K7923M2361
$$ 435347 510266 558644 504375 524072 524749 542598 533029 560807 497320 475978 503901 546262
5735E46262J3571m1241K9202p513P3118m1662j4218O760J5879j0385M9214p456
$$ 546262 559833 518592 547794 540281 613399 571737 557519 564279 580158 569773 618987 611531
5723F11531Q861L2163J1633k5242L2410N5452J6956P226q969K7646L6903K2815
$$ 611531 620392 652555 664188 638946 671356 726808 743764 750990 742021 769667 806570 829385
5711H29385m9606J0313P3233J8722N001L5317J7022k7447j6145M7114l784O0190
$$ 829385 779779 790092 863325 882047 887048 922365 939387 911940 895795 942909 939125 999315
5699I99315N5050j2563j6585m4752j1943m7772J7368M8647M3653N5339N9705Q1104
$$ 999315 1054365 1041802 1025217 980465 968522 920750 938118 986765 1030418 1085757 1145462 1226566
5687A226566L2387j6308k6653l6482j6144j4221o6194m2726K103k4062l1885M4175
$$ 1226566 1258953 1242645 1215992 1179510 1163366 1149145 1082951 1040225 1042328 1018266 986381 1030556
5675A030556L3491J5685N8655j8042M4632J2143R639k0944Q3495l1767O921P1182
$$ 1030556 1064047 1079732 1138387 1120345 1164977 1177120 1186759 1165815 1249310 1217543 1224464 1295646
5663A295646k2314n0965j2224L3199N4984J8246p025k8084R024j820J5512J9315
$$ 1295646 1273332 1222367 1210143 1243342 1298326 1316572 1309547 1281463 1290487 1288667 1304179 1323494
5651A323494J1114L8867N2546L2965J7350J2204j9362J00854O2253O1263J0259
$$ 1323494 1334608 1373475 1426021 1458986 1476336 1488540 1469178 1570032 1632285 1693548 1703807
5640A703807R7580R1009P3742J14438R3843O5714Q1144J17831P3461R6912N9279
$$ 1703807 1801387 1892396 1966138 2080576 2174419 2240133 2321277 2439108 2512569 2609481 2668760
5629B668760L7192M8127M7169K4695O8524k6745K2797O1553K6512P7705J06780
$$ 2668760 2705952 2754079 2801248 2825943 2894467 2867722 2890519 2952072 2978584 3056289 3163069
5618C163069J23998J62274J36982J41066R6241J89970J27783Q8109M9690k2599
$$ 3163069 3287067 3449341 3586323 3727389 3823630 4013600 4141383 4229492 4279182 4256583
5608D256583j18366j05192n1573n1202m0609J4953K1882J6961J22978R7608J15414
$$ 4256583 4138217 4033025 3981452 3930250 3889641 3904594 3926476 3943437 4066415 4164023 4279437
5597D279437J28156J20145J09061R5888R0715L2688M1835J0570K1442N1025M0751
$$ 4279437 4407593 4527738 4636799 4732687 4823402 4856090 4897925 4908495 4929937 4980962 5021713
5586E021713O9778K6703P2342L3372O6764P2795L6025R9520J30264Q5834R0252
$$ 5021713 5091491 5118194 5190536 5223908 5290672 5363467 5399492 5499012 5629276 5715110 5805362
5575E805362Q5747J22461J01779J09741Q8502P3560K2082L4461J0568L4419K7568
$$ 5805362 5891109 6013570 6115349 6225090 6313592 6387152 6409234 6443695 6454263 6488682 6516250
5564F516250N6643P5215L1119r702J882R763j6101o5859m0649l930n0256L908
$$ 6516250 6572893 6648108 6679227 6669525 6671407 6681170 6665069 6599210 6558561 6554631 6504375 6508283
5552F508283n2548o9635p2368p7921l1377j0996m2441j7978N4949L6294K9441
$$ 6508283 6455735 6386100 6313732 6235811 6204434 6193438 6150997 6133019 6187968 6224262 6253703
5541F253703K5541P514L0189M2715L2195o5202m1571q4937r6837j00441j17159
$$ 6253703 6279244 6286758 6316947 6359662 6391857 6326655 6285084 6200147 6103310 6002869 5885710
5530E885710r8296j03975j60858j00362j64544j18632o3082j16323m6108l2483
$$ 5885710 5787414 5683439 5522581 5422219 5257675 5139043 5075961 4959638 4913530 4881047
5520D881047k8267o0141m8431l1883q966J6764J7394k644P1001J08764M8716K1732
$$ 4881047 4852780 4792639 4744208 4712325 4703359 4720123 4737517 4734873 4805874 4914638 4963354 4985086
5508D985086J39348J23586J57383J74253J54155J63093K74902K26045K06793K39111
$$ 4985086 5124434 5248020 5405403 5579656 5733811 5896904 6171806 6397851 6604644 6843755
5498F843755K06782J79974K09086K00782J17818J05840J04946P4706Q7508R7219
$$ 6843755 7050537 7230511 7439597 7640379 7758197 7864037 7968983 8043689 8131197 8228416
5488H228416L7278Q2734O1731n079L3938p4858q2326j84362p2019j67654j58180
$$ 8228416 8265694 8348428 8410159 8405080 8439018 8364160 8281834 8097472 8025453 7857799 7699619
5477G699619j93654j91581j03517o8130k3304k7009j6827O974k52K9370K4385
$$ 7699619 7505965 7314384 7210867 7142737 7119433 7092424 7075597 7082571 7082319 7111689 7136074
5466G136074k2185j15157j26692j63148j06632j35120j48282q9343j13994r2069
$$ 7136074 7113889 6998732 6872040 6708892 6602260 6467140 6318858 6229515 6115521 6023452
5456F023452n6897m5481R276M3228J7270k5938o127J0492j1852K601r9777j16096
$$ 6023452 5966555 5921074 5930350 5973578 5990848 5964910 5958783 5969275 5957423 5960024 5860247 5744151
5444E744151p2619r9702j36563j10772q6274j77019r8032m8546p6810n7669r6882
$$ 5744151 5671532 5571830 5435267 5324495 5238221 5061202 4963170 4914624 4837814 4780145 4683263
5433D683263j14478q4930o3521p2359j00921p7859q8572o2745m2778j00077o0996
$$ 4683263 4568785 4483855 4420334 4347975 4247054 4169195 4080623 4017878 3975100 3875023 3814027
5422C814027l4470j21822j30380j48927o2192j02542j33716p9753j34936J9152
$$ 3814027 3779557 3657735 3527355 3378428 3316236 3213694 3079978 3000225 2865289 2884441
5412B884441j22559j03202p0512j4405j02088m9689m7987p9514m0036j8731j01928
$$ 2884441 2761882 2658680 2588168 2573763 2471675 2421986 2373999 2294485 2254449 2235718 2133790
5401B133790l0156l1406l3823o9780Q040O278L646m9828l6634k7170K7602o1895
$$ 2133790 2103634 2072228 2038405 1968625 1976665 1982943 1986589 1936761 1900127 1872957 1900559 1838664
5389A838664P3098j4932j7497n133m4861O2779j891o9924J0190q806M100O7650
$$ 1838664 1911762 1896830 1879333 1874200 1829339 1892118 1890227 1820303 1830493 1821687 1825787 1893437
5377A893437N4058P515O363k5880P642m5381k9823j5780q3805K1316o0206n1679
$$ 1893437 1947495 1955010 1961373 1935493 1943135 1897754 1867931 1852151 1768346 1789662 1729456 1677777
5365A677777n6968m3483R704k6751j4283l2694k1059j6243M2453k3156j1917O810
$$ 1677777 1620809 1577326 1587030 1560279 1545996 1513302 1492243 1476000 1518453 1495297 1483380 1490190
5353A490190N9945n6968l5515K4250k8661M3516j2460j9128q7959j8054k5517
$$ 1490190 1550135 1493167 1457652 1481902 1453241 1496757 1484297 1465169 1377210 1359156 1333639
5342A333639K1376k6671n936l047O5736m4028l5161M786K1329O5839L5153j1974
$$ 1333639 1355015 1328344 1322408 1319361 1385097 1341069 1305908 1310694 1332023 1397862 1433015 1421041
5330A421041m0106L2440J2320K7902K8799n4688p4664O1540K1462L3739L281l6274
$$ 1421041 1380935 1413375 1425695 1453597 1482396 1427708 1353044 1414584 1436046 1469785 1473066 1436792
5318A436792k293K4957O6409J24960N1319M4496P7874O3995M5114Q0659J06597
$$ 1436792 1434499 1459456 1525865 1650825 1702144 1746640 1824514 1888509 1933623 2014282 2120879
5307B120879J35585K22600K65861K79652J53692M8274j63832k40035k30707j67908
$$ 2120879 2256464 2479064 2744925 3024577 3178269 3226543 3062711 2822676 2591969 2424061
5297B424061r2780j35705j1471j1754Q770l245n4628L7855M0966Q5980M7079N3167
$$ 2424061 2331281 2195576 2184105 2172351 2181121 2177876 2123248 2161103 2202069 2288049 2335128 2388295
5285B388295J27432K30708K24342J97935J26906J28241j11083j80370k08699k39596
$$ 2388295 2515727 2746435 2970777 3168712 3295618 3423859 3312776 3132406 2923707 2684111
5275B684111k02112o5298q9318k8286n8190o95j2636n6956J6458J0331J2912l7651
$$ 2684111 2481999 2416701 2327383 2299097 2240907 2240212 2227576 2170620 2187078 2197409 2210321 2172670
5263B172670J144l0571o1819O143L7224l8926n344N9949M4233q851L8732m9414
$$ 2172670 2173814 2143243 2081424 2087567 2124791 2085865 2080521 2140470 2184703 2175852 2214584 2165170
5251B165170j3243J14117J07182L0894J7154M8002o707k9027k0201L2741L9562
$$ 2165170 2151927 2266044 2373226 2404120 2421274 2469276 2462569 2433542 2413341 2446082 2485644
5240B485644L5030q7675k0109L6033j314n2251M7463M2634J6239J8717j3319N7519
$$ 2485644 2520674 2432999 2412890 2448923 2447609 2395358 2442821 2485455 2501694 2520411 2507092 2564611
5228B564611J05325J4364K6857M0720J1109K3714M2498N2807K2229K2433J1344
$$ 2564611 2669936 2684300 2711157 2751877 2762986 2786700 2829198 2882005 2904234 2926667 2938011
5217B938011p287K3622N9633J6620j2992J2643J423M1164J2899M2431N7437Q7648
$$ 2938011 2930724 2954346 3013979 3030599 3017607 3030250 3031673 3072837 3085736 3128167 3185604 3273252
5205C273252P7961R7103J49642J37217O8043O9815m936k425J055m024l0557L1314
$$ 3273252 3351213 3448316 3597958 3735175 3803218 3873033 3868097 3865672 3866727 3862703 3832146 3863460
5193C863460k2401O5210o3086n0396j5041l9296J91O2352J21171J16239N7822
$$ 3863460 3841059 3906269 3843183 3792787 3777746 3738450 3738641 3800993 3922164 4038403 4096225
5182D096225R4047J28457J14345R5185J13139J24559O3645J79466M9420j1020
$$ 4096225 4190272 4318729 4433074 4528259 4641398 4765957 4829602 5009068 5058488 5047468
5172E047468N7217N3260R3452m8667L6737R3127L7294P1204J73321J23554J22381
$$ 5047468 5104685 5157945 5251397 5202730 5239467 5332594 5369888 5441092 5614413 5737967 5860348
5161E860348J95166J24011R1944J55415J33712J08079J20382J28649J58335J00940
$$ 5860348 6055514 6179525 6271469 6426884 6560596 6668675 6789057 6917706 7076041 7176981
5151G176981J36617J61012J90113J38321J96017J62303K39888K07471K85117L23834
$$ 7176981 7313598 7474610 7664723 7803044 7999061 8161364 8401252 8608723 8893840 9217674
5141I217674L88900L69977M35531L71368M69479M52958M96831O29317O08212O47459
$$ 9217674 9606574 9976551 10412082 10783450 11252929 11705887 12202718 12832035 13440247 14087706
5131A4087706P86135Q35529R69665J008093P83781M02650J30993N9519M3673N9897
$$ 14087706 14873841 15709370 16679035 17687128 18470909 18873559 19004552 19064071 19107744 19167641
5121A9167641J75840L05173M59073M72226N71179M28201N80499M59261N61694
$$ 19167641 19343481 19648654 20107727 20579953 21151132 21579333 22159832 22619093 23180787
5112B3180787O55273Q14231Q66577J033063J052604J167406J181439J395397J218709
$$ 23180787 23836060 24650291 25516868 26549931 27602535 28769941 29951380 31346777 32565486
5103C2565486J248135J135115J128037J152270J257688J378681J613170J676837
$$ 32565486 33813621 34948736 36076773 37229043 38486731 39865412 41478582 43155419
5095D3155419J850095J948143K069428K075442K132937K059424K350789K442893
$$ 43155419 45005514 46953657 49023085 51098527 53231464 55290888 57641677 60084570
5087F0084570L087389L451600M253956N048491O157906P223986Q390567R310597
$$ 60084570 63171959 66623559 70877515 75926006 82083912 89307898 97698465 107009062
5079A07009062J0781674J2654646J4952648J7965065K2191576K8488654L8223049
$$ 107009062 117790736 130445382 145398030 163363095 185554671 214043325 252266374
5072B52266374M7171341M2013303K3215642j0754051l7869661n0075920m5756157
$$ 252266374 299437715 341451018 364666660 353912609 316042948 265967028 220210871
5065B20210871l2377536k2170075j5300310j1440204p301779m479961j479347
$$ 220210871 187833335 165663260 150362950 138922746 131620967 127141006 125661659
5058A25661659L31028K713459M644069P321794Q925853J2515049J5839461K2022862
$$ 125661659 125992687 128706146 133350215 140672009 149597862 162112911 177952372 199975234
5050A99975234K9699868M0455406L7026650K6733937M262542k6007481m0562292
$$ 199975234 229675102 270130508 307157158 333891095 338153637 312146156 271583864
5043B71583864m8400130m1069120l0663077k1586331j6640511j3227077j0603451
$$ 271583864 223183734 182114614 151451537 129865206 113224695 99997618 89394167
5036H9394167q216996o937992n634894m825791m000624l845858l485320l508142
$$ 89394167 81177171 74239179 68604285 63778494 59777870 55932012 52446692 48938550
5028D8938550l282108k863922k483213k233612j931036j667990j348220j248725
$$ 48938550 45656442 42792520 40309307 38075695 36144659 34476669 33128449 31879724
5020C1879724j209929j180638j162485j043944q83464q49537p95998o85666o70445
$$ 31879724 30669795 29489157 28326672 27282728 26399264 25549727 24753729 24068063 23397618
5011B3397618o69880o79798o01127o25056n91318n12318m07329m69680n69525
$$ 23397618 22727738 22047940 21446813 20821757 20230439 19718121 19310792 18841112 18271587
5002A8271587o25241n84886p00310n01578n75044n26671n15822n13774m83399
$$ 18271587 17646346 17061460 16361150 15859572 15284528 14757857 14242035 13728261 13244862
4993A3244862l98572m17558k63954l37071l00473k37085k85493k70741k40004
$$ 13244862 12846290 12428732 12164778 11827707 11527234 11290149 11004656 10733915 10493911
4984A0493911k37000j47049j84521j46017j63007j61333j49248r3433j68906j36284
$$ 10493911 10256911 10109862 9925341 9779324 9616317 9454984 9305736 9212303 9043397 8907113
4974H907113k12133j81042j74179j56786k36042r9810k61826j91734j90188k30674
$$ 8907113 8694980 8513938 8339759 8182973 7946931 7847121 7585295 7393561 7203373 6972699
4964F972699k41162n8521j00408j21791j57641j27092j65657j24003p6597k8396
$$ 6972699 6731537 6673016 6572608 6450817 6293176 6166084 6000427 5876424 5799827 5771431
4954E771431n4255o5985q4159j24093j50150m2306j51359j61429j27258k8697
$$ 5771431 5717176 5651191 5567032 5442939 5292789 5250483 5099124 4937695 4810437 4781740
4944D781740r6668j9578o0009k7768p8285J2775K8205k9341j6433J9950l5164
$$ 4781740 4685072 4665494 4605485 4577717 4499432 4512207 4540412 4511071 4494638 4514588 4479424
4933D479424p3965q2296K3729o9247m6087n3165o2409j03416j15851r7276k8057
$$ 4479424 4405459 4323163 4346892 4277645 4231558 4178393 4115984 4012568 3896717 3799441 3771384
4922C771384k8627K2811p2412m1817m4718k7239o7583K6310j9765M3797K6405
$$ 3771384 3742757 3765568 3693156 3651339 3606621 3579382 3511799 3538109 3518344 3562141 3588546
4911C588546L0383J4811K6982k153K0518m5660J6133J1331n0314j6688o3522J8050
$$ 3588546 3618929 3633740 3660722 3658569 3679087 3633427 3649560 3660891 3610577 3593889 3530367 3548417
4899C548417j1191l7332o7464m8563l6121j4351K5500M3267K3240o6151J6083
$$ 3548417 3537226 3499894 3432430 3383867 3347746 3333395 3358895 3402162 3425402 3359251 3375334
4888C375334K196J1206M1029m423K2619o8884j5042j0714K1640m3796n4422l0977
$$ 3375334 3377530 3388736 3429765 3425342 3447961 3379077 3364035 3353321 3374961 3331165 3276743 3245766
4876C245766k1600L1343l4629k5490L5437J0996K8581J8609M3088L5040P0609
$$ 3245766 3224166 3255509 3220880 3195390 3230827 3241823 3270404 3289013 3332101 3367141 3437750
4865C437750J3053N9906N3251M1568P7181R8245K0847J24008M8539L2933L7838
$$ 3437750 3450803 3510709 3563960 3605528 3682709 3780954 3801801 3925809 3974348 4007281 4045119
4854D045119N3067J24900P4272j3672Q5582J5599P2818R9688J16800L7195J13861
$$ 4045119 4098186 4223086 4297358 4283686 4369268 4384867 4457685 4557373 4674173 4711368 4825229
4843D825229J65010J75284J76704J95677J85836K49538K87170M50877K41876J04237
$$ 4825229 4990239 5165523 5342227 5537904 5723740 5973278 6260448 6711325 6953201 7057438
4833G057438l2236k28596l40462j73287j44381j94552j04895j01488r7034k3046
$$ 7057438 7025202 6796606 6456144 6282857 6138476 5943924 5839029 5737541 5640507 5617461
4823E617461m8930O384M2382L0792L2782J11465N584J32598J28899J88869K17965
$$ 5617461 5568531 5574915 5617297 5648089 5680871 5792336 5797920 5930518 6059417 6248286 6466251
4812F466251K80979K36796J76871j7534j36313j68423j61588r3417J915Q4465
$$ 6466251 6747230 6984026 7160897 7143363 7007050 6838627 6677039 6583622 6585537 6670002
4802F670002R8575P0145J8638Q62k07020k22322j93871k01972k09406r2259j07131
$$ 6670002 6768577 6838722 6857360 6858222 6651202 6428880 6235009 6033037 5823631 5731372 5624241
4791E624241q474L9306M938j9650J15223J48655J07833J68997K06835K46816P1791
$$ 5624241 5615767 5655073 5660011 5640361 5755584 5904239 6012072 6181069 6387904 6634720 6706511
4780F706511p5164j08096o8349q7683q5501m7860m0947l754o6860p872O2176Q0342
$$ 6706511 6631347 6523251 6454902 6367219 6281718 6233858 6192911 6189157 6122297 6114425 6176601 6256943
4768F256943R8655R5919J60419J46627J69664J10378J53175J07671J03499J29493
$$ 6256943 6355598 6451517 6611936 6758563 6928227 7038605 7191780 7299451 7402950 7532443
4758G532443R1064P3807P5153N3931n1732k9409k4046l029J01679R0005Q0810
$$ 7532443 7623507 7697314 7772467 7826398 7774666 7745257 7721211 7718182 7819861 7909866 7990676
4747G990676J36969J42391K04254J94108J87473J87145J35407J37874J51347J87856
$$ 7990676 8127645 8270036 8474290 8668398 8855871 9043016 9178423 9316297 9467644 9655500
4737I655500K16756K32334K90495K29736L87522L86066M64735N69999N70464N16688
$$ 9655500 9872256 10104590 10395085 10624821 11012343 11398409 11863144 12433143 13003607 13520295
4727A3520295O40891O13132P10812Q40797R26529J154639J297015J547991J845109
$$ 13520295 14161186 14774318 15485130 16325927 17252456 18407095 19704110 21252101 23097210
4718B3097210J952683K279406K661334L123263L687315M550352N583033O928769
$$ 23097210 25049893 27329299 29990633 33113896 36801211 41351563 46934596 53863365
4710E3863365Q366101Q389460M852786r74211o793365r867853r488757p571463
$$ 53863365 62229466 70618926 75471712 74497501 67704136 57836283 48347526 40776063
4702D0776063n753251m575073l680870k908789k399387j976525j717921j548961
$$ 40776063 35022812 30447739 26766869 23858080 21458693 19482168 17764247 16215286
4694A6215286j216223j030668q78762r68283p96786o86079o59495n80094m72763
$$ 16215286 14999063 13968395 13089633 12121350 11324564 10638485 9978990 9398896 8926133
4685H926133m17173l11234l03586k60992k11766k21034k73834k59867j47418k32206
$$ 8926133 8508960 8197726 7894140 7633148 7421382 7200348 6926514 6666647 6519229 6287023
4675F287023j95545j90377j37737q8947j46170k16445r9223j17014j43743j19793
$$ 6287023 6091478 5901101 5763364 5674417 5528247 5311802 5212579 5095565 4951822 4832029
4665D832029r7723j01164q1798r0148j35488j14645p2637j10354n4375j13796
$$ 4832029 4734306 4633142 4551344 4461196 4325708 4211063 4138426 4028072 3973697 3859901
4655C859901j60962k675j9066l6589k9533n5892N4775N2991q563M6564l0574M3034
$$ 3859901 3698939 3696264 3677198 3640609 3611076 3555184 3609959 3662950 3654387 3700951 3670377 3713411
4643C713411J3903r1216j9575L4815P7590K8245j7273m6764p6875j11049j12551
$$ 3713411 3727314 3636098 3616523 3651338 3728928 3757173 3739900 3693136 3616261 3505212 3392661
4632C392661j09759q3208o9086k0460m9942k0950k7708l4274j28197o68K6721
$$ 3392661 3282902 3199694 3130608 3110148 3060206 3039256 3011548 2977274 2849077 2848409 2875130
4621B875130j0947K3490m74k5828J9130M8391L4265P9784P5725N7061P3909J30759
$$ 2875130 2864183 2887673 2887199 2861371 2880501 2928892 2963157 3042941 3118666 3175727 3249636 3380395
4609C380395J41712J77596J36959K17820J96420J47159J30919P5661m7749m9837
$$ 3380395 3522107 3699703 3836662 4054482 4250902 4398061 4528980 4604641 4556892 4507055
4599D507055j21732r9504j44179R471L7199k6214k053o704p6596p0328j17972
$$ 4507055 4385323 4285819 4141640 4151111 4188310 4162096 4160043 4153339 4076743 4006415 3888443
4588C888443j11544j17568r7190l1723k5046j34447o1162p2685J8795M2194j843
$$ 3888443 3776899 3659331 3562141 3530418 3505372 3370925 3309763 3237078 3255873 3298067 3296224
4577C296224Q975O795J3375J14103Q5045N0134R0344P2261J26646J52904J13641
$$ 3296224 3305199 3311994 3325369 3439472 3524517 3574651 3664995 3737256 3863902 4016806 4130447
4566D130447J38475J94478J70854J68964K10530K63598K19971K51553K29155K11345
$$ 4130447 4268922 4463400 4634254 4803218 5013748 5277346 5497317 5748870 5978025 6189370
4556F189370J72581J22007K0042j2363n3693j10093j41427j43983o8377j02760
$$ 6189370 6361951 6483958 6504000 6491637 6437944 6327851 6186424 6042441 5974064 5871304
4546E871304q5420K5382k3513j0751k7695o3992r2800j14995j97601k20718j72355
$$ 5871304 5785884 5811266 5787753 5777002 5749307 5685315 5592515 5477520 5279919 5059201 4886846
4535D886846j95509k01931j84879j19993j31641p1246j12680j17877k0284m6103
$$ 4886846 4691337 4489406 4304527 4184534 4052893 3981647 3868967 3751090 3730806 3684703
4525C684703j11728n9274l8282k9134l1476j53810j37900j11889r8220j06767
$$ 3684703 3572975 3513701 3475419 3446285 3414809 3260999 3123099 3011210 2912990 2806223
4515B806223o2776p4753p8972l2584J1679l4747j6100p1677m3039K0093l1721
$$ 2806223 2743447 2668694 2589722 2557138 2568817 2534070 2517970 2446293 2403254 2423347 2391626
4504B391626n3785j8301O7699p1119P887j8029l9838K9476M331K8036k1519K2539
$$ 2391626 2337841 2319540 2387239 2316120 2324007 2305978 2266140 2295616 2299947 2327983 2306464 2329003
4492B329003K6627J2374j4775j3597J17985l9960K2603N9950M3453M6164K0310
$$ 2329003 2355630 2368004 2353229 2339632 2457617 2417657 2440260 2500210 2543663 2589827 2610137
4481B610137R4464K5647O4422P2203N6837K3462N1079J3595K0977L1527O813J15167
$$ 2610137 2704601 2730248 2794670 2866873 2923710 2947172 2998251 3011846 3032823 3064350 3071163 3186330
4469C186330j0976J19014J05221J18596J11539J81647J86005K20429J82585L19533
$$ 3186330 3175354 3294368 3399589 3518185 3629724 3811371 3997376 4217805 4400390 4719923
4459D719923L62384L88031M96418N16437N34461M43664J59432j42637l84057n88951
$$ 4719923 5082307 5470338 5966756 6483193 7017654 7461318 7620750 7478113 7094056 6505105
4449F505105o24930n55386m40226l73357k89179k56316j93093j26543j52473j65840
$$ 6505105 5880175 5324789 4884563 4511206 4222027 3965711 3772618 3646075 3493602 3327762
4439C327762n3407j63640l6558q4530m8610m0747o3919l9341M0568m4898J5594
$$ 3327762 3274355 3110715 3074157 2989627 2941017 2900270 2836351 2797010 2837578 2792680 2808274
4428B808274o0793l9795P076k9389O827L4217l4345n8717K8026P57l4409M2011
$$ 2808274 2747481 2707686 2714762 2685373 2692200 2726417 2692072 2633355 2661381 2662138 2627729 2669740
4416B669740o4365J4264l3999j67L1609j9738l3531J6246m2575l5957J6822j2957
$$ 2669740 2605375 2619639 2585640 2585473 2617082 2597344 2563813 2580059 2537484 2501527 2518349 2505392
4404B505392m1619J6940J0356M3782l5132J9799o772l9431N8002j9124R613j9292
$$ 2505392 2463773 2480713 2491069 2534851 2499719 2519518 2512746 2473315 2531317 2512193 2521806 2502514
4392B502514J2195J0530m5823K6589L9609Q0201M768j2314j6750n2342L3606K0862
$$ 2502514 2514709 2525239 2479416 2506005 2545614 2625815 2630583 2618269 2601519 2549177 2582783 2603645
4380B603645r356J3228P5453J9040q783L0242m2376m73K4439J7665L1446m325
$$ 2603645 2594289 2607517 2682970 2702010 2693227 2723469 2681093 2680620 2705059 2722724 2754170 2749845
4368B749845M8805m7340Q824R9709k1106M300P9824k0985K690N864Q5611K937
$$ 2749845 2798650 2751310 2760134 2859843 2838737 2843037 2922861 2901876 2904566 2910430 2996041 2998978
4356B998978N0063l2046N1858L4478K5336M3222K1301M9213L7018N163M0415O8704
$$ 2998978 3049041 3016995 3068853 3103331 3128667 3171889 3193190 3242403 3279421 3284584 3324999 3393703
4344C393703L0351J7957J7783Q3912J8779l362Q4779M1958l1090O5761Q5014K5920
$$ 3393703 3424054 3442011 3459794 3543706 3562485 3559123 3643902 3685860 3654770 3720531 3805545 3831465
4332C831465O4397K5106j1515Q3206L0599M5626J3579Q502O0146N65N3784N4647
$$ 3831465 3895862 3920968 3909453 3992659 4023258 4068884 4082463 4090965 4151111 4151676 4205460 4260107
4320D260107R7927J3036P7450K0419J7594N8583R4245P4712M7369L3372K1859
$$ 4260107 4358034 4371070 4448520 4468939 4486533 4545116 4639361 4714073 4761442 4794814 4816673
4309D816673J23809L0284R8491O8027O1218Q9625L1518P0122L4090Q0928K8674
$$ 4816673 4940482 4970766 5069257 5137284 5198502 5288127 5319645 5389767 5423857 5504785 5533459
4298E533459L4117N9015O8583M9777j7N9358L7429k334P1358K9598P4766O3065
$$ 5533459 5567576 5626591 5695174 5744951 5744934 5804292 5841721 5839387 5910745 5940343 6015109 6078174
4286F078174M5659P473N7720N7j008N3354m9728J7066N7201K4514L418Q981r762
$$ 6078174 6123833 6131306 6189026 6189083 6188075 6241429 6191701 6208767 6265968 6290482 6293900 6302881 6293119
4273F293119J4301K1730K0965L3200O7556J0348n5202L8830P8893Q564K7113L1138
$$ 6293119 6307420 6329150 6350115 6383315 6450871 6461219 6406017 6444847 6523740 6532304 6559417 6590555
4261F590555M4770k338P4524j4895k4676P6150J7337L7597J3081k4261J537P8736
$$ 6590555 6635325 6632987 6707511 6692616 6667940 6744090 6761427 6799024 6812105 6787844 6789381 6868117
4249F868117L9727k88n791L4985j6005l1252K0375l8963N0416L362o7090n481
$$ 6868117 6907844 6907556 6901765 6936750 6920745 6889493 6909868 6870905 6921321 6924683 6857593 6852112
4237F852112k0921j1872m2943J049K4844q306J7381l5095J1697k6734r993j3933
$$ 6852112 6831191 6819319 6776376 6777425 6802269 6793963 6811344 6776249 6787946 6761212 6751219 6737286
4225F737286j0567M5344J84J0658o98L6098k6819R789P1096O357K1747K9241k6940
$$ 6737286 6726719 6772063 6772247 6782905 6782207 6818305 6791486 6801275 6872371 6878728 6900475 6929716 6902776
4212F902776K7638l2554R8075M3599p176M4163N3971J0187K9337R4109N371M5366
$$ 6902776 6930414 6897860 6995935 7039534 7032358 7076521 7130492 7140679 7170016 7264125 7269496 7314862
4200G314862O3829Q4056M8475Q741M4343J04601K7472O4137J2611L5210M4466
$$ 7314862 7378691 7462747 7511222 7519963 7564306 7668907 7696379 7760516 7773127 7808337 7852803
4189G852803M8501L7571L0492Q488O6132O4553Q3962N9023R7581O5073N9825N5791
$$ 7852803 7901304 7938875 7969367 7977855 8043987 8108540 8192502 8251525 8349106 8414179 8474004 8529795
4177H529795O5875Q1628N3178M6258O4274M8130J03078L1213j8251M3364k6684
$$ 8529795 8595670 8677298 8730476 8776734 8841008 8889138 8992216 9023429 9005178 9048542 9021858
4166I021858L0548J9808N281Q9230L1011Q4064N6843L8102J1919O0399J36617
$$ 9021858 9052406 9072214 9077495 9166725 9197736 9281800 9338643 9376745 9388664 9449063 9585680
4155I585680M8604P9537M2374J9360Q8238K0716L5769O4431K4004L1241l3492
$$ 9585680 9634284 9713821 9756195 9775555 9863793 9884509 9920278 9984709 10008713 10039954 10006462
4144A0006462L3371j5787k4331J8718O2359J0215N3439J2575P3028K8649Q6923
$$ 10006462 10039833 10024046 9999715 10018433 10080792 10091007 10144446 10157021 10230049 10258698 10345621
4133A0345621N7925L8960Q5008O0401K4878K9893Q4092L2387J5249N0288N6875
$$ 10345621 10403546 10442506 10527514 10587915 10612793 10642686 10726778 10759165 10774414 10824702 10881577
4122A0881577P9198P0905J7531M1053N5055P1461L9122J601P7839Q8434K8516
$$ 10881577 10960775 11031680 11049211 11090264 11145319 11216780 11255902 11257503 11335342 11423776 11452292
4111A1452292O3835O9510J06328J27410J22635P5236J01711O6003J16963R2869
$$ 11452292 11516127 11585637 11691965 11819375 11942010 12017246 12118957 12184960 12301923 12394792
4101A2394792Q9005J9445J32736R1830M7495Q9089J24339J11673J09455J16060
$$ 12394792 12483797 12503242 12635978 12727808 12775303 12864392 12988731 13100404 13209859 13325919
4091A3325919J48500N4612J50036P3410J68267J53900J22434K50114J27874J45608
$$ 13325919 13474419 13529031 13679067 13752477 13920744 14074644 14197078 14447192 14575066 14720674
4081A4720674J99745J24086J62793K22645K22425K28295K03182J94688K17528
$$ 14720674 14920419 15044505 15207298 15429943 15652368 15880663 16083845 16278533 16496061
4072A6496061K27166J81154K77209K37406K74533K27030J90008K19262L44108
$$ 16496061 16723227 16904381 17181590 17418996 17693529 17920559 18110567 18329829 18673937
4063A8673937K52709K27853K39443L64449K79130K76477L26498L16148K89664
$$ 18673937 18926646 19154499 19393942 19758391 20037521 20313998 20640496 20956644 21246308
4054B1246308K79955L42299K89223L28768M35203L35644M05775M06106M34347
$$ 21246308 21526263 21868562 22157785 22486553 22921756 23257400 23663175 24069281 24503628
4045B4503628M41178M78968M74526M60559N63399N00148N84708O56769O39504
$$ 24503628 24944806 25423774 25898300 26358859 26922258 27422406 28007114 28663883 29303387
4036B9303387P03510P11473O45200O95240P16259P44986P02555P35604P77205
$$ 29303387 30006897 30718370 31363570 32058810 32775069 33520055 34222610 34958214 35735419
4027C5735419P71067Q00407P94397Q85109R15492R51540Q94945R79764J041408
$$ 35735419 36506486 37306893 38101290 38986399 39901891 40853431 41748376 42728140 43769548
4018D3769548J039245J080723J134685J202262J198619J319230J340141J251707
$$ 43769548 44808793 45889516 47024201 48226463 49425082 50744312 52084453 53336160
4010E3336160J341536J347820J380201J372077J409258J392994J485694J564037
$$ 53336160 54677696 56025516 57405717 58777794 60187052 61580046 63065740 64629777
4002F4629777J638667J692879J729057J823547J925063K058600K210674K383219
$$ 64629777 66268444 67961323 69690380 71513927 73438990 75497590 77708264 80091483
3994H0091483K497712K653510K839890L037288L335634L694336M097949M565044
$$ 80091483 82589195 85242705 88082595 91119883 94455517 98149853 102247802 106812846
3986A06812846M982425N584122O134564O647903P214350P886040Q496610Q901176
$$ 106812846 111795271 117379393 123513957 130161860 137376210 145262250 153758860 162660036
3978A62660036R280621R316675Q856106P865727N925448K939829q90218m867063
$$ 162660036 171940657 181257332 190113438 197979165 203904613 206844442 205954224 201087161
3970B01087161q026172r820959j0153561r484780q512199p507418o604669n887129
$$ 201087161 193060989 183240030 173086469 163601689 155089490 147582072 140977403 135090274
3962A35090274n232957m654864m192098l777473l449113l242104k971207k854499
$$ 135090274 129857317 125202453 121010355 117232882 113783769 110541665 107570458 104715959
3954A04715959k763524k584298k541349k502295k483560k447800k471154k422277
$$ 104715959 101952435 99368137 96826788 94324493 91840933 89393133 86921979 84499702
3946H4499702k414000k358695k289945k181087k051918k080074k080804k018735
$$ 84499702 82085702 79727007 77437062 75255975 73204057 71123983 69043179 67024444
3938F7024444j950666j812714j716481j550691j485638j463232j317507j266171
$$ 67024444 65073778 63261064 61544583 59993892 58508254 57045022 55727515 54461344
3930E4461344j194463j126813j135678j091955j026653r94613j006946q90461
$$ 54461344 53266881 52140068 51004390 49912435 48885782 47891169 46884223 45993762
3922D5993762q50229q03727p91871p47757o52973o55341o58086o72782p38027
$$ 45993762 45143533 44339806 43547935 42800178 42147205 41491864 40833778 40160996 39422969
3913C9422969o10940n42451o11284n87055n19949n21207m85608m70542m14529
$$ 39422969 38812029 38269578 37658294 37071239 36551290 36030083 35544475 35073933 34659404
3904C4659404m65169m88758m45681l59005m77114m22852m35335m27787l89013
$$ 34659404 34194235 33705477 33259796 32900791 32423677 32000825 31565490 31137703 30748690
3895C0748690m36655l73074l70899l73646l47716l41790l64211l29098k84037
$$ 30748690 30312035 29938961 29568062 29194416 28846700 28504910 28140699 27811601 27527564
3886B7527564k98370l51957k74510l28695k91268k17582k64277k37216j96993
$$ 27527564 27229194 26877237 26602727 26274032 25982764 25765182 25500905 25263689 25066696
3877B5066696k21233j99435j71664j93238k07399j66672j60242k14342j56196
$$ 25066696 24845463 24646028 24474364 24281126 24073727 23907055 23746813 23532471 23376275
3868B3376275j33438j74164j65110j73046j01296j26871j62922p3248j21518j65869
$$ 23376275 23242837 23068673 22903563 22730517 22629221 22502350 22339428 22266180 22144662 21978793
3858B1978793j10797j17895j42127q7998j59303j53026j13372j49856j00115k09080
$$ 21978793 21867996 21750101 21607974 21519976 21360673 21207647 21094275 20944419 20844304 20635224
3848B0635224j69828k41033k59549j84118j78539j09619j29665j80259j62748
$$ 20635224 20465396 20224363 19964814 19780696 19602157 19492538 19362873 19182614 19019866
3839A9019866k03363j80997j80845j34393j46511j17317j32686o6497j13693j72805
$$ 19019866 18816503 18635506 18454661 18320268 18173757 18056440 17923754 17857257 17743564 17570759
3829A7570759r5162j85736j72900r8506j57678j89756j92538j48109j50669j42409
$$ 17570759 17475597 17289861 17116961 17018455 16860777 16671021 16478483 16330374 16179705 16037296
3819A6037296k18142j90039j57029j78784j44869j02780j22100q0671o9489n2778
$$ 16037296 15819154 15629115 15472086 15293302 15148433 15045653 14923553 14842882 14773393 14720615
3809A4720615p1279q9613P0428o4774p5210M0659k2308n948N1805n3803R169l236
$$ 14720615 14649336 14559723 14630151 14565377 14490167 14530826 14508518 14502570 14554375 14500572 14509741 14506505
3797A4506505N331J3827j4563J4633J3357O6554J44476N9330J62612J35906J32542
$$ 14506505 14511836 14525663 14511100 14525733 14539090 14605644 14750120 14809450 14972062 15107968 15240510
3786A5240510J58265J48860J35117J50410J97445J80158J60978J96766J99457
$$ 15240510 15398775 15547635 15682752 15833162 16030607 16210765 16371743 16568509 16767966
3777A6767966K47463K69080K43456L02038K62384K50755J88913K74247K09362
$$ 16767966 17015429 17284509 17527965 17830003 18092387 18343142 18532055 18806302 19015664
3768A9015664K32067K79835K89540K46143L61565L89026M05895L33624L59542
$$ 19015664 19247731 19527566 19817106 20063249 20424814 20813840 21219735 21553359 21912901
3759B1912901M31882M68951M60684N49222O21509O07654P03653P61646O81537
$$ 21912901 22344783 22813734 23274418 23823640 24445149 25052803 25756456 26518102 27199639
3750B7199639Q02941Q22410Q48011R63764J028789J114104J086829J164987J293848
$$ 27199639 28002580 28824990 29673001 30636765 31665554 32779658 33866487 35031474 36325322
3741C6325322J279556J270171J240930J144495J056589R30550Q57695Q34239Q01087
$$ 36325322 37604878 38875049 40115979 41260474 42317063 43247613 44105308 44939547 45740634
3732D5740634Q12356R69981J049272J206426J406842J496705J710005J967202
$$ 45740634 46552990 47522971 48572243 49778669 51185511 52682216 54392221 56359423
3724E6359423K109037K186210K432090K587205K566768K590635K394050K041467
$$ 56359423 58468460 60654670 63086760 65673965 68240733 70831368 73225418 75266885
3716G5266885J386861K92764p82151j563545j972435j711877j137395m71141L640
$$ 75266885 76653746 76946510 76164359 74600814 72628379 70916502 69779107 69307966 69311606
3707F9311606M75017Q50712J214955J249203J395159J394293J394803J290646
$$ 69311606 69786623 70637335 71852290 73101493 74496652 75890945 77285748 78576394
3699G8576394J013018O40041P8084o67592j204811j567471j877099k108356k338434
$$ 78576394 79589412 80229453 80307537 79639945 78435134 76867663 74990564 72882208 70543774
3690G0543774k456776k314216j953798j517604j114080p76576n90351n12368m09213
$$ 70543774 68086998 65772782 63818984 62301380 61187300 60410724 59820373 59308005 58898792
3681E8898792n19949p13121j042061j258433j658405j982383k293465k469806
$$ 58898792 58378843 57665722 56623661 55365228 53706823 51724440 49430975 46961169
3673D6961169k541308k391739k177679k090826j832258j655858j466974j268443
$$ 46961169 44419861 42028122 39850443 37759617 35927359 34271501 32804527 31536084
3665C1536084j162138j118404r87878q98112q11071p25540p61019q12636p44570
$$ 31536084 30373946 29255542 28267664 27369552 26558481 25832941 25071922 24259286 23514716
3656B3514716p18732p79672q14779p12938p44718o53222o30169o14635n26489
$$ 23514716 22795984 22016312 21201533 20488595 19743877 19090655 18460486 17845851 17319362
3647A7319362n68674m63798n50471m37856m37340m40904l67529l95431l36081
$$ 17319362 16750688 16286890 15736419 15298563 14861223 14420319 14052790 13657359 13321278
3638A3321278k61097k51089l05136k16241k12007k68708j92085k83533k52808
$$ 13321278 13060181 12809092 12503956 12287715 12075708 11807000 11614915 11331382 11078574
3629A1078574k47859k97196k02103k48154k89779k67335k64901k57588k40648
$$ 11078574 10830715 10533519 10331416 10083262 9793483 9526148 9261247 9003659 8763011
3620H763011j88090k36551j90419j73540k04115j34331j28216j38389j08221j79173
$$ 8763011 8574921 8338370 8147951 7974411 7770296 7635965 7507749 7369360 7261139 7081966
3610G081966j45666j81133o1329j58360j49714j61063k12350j20208r2986j76509
$$ 7081966 6936300 6755167 6693838 6535478 6385764 6224701 6012351 5892143 5799157 5622648
3600E622648j97352j12209j15801j62035j13230p9118j25033r1138j10211j35535
$$ 5622648 5425296 5313087 5197286 5035251 4922021 4842903 4717870 4626732 4516521 4380986
3590D380986n5930o9215j15450l6077r3572j03548o6183m2801p1124o7236p9979
$$ 4380986 4325056 4255841 4140391 4104314 4010742 3907194 3841011 3798210 3727086 3659850 3579871
3579C579871j9913q2226m3957q8084m4381n0187l3572k8847o0208k5258o8967
$$ 3579871 3559958 3477732 3433775 3345691 3301310 3251123 3217551 3188704 3128496 3103238 3034271
3568C034271k3733J9332m5433p2142j0870p1540n8110l4440j8010L1591n1415
$$ 3034271 3010538 3029870 2984437 2912295 2901425 2829885 2771775 2737335 2719325 2750916 2699501
3557B699501m7283j1935r520l0901o4596l6416l4362n8286j4934j7939p823O408
$$ 2699501 2652218 2640283 2630763 2599862 2535266 2498850 2464488 2406202 2391268 2373329 2365506 2371914
3545B371914n6861j2347j9694n4881N351m2595k5756o4424J0618J0272K2148j7947
$$ 2371914 2315053 2302706 2283012 2228131 2233482 2190887 2165131 2100707 2111325 2121597 2143745 2125798
3533B125798j2070j3532j6517k8330J8572j8760o363r162o200j127k2712n6833
$$ 2125798 2113728 2100196 2083679 2055349 2073921 2055161 2048798 2039636 2033436 2032309 2009597 1952764
3521A952764j7104o747r381M1812l2854k3995l0966J2256q568l9096J0045J2329
$$ 1952764 1935660 1928913 1919532 1961344 1928490 1904495 1873529 1885785 1877217 1838121 1848166 1860495
3509A860495k7747N286K7977N7025l5807o2651l3641K6264o885n2250k3676o420
$$ 1860495 1832748 1838034 1866011 1923036 1887229 1824578 1790937 1817201 1810316 1758066 1734390 1727970
3497A727970m4078j3141M8100j632m6822k2370M0605L378k8161M1822n0565k3901
$$ 1727970 1683892 1670751 1718851 1717219 1670397 1648027 1688632 1692010 1663849 1705671 1655106 1631205
3485A631205K1943l3110n550k9239K937j8671k5468k0311k4979O126o3613L3554
$$ 1631205 1653148 1620038 1614488 1585249 1588186 1569515 1544047 1523736 1498757 1504883 1441270 1474824
3473A474824k5888J2130k7453m1664K3134m0207j4392L3158k8584m0100n7204
$$ 1474824 1448936 1461066 1433613 1391949 1415083 1374876 1360484 1393642 1365058 1324958 1267754
3462A267754J9456m8768k8904l3648L999Q473P289n1849p0344J8898J4010l284
$$ 1267754 1287210 1238442 1209538 1175890 1179889 1188362 1195651 1143802 1073458 1092356 1106366 1103082
3450A103082j0017J7148m9714m7218L1603l1484R471r124k0545n067j8642o7875
$$ 1103082 1093065 1110213 1060499 1013281 1044884 1013400 1022871 1013747 993202 988135 969493 901618
3438I01618Q792J4318J8311j0542n8115J3894K8974J2125m6988o945L3563j8904
$$ 901618 910410 924728 943039 932497 874382 888276 917250 929375 882387 875442 909005 890101
3426H90101n6178N399r56k2947K9209m447o614O632m4923j708l2649j1851m1190
$$ 890101 833923 839322 838366 815419 844628 840181 833567 840199 795276 793568 760919 749068 707878
3413G07878r213n027K7558j7391k6543N734l335n246k357r145j7893l3708J255
$$ 707878 698665 693638 721196 703805 677262 682996 679661 674415 672058 662913 645020 611312 612567
3400F12567k532J4183k3482M6119K7839m7731r3390K9221L8790j1444O3820j03681
$$ 612567 610035 624218 600736 646855 674694 626963 533573 562794 601584 590140 653960 550279
3388E50279l0730L8488m1782N534l917Q60k5211O098K334l9002R504l0664J0790
$$ 550279 519549 558037 516255 521789 517872 518732 493521 499619 501953 462951 472455 441791 452581
3375D52581n1477M617N510k6331K1493k9555p760m0056N9821J5490M12m8687j545
$$ 452581 401104 405721 411231 384900 406393 376838 369078 329022 388843 404333 404745 356058 354513
3362C54513k4333J4295j8977J6935m1661K1033j8337l0866L5670n4834j9966K8792
$$ 354513 330180 344475 325498 342433 300772 321805 303468 272602 308272 253438 233472 262264
3350B62264l303O4195m3357l2367N1123j4272m4473k623K6234k7956k3191O0608
$$ 262264 258961 323156 279799 247432 298555 284283 239810 237187 263421 235465 212274 272882
3338B72882L095j7333q511k095j3842j8940L5777m0957L1287l6473m086J195K3204
$$ 272882 275977 258644 250133 248038 234196 215256 251033 210076 241363 204890 200804 201999 225203
3325B25203n4566j3486L9663l6341k8685J9814J6907M160O7843K0749q3935j7740
$$ 225203 170637 157151 196814 160473 131788 151602 168509 172669 240512 261261 177326 159586
3313A59586k184j6310L0587l1289k4252k9691K8188L2707k9068J2905j0261j3633
$$ 159586 157402 141092 171679 140390 116138 86447 114635 147342 118274 131179 120918 107285
3301A07285j8505M5352p102j4742j1033M8731j2327o3830k9503R31N1391K5488
$$ 107285 88780 134132 127030 112288 101255 149986 137659 73829 44326 45257 96648 122136
3289A22136k5032j2316j7552K1415j7027k1469J1979k7822K5451J00850j0840
$$ 122136 97104 84788 67236 88651 71624 50155 62134 34312 59763 160613 149773
3278A49773l9765k8755j8598L937L685L6154n004n8904l0070m096M9770Q447j6576
$$ 149773 110008 81253 62655 66592 70277 106431 101427 42523 12453 8357 58127 66574 49998
3265D9998J4249j9039L4305p299n4910J0174O4817m6584k2468K2573n6603l0217
$$ 49998 64247 45208 79513 72214 17304 27478 92295 45711 23243 45816 -10787 -41004
3253d1004L9991P1060k446J82K351J1436P087l3272k4942L4303j6506L9483p3820
$$ -41004 -1013 70047 67601 67783 70134 81570 88657 55385 30443 64746 48240 87723 13903
3240A3903m070M0839J4237K1473n758k4556J370J1944k9573K4790P537j5870J9334
$$ 13903 9833 50672 64909 86382 80624 56068 57438 69382 39809 64599 72136 56266 75600
3227G5600n0679k3418O9051J817o848M0049m2916j5010j2505N794l5957M2398
$$ 75600 24921 1503 70554 72371 65523 105572 62656 47646 35141 40935 4978 47376
3215D7376j3116l1769O6136k1995M0879m035o5577M840M9680l1230Q333l4291
$$ 47376 34260 2491 68627 46632 87511 83476 17899 22739 72419 41189 49522 15231
3203A5231K5279N7459l1724L2444L1477L739j0820n4017K8031j1117M5677l9486
$$ 15231 40510 97969 66245 98689 130166 133905 123085 69068 97099 85982 131659 92173
3191I2173J3366r746k5623J4332K5148q48L0328J9138j5159q899r446m14M8457
$$ 92173 105539 95793 70170 84502 109650 108802 139130 158268 143109 134210 124764 124350 172807
3178A72807L0584k256p572O910j6778L0379K0521j1704l6710L011M2878J1859
$$ 172807 203391 201135 193563 200473 183695 214074 234595 222891 186181 189192 232070 243929
3166B43929n6101Q5112K8380k6999K533M652O483N0447L4232k1707R077l0702
$$ 243929 187828 272940 301320 274321 276854 281506 287989 338436 372668 350961 360038 329336
3154C29336O9169P276q723O017L7409M0220O160L63L6569L5644o393K1342O4561
$$ 329336 398505 405781 397058 403075 440484 480704 486864 487227 523796 559440 553047 574389 638950
3141F38950O9569q45P1334M9838l1400L6189J11832Q4371P9416J13147P4857J54138
$$ 638950 708519 707674 779008 828846 797446 833635 945467 1029838 1109254 1222401 1297258 1451396
3129A451396J82260J45037J52786J72216K73472K58473L53889M96546O98744Q54978
$$ 1451396 1633656 1778693 1931479 2103695 2377167 2635640 2989529 3486075 4184819 5039797
3119E039797J253851Q75153O9916p92089j403438j114369q12481m91933m11132
$$ 5039797 6293648 7168801 7238717 6446628 5043190 3928821 3116340 2624407 2213275
3110B213275k34527k23691j90493j42750j11600j20505j14943r6082m8559j10896
$$ 2213275 1978748 1755057 1564564 1421814 1310214 1189709 1074766 978684 930125 819229
3100H19229r0929r1077Q141j2279n9663o8637o713m8650n8088j2559j5426M5979
$$ 819229 728300 637223 645364 633085 573422 504785 498072 449422 391334 378775 363349 409328
3088D09328K283n4293m1197j3464N15k750j8740N359j572m4428k1698k2983O089
$$ 409328 411611 357318 316121 302657 303172 300422 281682 287041 285469 241041 219343 196360 202449
3075B02449p0830Q9016P291k910k8288p092l3549m6535l5308L8766n2346k5015
$$ 202449 131619 220635 227926 225016 196728 189636 156087 109552 74244 113010 60664 35649
3063C5649L8439l7119R3285p679j9796n2365N7808K6764o2200n5492M2472J1423
$$ 35649 74088 36969 130254 122575 102779 50414 108222 134986 72786 17294 59766 71189
3051G1189m2626J4345l027J5727J5527j5875l536l2024L6413l7159J8414K2326
$$ 71189 28563 42908 39881 55608 71135 55260 51724 19700 56113 18954 37368 59694
3039E9694m4159M841M9136m5256K303L3692j5761l1710N7413m0120k2937J7817
$$ 59694 15535 20376 69512 24256 26559 60251 44490 12780 70193 30073 7136 24953
3027B4953o49l0690O94Q731j9722M1806o057l2772K0718M0707K8244n7264K1460
$$ 24953 24304 -6386 -5692 3039 -16683 25123 19066 -13706 7012 47719 75963 18699 40159
3014D0159k2449k3015K8503k5580q357L4431o2418M5071n6149K0664J9722K2812
$$ 40159 17710 -5305 23198 -2382 -10739 23692 -38726 6345 -49804 -29140 -9418 13394
3002A3394m924o0782K4422R329J8402m0371J5927l1369j3066K2656Q205o0829
$$ 13394 8470 -52312 -27890 -18561 -159 -40530 -24603 -55972 -69038 -46382 -38177 -99006
2990i9006L1702R23p044K2877L4953n3721M160M2644j5442K5250j1091k5870J0602
$$ -99006 -67304 -66381 -73425 -50548 -15595 -69316 -65156 -22512 -37954 -12704 -23795 -49665 -39063
2977c9063J6361j4443l6181K5108K6820j4569m835K0650R507N92k7165J4329k2775
$$ -39063 -22702 -37145 -73326 -48218 -21398 -35967 -40802 -20152 -10645 -10053 -37218 -22889 -45664
2964d5664L3341L1115j769K1996k6722p4975N1044j4748K6811j1013O884J7606
$$ -45664 -12323 18792 17023 39019 12297 -62678 -11634 -26382 429 -10584 -3700 13906
2952A3906m6899J7718m950l4883l9670O5861L2659k8481K262p93L181M8616q6325
$$ 13906 -32993 -15275 -20225 -55108 -94778 -28917 3742 -24739 -22477 -23270 -20089 28527 -57798
2939e7798J3464K1999p6115L4777L0474l8428L1847K0477m0760m548J759L7730
$$ -57798 -44334 -22335 -98450 -63673 -33199 -71627 -39780 -19303 -60063 -64611 -62852 -25122
2927b5122j734L2547l1185j5782M1599o2722L9696Q344P984N5007q6326K4155
$$ -25122 -26856 5691 -25494 -41276 323 -62399 -22703 -14359 -6375 48632 -37694 -13539
2915a3539k1170L0874J1226l4177J4784l2021J9285N207N815J354k1269J0011
$$ -13539 -34709 -3835 7391 -26786 -12002 -44023 -24738 -19531 -13716 -12362 -33631 -23620
2903b3620L104k4848K653J5266J5136m2868K0945K0576l2144K137K3893k4075
$$ -23620 -20516 -45364 -42711 -27445 -12309 -55177 -34232 -13656 -45800 -43663 -19770 -43845
2891d3845k559M4480p5114J7779N2811J9176j7124M856l4309J0129l1776m9413
$$ -43845 -46404 -1924 -77038 -59259 -6448 12728 -4396 460 -33849 -23720 -55496 -104909
2879a04909L0915J5207J749n099K2828j8201L4038l795Q57k0733M0775m6774L182
$$ -104909 -73994 -58787 -57038 -62137 -39309 -57510 -23472 -27267 -26410 -47143 -6368 -53142 -49960
2866d9960M7225M1547l2623n8539L1235l1564J4711l942j9500q623L8894L5177
$$ -49960 -2735 38812 6189 -52350 -21115 -52679 -37968 -41910 -61410 -70033 -31139 4038
2854D038k9655l2870N814K8018Q831k450k7089J4985k8165k6141k498O4341K3625
$$ 4038 -25617 -58487 -52673 -24655 -15824 -18274 -45363 -30378 -58543 -84684 -87182 -22841 784
2841G84n1372j2862N5603j5160l1952K2545l735m1204k494K3308K5057J1861N202
$$ 784 -50588 -63450 -7847 -23007 -54959 -32414 -36149 -77353 -79847 -56539 -31482 -19621 -14419
2828a4419j1372r731k8913L7540K1366j8763J1272k1127l7114j1361J7358j951
$$ -14419 -25791 -35522 -64435 -26895 -5529 -24292 -13020 -34147 -71261 -82622 -65264 -67215
2816f7215J0979o603J3079L6217J1076J6682J9693j1034n475j0374n1968N059
$$ -67215 -56236 -62839 -49760 -13543 -2467 14215 33908 22874 17399 7025 -44943 -39884
2804c9884K2935M560l973J687K9292l0962K296m8157j4530L1853k1334M82K988
$$ -39884 -16949 -12389 -16362 -14675 14617 -16345 -14049 -62206 -76736 -44883 -66217 -65735 -62747
2791f2747N4081j6534k1759M5518j8512P311M6706l4294o2346K7649m6417J5153
$$ -62747 -8666 -25200 -46959 -1441 -19953 -12642 34064 -230 -62576 -34927 -81344 -66191
2779f6191J2239J8740K5676l8651L1057P338L3306l1578o5824K0758o626k4135
$$ -66191 -53952 -35212 -9536 -48187 -17130 -9792 23514 -8064 -73888 -53130 -59756 -83891
2767h3891M3302M4996k2670l2489l2921P114J8908j7990K5500K236o784N9878
$$ -83891 -40589 4407 -18263 -50752 -83673 -76559 -57651 -75641 -50141 -47905 -54689 5189
2755E189j1403J1292j1623N066n6614k022N2173M8997l5903k2587N605m4719j4452
$$ 5189 -6214 5078 -6545 -1479 -58093 -60115 -7942 41055 5152 -17435 -11830 -56549 -71001
2742g1001J3130O869J5896L3039k3350m38J7205k6164l4480O6647j1679m9972
$$ -71001 -57871 -51002 -35106 -2067 -25417 -25855 -8650 -34814 -69294 -2647 -14326 -64298
2730f4298K4267L4274m2420k3338N1118J8366l3184l7848L0623K5969n569k4294
$$ -64298 -40031 -5757 -48177 -71515 -20397 -2031 -35215 -73063 -42440 -16471 -22040 -46334
2718d6334L806K8871l288k7002K398j3242j1937Q2846l9498j8064j3158K6730
$$ -46334 -42528 -13657 -16945 -43947 -41549 -54791 -66728 16118 -23380 -41444 -54602 -27872
2706b7872k2960M4970k1663j1322j2974N5387o01j6870n681p844J9819K0362k9151
$$ -27872 -50832 -5862 -27525 -38847 -51821 3566 2965 -13905 -19586 -27430 -7611 12751 -16400
2693a6400j1920j7063K0799O1624r7427K8730M871K3358J438p803l8986J6431
$$ -16400 -28320 -45383 -24584 37040 -60387 -31657 -26786 -3428 -1990 -9793 -48779 -32348
2681c2348J4584k0937m2423M1297J3689O7093k1740m012k0334j0063P584l2262
$$ -32348 -17764 -38701 -81124 -39827 -26138 40955 19215 15203 -5131 -15194 -7610 -39872
2669c9872M2677k7285o19N6604k2388l3369l2444j9482J5810k6007L8771K1585
$$ -39872 2805 -24480 -25099 31505 9117 -24252 -56696 -76178 -60368 -86375 -47604 -26019
2657b6019k0762k3525N463L2238n788N4581K299m6617m980K2643o4420K3338J046
$$ -26019 -46781 -70306 -64843 -32605 -38393 16188 18487 -28130 -33110 -10467 -74887 -51549 -50503
2644e0503J364K2949Q356M397J611j7011M407K56O123J7527j2645J4555p866p330
$$ -50503 -49139 -26190 -17834 -13437 -11826 -28837 -24430 -24174 -18051 -524 -13169 1386 -6480 -13810
2630a3810q102J864P843J5928j4333o8269L0926M1517j3066M1283m6760L336M74
$$ -13810 -21912 -20048 -12205 3723 -10610 -78879 -47953 -6436 -19502 21781 -24979 -21643 -21169
2617b1169R010n4449L99J7118K1559M4843l3480O273K0988J5596l7073K2859J5940
$$ -21169 -12159 -66608 -66209 -49091 -27532 17311 -16169 -9896 11092 26688 -10385 12474 28414
2604B8414m0904m3212L0289K3m1936L1357L6581j7046m771L1367m6968K3181J8055
$$ 28414 -12490 -55702 -25413 -25390 -67326 -35969 612 -16434 -21205 10162 -36806 -13625 4430
2591D430k1036J465J7975l8354l598P234L0643k9168j1801L1885L717k9258k8740
$$ 4430 -16606 -15141 2834 -35520 -39118 -31884 -1241 -30409 -42210 -10325 -6608 -35866 -64606
2578f4606m4553N2357L2135K9044l7573k4487N5725l3346k4096j3304K5054K0209
$$ -64606 -109159 -56802 -24667 4377 -33196 -57683 -1958 -35304 -59400 -72704 -47650 -27441
2566b7441J4352L3722l8683j672K3068J1218o3564K8032q44j1863k6432L1696
$$ -27441 -13089 20633 -18050 -19722 3346 14564 -49000 -20968 -21812 -33675 -60107 -28411
2554b8411r677m0135J3778r976O0835J673k295j5575Q555k0076k4292N656K3448
$$ -28411 -38088 -78223 -64445 -74421 -13586 -11913 -14208 -29783 -21228 -41304 -65596 -59940 -36492
2541c6492J8472k2080k3659N6214K8952k3769J1704k4633J697K4159n114n2076
$$ -36492 -18020 -40100 -63759 -7545 21407 -2362 9342 -15291 -13594 10565 5451 -46625
2529d6625o547P2020o7498J4589K5194n9773N7318k9881j0712k9726O571N5458
$$ -46625 -53172 18848 -48650 -34061 -8867 -68640 -11322 -41203 -51915 -81641 -75070 -19612
2517a9612j18J3403o8887j1650L6878O5010k0412k1664M8924k3857l6518k7125
$$ -19612 -19730 -6327 -75214 -86864 -49986 15024 -5388 -27052 21872 -1985 -38503 -65628
2505f5628k2907K0617N9845P510J2070p897J0614j3614j9097J5577J0124J8013
$$ -65628 -88535 -67918 -8073 -563 11507 3610 14224 610 -18487 -2910 7214 25227
2493B5227l1449L5054k3092l2824p21K8355n4572K9657k7427n178K0790K2953
$$ 25227 -6222 28832 5740 -27084 -27805 550 -54022 -24365 -51792 -56970 -36180 -13227
2481a3227l8256K3780k1954q888J3528j4115K5465m6244M6936M1884K111j6034
$$ -13227 -51483 -27703 -49657 -58545 -45017 -59132 -33667 -79911 -32975 8909 11020 -5014
2469e014J6106J817n8208L9280k6070L5297k8473P714o6910P1175J2823N261K9088
$$ -5014 11092 12909 -45299 -6019 -32089 3208 -25265 -17551 -84461 -13286 -463 4798 33886
2456C3886n2908K9727m1158M483J4426J9184l6475R719K0187J4181k9011j2152
$$ 33886 -19022 10705 -30453 -25970 -11544 7640 -28835 -19116 1071 15252 -13759 -25911
2444b5911P893l299L5748K6082j0859M834R320p2844K4637l3307k7321L2725k9913
$$ -25911 -18018 -21317 14431 40513 29654 34488 43808 -29036 -4399 -37706 -65027 -32302 -62215
2431f2215N3860m2249m339k8675M5458J4604m6731J6396M7235M497j57P328M0894
$$ -62215 -8355 -50604 -54943 -83618 -38160 -23556 -70287 -53891 -6656 -2159 -2316 5012 45906
2418D5906o2861J7077m1618M2450j2384p939r370J5166L6656o1350j7777L2149
$$ 45906 -16955 122 -41496 954 -11430 -19369 -28739 -13573 23083 -38267 -56044 -23895
2406b3895N9696k3115k1667o193Q302K5104P360k6487J199J1360l7968N3723n991
$$ -23895 35801 12686 -8981 -15174 -6872 18232 25592 -895 304 11664 -26304 27419 21428
2393B1428k5352n2720M4160n027J2375K3688l0655J8423J638k8918L1108j6427
$$ 21428 -3924 -56644 -12484 -17511 -5136 18552 -12103 6320 7958 -20960 10148 -6279
2381f279k8549M1748m7035J0530k8825L218L2160Q489n6656N9182N977q971j1612
$$ -6279 -34828 6920 -40115 -29585 -58410 -55192 -23032 -14543 -71199 -12017 -6040 -15011 -26623
2368b6623K9655P905j7802l4033J1108L5795K5896m4596J4298k9485L8349j7889
$$ -26623 3032 10937 -6865 -40898 -29790 6005 31901 -12695 1603 -27882 10467 -7422
2356g422k195k509J1140j4555q653M5469m8448l400l426K4562l5090M2613P957
$$ -7422 -9617 -12126 -986 -15541 -24194 21275 -27173 -30573 -33999 -9437 -44527 -1914 6043
2343F043p919p234M5410j9253j4175N6190p2601p797L3751k3312J6252n7833K5191
$$ 6043 -1876 -9110 36300 17047 2872 59062 -13539 -21336 12415 -10897 5355 -52478 -27287
2330b7287j2709M2490p483l1721k0174M5711j0186k078L7901m1002P582m946m144
$$ -27287 -39996 2494 -4989 -36710 -56884 -11173 -21359 -23437 14464 -26538 -18956 -23902 -28046
2317b8046j2483j5686N8119l9872J5318L88k2703M2518j3913J3780l7833j8240
$$ -28046 -40529 -56215 1904 -37968 -22650 -22262 -44965 -2447 -16360 -2580 -40413 -58653
2305e8653J0885O231j5186N7859m556l4813J7894M2625l2692K5656k3952k0468
$$ -58653 -47768 -41537 -56723 1136 -3420 -38233 -20339 22286 -10406 15250 -8702 -29170
2293b9170M4349j6690K411k0189k2l797k5274n302J2919M6685K8435j1949n60
$$ -29170 15179 -1511 900 -19289 -19311 -23108 -48382 -53684 -40765 5920 34355 22406 21846
2280B1846j4983k0054R23m8500L0135K871K4915j0317l401q162R109P450M7790
$$ 21846 6863 -13191 -12268 -60768 -30633 -27762 -2847 -13164 -16565 -24727 -15618 -8168 39622
2267C9622k178j1248j457l7757N37j2433J2683l3849J5661O608j7656j8405M4030
$$ 39622 37444 26196 24739 -13018 -12481 -24914 -12231 -46080 -30419 -23811 -41467 -59872 -15842
2254a5842j0364O832o451j3428P0109k5967k6600j3329k7714J2380J07927j1187
$$ -15842 -26206 -19374 -25825 -39253 30856 4889 -21711 -35040 -62754 -50374 57553 46366
2242D6366p2675L3911J3878N348L5246l6060l5211j1510L390k451l4682p507L8519
$$ 46366 -26309 7602 21480 26828 62074 26014 -9197 -20707 -17317 -19768 -54450 -61957 -23438
2229b3438l86q658j416J6375K3710m5826K0406K1995J1474k8583J1238N312n173
$$ -23438 -23824 -32482 -33898 -17523 6187 -39639 -19233 2762 14236 -14347 -3109 2203 -2970
2216b970j3984K9736j5785K038R692k2823L6619l2662p514j4635Q275J0368r013
$$ -2970 -16954 12782 -3003 -965 8727 -14096 22523 -10139 -17653 -32288 -24013 -13645 -22658
2203b2658K8237J2002j1917l2122L3002N13K8161L198j3013l7911Q611L1153O750
$$ -22658 5579 17581 5664 -26458 6544 7057 35218 38416 25403 -12508 -3897 27256 34006
2190C4006n8306l8703O0083K6594k7823J5969k6516j2276L7510M0070l5751l2576
$$ 34006 -24300 -63003 -2920 23674 -4149 11820 -14696 -26972 10538 50608 14857 -17719
2178a7719K5949P6l6439K9789K7294m5156K4543n1634K6434P1296j2530m3870
$$ -17719 8230 8306 -28133 1656 28950 -16206 8337 -43297 -16863 54433 41903 -1967
2166a967l3885k0821J5035K5788Q9098k0866j3256l1077o599K1786l764R037k895
$$ -1967 -35852 -56673 -41638 -15850 73248 52382 39126 8049 1450 23236 19472 28509 25614
2153B5614l4116l0720J6422j1583k3547N7010k4741k9238N1353k6450R761L3371
$$ 25614 -8502 -39222 -22800 -34383 -57930 -920 -25661 -54899 -3546 -29996 -20235 13136
2141A3136l3776K5075j1823K7955j8691J2798Q130j1529K4462P34l1679q6833
$$ 13136 -20640 4435 -7388 20567 1876 14674 22804 11275 35737 36471 4792 -82041
2129h2041M2626K2823m1765O3331r51l1459J0723k4304P2496m490j8527J8625
$$ -82041 -39415 -16592 -58357 4974 4023 -27436 -16713 -41017 31479 26989 8462 27087
2117B7087R110L5945M840j852m2025k8820j0288L2571O16o521j6792J5510Q407
$$ 27087 36197 72142 76982 75130 33105 4285 -6003 26568 27184 20663 3871 19381 27788
2104B7788k4310l8376K4795O007k7645Q1564k6513L5857j5469M0981k8273j1999
$$ 27788 3478 -34898 -10103 -4096 -31741 49823 23310 59167 43698 84679 56406 44407
2092D4407J1707m3062j9190O0320k2199l6251q552k9005J9821O0089l0859J3926
$$ 44407 56114 13052 -6138 54182 31983 -4268 -12820 -41825 -22004 38085 7226 21152
2080B1152j7688J9219k2101K2031O746l2041J0391J9785j1001l0019J5789N97
$$ 21152 3464 22683 582 22613 29359 -2682 7709 27494 16493 -13526 2263 2860
2068B860O101l9952k949M7714Q273k6040N565J0321j4783M0817n6292k9588Q2398
$$ 2860 8961 -30991 -33940 13774 22047 -3993 1572 11893 -2890 37927 -18365 -47953 34445
2055C4445j6340p572r932j9075j6318L5957p32M5901k8282j6867k4167L315m4337
$$ 34445 18105 10533 601 -18474 -34792 1165 433 46334 18052 1185 -22982 -19667 -64004
2042f4004Q2940r31j8751m7488k927M2938N464q678K7488J1733l9784o558m3423
$$ -64004 18936 18005 -746 -48234 -51161 -8223 -2759 -11437 16051 27784 -12000 -18558 -61981
2029f1981M8553k7767k4362L6866j5688O3666O5718l5367m1596p402n1808M654
$$ -61981 -13428 -41195 -65557 -28691 -44379 19287 85005 49638 8042 640 -51168 -46514
2017d6514O8451K4941l6564m9750o50L1772L6161l6567q890k3796K9122l4253
$$ -46514 21937 46878 10314 -39436 -40086 -8314 27847 -8720 -17610 -41406 -12284 -46537
2005d6537q839L4084N2552l5395m7895M1641O387J1849J7769M8429l6844o9643
$$ -46537 -55376 -21292 31260 -4135 -52030 -10389 -4002 7847 25616 74045 37201 -32442
1993c2442j3617j2076M0553L0439K2520j7493l178K0864j1996l4935j7626K4610
$$ -32442 -46059 -58135 -17582 12857 35377 17884 14706 35570 23574 -11361 -28987 -4377
1981d377o833q966J1616P612J3008J7686r500m1488J7000l2896J8219J5465j5733
$$ -4377 -11210 -20176 -8560 -948 12060 29746 20246 -21242 -4242 -37138 -18919 -3454 -19187
1968a9187L3316l3506K7367N921m041K854j0644M7202q1853n40Q5694m1927l282
$$ -19187 14129 -19377 7990 13911 9870 12724 2080 49282 -32571 -33111 52583 10656 7374
1955G374k2424k102K2509k016k9663K1095k0022N4430l9542L7073L835M0145l2726
$$ 7374 -15050 -17152 5357 3341 -26322 -5227 -25249 29181 -10361 26712 30547 70692 37966
1942C7966j0343m8339K3619M0900k7408j5261m8482N2997k5563m612M3339L030
$$ 37966 27623 -20716 2903 43803 16395 1134 -47348 5649 -19914 -24526 18813 21843
1930B1843l9399M1929m9593J3869j4154J7863J0717l4848p939N2451L6866q9830
$$ 21843 -17556 24373 -25220 -11351 -25505 -7642 3075 -31773 -39712 12739 49605 -40225
1918d0225j0065K5673N1652j8736m5832J3530J2370K1650k8108Q976R139l5465
$$ -40225 -50290 -24617 27035 8299 -37533 -24003 -11633 10017 -18091 -9115 24 -35441
1906c5441k7307L4851K163l863J4473m201J3143L6861j6111J8495k6130J7700
$$ -35441 -62748 -27897 -25734 -29597 -15124 -19325 -6182 30679 14568 33063 6933 24633
1894B4633J3870m7632J7289M640R351J1057j6018k9625K3078n17K8133m0960K8405
$$ 24633 38503 -9129 8160 12800 22151 33208 17190 -12435 10643 10126 38259 -2701 25704
$$ [...]
##END NTUPLES=NMR SPECTRUM
##END=
