##TITLE=1H_CG-1219-2
 CDCl3
 8 sc, 
 26.11.2024
##JCAMPDX= 6.0         $$ Bruker NMR JCAMP-DX V2.0
##DATA TYPE= NMR SPECTRUM
##DATA CLASS= NTUPLES
##ORIGIN= UXNMR, Bruker Analytische Messtechnik GmbH
##OWNER= root
$$ XWIN-NMR		Version 3.5
$$ Tue Nov 26 13:43:01 2024 Russian Standard Time (UT+4h)  she@DPX200
##.OBSERVE FREQUENCY= 200.1315
##.OBSERVE NUCLEUS= ^1H
##.ACQUISITION MODE= SIMULTANEOUS
##.ACQUISITION SCHEME= undefined
##.AVERAGES= 8
##.DIGITISER RES= 18
##SPECTROMETER/DATA SYSTEM= spect
##.PULSE SEQUENCE= zg30
##.SOLVENT NAME= D2O
##.SHIFT REFERENCE= (INTERNAL, D2O, 0, 19.4945)
##AUDIT TRAIL= $$ (NUMBER, WHEN, WHO, WHERE, WHAT)
$$ ##TITLE= Audit trail, XWIN-NMR		Version 3.5
$$ ##JCAMPDX= 5.01
$$ ##ORIGIN= Bruker BioSpin GmbH
$$ ##OWNER= she
$$ F:/spectra/data/she/nmr/H-F/1/pdata/1/auditp.txt
$$ ##AUDIT TRAIL=  $$ (NUMBER, WHEN, WHO, WHERE, WHAT)
(   1,<2024-11-26 13:41:51.43 +0400>,<she>,<DPX200>,
      <created by zg, POWCHK disabled, PULCHK disabled
       configuration hash MD5:
       00 E9 B6 7A A2 85 ED C7 34 08 36 98 17 FE 4E 26
       data hash MD5: 16K
       FC 1B 36 F3 88 0E DA 79 76 40 6F 3B A6 ED 22 FC>)
(   2,<2024-11-26 13:41:56.96 +0400>,<she>,<DPX200>,
      <Start of raw data processing
       efp BC_mod = 2 LB = 0.24 FT_mod = 6 PKNL = 1 PHC0 = -26865.15 PHC1 = 11.78744 SI = 16K 
       data hash MD5: 16K
       22 6D CA 4B 28 67 3B 3C 10 96 B9 E4 BB 7D C7 4B>)
(   3,<2024-11-26 13:42:13.79 +0400>,<she>,<DPX200>,
      <pk PHC0 = -5.006211 PHC1 = 8.399999 
       data hash MD5: 16K
       BE 62 D9 2D 7F 04 7A 0F 9C F7 59 85 79 7F 11 47>)
(   4,<2024-11-26 13:42:17.70 +0400>,<she>,<DPX200>,
      <abs ABSG = 5 
       data hash MD5: 16K
       3E E0 82 0C 3F C8 7B 07 34 7F 77 B6 96 2D 70 35>)
$$ ##END=
$$ 
$$ hash MD5
$$ 7E E0 A8 88 77 98 76 77 F6 56 73 03 B8 BD C6 DE
##$RELAX= 
##$RELAX= 
##$RELAX= 
##$RELAX= 
##$RELAX= 
##$RELAX= 
$$ Bruker specific parameters
$$ --------------------------
##$DU= <F:/spectra>
##$EXPNO= 1
##$NAME= <H-F>
##$PROCNO= 1
##$TYPE= <nmr>
##$USER= <she>
##$AMP= (0..31)
100 100 100 100 100 100 100 100 100 100 100 100 100 100 100 100 100 100 
100 100 100 100 100 100 100 100 100 100 100 100 100 100 
##$AQSEQ= 0
##$AQ_mod= 1
##$AUNM= <au_zg>
##$AUTOPOS= <>
##$BF1= 200.13
##$BF2= 200.13
##$BF3= 200.13
##$BF4= 200.13
##$BF5= 200.13
##$BF6= 200.13
##$BF7= 200.13
##$BF8= 200.13
##$BYTORDA= 1
##$CFDGTYP= 0
##$CFRGTYP= 5
##$CHEMSTR= <none>
##$CNST= (0..31)
1 1 145 1 1 1 1 1 1 1 1 1 1 1 1 1 1 1 1 1 1 1 1 1 1 1 1 1 1 1 1 1 
##$CPDPRG= <>
##$CPDPRG1= <>
##$CPDPRG2= <>
##$CPDPRG3= <>
##$CPDPRG4= <mlev>
##$CPDPRG5= <mlev>
##$CPDPRG6= <mlev>
##$CPDPRG7= <mlev>
##$CPDPRG8= <mlev>
##$CPDPRGB= <>
##$CPDPRGT= <>
##$D= (0..31)
0 1.2 0 0 0 0 0 0 0 0.06 0 0.03 0 0 0 0 0.0002 0 0 0 0 0 0 0 0 0 0 0 0 
0 0 0 
##$DATE= 1732614110
##$DBL= (0..7)
120 120 120 120 120 120 120 120 
##$DBP= (0..7)
150 150 150 150 150 150 150 150 
##$DBP07= 0
##$DBPNAM0= <>
##$DBPNAM1= <>
##$DBPNAM2= <>
##$DBPNAM3= <>
##$DBPNAM4= <>
$$ [...]
##$SUBNAM3= <"">
##$SUBNAM4= <"">
##$SUBNAM5= <"">
##$SUBNAM6= <"">
##$SUBNAM7= <"">
##$SUBNAM8= <"">
##$SUBNAM9= <"">
##$SW= 24.0689530833862
##$SWIBOX= (0..15)
0 0 2 0 0 0 0 0 0 0 0 0 0 0 0 0 
##$SW_h= 4816.95568400771
##$TD= 16384
##$TD0= 1
##$TE= 0
##$TE2= 300
##$TE3= 300
##$TEG= 300
##$TL= (0..7)
0 120 120 120 120 120 120 120 
##$TP= (0..7)
150 150 150 150 150 150 150 150 
##$TP07= 0
##$TPNAME0= <>
##$TPNAME1= <>
##$TPNAME2= <>
##$TPNAME3= <>
##$TPNAME4= <>
##$TPNAME5= <>
##$TPNAME6= <>
##$TPNAME7= <>
##$TPOAL= (0..7)
0.5 0.5 0.5 0.5 0.5 0.5 0.5 0.5 
##$TPOFFS= (0..7)
0 0 0 0 0 0 0 0 
##$TUNHIN= 0
##$TUNHOUT= 0
##$TUNXOUT= 0
##$USERA1= <user>
##$USERA2= <user>
##$USERA3= <user>
##$USERA4= <user>
##$USERA5= <user>
##$V9= 5
##$VALIST= <valist>
##$VCLIST= <CCCCCCCCCCCCCCC>
##$VD= 0
##$VDLIST= <DDDDDDDDDDDDDDD>
##$VPLIST= <PPPPPPPPPPPPPPP>
##$VTLIST= <TTTTTTTTTTTTTTT>
##$WBST= 1024
##$WBSW= 4
##$XGAIN= (0..3)
0 0 0 0 
##$XL= 0
##$YL= 0
##$YMAX_a= 267391
##$YMIN_a= -440738
##$ZGOPTNS= <>
##$ZL1= 120
##$ZL2= 120
##$ZL3= 120
##$ZL4= 120
##$ABSF1= 19.49007
##$ABSF2= -4.579062
##$ABSG= 5
##$ABSL= 3
##$ALPHA= 0
##$AQORDER= 0
##$ASSFAC= 0
##$ASSFACI= 0
##$ASSFACX= 0
##$ASSWID= 0
##$AUNMP= <proc_1d>
##$AZFE= 0.1
##$AZFW= 0.1
##$BCFW= 0
##$BC_mod= 2
##$BYTORDP= 0
##$COROFFS= 0
##$CY= -3
##$DATMOD= 1
##$DC= 0
##$DFILT= <>
##$DTYPP= 0
##$F1P= 0
##$F2P= 0
##$FCOR= 1
##$FTSIZE= 16384
##$FT_mod= 6
##$GAMMA= 0
##$GB= 0
##$INTBC= 1
##$INTSCL= 2.524811e-10
##$ISEN= 128
##$LB= 0.24
##$LEV0= 0
##$LPBIN= 0
##$MAXI= 10000
##$MC2= 0
##$MEAN= 0
##$ME_mod= 0
##$MI= 1.114404
##$NCOEF= 0
##$NC_proc= -6
##$NLEV= 6
##$NOISF1= 3.799351
##$NOISF2= 2.8
##$NSP= 0
##$NTH_PI= 0
##$NZP= 0
##$OFFSET= 19.49447
##$PC= 1
##$PHC0= -26870.16
##$PHC1= 20.18744
##$PH_mod= 1
##$PKNL= yes
##$PPARMOD= 0
##$PSCAL= 0
##$PSIGN= 0
##$REVERSE= no
##$SF= 200.130007049909
##$SI= 16384
##$SIGF1= 3
##$SIGF2= 2
##$SINO= 5.538805
##$SIOLD= 16384
##$SREGLST= <1H.CDCl3>
##$SSB= 0
##$STSI= 16384
##$STSR= 0
##$SW_p= 4816.95568400771
##$SYMM= 0
##$S_DEV= 0
##$TDeff= 16384
##$TDoff= 0
##$TI= <>
##$TILT= no
##$TM1= 0
##$TM2= 0
##$TOPLEV= 0
##$USERP1= <user>
##$USERP2= <user>
##$USERP3= <user>
##$USERP4= <user>
##$USERP5= <user>
##$WDW= 1
##$XDIM= 16384
##$YMAX_p= 325581399
##$YMIN_p= -256521
$$ End of Bruker specific parameters
$$ ---------------------------------
##NTUPLES= NMR SPECTRUM
##VAR_NAME=  FREQUENCY,     SPECTRUM/REAL,   SPECTRUM/IMAG
##SYMBOL=    X,             R,               I
##VAR_TYPE=  INDEPENDENT,   DEPENDENT,       DEPENDENT
##VAR_FORM=  AFFN,          ASDF,            ASDF
##VAR_DIM=   16384,         16384,           16384
##UNITS=     HZ,            ARBITRARY UNITS, ARBITRARY UNITS
##FACTOR=    0.29402158847633, 1,            1
##FIRST=     3901.42853787446, 0,            0
##LAST=      -915.52714613325, 0,            0
##MIN=       -915.52714613325, -256521,      0
##MAX=       3901.42853787446, 325581399,    0
$$ Real data points
##PAGE= N=1
##DATA TABLE= (X++(R..R)), XYDATA
$$ [...]
8031B7922647M34164K19786J47429k37449l08397m39495o30785o88057p22211
8022B5697632n98786n71952n24310n48490l84006l89269k81346j43083P3121J42706
8012B2472217O9808J40646K56568K02729k4178L7723J35823J75327K02700l8315
8002B3631048j73781j33729j63559j54423o9840k61963k68259l00596k31704m30985
7992B1442209l44478j62956j03827j36473j686N4117P8360P0504N1036J62052
7982B1108858J63175J65633K44828N5971N6211j11226l32733n49462o25680p16549
7972A9459026o39600m46773l02430k30680j00257l9739K39048J71276K30633J32634
7962A8473138K1011j63181m38219o81090n76138k92494j38968j40851J07198Q9136
$$ plain form
8031 27922647 28356811 28576597 28724026 28486577 28178180 27738685 27107900 26419843 25697632
8022 25697632 25098846 24526894 24002584 23454094 23070088 22680819 22399473 22256390 22329511 22472217
8012 22472217 22542025 22682671 22939239 23141968 23117790 23155513 23291336 23466663 23669363 23631048
8002 23631048 23457267 23323538 23159979 23005556 22935716 22673753 22405494 22104898 21873194 21442209
7992 21442209 21097731 20934775 20830948 20694475 20692789 20746906 20825266 20895770 20946806 21108858
7982 21108858 21272033 21437666 21682494 21738465 21794676 21683450 21350717 20801255 20175575 19459026
7972 19459026 18819426 18372653 18070223 17839543 17739286 17699547 17938595 18109871 18340504 18473138
7962 18473138 18494149 18330968 17892749 17211659 16635521 16343027 16204059 16063208 16170406 16259542
7952A6259542L48316N11157M90009M08761L71549J70672q9314m42822p69027o91241
7942A6567602p24986o44509l71665j85050q543P6997L16274M11084L86610K32342
7932A6056156K71558j8364m15156o07786o99064o40635m85882l19678k61370j59118
7922A2720661p1078K4681m2718R2733K8061J65496J74836J03268K31405K36515
7912A3663860R7955K73130O0198J92106J11566J37884L00802L41337M16544P71528
7902A6366910K06241J73306J40195k4575n3608p45j57748l1697P9257j5894j1109
7891A6670533j72854p0448J10620J14704J1423K35151L10727J65021M5608O2064
7881A7482549J35704M6518L0842j45797r9010k88740j42515P1646N8305J80376
$$ plain form
7952 16259542 16607858 17119015 17609024 18017785 18389334 18560006 18470692 18027870 17258843 16567602
7942 16567602 15842616 15198107 14826442 14641392 14632849 14709846 15026120 15437204 15823814 16056156
7932 16056156 16327714 16309350 15894194 15286408 14587344 13946709 13460827 13141149 12879779 12720661
7922 12720661 12649583 12674264 12631546 12724279 12752340 12917836 13092672 13195940 13427345 13663860
7912 13663860 13761815 14034945 14095143 14287249 14398815 14536699 14837501 15178838 15595382 16366910
7902 16366910 16573151 16746457 16886652 16862077 16808469 16807724 16649976 16618279 16697536 16681642 16670533
7891 16670533 16497679 16427231 16537851 16652555 16663978 16899129 17209856 17374877 17420485 17482549
7881 17482549 17618253 17664771 17695613 17549816 17450806 17162066 17019551 17091197 17149502 17329878
7871A7329878M01088M10268l2538j52262l46479n62040m13878l48213j64202K5353
7861A6146975l0473O0614k0468j49401k6162J67098K08972J33362j27603l31664
7851A6031250n61243n47577m84548k47880k21211l20451k72335j93274k79748
7842A2902983k75064j00473k13193p7438M185M5845K09569P5999K42640K77396
7832A3092449M40852L12148M25008M52381M91812M77356N03238L92151N97610
7823A7185005O46408M29871L94408J06449j7817m5228J12454K67665K04313K14202
7813A9497730J00144j85820m16653m69929m27710j61278p7359N4519J27767J09600
7803A8151011K65625N11248M31217N73366P25468Q71011P79027P48095R55053
$$ plain form
7871 17329878 17730966 18141234 18108696 17956434 17609955 17047915 16634037 16285824 16121622 16146975
7861 16146975 16116502 16177116 16156648 16007247 15981085 16148183 16357155 16490517 16362914 16031250
7851 16031250 15470007 14922430 14437882 14190002 13968791 13648340 13376005 13182731 12902983
7842 12902983 12627919 12527446 12314253 12236815 12241000 12286845 12496414 12572413 12815053 13092449
7832 13092449 13533301 13845449 14270457 14722838 15214650 15692006 16195244 16587395 17185005
7823 17185005 17831413 18261284 18655692 18762141 18744324 18699096 18811550 19079215 19283528 19497730
7813 19497730 19597874 19412054 18995401 18525472 18097762 17936484 17859125 17913644 18041411 18151011
7803 18151011 18416636 18927884 19359101 19932467 20657935 21528946 22307973 23056068 24011121
7794B4011121Q53639R66506J006358Q65935O03141M42436K14389K32973K87989
7785B9484487K88948M74482M07115j38843n31559q80243r24746q50694p47104
7776B6581843k06832o853N7210N4202K05829J76332L63685N16215N46580P49189
7766B9037400M06497J42554p6289k86782j17483n4477N3341J42342M6864j19799
7756B9174168l68367l12472m30685k02923k85019l73282o12288q69564j007922
7747B4711646p15427o03337l52770k08242k26360j92223k79581k10911n1843J00308
7737B1971260L01309M94914N61255N31733M91122J94745l6396l17679l01705k09083
7727B3681475j45085J8938j4817j23407k23486l28353k62561m7455M447j46630
$$ plain form
7794 24011121 24864760 25831266 26837624 27703559 28306700 28749136 28963525 29196498 29484487
7785 29484487 29773435 30247917 30655032 30516189 29984630 29104387 28179641 27328947 26581843
7776 26581843 26375011 26368158 26425368 26479570 26685399 26861731 27225416 27741631 28288211 29037400
7766 29037400 29443897 29586451 29510162 29223380 29105897 29051420 29104761 29247103 29293967 29174168
7756 29174168 28805801 28493329 28062644 27859721 27574702 27201420 26589132 25719568 24711646
7747 24711646 23996219 23392882 23040112 22831870 22605510 22413287 22133706 21922795 21870952 21971260
7737 21971260 22272569 22767483 23328738 23860471 24351593 24546338 24509942 24192263 23890558 23681475
7727 23681475 23536390 23555328 23540511 23417104 23193618 22865265 22602704 22555249 22559696 22413066
7717B2413066m31315o23027p88068o31833m79786n03819l84337m95798o05018
7708A7470065m55184m68285n20729m42074l90880m52743l33395m62706n14790
7699A3429279m52162m24728l49755l86740k14461j93074j36369k4293j27239j6808
7689A1103650o360K341J94641Q9933K46550K70438K55560M61776L99476O65800
7679A3683805O81620L80649Q9497j71814m54056m62007k99175k26616k69288j63337
7669A2789278k26164k44953j16988k68011r3658r1940j24358p5534J08501J93876
7659A1850049J72358L12736p6772m45203p94413q14336q48610n80047n34415m11585
7649G829762k25525k19184j04001n2224j12022l2034L7172j50661j47344j31598
$$ plain form
7717 22413066 21981751 21358724 20570656 19938823 19459037 18955218 18570881 18075083 17470065
7708 17470065 17014881 16546596 16025867 15583793 15192913 14740170 14406775 13944069 13429279
7699 13429279 12977117 12552389 12202634 11815894 11601433 11408359 11271990 11247697 11120458 11103650
7689 11103650 11097290 11099631 11294272 11384205 11630755 11901193 12156753 12618529 13018005 13683805
7679 13683805 14365425 14746074 14835571 14663757 14209701 13747694 13448519 13221903 12952615 12789278
7669 12789278 12563114 12318161 12201173 11933162 11839504 11747564 11623206 11547672 11656173 11850049
7659 11850049 12022407 12335143 12258371 11813168 11018755 10204419 9355809 8775762 8241347 7829762
7649 7829762 7604237 7385053 7281052 7228828 7116806 7084772 7121944 6971283 6823939 6692341
7639F692341m4839r8923j32235k3727q2473j09242n9674j34393q0713p581N1974
7628E970515P2241N1619J67308K36120K44930K40066L99934L14380M96915N64909
7618H758937L37846n590l77785o54648p70362p33424n48970m32306k70562k90772
7608E012364k26841p4587r3820p0980o5318Q46o8739l6402L6091j06919k16368
7597D089327j99214j26481q7814k03409l9429p0347j62823o3236R2212Q4156r505
7586C303437N4375J47961J28362K7375j9677N3133r669j14243k09616j40789j98471
7575C022178r9044r3108j88615j24542j24088j40097o7256j93236P721R888j0201
7564A999600j2758l4554j2572K4019j7849n2669K2689L9270r4354K6813J51173
$$ plain form
7639 6692341 6647502 6548579 6416344 6392617 6310144 6200902 6141228 6006835 5926122 5918541 5970515
7628 5970515 6042756 6094375 6261683 6497803 6742733 6982799 7382733 7697113 8194028 8758937
7618 8758937 9096783 9091193 8713408 8058760 7288398 6554974 6006004 5573698 5303136 5012364
7608 5012364 4785523 4710936 4617116 4546136 4480818 4481664 4412925 4376523 4412614 4305695 4089327
7597 4089327 3890113 3763632 3675818 3472409 3432980 3362633 3199810 3136574 3228786 3312942 3303437
7586 3303437 3357812 3505773 3634135 3661510 3641833 3694966 3685297 3571054 3361438 3220649 3022178
7575 3022178 2923134 2830026 2641411 2516869 2392781 2252684 2185428 1992192 1999913 2009801 1999600
7564 1999600 1986842 1952288 1939716 1963735 1945886 1893217 1915906 1955176 1860822 1887635 2038808
7553B038808o0082P0006L4299P4681k2923k9746J75360R8920J48632P8878J05707
7542B712540P7450r0884N2613p8073j63693o2939j13820k25380j50076j9447n2057
7531A886234j12500j51591o7653k9639r1611L2572p3794l2748K4080l1762k3846
7520A327742m8213q884N9300o6780j6654J2077k9156o287L0837N7365N5409M9330
7508A416086n4538j07568n0710O2509q210l1384J20605l2733p2P4991p7640j9310
7496A292026P4208o9311n9462L9194n1197M0586r6988O9212l8392q8824R5766
7485A206818J218l3198K3316K0121n995o9576k6810q2502J853l4918J797m4663
7473I57461j6278k1945p5628j5220K6325Q5691j43545l8639M0576l2746m1447
$$ plain form
7553 2038808 1978726 2048732 2083031 2157712 2134789 2105043 2280403 2379323 2527955 2606833 2712540
7542 2712540 2789990 2699106 2751719 2673646 2509953 2447014 2333194 2107814 1957738 1938291 1886234
7531 1886234 1773734 1622143 1554490 1524851 1433240 1465812 1392018 1359270 1383350 1351588 1327742
7520 1327742 1279529 1270645 1329945 1263165 1246511 1258588 1229432 1223145 1253982 1311347 1366756 1416086
7508 1416086 1361548 1253980 1203270 1265779 1257569 1226185 1346790 1314057 1313985 1388976 1311336 1292026
7496 1292026 1366234 1296923 1237461 1276655 1225458 1266044 1169056 1238268 1199876 1111052 1206818
7485 1206818 1208036 1174838 1198154 1218275 1212280 1142704 1115894 1033392 1035245 1000327 1002124 957461
7473 957461 941183 919238 843610 828390 854715 940406 796861 758222 798798 766052 724605
7462G24605J15802O7714j10399p7154R8707l5554L2673J17566k7874l7257l3651
7451H35178k4226J4883q3278J4452L8834r7239q8747L7488k7665j25320L4071
7440E28431P8497J1027M6090l1186j4592J4327j06834p0332J21101m5322j49819
7429C81388k1244R6377P8546j02796K9969j0374N7622j14641J0950jL9003J07383
7417E52182j7652O813o785O0263j37975J2801l2809L6008j3017M5951p7396L7100
7405D65484L4946M9953l6569M746N9017N9822J3363M7234O710j7486m5829K6595
7393F67986R5362j19893M5290L865Q1479k1886o738M5158Q4635Q409j6952p2540
7381G94175J7594R255R6446o6791M0449j4141l5701M5282K4446J8620J9153N950
$$ plain form
7462 724605 840407 908121 797722 720568 819275 783721 816394 933960 906086 868829 835178
7451 835178 810952 825835 742557 757009 795843 698604 609857 647345 619680 494360 528431
7440 528431 606928 617955 664045 632859 618267 632594 525760 455428 576529 531207 381388
7429 381388 360144 456521 535067 432271 462240 451866 509488 394847 405797 405796 444799 552182
7417 552182 534530 541343 534558 594821 456846 469647 436838 472846 459829 505780 428384 465484
7405 465484 500430 550383 513814 518560 577577 637399 650762 697996 704706 687220 641391 667986
7393 667986 763348 643455 688745 692610 774089 752203 745465 790623 875258 883667 866715 794175
7381 794175 811769 821024 917470 850679 891128 876987 841286 886568 911014 929634 948787 954737
7369I54737M8593m9403k071J7738j8693K533P1163l5309M1208Q6210o129r268
7357A101309J3561k921o9899L3139K9971p1816K6887l8514p6027O828J997M4454
7345I98969q1914k6314n5629j8783L45J63585j03517n8363L0639O1917j6593L2195
7333I26537q2970j8842k795p5306Q6858J2410o6333P1506l1425R1487P114j09396
7321H08845L4884k6295J5967p7820M3177l3663n7569j10593L5011J05945j26740
7310F11149j58922P6010p8259k9005L5376N1197O274m8909J2923o1977L921k3387
7298C96391l4167j08785J6909M5321k866p669J3495j9019K6806L7462j462k8343
7286C34073K5039m9640l1771N1856K4909K3477K0523o7923p3132k9200R0219J13272
$$ plain form
7369 954737 1003330 953927 951856 969594 950901 953434 1024597 989288 1030496 1116706 1110577 1101309
7357 1101309 1114870 1111949 1042050 1075189 1105160 1033344 1060231 1021717 945690 952518 954515 998969
7345 998969 917055 890741 835112 816329 816674 980259 876742 818379 849018 910935 894342 926537
7333 926537 843567 824725 821930 746624 833482 845892 779559 851065 819640 911127 918241 808845
7321 808845 843729 817434 833401 755581 798758 765095 707526 596933 631944 737889 611149
7310 611149 452227 528237 449978 420973 456349 507546 513820 464911 477834 415857 419778 396391
7298 396391 362224 253439 270348 315669 312803 305134 318629 299610 326416 363878 362416 334073
7286 334073 359112 309472 277701 329557 354466 377943 398466 330543 257411 228211 318430 431702
7274D31702q4687k0245j5448j2890o7936j8954M9426K7239J38961n7087o2012
7263C08069o2501K6092J08115m0050n5139m9745o0830J19766n3048L4495j7370
7252B57854n4283J26134Q8133k2984r0486K1107P1511r744r5169l1359R3645R3564
7240D47923j53953N5420R7158m7632K6292N3801j11291L3769J30551k0646q6712
7229D24680k7413P879k0162j02019J34335n7238j4480q951J4282m123O1132J2936
7217D20858N0658Q687N8905p232r7017l7561L1354P8083N1798n2387l6776j9620
7205D49750N2169J11319o4462O5875l9328n328r0230L3721J90823k7839r0988
7194E85482K6530Q7023R185m8033N3852K6943J2819L4207o1300o225M2946J4494
$$ plain form
7274 431702 347015 326770 311322 298432 230496 211542 260968 288207 427168 370081 308069
7263 308069 245568 271660 379775 339725 284586 234841 174011 293777 240729 275224 257854
7252 257854 203571 329705 417838 394854 304368 325475 396986 387242 292073 260714 354359 447923
7240 447923 293970 349390 446548 398916 425208 479009 367718 401487 532038 511392 424680
7229 424680 397267 405146 384984 282965 417300 360062 345582 336631 350913 346790 407922 420858
7217 420858 471516 480203 539108 531876 434859 397298 428652 506735 558533 506146 469370 449750
7205 449750 501919 613238 548776 614651 575323 569995 479765 513486 704309 676470 585482
7194 585482 612012 699035 708220 660187 714039 740982 753801 788008 726708 720483 763429 777923
7182G77923K8042Q9906N1074m6977J55231M2501J29817P1392k6492L1787R7541
7171A401745Q4812O0831N9285K5679j2007J69485J1941N3894J73435J40318J52682
7160B322100j4517L3225P3111J00267P9432l1817r921J65133Q6758j8070j821
7149B783880J41222R7605J05625J22598J39189M1038J15060J64834N5040K85761
7139D051852K03377K67173K66038M26970L58141K66750L59100N58577N23082L83845
7129G664905M52583L21128K65709L14327K90007J26271L001j26468k21413l18940
7119H771110k16003k53172l70649m88165l13606k70621k82780k62490k02592k35989
7109E875043j46442j68031j44118N1783L4441m4238p5240J8627r6043J3992P7728
$$ plain form
7182 777923 805965 895871 946945 899968 1055199 1097700 1227517 1298909 1272417 1304204 1401745
7171 1401745 1486557 1547388 1606673 1632352 1620345 1789830 1801771 1855665 2029100 2169418 2322100
7160 2322100 2307583 2340808 2413919 2514186 2593618 2561801 2551880 2717013 2803771 2785701 2783880
7149 2783880 2925102 3022707 3128332 3250930 3390119 3431157 3546217 3711051 3766091 4051852
7139 4051852 4255229 4522402 4788440 5215410 5573551 5840301 6199401 6757978 7281060 7664905
7129 7664905 8117488 8438616 8704325 9018652 9308659 9434930 9437931 9311463 9090050 8771110
7119 8771110 8555107 8301935 7931286 7443121 7129515 6858894 6576114 6313624 6111032 5875043
7109 5875043 5728601 5560570 5416452 5468235 5502676 5458438 5383198 5401825 5305782 5319774 5397502
7098E397502M2378j2668n9358j29425R3388Q1941N5061P6920k875J07628J79440
7087E829932R5833K59497K11960J86755K48794J10940J68597J34202K05661J57779
7077G609950J85707K09513J33138J02076K54805J98123N4878J38582J16709J01900
7067I105381J74294k5448K8225J3885j32104k59348k56240l57691l41642l57762
7057G591550l77444l19162l63330l62323l14746l10138j90594k31529l34019q8147
7047D700118k03509p9291j02734O397q1329j41238o3773q3580j23936M6239k0089
7036C853275o5549l3466o9719o895P4317P6691K5201n765J6487M5429J13762J10191
7024D133959O9842J84623k1767J0441k986O5508n1757o8841r0163q3849j91060
$$ plain form
7098 5397502 5439880 5427212 5367854 5238429 5331817 5413758 5468819 5545739 5542864 5650492 5829932
7087 5829932 5925765 6185262 6397222 6583977 6832771 6943711 7112308 7246510 7452171 7609950
7077 7609950 7795657 8005170 8138308 8240384 8495189 8693312 8748190 8886772 9003481 9105381
7067 9105381 9279675 9254227 9282452 9296337 9164233 8904885 8648645 8290954 7949312 7591550
7057 7591550 7214106 6894944 6531614 6169291 5854545 5544407 5353813 5122284 4788265 4700118
7047 4700118 4496609 4417318 4314584 4320981 4239652 4098414 4034641 3951061 3827125 3873364 3853275
7036 3853275 3787726 3754260 3684541 3677646 3751963 3828654 3853855 3848090 3864577 3910006 4023768 4133959
7024 4133959 4203801 4388424 4366657 4377098 4374112 4439620 4387863 4319022 4228859 4145010 3953950
7013C953950j70505j15568j49755j12738o2649l2153j47974r6915o1154m8902
7003B955637K3504p5211q8637o3362M7512P2297j7652K9367O9764J01121P9922
6992C134262m4282J57270O8459M543j5818R3393M2528N4221J31374O6934J85893
6981C878777J54616K34976Q8087K34886L52449L16287K96668M30581M74606N73189
6971G035122Q82964Q24430P18134M71133K28846j14289k31515j8550J77669R6068
6961A0070012l99693n76232q72997r39412o50906m88352n19068l12600j90700
6952E120052j56123k18075j74479M2683r2455o1888n3656m3412Q4114q8125l1562
6941D327074Q5790L0750L0436j5371L4891J25451p2882J01031O1593R0133J00624
$$ plain form
7013 3953950 3783445 3667877 3518122 3405384 3342735 3310582 3162608 3065693 3004539 2955637
7003 2955637 2979141 2903930 2815293 2751931 2799443 2871740 2854088 2883455 2953219 3054340 3134262
6992 3134262 3089980 3247250 3315709 3320252 3304434 3397827 3440355 3494576 3625950 3692884 3878777
6981 3878777 4033393 4268369 4356456 4591342 4943791 5260078 5556746 5987327 6461933 7035122
6971 7035122 7918086 8742516 9460650 9931783 10160629 10046340 9814825 9796275 9973944 10070012
6961 10070012 9670319 9094087 8221090 7281678 6630772 6142420 5623352 5310752 5120052
6952 5120052 4963929 4745854 4571375 4614058 4521603 4459715 4406059 4362647 4446761 4358636 4327074
6941 4327074 4412864 4443614 4474050 4458679 4493570 4619021 4546139 4647170 4708763 4798896 4899520
6930D899520J25483R7021M0594R8071J41249J48697J95675O8497J47492K82039
6920F244338J43885K94867K27017L05874L89923L70365M32017N48610P31060Q25639
6910A0513595Q07099P77966O75115L93763J37816J18257L25598L92305N57848
6901A4699362M66080r9936l16513m88622m49036k56318j79500j23565j53065j50807
6891A2948080k20936m04622l20863l14160l87498j95532k68976l71418l76686
6882A0087389l61748k77036k19334o8317j86347j56442n5303k426r9838O6773
6872H727371K0964K7963Q6939J90375K28285K06180R5273J60741L15866M16496
6862A0476453L18968L92436L04238J88953K42280K93384J31191K04729K72241
$$ plain form
6930 4899520 5025003 5122024 5162618 5260689 5401938 5550635 5746310 5814807 5962299 6244338
6920 6244338 6388223 6683090 6910107 7215981 7605904 7976269 8408286 8956896 9687956 10513595
6910 10513595 11320694 12098660 12773775 13167538 13305354 13423611 13749209 14141514 14699362
6901 14699362 15165442 15065506 14748993 14260371 13811335 13555017 13375517 13251952 13098887 12948080
6891 12948080 12727144 12322522 12001659 11687499 11300001 11104469 10835493 10464075 10087389
6882 10087389 9725641 9448605 9229271 9160954 8974607 8818165 8762862 8760436 8660598 8727371
6872 8727371 8748335 8776298 8863237 9053612 9281897 9488077 9583350 9744091 10059957 10476453
6862 10476453 10795421 11187857 11492095 11681048 11923328 12216712 12347903 12552632 12824873
6853A2824873K1505k679j85550j95342k39488k07938j49578k83728k44147j62190
6843A1175738j79791j22482j53750k1199j32512k48837j25108P095o9667K1561
6833A0151048j57709q2541j95919j10662j84534j59850q5175j69274j69881j49756
6823H685747j62169q7249M8711j73799n2335O9294J6480K9395Q9168P9377N4336
6812H596956M0268J53833O7741N3756L8039J54645J94665J40067J22078Q5983
6802I648031J38340J09261J90599K26349J59757J92799K91225J95966L04376M71631
6792A1928334L05649N11460L22360L8890p2309m26087l50910l25478j72994k58195
6782A1500720m48051o91954p62349p11345o61386n75185m26883l94960k77646
$$ plain form
6853 12824873 12846378 12843699 12658149 12462807 12223319 12015381 11865803 11582075 11337928 11175738
6843 11175738 10995947 10873465 10719715 10698516 10566004 10317167 10192059 10199154 10129487 10151048
6833 10151048 9993339 9910798 9714879 9604217 9419683 9259833 9174658 9005384 8835503 8685747
6823 8685747 8523578 8436329 8485040 8311241 8258906 8328200 8344680 8374075 8463243 8542620 8596956
6812 8596956 8637224 8791057 8858798 8912554 8950593 9105238 9299903 9439970 9562048 9648031
6802 9648031 9786371 9895632 10086231 10312580 10472337 10665136 10956361 11152327 11456703 11928334
6792 11928334 12233983 12745443 13067803 13106693 13034384 12608297 12257387 11931909 11758915 11500720
6782 11500720 11052669 10360715 9598366 8887021 8225635 7650450 7223567 6828607 6550961
6773F550961m5350k59328k62161k07972L1595j47815j59188K6613k1040q8380
6763E417935L206N3588M1211P5320K38440J02487J62963K48734L42630N00002
6753G186516N36719N71773M58303N19916K60110J5593j74815j85718j49378j59211
6743H879808k20077l70061o44258o73324o46701o52580n51713l40435k68719l00596
6733D211344j62175j03517j24515j50025n7793j3813q7765j19251N6412R2063
6723C540965p2870p1656q2340j50846n9351r5022r5423L3380j07774m5588j31027
6712B662448j6382r4205m7265L8375O9609n0098p9040O7858j07814j00781R441
6701B352146k122l5714P4647J9667J3453n4217j8299P207m1274j31578K3419k5669
$$ plain form
6773 6550961 6505611 6246283 5984122 5776150 5807745 5659930 5500742 5527355 5506315 5417935
6763 5417935 5421141 5474729 5515940 5591260 5829700 5932187 6095150 6343884 6686514 7186516
6753 7186516 7723235 8295008 8753311 9273227 9533337 9548930 9374115 9188397 9039019 8879808
6743 8879808 8659731 8289670 7645412 6972088 6325387 5672807 5121094 4780659 4511940 4211344
6733 4211344 4049169 3945652 3821137 3671112 3613319 3599506 3511741 3392490 3448902 3540965
6723 3540965 3468095 3396439 3314099 3163253 3103902 3008880 2913457 2946837 2839063 2793475 2662448
6712 2662448 2646066 2551861 2504596 2542971 2612580 2562482 2483442 2551300 2443486 2342705 2352146
6701 2352146 2350024 2314310 2388957 2408624 2422077 2367860 2349561 2356768 2315494 2183916 2207335 2181666
6689B181666K3132q5161o4148K8407L5496j01452L0432p6733j28277r925l9457
6678A793980M2429k18931j24242J026m405q4859M9911j23725q8353O397p3551
6667A175677L1020o6649l3554M0421m6057k6205J9599J3149o9818J54943j08565
6656A083961n1740K6138k4661n1367j58549L6518J2020P0460r8950N3200j32050
6645G64980k7133P3341l9012P2206j03862J2367M5962J288r9392J2822m7867M0321
6633G06021M513k7202l4375R4464K3876j19288J73034k0445j44692k8417R5106
6622G22595o7736K4r7344N4919j00720m899N5791q7452O0288m785j5190K686M7121
6609E65298r3428j4706J14921m6877r670q5570M6596M2948L1439K4363K7855m7982
$$ plain form
6689 2181666 2204798 2119637 2055489 2083896 2119392 2017940 2048372 1971639 1843362 1833437 1793980
6678 1793980 1836409 1617478 1493236 1494262 1489857 1404998 1454909 1331184 1242831 1249228 1175677
6667 1175677 1206697 1140048 1106494 1146915 1100858 1074653 1094252 1107401 1037583 1192526 1083961
6656 1083961 1032221 1058359 1033698 982331 823782 860300 872320 942780 843830 897030 764980
6645 764980 737847 811188 772176 844382 740520 752887 798849 800137 700745 713567 665700 706021
6633 706021 710534 683332 648957 743421 767297 648009 821043 800598 655906 627489 722595
6622 722595 654859 654883 557539 612458 511738 506839 562630 475178 535466 530681 515491 518177 565298
6609 565298 471870 457164 572085 525208 515538 429968 476564 519512 550951 575314 603169 555187
6597E55187j32909R4485J8271l3750o6759Q3338o3403m9165n5626M254l7457K1839
6585C38305N7710m7998j8975p774L9929o2049M8277n0368K9770J1719J0298o9128
6573B79716M5986n2164O0419J220j7074J3952n8795j3149k6734O9671M3931n3473
6561B93506o1525R7298r485Q2713k4563K2170m4797n7877M0223p218o1363l1728
6549B37354m2369R4103J6129q0864q8693J09614N1004J5079J07591l7943n5588
6538C25417Q5130M9664n1072q5325J16452q326j28339O7968O7124o5586p51q3965
6526B88391J17441Q81m8943n1401p9554R7017k4102L7376n7759l8705J32243L1241
6514D04126j12477Q069N0265R1578r2851Q094j8180j05253J86154n3557J3563
$$ plain form
6597 555187 422278 516763 535034 501284 434525 517863 454460 405295 349669 353923 316466 338305
6585 338305 396015 348017 329042 321268 361197 299148 347425 297057 326827 338546 348844 279716
6573 279716 325702 273538 333957 335177 318103 332055 273260 260111 233377 303048 346979 293506
6561 293506 231981 329279 319794 402507 377944 400114 355317 297440 337663 330445 269082 237354
6549 237354 194985 289088 305217 224353 135660 245274 296278 311357 418948 381005 325417
6538 325417 410547 460211 409139 323814 440266 431940 303601 371569 438693 373107 372356 288391
6526 288391 405832 406713 357770 306369 226815 323832 299730 337106 279347 240642 372885 404126
6514 404126 291649 299718 349983 441561 348710 356804 338624 233371 419525 365968 379531
6503C79531J43580j50991M2359j01416m4012K2412j9236L1032k0792k4042k6327
6492B32098l8351j6408P6224k1289K39J2011J6182l1977Q9747j3490p4070N0733
6480B81649m0754R8247j8119r8371J11518R4202q9261r406K4630l3907j5190r1702
6468B13536K6710L990m0679P1238j1050J21652l4851j34092M7070M8439j4681
6457B97282l6685P3315L0126n762m3730K4781M1801n3503L2815L4777N373n7821
6445C42769n0536R1731M9778j91907M6718K7069q007n8312k615j1287P1620J54252
6433D61273j52869L3111k0047N4380L5199j21247m0954O249P2856j08597j4536
6422B04818J32021J1351K5061O0664q0996L3337o2117k9045m4628N0558K8528
$$ plain form
6503 379531 523111 372120 414479 313063 269051 291463 272227 303259 282467 258425 232098
6492 232098 193747 177339 253563 232274 232513 244524 260706 228729 318476 304986 230916 281649
6480 281649 240895 339142 321023 222652 334170 428372 339111 329705 354335 320428 305238 213536
6468 213536 240246 244236 203557 274795 263745 385397 350546 216454 263524 311963 297282
6457 297282 260597 333912 364038 358276 314546 339327 381128 327625 360440 395217 400590 342769
6445 342769 292233 383964 433742 241835 288553 315622 307615 249303 246688 235401 307021 461273
6433 461273 308404 341515 321468 375848 411047 289800 248846 255095 327951 219354 204818
6422 204818 336839 348190 373251 433915 352919 386256 324139 295094 250466 301024 329552
6411C29552P286O8155p3211j04931J5618N8071J718O2419k3811l4255m4486O5188
6399C27313k9434M1491K9681j4695J7192J2880J8937m5085n488j4702l5992O2763
6387C64861N0158k9540o884K1240O6291J4918k2772j850k3499l311N8090J2149
6375D99851J3983p6429k3466R8635q6655O8268n3250O4435K4741m7599p8621N2106
6363D55999M159M5421J206J0296l328J8883p0195j2447M8191K0825O6213j18384
6351D66839K6120N1525J5116q6252P2470j13207r418M5618J01928K1591q0584
6340E11746M1564N1275P3414L20n8587J3034K7L4325L3898J973l1223K9756j5498
6327F86024k6679k8500n0825J0289K9680k1077L0296L4529J3212Q140j6440j04278
$$ plain form
6411 329552 336838 404993 331782 226851 242469 300540 302258 364677 340866 306611 262125 327313
6399 327313 297879 339370 369051 354356 371548 384428 403365 358280 352792 338090 302098 364861
6387 364861 415019 385479 378595 399835 466126 481044 458272 456422 432923 429612 487702 499851
6375 499851 513834 437405 413939 512574 425919 494187 440937 505372 530113 482514 403893 455999
6363 455999 460158 505579 506785 517081 513753 532636 462441 449994 498185 519010 585223 466839
6351 466839 492959 544484 559600 473348 545818 432611 423193 468811 570739 592330 511746
6340 511746 553310 604585 677999 678319 619732 632766 632793 667118 701016 702989 671766 701522 686024
6327 686024 659345 630845 580020 590309 619989 598912 629208 663737 676949 685089 668649 564371
6315E64371J21990k0522q0707O3558Q7574m7408L73Q905Q291p1636n723R1575
6303G20641O5669j5295j18943L2166L2038N3530L64J08597p0367J1901R8716n7754
6291H61263l3750P0979j00325J80898P1888j2331n8095p1001m9256N9022J67228
6280A086520R3788n554l1968N5479L4456Q5300k2293R5654Q4443m3566j8745O0400
6268A473914J20342M1644Q5141j0901J2926l4630J38513N3615Q0996N6274M1859
6257B059693J15483J3744R1609J39766J33885J8104L8597K31554J0857m3111P8552
6246B888733K2301R7563J10797K04961J18707P6502R1973M2713J20505J01742
6236C876497r685j17222j12399p5920k77671j73632j02073j16162j39583k18634
$$ plain form
6315 564371 686361 665839 585132 648690 736264 688856 689229 698134 706425 634789 629066 720641
6303 720641 786310 771015 652072 684238 716276 769806 770170 878767 808400 820301 919017 861263
6291 861263 827513 898492 798167 979065 1050953 1038622 980527 909526 860270 919292 1086520
6280 1086520 1180308 1174754 1142786 1198265 1232721 1318021 1295728 1391382 1475825 1432259 1413514 1473914
6268 1473914 1594256 1635900 1721041 1710140 1723066 1688436 1826949 1880564 1961560 2017834 2059693
6257 2059693 2175176 2188920 2280529 2420295 2554180 2572284 2610881 2842435 2853292 2810181 2888733
6246 2888733 2911034 3008597 3119394 3324355 3443062 3519564 3611537 3654250 3774755 3876497
6236 3876497 3866812 3749590 3637191 3561271 3283600 3109968 3007895 2891733 2752150 2533516
6226B533516q7257L2191j33866j43193m2487r9480J172j22956m8065r4598k2371
6215A772606P242j14355j05946L7592m4021q9272m8811k4309K2737m1078N9980
6204A432365J7984n4283l5703J08156r8643q7587P857k2073L4654M9754J3693
6193A366174l3183o4046L3856L8374L4023k3692K0208m9827j1929K6520R8853
6182A435331j23759K6476p512M945J9382J40522j8423k5822J2213j7471J56128
6171A602010P3540r8566L723k9876L2407Q0160n3582l6820P5051R2522q216O7478
6159A799831l2472j29856J42712J03036p3459J8869O6709m539M190J30902J1571
6148B037494n5518M5333j28758J50442J01660P2496N9436m8022Q0313J204L4133
$$ plain form
6226 2533516 2446259 2478450 2344584 2201391 2158904 2059424 2060596 1937640 1889575 1794977 1772606
6215 1772606 1779848 1665493 1559547 1597139 1553118 1463846 1415035 1390726 1413463 1372385 1432365
6204 1432365 1450349 1396066 1360363 1468519 1369876 1282289 1290146 1268073 1302727 1352481 1366174
6193 1366174 1332991 1268945 1302801 1341175 1375198 1351506 1371714 1321887 1309958 1336478 1435331
6182 1435331 1311572 1338048 1330536 1335481 1354863 1495385 1476962 1451140 1463353 1445882 1602010
6171 1602010 1675550 1576984 1580707 1550831 1583238 1663398 1609816 1572996 1648047 1740569 1732353 1799831
6159 1799831 1767359 1637503 1780215 1883251 1809792 1828661 1895370 1890831 1895021 2025923 2037494
6148 2037494 1981976 2027309 1898551 2048993 2150653 2223149 2282585 2234563 2314876 2316080 2350213
6137B350213J2893Q228Q484M2037Q8028k856k7186J39067P3626N4183p2350J47380
6125B821747M2102J27545J33994O0405R941J5213R6736J70570K12268O0695O3989
6114C815205J84406J18418K40818J39369K36992J66674J64818K78090M39531K42661
6104F026982L74260N70613M92917L91751L02842L10291P3100K0865j27437J9473
6094H455657R755J41842K06609P9212M05765L99961M96869M26314O43365O81983
6084A1947332P72595R36122Q62013P53547N10128J1435m03542n75799n08323n62472
6074A3743036l92358l05477j26689M0505J31236K05976L89401M63580L21489M50923
6064A4921622M55117N49728L90414L31436J23027l13855l33721l15894m05274
$$ plain form
6137 2350213 2363106 2371334 2379818 2421855 2509883 2507027 2479841 2618908 2692534 2746717 2674367 2821747
6125 2821747 2863849 2991394 3125388 3185793 3195734 3210947 3307683 3478253 3690521 3751216 3815205
6114 3815205 3999611 4118029 4358847 4498216 4735208 4901882 5066700 5344790 5784321 6026982
6104 6026982 6401242 6971855 7464772 7856523 8159365 8469656 8542756 8563621 8436184 8455657
6094 8455657 8465412 8607254 8813863 8893075 9298840 9698801 10195670 10621984 11265349 11947332
6084 11947332 12719927 13656049 14518062 15271609 15781737 15793172 15389630 14813831 14305508 13743036
6074 13743036 13350678 13045201 12918512 12959017 13090253 13296229 13685630 14149210 14470699 14921622
6064 14921622 15376739 15926467 16316881 16648317 16771344 16457489 16123768 15807874 15402600
6055A5402600l10636k61173j25340O2326J46238J31958K02583K65295M30563M20620
6045A6365034N54886M67430N72687N57217P03719Q15578Q69753Q11109J014948
6036B2732361R10429P93047O66918M97656L83982L30802K00896K25283L96418
6027B7137792L22559N11811N80892Q98098R96599J050366J157260J260333J080343
6018C4996053Q11961M55809J48558j02039n69802n59268m36984n18993m16769
6009C3808526k19841j89487j27937j9912j02655j7292j3231k67654k89829o73020
5999C1887668q32251j239403j180999j176314j195837j027788q51190p83773q95822
5990B2704291n20083n71214n92095n39658n21179n03623m15371n58299o06754
$$ plain form
6055 15402600 15091964 14830791 14705451 14767777 14914015 15045973 15248556 15513851 15944414 16365034
6045 16365034 16919920 17387350 17960037 18517254 19220973 20036551 20906304 21717413 22732361
6036 22732361 23642790 24435837 25102755 25600411 25984393 26315195 26516091 26741374 27137792
6027 27137792 27460351 27972162 28553054 29451152 30447751 31498117 32655377 33915710 34996053
6018 34996053 35808014 36263823 36412381 36310342 35740540 35181272 34744288 34225295 33808526
6009 33808526 33588685 33399198 33271261 33251349 33148694 33131402 33118171 32850517 32560688 31887668
5999 31887668 31055417 29816014 28635015 27458701 26262864 25235076 24383886 23600113 22704291
5990 22704291 22184208 21612994 21020899 20481241 19960062 19456439 19041068 18482769 17876015
5981A7876015n80922o37327m91298n27955n57364l88361n15766n10286m70935
5972A3195801m05174k85929l41509k06956k37219k65321j68259r3542j28999k33698
5962A0829195n6756j60647m7698m3986r5415n0249m7006j3071O8051N3690Q5458
5951A0521566J07375J46310J81415R5782K25646J57700J96738J50781K57515O2355
5941A2103183J36673K38175J94907P3306r3785M0689J82676R5673J76423K77095
5931A3425015J68243J68748J79544J55571K19774L39054K39921L21613L65042
5922A5582525K70396K29803K6752q3505j40313k24334k59814k28245r0937j5684
5912A5066644j86897k61708j90154j97077n6208j24256o5052K1287P3027R8341
$$ plain form
5981 17876015 17295093 16657766 16166468 15638513 15081149 14692788 14177022 13666736 13195801
5972 13195801 12790627 12504698 12163189 11956233 11719014 11453693 11285434 11191892 11062893 10829195
5962 10829195 10772439 10611792 10564094 10520108 10424693 10374444 10327438 10314367 10382418 10436108 10521566
5951 10521566 10628941 10775251 10956666 11052448 11278094 11435794 11632532 11783313 12040828 12103183
5941 12103183 12239856 12478031 12672938 12746244 12652459 12693148 12875824 12971497 13147920 13425015
5931 13425015 13593258 13762006 13941550 14097121 14316895 14655949 14895870 15217483 15582525
5922 15582525 15852921 16082724 16109476 16025971 15885658 15661324 15401510 15173265 15082328 15066644
5912 15066644 14879747 14618039 14427885 14230808 14174600 14050344 13985292 14006579 14079606 14177947
5902A4177947p9752m7274N6283k22456m1247j46659j77283j39521k84309k31584
5892A2864145k14489l21321m87794l01115k00077l81264k70355k78909k53629
5883A0155192j92200j50127k36820j04309j60146o6159n6878m9277K0898o4577
5873I095597q1991j44270p1860j86455p7245k57560k61829j37515j59288k34052
5863G483532p9946j30932j71160l2170m1197l9058j2580j7586J34806R2520Q7099
5852G273328P9503J22300R4571Q1972n6777j97704j85250j04119j36355j50777
5842F820692J2733n1205l0410J31075P0053J49360J65748J71679K78673K30810
5832G949208K80952L24282K97870P9859l2407j00127l29589k83986k41736j25099
$$ plain form
5902 14177947 14098195 14050921 14107204 13884748 13843501 13696842 13519559 13380038 13095729 12864145
5892 12864145 12649656 12328335 11840541 11539426 11339349 10958085 10687730 10408821 10155192
5883 10155192 9962992 9812865 9576045 9471736 9311590 9245431 9188553 9139276 9160174 9095597
5873 9095597 9013606 8869336 8797476 8611021 8533776 8276216 8014387 7876872 7717584 7483532
5863 7483532 7403586 7272654 7101494 7069324 7028127 6989069 6976489 6958903 7093709 7186229 7273328
5852 7273328 7352831 7475131 7569702 7651674 7594897 7397193 7211943 7107824 6971469 6820692
5842 6820692 6833425 6782220 6751810 6882885 6952938 7102298 7268046 7439725 7718398 7949208
5832 7949208 8230160 8554442 8852312 8932171 8899764 8799637 8470048 8186062 7944326 7819227
5822G819227j99003j76277j1490L6704J39169R1010L08490L98610L43960M57188
5812I207588O00851N11494M15488J02192k01973m33916n86900o72012o99607n65319
5802G677886l81636j71117k24243j93803n5006j85834J86505J57570J86817J45199
5792G142338K74629J41490J2427p8790l56125l58956l98767m54367l47122l10284
5782E266473k42162k00116k23794j33872j77806j21157j6385r7111r5071r8974
5772C860025n1787Q245r7630r2613j02036o164k3585M6695M925p6496q3358P2972
5760C459193k0585j36302L3361P3800k4289n2841L3799m1178n3154k7252l4165
5749C210387L5395m2256M4664K6443K9591n0360j67071r8237J82055j1312Q02
$$ plain form
5822 7819227 7620224 7443947 7432457 7469161 7608330 7699340 8007830 8406440 8750400 9207588
5812 9207588 9808439 10319933 10735421 10837613 10635640 10201724 9614824 8942812 8243205 7677886
5802 7677886 7296250 7125133 6900890 6707087 6652081 6466247 6652752 6810322 6997139 7142338
5792 7142338 7416967 7558457 7570884 7492094 7135969 6777013 6378246 5923879 5576757 5266473
5782 5266473 5024311 4824195 4600401 4466529 4288723 4167566 4151181 4054070 3958999 3860025
5772 3860025 3808238 3816483 3718853 3626240 3524204 3518040 3494455 3541150 3546075 3469579 3386221 3459193
5760 3459193 3438608 3302306 3335667 3409467 3385178 3332337 3366136 3324958 3271804 3244552 3210387
5749 3210387 3245782 3203526 3248190 3274633 3304224 3253864 3086793 2988556 3170611 3159299 3160101
5738C160101P9671j5650k0995Q7157K2985R9772J1233J8556p4733R2272k7900
5727C432469J3290J44410J4159L3327J1457P3758P6235q2763J04282r705j7637
5716C793282J07060Q1277N3983p3839Q7950R1785O9736N7767J05158m7063J1028
5705D338124R7524Q4718j7889M1991M7349K14062m280O4518K53831Q1115K7483
5694E228546J05728J76078J6677J37891J68025N4886J67069J18632K27725P9898
5684F481155K12263K27424J38742J44586K52797K24423J40410K76446K43360K31782
5674H573388L39014K50554L14638L67815L78131L60213L84372L83168L91413N87755
5664A2330461M47403N83617Q09286O62926P41584P95672R46498J113384J064067
$$ plain form
5738 3160101 3239772 3224122 3203127 3290284 3313269 3413041 3424274 3442830 3368097 3460369 3432469
5727 3432469 3445759 3590169 3604328 3637655 3649112 3722870 3799105 3716342 3820624 3810919 3793282
5716 3793282 3900342 3981619 4035602 3961763 4049713 4141498 4211234 4269001 4374159 4327096 4338124
5705 4338124 4435648 4520366 4502477 4544468 4591817 4805879 4801599 4866117 5119948 5201063 5228546
5694 5228546 5334274 5510352 5527029 5664920 5832945 5887831 6054900 6173532 6401257 6481155
5684 6481155 6693418 6920842 7059584 7204170 7456967 7681390 7821800 8098246 8341606 8573388
5674 8573388 8912402 9162956 9477594 9845409 10223540 10583753 10968125 11351293 11742706 12330461
5664 12330461 12777864 13361481 14170767 14833693 15575277 16370949 17317447 18430831 19494898
5655A9494898J291902J136067J045384J003855O81059N66932M90926N57407N18039
5646B6786469P64013J130708J161274J089158Q99801Q89785Q89945Q79012R54184
5637C5444349R37239Q18091O71908L52184r847k36835j62930j26110J90565N09657
5627C8388271R06544J061732J153282J087556Q37760P78477M76275O72844L5583
5618D5398324l43508n26267q87320j199478r92739n94727l11914j16797L0232
5609D0455806J53895O8711K49166L29900L42382L44100J70839Q4416J18231O9307
5599D2386753J97461K25128M88801M25148N1072l87580m98129n90010p73563p69454
5589D0755627n06869l53040l69763m54477m01082k96231l08890l08085k59737
$$ plain form
5655 19494898 20786800 21922867 22968251 23972106 24653165 25220097 25711023 26268430 26786469
5646 26786469 27550482 28681190 29842464 30931622 31831423 32721208 33611153 34490165 35444349
5637 35444349 36381588 37199679 37871587 38223771 38213924 37977089 37814159 37688049 37878614 38388271
5627 38388271 39294815 40356547 41509829 42597385 43435145 44213622 44689897 45362741 45398324
5618 45398324 45054816 44528549 43641229 42441751 41449012 40854285 40542371 40425574 40455806
5609 40455806 40609701 40678412 40927578 41257478 41599860 41943960 42114799 42199215 42317446 42386753
5599 42386753 42584214 42809342 43298143 43723291 43774363 43386783 42888654 42298644 41525081 40755627
5589 40755627 40248758 39895718 39525955 39071478 38670396 38374165 38065275 37757190 37497453
5580C7497453J0034J09423k5998M3014K57675L36502L37046N30792L91641L21000
5570C9808582L64920K97338J05816j16398j15572j33701k05036k12884j62760
5561C9630305j17845N6441J29926J80487M88633L93742M37033L62965N18888P13415
5551D2793990O10412P78990Q10873R58982J082385J024305R27296J015370J156367
5542E1158970J039063Q01509N96911K88924J68464Q5936j64641j88298j79858
5533E3606980k59450l78131k68398k60706k73222l25019j64251L416Q2296J65365
5523E1928880M08026O14907P19314R63439J028519J325299J392953J275172J271464
5514F0927973J245280J075050J101683J152999J137225J094364J108388J182552
$$ plain form
5580 37497453 37507487 37616910 37590912 37633926 37891601 38228103 38565149 39095941 39487582 39808582
5570 39808582 40173502 40470840 40576656 40460258 40344686 40210985 40005949 39793065 39630305
5561 39630305 39512460 39568901 39698827 39879314 40367947 40761689 41198722 41561687 42080575 42793990
5551 42793990 43404402 44183392 44994265 45953247 47035632 48059937 48987233 50002603 51158970
5542 51158970 52198033 52999542 53596453 53885377 54053841 54139777 53975136 53786838 53606980
5533 53606980 53347530 52969399 52701001 52440295 52167073 51842054 51677803 51681219 51763515 51928880
5523 51928880 52336906 52951813 53671127 54634566 55663085 56988384 58381337 59656509 60927973
5514 60927973 62173253 63248303 64349986 65502985 66640210 67734574 68842962 70025514
5506G0025514J114672J157858J361674J392810J312098J031790N74711K70290
5498G8241417O2065l75846o06546q10826j016309j004996j115867j218242j446972
5489G0707878j922767j954755k186934j977346j729801j396467j385075j431085
5481E6723648j245203j289208j318292j103774r02494p92072m57551k84484k39885
5472D9090685k68499m38523n77957p95355r08404j111515j181225j025910j106834
5463D1676463q04125q48979o45454n42579n11757l82034m60601k53633m56588
5454C6770713o09052o88481q18890q97127r17813q93450r05151q76768r07073
5445B9256908q54768o76762o08875o43069o61457o30791m45497m67354l51621
$$ plain form
5506 70025514 71140186 72298044 73659718 75052528 76364626 77396416 77971127 78241417
5498 78241417 78303482 77927636 77321090 76510264 75493955 74488959 73373092 72154850 70707878
5489 70707878 68785111 66830356 64643422 62666076 60936275 59539808 58154733 56723648
5481 56723648 55478445 54189237 52870945 51767171 50864677 50072605 49615054 49330570 49090685
5472 49090685 48822186 48383663 47805706 47010351 46101947 44990432 43809207 42783297 41676463
5463 41676463 40872338 40023359 39377905 38835326 38323569 37941535 37480934 37227301 36770713
5454 36770713 36161661 35473180 34654290 33757163 32839350 31945900 31040749 30163981 29256908
5445 29256908 28402140 27725378 27116503 26473434 25811977 25181186 24735689 24268335 23916714
5436B3916714j25234m4291J21159R2393o93358p92191r23248j175215j260151
5427A9116578j251326j041636q42718p12265o66945m69456m47718l49336n23165
5418A2812013m49505k44481l32115k83026k61234j66429k51001k68388j61895
5409A0393939j89350m5032j21364j62103j55103j00093k38663j70092k26058j01593
5399H884488l5528k15302l2388j02931j13555j17811q5616o7079m3971n6946J50477
5388H163838R462r3349j6842q6283j09091p5674K7370j04366q0770j80453j68231
5377G285611n7015k24914j56516j7156j03374j65924j30147j08511n6049J2197
5367F278202J4681j23772j61950j45441q24p0080o8305k2586j1784M7622j91820
$$ plain form
5436 23916714 23791480 23747189 23868348 23960741 23267383 22475192 21551944 20376729 19116578
5427 19116578 17865252 16823616 15980898 15268633 14601688 14132232 13684514 13335178 12812013
5418 12812013 12362508 12118027 11785912 11502886 11241652 11075223 10824222 10555834 10393939
5409 10393939 10204589 10159557 10038193 9876090 9720987 9620894 9382231 9212139 8986081 8884488
5399 8884488 8848960 8633658 8601270 8498339 8384784 8266973 8181357 8114278 8070307 8013361 8163838
5388 8163838 8173300 8079951 8063109 7976826 7867735 7792061 7819431 7715065 7634295 7453842 7285611
5377 7285611 7228596 7003682 6847166 6830010 6726636 6560712 6430565 6322054 6266005 6278202
5367 6278202 6292883 6169111 6007161 5861720 5860896 5790816 5722511 5699925 5688141 5735763 5543943
5356E543943q7960r1468L9992L8154l4177o5517Q1785M1910J5538R4568p0509
5345E506259L7608J16147J01398K90613J86214J03464J1048j57461j75583l56105
5335E663602k64598k36584m3244j16577Q253j30654k3125j4659n484J926L0998
5324D869854j33006l1726Q7716k584l0512p1304L940N9516R0255j21547o7040
5313D653562M2529K1279M3328P5475j9128K3495M8925J26732Q51M4955R7851J0255
5301E170109K31473K78360J15692J00322Q401k00975p8639k80767j84846k29104
5291D930026j48600J790r5842Q4305K9976r1010k4356K3356o7390l5308o2728
5280D544219N8408r0468j159P6363J581o6640n267l7564R9384O7472o9962l6561
$$ plain form
5356 5543943 5455983 5364515 5404507 5442661 5408484 5342967 5424752 5466662 5482200 5576768 5506259
5345 5506259 5543867 5660014 5761412 6052025 6238239 6341703 6352751 6195290 6019707 5663602
5335 5663602 5399004 5162420 5119176 5002599 5010852 4880198 4857073 4842414 4836930 4838856 4869854
5324 4869854 4736848 4705122 4792838 4790254 4759742 4688438 4692378 4751894 4842149 4720602 4653562
5313 4653562 4696091 4717370 4760698 4836173 4817045 4840540 4889465 5016197 5017048 5062003 5159854 5170109
5301 5170109 5401582 5679942 5795634 5895956 5904357 5703382 5624743 5343976 5159130 4930026
5291 4930026 4781426 4783216 4687374 4771679 4801655 4710645 4686289 4709645 4642255 4606947 4544219
5280 4544219 4602627 4512159 4511000 4587363 4588944 4522304 4517037 4479473 4578857 4646329 4576367 4539806
5268D539806n4687M1028O4652L2538J12650o2707n9369N717M5153j499l1615n4029
5256D577638K4228m9418J9967J40808l539K1754K7119O1962J10655m7922j7860
5245D865392o231p1281N0873J20670m230N8751J9176K1497o4096L348l8971l0891
5233D924007j0825q885Q789m0481J9423l6882N0285J08134n8659N4440J04186
5222E113532l16L2311J31712J66110J03439M5570N2294k302K06847R3403n0958
5211E891642J7684J68217R0598P3834J71919K22760J42099K42232J28903J5837
5201G165725J07090L8863L8238P1876J48706O5191K07204J53534Q8759M8852N3094
5190H187132l7260J84442L7499J69224J41439K00608K71052K10161J95918L29456
$$ plain form
5268 4539806 4485119 4526147 4590799 4623337 4735987 4673280 4613911 4619628 4664781 4663282 4631667 4577638
5256 4577638 4601866 4552448 4572415 4713223 4709684 4731438 4758557 4820519 4931174 4883252 4865392
5245 4865392 4859161 4787880 4838753 4959423 4955193 5013944 5033120 5054617 4990521 4993869 4954898 4924007
5233 4924007 4913182 4904297 4913086 4872605 4892028 4855146 4905431 5013565 4954906 5009346 5113532
5222 5113532 5113216 5145527 5277239 5443349 5546788 5592358 5644652 5642350 5849197 5942600 5891642
5211 5891642 5909326 6077543 6168141 6241975 6413894 6636654 6778753 7020985 7149888 7165725
5201 7165725 7272815 7311678 7349916 7421792 7570498 7635689 7842893 7996427 8085186 8134038 8187132
5190 8187132 8149872 8334314 8371813 8541037 8682476 8883084 9154136 9364297 9560215 9889671
5180I889671K71209J64905J80230L80366L22624K95867L03245L52232L68085K60057
5170A2788491L07497M04106N38292O18806N18881O92900P49840O28350P61376
5161A8008539Q80832R27279Q98041J207280J339187J395118J528912J802318J866886
5152B9854392K166010K118359K104431K411309K441561K634257K458188K190417
5144D8378924J466087O24184j85020j035231j198787j165814r14762m27487j51130
5135D5390964j63176J37668L39088O82033Q67240J184720J163474J604723J769867
5126E2976601K088949K322443K733863K919729L706658M310882M888743N776656
5118H1724524O687800P668081R207323J0877893J3565286J6744238K1461228K7822791
$$ plain form
5180 9889671 10160880 10325785 10506015 10886381 11209005 11504872 11808117 12160349 12528434 12788491
5170 12788491 13095988 13500094 14038386 14657192 15176073 15868973 16618813 17247163 18008539
5161 18008539 18889371 19816650 20714691 21921971 23261158 24656276 26185188 27987506 29854392
5152 29854392 32020402 34138761 36243192 38654501 41096062 43730319 46188507 48378924
5144 48378924 49845011 50469195 50284175 49248944 48050157 46884343 45969581 45542094 45390964
5135 45390964 45227788 45365456 45704544 46386577 47253817 48438537 49602011 51206734 52976601
5126 52976601 55065550 57387993 60121856 63041585 66748243 71059125 75947868 81724524
5118 81724524 88412324 96080405 105287728 116165621 129730907 146475145 167936373 195759164
5110A95759164L7849853M2860891L3871355J5240136j2733820l2686327m4696280
5103B35464972m3336744l3870350k3354398j6818915j2526048r628962p426703
5096H8502852o053581m489952l508497k678054j972188j537814r11764m29539
5088F6921463l34323N6269M52814O16215P81341J005790J326132J487727J857224
5079G4170652K322140L082170L615211M670527N475353O528851P816720R826065
5071A17507689J2077431J5133894J9051257K4990926L3768909M0062768L1170949
5064B93763823K1406951n876853k8895508m0328031m3433804l6303539k6463257
5057A33869782j8453164j4290009j0658502q687984o648742n663979m542444l905348
$$ plain form
5110 195759164 233609017 276469908 310341263 325581399 312847579 280161252 235464972
5103 235464972 192128228 158257878 134903480 118084565 105558517 95929555 88502852
5096 88502852 82449271 77959319 74450822 71772768 69800580 68262766 67351002 66921463
5088 66921463 66587140 66643409 67096223 67712438 68493779 69499569 70825701 72313428 74170652
5079 74170652 76492792 79574962 83190173 87860700 93336053 99864904 107681624 117507689
5071 117507689 129585120 144719014 163770271 188761197 222530106 262592874 293763823
5064 293763823 315170774 309293921 280398413 240070382 196636578 160333039 133869782
5057 133869782 115416618 101126609 90468107 81780123 75131381 69467402 64924958 61019610
5049F1019610l220189k820900k399905k277925j840709j641569j472624j559831
5041D3785958j356716j213032j193807j306243j043027r06854r59206r65789p50716
5032C4090568q94350p33714p80146p07291n83386n28606o57605l61180n30637
5023B8313653l76566m42176l49601m10015k66109k00386j90953k37590l10765
5014B5529492n30824m39588n53969l45249m09640k90254l41204j73674j09365
5005B2335725j29318p0081m0504j60624k51352m59359l35012l27025m11239k77534
4995A9873677o6209j19437p2807K5403J77400J62192K54378J94011K90737K55160
4985B0974505O4030l146M7241q0212r9501k90369k23127l14297l26237l38596
$$ plain form
5049 61019610 57799421 54978521 52578616 50300691 48459982 46818413 45345789 43785958
5041 43785958 42429242 41216210 40022403 38716160 37673133 36766279 35807073 34841284 34090568
5032 34090568 33196218 32462504 31682358 30975067 30391681 29863075 29205470 28844290 28313653
5023 28313653 27937087 27494911 27145310 26735295 26469186 26268800 26077847 25840257 25529492
5014 25529492 24998668 24559080 24005111 23659862 23250222 22959968 22618764 22445090 22335725
5005 22335725 22206407 22136326 22095822 21935198 21683846 21224487 20889475 20562450 20151211 19873677
4995 19873677 19807468 19688031 19615224 19640627 19818027 19980219 20234597 20428608 20719345 20974505
4985 20974505 21038535 21035389 21082630 21002418 20902917 20612548 20389421 20075124 19748887 19410291
4975A9410291k16207l14315l09823j82099k07410j11531j14865q5586q8853R3762
4965A7873364J95246K63203L69125L17096L40384K03298K61237Q1711j88746k26544
4955A9489374k60946o0118J3274Q1440L93058M59759N25626M66733K42273J54657
4945B1505130l8283q6913r4077k23482k73112k30751l33532k02743k94717m28699
4935A9298821l54048l39343m20058m27709k97041k16124k51142j45440j88327
4926A6659589k31911k80345k35686k00978k24035j64014l08888l09876l14486
4917A4389370k08132j96216q9489K2921j85668o5774q5800R1093k831j29263N833
4906A3546044r538j9936n9242l4900j48617M748k6589j58109L1516L7420M7754
$$ plain form
4975 19410291 19194084 18879769 18569946 18387847 18180437 18068906 17954041 17868455 17779602 17873364
4965 17873364 18068610 18331813 18700938 19018034 19358418 19561716 19822953 19904664 19715918 19489374
4955 19489374 19228428 19168310 19181584 19263024 19656082 20115841 20641467 21108200 21350473 21505130
4945 21505130 21466847 21379934 21285857 21062375 20789263 20558512 20224980 20022237 19727520 19298821
4935 19298821 18944773 18605430 18185372 17757663 17460622 17244498 16993356 16847916 16659589
4926 16659589 16427678 16147333 15911647 15710669 15486634 15322620 15013732 14703856 14389370
4917 14389370 14181238 13985022 13895533 13918454 13732786 13667012 13581212 13672305 13669474 13540211 13546044
4906 13546044 13536506 13516570 13457328 13422428 13273811 13278559 13251970 13093861 13125377 13162797 13210551
4895A3210551Q9604j5745J99669J07482R632J57591J41892K38608J91122K47692
4885A4578098K01204L60653L14374M32872M16267L42026M79509O22920O02806
4876A8350729O40640P46638P99512R89999P38772P83850O98970N32337M49681
4867B4731128M44302P39647O41700O42114N90958O57987N67563P52389O48164
4858C0415952O50576O75752P39309P58962Q23473Q99964J005951R76022J033004
4849C7978965J120603J107961J142234R82446Q09406R11365R52633R69180R10521
4840D6885314R25934J181576J143667R19973P80141M21551N52876Q81307J127101
4831E4819440J623478K382267K947296K993911K185262Q71355m90264j429004
$$ plain form
4895 13210551 13300155 13284410 13484079 13591561 13601193 13758784 13900676 14139284 14330406 14578098
4885 14578098 14779302 15139955 15454329 15887201 16303468 16645494 17125003 17747923 18350729
4876 18350729 18991369 19738007 20537519 21527518 22266290 23050140 23749110 24281447 24731128
4867 24731128 25175430 25915077 26556777 27198891 27789849 28447836 29015399 29767788 30415952
4858 30415952 31066528 31742280 32481589 33240551 34064024 34963988 35969939 36945961 37978965
4849 37978965 39099568 40207529 41349763 42332209 43141615 44052980 45005613 45974793 46885314
4840 46885314 47811248 48992824 50136491 51056464 51836605 52258156 52811032 53692339 54819440
4831 54819440 56442918 58825185 61772481 64766392 66951654 67823009 67332745 65903741
4823F5903741j910809j994983k223189k661132l131546l363647l353845k885066
4815D4379524k610723k205033j884635j622032j397871j287593j121994r42625
4807C1307018q04446r85669q90034p99851q24326o30790n10461m65849j74106
4798B5221486r3700M0001K52677K08871K71030J80253m3361l14998l79141n01533
4788B4841585m76927l49214m29665j8334m1350J19756L31839M51233L78900L60919
4778B5168742P0530J06606p4534m20840o37011p45035r65114j012984j011195
4769B0479165p56176n83355m37589k45270k88337k17095r3473j23948j20107k58421
4759A7355394n88850q75248q33536q83617p05456q52928p36029n78919o20674
$$ plain form
4823 65903741 63992932 61997949 59774760 57113628 53982082 50618435 47264590 44379524
4815 44379524 41768801 39563768 37679133 36057101 34659230 33371637 32249643 31307018
4807 31307018 30502572 29516903 28626869 27827018 27002692 26371902 25861441 25395592 25221486
4798 25221486 25127786 25167787 25420464 25629335 25900365 26080618 26037257 25722259 25343118 24841585
4788 24841585 24364658 24015444 23585779 23567445 23526095 23645851 23977690 24428923 24807823 25168742
4778 25168742 25239272 25345878 25271344 24850504 24213493 23468458 22503344 21490360 20479165
4769 20479165 19722989 19139634 18702045 18456775 18168438 17951343 17857870 17733922 17613815 17355394
4759 17355394 16766544 15891296 15057760 14174143 13468687 12615759 11879730 11300811 10680137
4750A0680137m39204m45781m86276k94644l41352l45109l54029j90987k43891
4741G538864j27646l24497j08821j15926m6093o9519j16594o9250j43571o0274
4731F356673r3592r6478j46287m2929p6189l5977j53103n2417q0057J7807m6798
4720E550653j00800M9023M8897j97548Q4207l2608j0797J12784J6913r4402L9456
4709E465778L100j78749P1662o3640j70310p2214j8215K563p7190n1717n2887
4698D858181J07692N9768j9922J238J13364r412j14729j55844o9008r7278j25797
4687D548253O2949l6184j31767L3828J9439l24N1321q8223L3568o3738N8102Q2212
4675D569436M1817p707R358N7466l359P6979P4107k0933r860m1804M4204m4754
$$ plain form
4750 10680137 10240933 9795152 9308876 9014232 8672880 8327771 7973742 7782755 7538864
4741 7538864 7411218 7086721 6977900 6861974 6815881 6746362 6629768 6560518 6416947 6356673
4731 6356673 6263081 6166603 6020316 5977387 5901198 5865221 5712118 5659701 5579644 5597451 5550653
4720 5550653 5449853 5498876 5547773 5350225 5434432 5401824 5391027 5503811 5520724 5426322 5465778
4709 5465778 5468878 5290129 5361791 5298151 5127841 5055627 5037412 5039975 4962785 4911068 4858181
4698 4858181 4965873 5025641 5005719 5006957 5120321 5110909 4996180 4840336 4771328 4674050 4548253
4687 4548253 4611202 4575018 4443251 4477079 4496518 4496194 4547515 4459292 4492860 4429122 4487224 4569436
4675 4569436 4611253 4603546 4612904 4670370 4667011 4743990 4818097 4797164 4787304 4745500 4789704 4744950
4663D744950j56174m4754j14234M4574P3275M5507L1396M2736L6309J33583J6442
4652D853610J31989q785J01068J31580k0063Q4887K6398R4327J30471N3505J52252
4641E731239N3006J61850l301J13555K22681P9819J05703Q8353K37578R1078J81354
4630G062915J99275J19580J77789K14723K46692J74906J70602K04419K87380K81875
4620I140156M17290L32905L69474K32505L17153M44131M37589M71010O25894N24987
4610A3313094O70155O91403L92525N39731N16996K98840K13852K08166J96405
4601A7041167L83457K36512K93154M36912M12370K74551M37964J53089J38673
4592A9807849o5774l8551J03526M7203O5664j517J52329L48164L19762M69811
$$ plain form
4663 4744950 4588776 4544022 4429788 4474362 4547637 4593144 4624540 4667276 4703585 4837168 4853610
4652 4853610 4985599 4976814 5077882 5209462 5189399 5274286 5300684 5395011 5525482 5578987 5731239
4641 5731239 5784245 5946095 5942794 6056349 6279030 6358849 6464552 6552905 6790483 6881561 7062915
4630 7062915 7262190 7381770 7559559 7774282 8020974 8195880 8366482 8570901 8858281 9140156
4620 9140156 9557446 9890351 10259825 10492330 10809483 11253614 11691203 12162213 12788107 13313094
4610 13313094 13983249 14674652 15067177 15606908 16123904 16422744 16636596 16844762 17041167
4601 17041167 17424624 17661136 17954290 18391202 18803572 19078123 19516087 19669176 19807849
4592 19807849 19742075 19703524 19807050 19854253 19919917 19918400 20070729 20418893 20738655 21208466
4582B1208466O75776Q15023Q81269R46426J042650J173021J296491J637584J707621
4573C1384327J792211K068645K289237K651377K859335L036000L158592K979835
4565E2219559K762455K104111J198758J82475j120258j910359k716102k886346
4557D9834293k860614k705843k352464j967173j515430j154972q83362n70277
4549C5824158p53569j058134j331294j560807j577980j766328j663613j708638
4541B4403795j522935j287389j096869r73892q66902p04139q10727p63535m31339
4532A5946068n35594m01000l70329m66168m12863n19463l89066n50524n41085
4523A1759976m95868k54179l92773l16016k84349l82417k35790j28044j16709
$$ plain form
4582 21208466 21884242 22699265 23580534 24526960 25569610 26742631 28039122 29676706 31384327
4573 31384327 33176538 35245183 37534420 40185797 43045132 46081132 49239724 52219559
4565 52219559 54982014 57086125 58284883 58467358 57347100 55436741 52720639 49834293
4557 49834293 46973679 44267836 41915372 39948199 38432769 37277797 36394435 35824158
4549 35824158 35070589 34012455 32681161 31120354 29542374 27776046 26112433 24403795
4541 24403795 22880860 21593471 20496602 19522710 18655808 17951669 17140942 16377407 15946068
4532 15946068 15410474 15009474 14639145 14172977 13760114 13240651 12851585 12301061 11759976
4523 11759976 11264108 11009929 10617156 10301140 10016791 9634374 9398584 9270540 9153831
4514I153831k25856j21283j41275j49966r0448q1205j69362j6911P79j8300r4510
4503H045494j22380K8405l9600L6674j499O304O6217L4649r773K9476O6015J55338
4491H295320R4032J47210J53984J54809K98633K71658J82380J31442L36539K99617
4481A0365624L92697L31775L52966M97580M73692M78824N82031P96683Q20539
4472A5092411Q72621J109513J243673J443776J664044J867505K191643K554244
4464B8039430K951124L373665L873159M553814M568655L623673J681269j158303
4456E1506486l673580n145228n341503m702895m186282l436778k795897k356269
4448A9868054j979903j540184j350225j208660r86357r13634q28122n90910o40147
$$ plain form
4514 9153831 8927975 8806692 8665417 8515451 8425003 8343798 8174436 8157525 8158304 8140004 8045494
4503 8045494 7923114 7951519 7911919 7948593 7947094 7953398 8019615 8054264 8044491 8073967 8139982 8295320
4491 8295320 8389352 8536562 8690546 8845355 9143988 9415646 9598026 9729468 10066007 10365624
4481 10365624 10758321 11090096 11443062 11940642 12414334 12893158 13475189 14271872 15092411
4472 15092411 15965032 17074545 18318218 19761994 21426038 23293543 25485186 28039430
4464 28039430 30990554 34364219 38237378 42791192 47359847 50983520 52664789 51506486
4456 51506486 47832906 42687678 37346175 32643280 28456998 25020220 22224323 19868054
4448 19868054 17888151 16347967 14997742 13789082 12802725 11889091 11060969 10470059 9829912
4439I829912o20771m28022l46830l74042l56102m66110k73298l08100k59439r4552
4429F302646k76425j44919k91447k24964j21314r3754k05471j57375l3640j17594
4419D635743j45850j45911j66381j30500p6603j24338j90865j20467m016p0362
4409C460450j49254n9751r9713k5353j67972j13625o7865n4502q5744n7304j36102
4398B443265q3689J5681k4953j10879p1750j21670R0076q4117j69308j6530p1294
4387A794832m9465l9798P6950p8654n8640o1183M2532l0463K9406j06038J9218
4376A538697l6787n2642K644q3801l3601L2002j0232j01393N1234l8183k1832
4365A246106n2147L61P4143n1815k231o6665j54867J44077p661m2799K1940M3652
$$ plain form
4439 9829912 9209141 8781119 8434289 8060247 7704145 7238035 6964737 6656637 6397198 6302646
4429 6302646 6026221 5881302 5589855 5364891 5243577 5149823 4944352 4786977 4753337 4635743
4419 4635743 4489893 4343982 4177601 4047101 3970498 3846160 3655295 3534828 3530812 3460450
4409 3460450 3311196 3251445 3151732 3126379 2958407 2844782 2776917 2722415 2636671 2579367 2443265
4398 2443265 2359576 2375257 2350304 2239425 2167675 2046005 2136081 2051964 1882656 1866126 1794832
4387 1794832 1745367 1705569 1782519 1703865 1645225 1584042 1626574 1596111 1625517 1519479 1538697
4376 1538697 1501910 1449268 1451912 1368111 1334510 1366512 1356280 1254887 1306121 1267938 1246106
4365 1246106 1193959 1194320 1268463 1216648 1214417 1147752 992885 1136962 1129301 1086502 1108442 1152094
4353A152094k3242k1776M9602j4282N2120k5123n9514k4775o586M9237p699J4485
4341A134541K7717m5054l7844N286J07804n6037n1662p425J7136r2366m5526r1681
4329H64889P741n4552P4103J24007j77398j34010N5426R2133j2617k0471J8986
4318H38237j1473j24870M1974N5583o8909k8538L4172P283l8833l2308J04939
4307G77257j4632m0467p9655r265M2439o1730r5463J60931r86Q447l0131q7407
4295E69338N7670K9895n3092n1171L8847p9362K3938M524n093j40871k0092J53772
4283E28303o1319J2766p5243K0855O4464R364l7350L7804P4271Q2744j38223m1768
4271D76668N3075Q690O927j9317N5087l0666L7458j69590k3160J10993M9564j03112
$$ plain form
4353 1152094 1128852 1107076 1156678 1142396 1194516 1169393 1109879 1085104 1078518 1127755 1120056 1134541
4341 1134541 1162258 1117204 1079360 1084646 1192450 1136413 1084751 1077326 1094462 1002096 956570 864889
4329 864889 872630 818078 892181 1016188 838790 704780 760206 852339 839722 819251 838237
4318 838237 826764 701894 743868 799451 730542 702004 736176 743459 704626 672318 777257
4307 777257 762625 722158 642503 633238 675677 613947 518484 679415 678429 686876 656745 569338
4295 569338 627008 656903 603811 552640 591487 512125 536063 540587 535494 394623 374531 528303
4283 528303 466984 479750 404507 425362 489826 499190 461840 499644 573915 656659 518436 476668
4271 476668 529743 538433 545360 526043 581130 550464 587922 418332 395172 506165 555729 452617
4259D52617K5776j0110J816k4081q3297J40322J7238L5358k8796j25285J72609
4248E74167m6232l0375j5068k849R9514P5065n0293m0695K3190J8283n491j0109
4236E89107n2788K0984M2889j0917O8147J30886p3764q0073m3328J6721m1855
4225E66009k5977o355o0433K2700r876J8021L7655p2405n9529M0562m443o93L9116
4212D84352Q9350k7910l2420q3374J03229l5499n3678Q3341J01944j34507r3878
4201D00950j3944N7382O8735Q097M9242l1616K361P406l6454J8340m5944N3749
4189E38304J09798K4362l7245p6900j9438k5474n5133N9947k2847J1728m8189
4178D58913m7057J53398k4133k6329m0660J6160J15286k6252q5726K5192J05870
$$ plain form
4259 452617 478393 468283 470099 446018 362721 503043 520281 555639 526843 401558 574167
4248 574167 527935 497560 482492 479643 579157 654222 603929 563234 586424 604707 599216 589107
4236 589107 536319 557303 600192 589275 657422 788308 714544 634471 591143 607864 566009
4225 566009 540032 533677 473244 495944 486068 504089 541744 469339 409810 450372 445929 445236 484352
4212 484352 573702 545792 513372 429998 533227 497728 444050 527391 629335 494828 400950
4201 400950 387006 444388 513123 521220 570462 538846 541207 548613 512159 530499 484555 538304
4189 538304 648102 672464 635219 558319 538881 513407 458274 518221 495374 507102 458913
4178 458913 411856 565254 541121 514792 474132 490292 605578 579326 493600 518792 624662
4167F24662L3041L208m7292j38847J20187L3816n4901q2082j1995K6520j6838
4156D89479l7341k9718r922j5677J09480J41743n4255n649j06313q436k7429N6431
4144E02393O1210m0982k5467q1798P8330P4023p9814R967m1077r9594O5584K7656
4132D50431L6999l0134k8848o3505J27004q894n1156j7759n8410m8746J14762
4121D21744P763n6322p7517p861J24176l6352M3782j63122J44294J1003q0334
4110C31254l7705P7699m8989k2863K4842N7434N7552r4328J966j17006k7291R1412
4098B93977O3414l1628j6860k430p9119n1953J30718k090J966J15821k8780q9520
4086C03516m484k2952L462N5342R865Q199j18099l9975R8637Q8616K9071j06452
$$ plain form
4167 624662 657703 660911 613619 474772 594959 628775 573874 491792 479797 506317 489479
4156 489479 452138 422420 412498 396821 506301 648044 593789 588140 481827 473391 445962 502393
4144 502393 563603 522621 497154 415356 493686 567709 487895 497862 456785 357191 422775 450431
4132 450431 487430 457296 428448 364943 491947 483053 431897 414138 355728 306982 421744
4121 421744 429507 373185 295668 287807 411983 375631 419413 256291 400585 411588 331254
4110 331254 293549 371248 322259 299396 324238 381672 439224 344896 346862 229856 202565 293977
4098 293977 357391 325763 308903 306473 227354 175401 306119 304029 305995 421816 393036 303516
4086 303516 299032 276080 279542 334884 344749 352948 234849 194874 293511 382127 411198 304746
4074C04746q261l6936Q9500K0743M5307o694o6834n1860J55721k0489M2401l2121
4062D35223j25153k7989J34222J9589k0827j4859j2691Q7101M0840j2592M4455
4051E47319L5130j6849k2650l0999L1667J06452p9363l6891Q8681R4820o8418
4040F48899l3759j4409L4396n8390j7421M9145J3396N3622P1881q3042Q4638M6780
4028G95736j0528O9869n3472N1894k9327O5773j6202J31275l2147J2902P9381
4017A065154R1454p9471m7038J28385J19445n2161J16633P221P1768K671J49155
4006A573216j20820j1223J37839J1907Q1683J36240j8036l5998J39842k5356J66532
3995B035826P1723J52298J5252N5596J2934J31263K16731L2072Q0952P3157J66619
$$ plain form
4074 304746 296485 259549 349049 369792 415099 408405 341571 289711 445432 424943 467344 435223
4062 435223 310070 282081 416303 435892 415065 400206 387515 474616 515456 502864 547319
4051 547319 582449 565600 542950 511951 543618 650070 570707 533816 622497 717317 648899
4040 648899 615140 600731 635127 576737 559316 608461 621857 675479 747360 664318 748956 795736
4028 795736 785208 855077 801605 853499 824172 889945 873743 1005018 972871 985773 1065154
4017 1065154 1156608 1077137 1030099 1158484 1277929 1225768 1342401 1349622 1421390 1424061 1573216
4006 1573216 1452396 1441173 1579012 1590919 1672602 1808842 1790806 1754808 1894650 1869294 2035826
3995 2035826 2107549 2259847 2275099 2330695 2343629 2474892 2691623 2723695 2804647 2877804 3044423
3984C044423M3988P9004Q3735J30106J30575K76335K21200K50589K10502L16442
3974D786899L19567K06015K78730L58610L10384L67699L81376L92879L37221K96477
3964H035857K01478K19742J68613K24053L37109K03501M45455P09391P42191M00783
3954A1688173r0600m37627p83947r74376q79090o41703m10856o01674m29325k96123
3944F142852j95946j22238n9750j25548K0459J43298K13566L42179N11609O62209
3934G532690Q33794J289811J532266N89433j41576q55476j509473j487997j238126
3925F545346p22399o17108n10348k76743j46944l05872j06150j05930j02697M1513
3915C692668Q6750K1218N5916K26263L77012L35529O18482P22933J17248r7574
$$ plain form
3984 3044423 3088411 3167415 3251150 3381256 3511831 3788166 4009366 4259955 4470457 4786899
3974 4786899 5106466 5312481 5591211 5949821 6260205 6627904 7009280 7402159 7739380 8035857
3964 8035857 8237335 8457077 8625690 8849743 9186852 9390353 9835808 10545199 11287390 11688173
3954 11688173 11597573 11159946 10375999 9401623 8522533 7880830 7469974 6868300 6438975 6142852
3944 6142852 5946906 5824668 5764918 5639370 5659829 5803127 6016693 6358872 6870481 7532690
3934 7532690 8366484 9656295 11188561 11777994 11636418 10780942 9271469 7783472 6545346
3925 6545346 5822947 5205839 4695491 4418748 4271804 3965932 3859782 3753852 3651155 3692668
3915 3692668 3779418 3800636 3856552 4082815 4459827 4795356 5413838 6136771 6254019 6156445
3905F156445m66229q75101q08570n26227m43235k77603l24008j73403r3356j68080
3895B000633k09039j06318j34629m2341l586j23345J8878n5307j66054J8798N3766
3884A251456l8957j15099l8367J8899J1235j00167k5658k6023q7059m5201P104
3873H12163J3804p1072p1744J02045J7869o4941J07409j32053k02886J1630n7628
3862D64596N3415J32020p5559j04750N6520N5627n0061O7656J2572j5130j23307
3851D73599k8893N7115J7911j7701o0657l1112M0685K2883o5385Q102O6496j7402
3839D65641K0300q3717l7385K1297j4444q45O777k5574K8002K3687j32764R7044
3827C68019L7304J2965m2632j10014o3268P227O9294J6233q7874J0783J13501
$$ plain form
3905 6156445 5690216 4815115 4006545 3480318 3037083 2759480 2435472 2262069 2168713 2000633
3895 2000633 1791594 1685276 1550647 1508306 1504720 1381375 1400253 1344946 1178892 1197690 1251456
3884 1251456 1212499 1097400 1059033 1077932 1089167 989000 963342 937319 850260 805059 812163
3873 812163 825967 754895 683151 785196 803065 738124 845533 713480 510594 522224 464596
3862 464596 518011 650031 574472 469722 526242 581869 531808 599464 612036 596906 473599
3851 473599 444706 501821 519732 502031 441374 410262 450947 473830 408445 416547 483043 465641
3839 465641 485941 402224 364839 386136 371692 370847 377624 352050 380052 403739 270975 368019
3827 368019 405323 418288 375656 265642 202374 209601 278895 295128 207254 218037 331538
3816C31538m4675Q96O9744r2053j14864m6139R5688N9888j987p032p3216J7063
3804A94851l4907N4855M48J23901k6930p1721M0900N2766K6817k4212j70556J1175
3792A77387J3784N5904J5204p3209k7630L0218O1975K8717Q100P0135l7416K2050
3780C45219l2694j21240K4125L472J7267J26054m7478q1228L5603o091m3739Q859
3768B28129L6521K1197L7745q2282P6008q465p8183q9631N7654j8441J5056L6821
3756B32129J17064r167q0334p0915R1609Q6202n292Q7746J3991m9487o1143N7617
3744D10020J21452p6767l5425K2206j6707J11743J64733q271j06545J0651P2688
3733F69778k0590n677K0964j33135R5808K771l2568K2975K0229k3492j0498J2903
$$ plain form
3816 331538 286863 287759 357503 265450 150586 104447 200135 260023 258036 251004 177788 194851
3804 194851 159944 214799 215247 339148 312218 240497 281397 334163 360980 336768 166212 177387
3792 177387 191171 247075 262279 189070 161440 191658 253633 282350 290450 360585 323169 345219
3780 345219 312525 191285 215410 218882 236149 362203 314725 233497 269100 263009 219270 228129
3768 228129 264650 285847 323592 241310 317318 308853 230670 141039 198693 180252 195308 232129
3756 232129 349193 340026 259692 188777 280386 366588 361296 449042 463033 413546 352403 410020
3744 410020 531472 454705 419280 441486 424779 536522 701255 692984 586439 597090 669778
3733 669778 649188 643511 664475 531340 627148 629919 597351 620326 640555 617063 606565 619468
3721F19468J02102M4140J4512Q4546l2513O583l6342N8435j2505j3509K43483
3710A078400p7370j50277m8156j7052O5968p6379j4627j3095n4873j26440P0502
3699F36601L666m0345k5064Q6195o9730j2923M7488K1911M1660o3836N935J1286
3687F42844o218j06667m9826L5381q4139j5318L6591j5724n4935O5850q2571L0754
3675C96022N159j4589n8797l6686L5660q4939J1015m1512J184o3841N9511P9100
3663B87287N2993m8579j73814K5802j267k7668M8783M4073N0023j08886l0921
3652A17826p942q3825N3888J04752M0308q736q9926N7474j43223O0910K3504k519
3640A22491M4611m8835Q2120K3683k02304N4182R2434q831o7840n258L0799P2422
$$ plain form
3721 619468 721570 765710 780222 864768 832255 838838 802496 860931 848426 834917 1078400
3710 1078400 1001030 850753 802597 785545 851513 775134 760507 747412 692539 566099 636601
3699 636601 640267 599922 574858 661053 591323 578400 625888 647799 689459 625623 631558 642844
3687 642844 636626 529959 480133 515514 431375 416057 452648 436924 381989 447839 365268 396022
3675 396022 401181 386592 327795 291109 326769 241830 252845 211333 212517 148676 208187 287287
3663 287287 340280 291701 117887 143689 142422 114754 163537 207610 257633 148747 117826
3652 117826 109884 26059 79947 184699 225007 216271 126345 183819 40596 101506 125010 122491
3640 122491 167102 118267 200387 224070 21766 75948 168382 159551 91711 86453 117252 189674
3628A89674k4528q8526J3142l3109k5722N1112O9799k8782m7730R4397m5252m8432
3616G6043N5579r9991q0458P8335k3877R467Q8327kl0590j16590J9553J3008J24908
3603A13712l2754P154p5451J7382J2275K2707n335k8892J0641j7857Q1637J2829
3591A18048r4519m8492J12535n498J6384q9896R8349J8615j9955n7574n1414K3077
3579A9660J4947p2813K2360J27160o5814n1420K5640O0944o4689K180r32J3462
3567C0685P60m3943N7347Q9330J9192j25564j15322Q2139j9388L3648r810K4601
3555B3675k813L5117R3085p7576n8992n5349O6959j3972J7328N0314n8153K4796
3543D4419N9066n4820m4998N8481l335m2718p233R4827n9177o7028L905M1393
$$ plain form
3628 189674 165146 76620 89762 56653 30931 82043 151842 123060 75330 169727 124475 76043
3616 76043 131622 31631 -48827 29508 5631 15098 103425 103423 72833 -43757 -24204 -11196 113712
3603 113712 80958 88112 12661 30043 42318 65025 59690 30798 41439 23582 105219 118048
3591 118048 23529 -24963 87572 82074 98458 8562 106911 125526 105571 47997 -3417 19660
3579 19660 34607 -38206 -15846 111314 45500 -5920 19720 80664 15975 18155 17223 30685
3567 30685 31445 -12498 44849 134179 153371 27807 -87515 -5376 -24764 8884 -926 23675
3555 23675 20862 55979 149064 71488 12496 -42853 24106 10134 27462 77776 19623 44419
3543 44419 103485 48665 3667 62148 58813 16095 8862 103689 44512 -22516 -18611 22782
3531B2782k7989K6928p0605L867o1948J28262J4558k0795P776o3974L0301L2116
3519B1279l422n2360R6867O6697k7913p9072j0010j0268M1580M5505n2745j4676
3507B1462j0830J278l1673O1141P3260K7274j34892p9304N0291j7554K0180P0031
3495E0664M6777q0139k9477p9292j7255J23693m985n8027J2985o9675J15205L3596
3483D4070l3845n5100J54919r3565m2451J234o2393P1796O8001o7921j3188r582
3471c8025N3878m3915K4441M6828n585P0604j07117K61p6165K3513k2063p76k2685
3458i6806M1761N7073m5491k2781P642O4461j4754j5327L8482L8140j09862R42
3446e6520P7967m4705j839K6259o8744o4990j0147L2193J06057m6629N8805k6312
$$ plain form
3531 22782 -5207 21721 -48884 -45017 -106965 21297 35855 15060 22836 -41138 -10837 21279
3519 21279 17857 -34503 62364 129061 101148 22076 12066 1798 43378 88883 36138 21462
3507 21462 10632 11910 -19763 41378 114638 141912 7020 -72284 -21993 -39547 -19367 50664
3495 50664 97441 17302 -12175 -91467 -108722 14971 9986 -48041 -35056 -104731 10474 44070
3483 44070 10225 -44875 110044 16479 -25972 -24738 -87131 -15335 52666 -15255 -28443 -38025
3471 -38025 15853 -28062 -3621 43207 37622 108226 1109 1370 -74795 -51282 -73345 -74121 -96806
3458 -96806 -55045 2028 -43463 -66244 -58602 5859 -8895 -24222 14260 52400 -57462 -56520
3446 -56520 21447 -23258 -25097 1162 -67582 -132572 -142719 -110526 -4469 -51098 7707 -18605
3434a8605j12796Q7503q1208k0561O8953J9176J15524K8090q0633q5628N6373
3423b3812n8415P9831j3539k3292P363q7477J86714k848m0698m1978j1350Q631
3411b0870K0262K3400k7872j10307J13134k3755l1564J26684K0637j1992p8822
3400a065k9779j39529J42826N334n0755k8574R9418J251P1564N4607j10460M9886
3388F4724J298l2883o1748K3907J5807Q291M3436m8843M770p3591M238J01190
3376E0596K3289K5300j0223K6510p4816n1864K6373p443k5652J0304k8643l5064
3364g1333L9173N3110l9097L6616j8038M9436l0110M3790j22863j8265K8662N2025
3352C106J3960K4310j18354l9312Q3360j2620K0837k0530r298m5178Q2635M4909
$$ plain form
3434 -18605 -131401 -43898 -125106 -145667 -76714 -57538 57986 86076 5443 -80185 -23812
3423 -23812 -82227 -2396 -15935 -39227 -31864 -119341 67373 64525 23827 -18151 -29501 -20870
3411 -20870 -608 22792 -5080 -115387 -2253 -26008 -57572 69112 89749 77757 -1065
3400 -1065 -30844 -170373 -27547 -22213 -72968 -101542 -2124 -873 70691 125298 14838 64724
3388 64724 66022 33139 -28609 -4702 11105 19396 62832 13989 18759 -54832 -50594 50596
3376 50596 73885 99185 88962 115472 40656 -11208 15165 7722 -17930 -7626 -36269 -71333
3364 -71333 -32160 20950 -18147 18469 431 49867 19757 63547 -59316 -77581 -48919 3106
3352 3106 17066 41376 -76978 -116290 -32930 -45550 -24713 -45243 -54541 -99719 -17084 27825
3340B7825L284m4777l9288M5167j9654N6060K427j996M5174j18607j0540J04189
3328D9264m7737j8088N1044N75j4302j06478N5428L3419Q5289k9732j3422R4709
3316A39969j9008O5368L9215j23974q6218j415m1497M3789L858j6563J20137n3273
3304G0388n3634l5232R5332o4408l4390J9678J7128p7026R713K8337M3969k5878
3292f023o5747J30285K4669N8300p9015j14444M1011N6822K4584j9222p3172k54
3280b2206M6844N9911j1447K991l1729j5892L8285p5894j0619P0002N5170q0094
3268B5322j5195M4816r334J0972o0118k9229R1450J06760j08162j25974J3799
3257e4893J6296J7348l5197N1102p3208M2905N3582L1547k6232q5754M8017l1126
$$ plain form
3340 27825 31109 -13668 -52956 -7789 -27443 28617 31044 29048 74222 -44385 -54925 49264
3328 49264 1527 -16561 34483 35058 20756 -85722 -30294 3125 88414 58682 45260 139969
3316 139969 120961 186329 225544 101570 15352 13937 -27560 16229 20087 3524 123661 70388
3304 70388 16754 -18478 76854 12446 -21944 -2266 14862 -62164 -52451 -24114 19855 -6023
3292 -6023 -71770 58515 83184 141484 62469 -51975 -10964 45858 70442 51220 -21952 -22206
3280 -22206 24638 84549 73102 76093 44364 28472 66757 -9137 -19756 50246 105416 25322
3268 25322 10127 54943 45609 56581 -3537 -32766 58684 165444 57282 -68692 -54893
3257 -54893 -38597 -21249 -56446 -5344 -78552 -35647 17935 49482 23250 -62504 -14487 -45613
3245d5613L1435J07064o7811o2868r222M9072M5018n329p608K4554Q2081J0854
3233A51627o996q4804o4814r218N7364p473r6786J28579P6821n4528L7929P0656
3221A98357n9293j5764l9319J1560Q2931j7841k4273k1947o9241l5013L3236R646
3209E3039j0288m0823J06270q074k6612o989K6332k6776L0970N6170l8896L293
3197A17616N14q8548M8481n7776n0823N6976M6780L2027J712j2000N9131M9553
3185B03643L4673l4844N0507n5942k2010l1379N0265L0073l2808m5681N5253m0756
3173A60994R9861R757L3673P0873n0220K7526l1303l6250J64080M802l373N1814
3161E02234P7723l0293n0008L8589L0954R9875j39074O4450N0813J34453j6976
$$ plain form
3245 -45613 -14178 92886 25075 -37793 -47015 2057 47075 41746 34138 58692 140773 151627
3233 151627 144631 59827 -4987 -14205 43159 35686 -61100 67479 144300 89772 127701 198357
3221 198357 139064 123300 83981 95541 178472 160631 136358 114411 45170 10157 43393 53039
3209 53039 42751 1928 108198 100124 73512 66523 92855 66079 97049 153219 114323 117616
3197 117616 118130 29582 78063 20287 -30536 26440 73220 105247 106959 94959 154090 203643
3185 203643 238316 203472 253979 198037 176027 144648 194913 224986 192178 146497 201750 160994
3173 160994 260855 270612 304285 375158 324938 352464 321161 284911 448991 453793 450420 502234
3161 502234 579957 549664 499656 538245 569199 669074 530000 594450 645263 779716 762740
3150G62740n7483Q3535J08750J8333L2954Q8082J07425J2788J44019L7610N1219
3139A389972J41265N295J5417P1258J49981J60373J36306J34593J43687K84644
3129B632791K03133K29856J96224M17797K38233M18280N52226M91181N01515Q81987
3119F763223J168624J369360J836436K748469K775455R04350j953541l148929
3111A2463447k769142k014650j379564j016597p68774n07953l43068l56142k40778
3102C066779k29010k71007k50851p0778k32387j69259j50835j23125r9381k754
3092A467392q5039q0382j30977p0788k4428o6975j2268M2172l7188j2679p2247
3081I16593j02357K3322J18956j20047j20453j5324Q5437J6460r3528j18097j7211
$$ plain form
3150 762740 705257 788792 897542 915875 948829 1036911 1144336 1157124 1301143 1338753 1389972
3139 1389972 1531237 1536532 1551949 1623207 1773188 1933561 2069867 2204460 2348147 2632791
3129 2632791 2835924 3065780 3262004 3679801 3918034 4336314 4888540 5379721 5881236 6763223
3119 6763223 7931847 9301207 11137643 13886112 16661567 17565917 15612376 12463447
3111 12463447 9694305 7679655 6300091 5283494 4514720 4006767 3663699 3307557 3066779
3102 3066779 2837769 2566762 2315911 2245133 2012746 1843487 1692652 1569527 1470146 1467392
3092 1467392 1382353 1301971 1170994 1100206 1075778 1008803 996535 1038707 1001519 988840 916593
3081 916593 814236 837558 956514 836467 716014 700690 786127 802587 709059 590962 573751
3070E73751n5993K7863l4573q3735O6011J21940j23989m2221j354m3872L3337
3059D37165J9404n3381l4732j957k3144M3294M6557j17040K9568r6443K4829o0588
3047B13532k1671n9087P3949N4430j05720Q7170n1688K6281N380r670m2161k9198
3035A41547J4953o8618j3842j5114P6466l675q1195N2045P0119N2937l3670j20496
3023G1457r0013O2090O061P3091k9172j4450n7850q328m5955L6733L4946l3693
3011D917j1754J24308m456l7661r9640J35178k7445j2286M7034k7502q9302R4111
2999I5502q0227R6494K4702n9741J6814j9323K5669O4203q8958J5102j2506m700
2987G3031K6962J7186N1354j09302m3465J3758O5685l6697q4813O6880J5715j11
$$ plain form
3070 573751 517758 545621 511048 427313 493324 615264 491275 449054 447700 403828 437165
3059 437165 456569 403188 368456 366499 343355 386649 433206 316166 345734 249291 274120 213532
3047 213532 191861 132774 206723 261153 155433 242603 190915 217196 222576 212906 170745 141547
3035 141547 156500 87882 74040 58926 135392 131717 50522 102567 172686 225623 191953 71457
3023 71457 -18556 43534 49595 122686 93514 79064 21214 12886 -33069 3664 38610 4917
3011 4917 -6837 117471 113015 75354 -24286 110892 83447 71161 118195 90693 1391 95502
2999 95502 15275 111769 136471 76730 93544 74221 99890 164093 75135 90237 77731 73031
2987 73031 99993 117179 168533 59231 15766 29524 95209 58512 -26301 40579 56294 56183
2975E6183m3495l8449O7935R8913J65657k36735j46384J37836L5356n7923K1244
2964F0138j07254J50180o7283N2408q2200J9067Q7036j18916r7125J04803Q6834
2953H7688j0985k1632K4786O1496j01309j7797p0544R3376K4677N3896K1011o3381
2941H1282o8865J1886Q1772m6370m1940l1029J29540l5934n954r1684J0875N5172
2929D8751K9475J8265j609m0795K7891l7508l290j7449q731p954J877J2368m0825
2916a9534k2749P1316J3280J58036n550k16012k967o9008J09448m7003J10540
2905G9797n463Q001M8053q6129j7736J4671o9228J173Q4283n7317m8300k4896
2893g3091J4217N9581O894Q0525j03904L9197k6243O2556P0643p2559j10445O5443
$$ plain form
2975 56183 12688 -25761 42174 141087 306744 70009 -76375 61461 96817 38894 60138
2964 60138 -47116 103064 35781 88189 5989 25056 112092 -6824 -103949 854 87688
2953 87688 76703 55071 79857 141353 40044 22247 -48297 45079 69756 123652 144663 81282
2941 81282 12417 24303 106075 59705 17765 -13264 116276 80342 74388 -17296 -6421 48751
2929 48751 78226 96491 94882 54087 81978 44470 41180 23731 15000 7046 8923 21291 -19534
2916 -19534 -42283 29033 42313 200349 194799 -21213 -24180 -93188 16260 -30743 79797
2905 79797 74334 82335 130388 44259 26523 41194 -28034 -26861 57422 105 -48195 -73091
2893 -73091 -58874 707 7601 88126 -15778 23419 -2824 59732 130375 57816 -52629 12814
2881A2814L4845j1744k6658N523J5078r0362J9536p181R362L9748Q6883m0343
2869D7501l8264n1905r134L7986K4946M4262r546o5018K2360O1082n768n6550
2857A952m1722l2414J54492q6259L3043q464L6859q3321J2265l9261L9736k349
2845a5443J2280L2074k0097N8440l4096M7760l8808p869K6771r6918k0755O9648
2833A2987l6010Q3448m960N074M0657o4705n6980j6906K4329r341K2007N5011
2821E4611l5274j482o6560P835J4987J5669j4541Q4662O557j2616j2250L7855
2809G9453M96n2203K5105o878p2941Q2476k573k3656n2637Q54P4546O3797j6398
2796I9441k928m0721K636j0046P0497m3233n5009n6410N8192N2325p9167O6398
$$ plain form
2881 12814 47659 35915 9257 14780 29858 -60504 -40968 -48149 -38787 961 87844 47501
2869 47501 9237 -42668 -51802 -13816 11130 55392 45846 -19172 3188 64270 58502 1952
2857 1952 -39770 -72184 82308 -3951 29092 20628 57487 -25834 -13569 -52830 -13094 -15443
2845 -15443 -3163 28911 8814 67254 33158 80918 42110 34241 61012 -35906 -56661 12987
2833 12987 -23023 60425 55465 60539 101196 36491 -20489 -37395 -13066 -22407 -400 54611
2821 54611 19337 17855 -48705 -40870 -25883 -10214 -24755 59907 66464 53848 41598 79453
2809 79453 79949 27746 52851 45973 -26968 55508 52935 29279 -23358 -22504 52042 115839 99441
2796 99441 96513 55792 58428 48382 118879 75646 20637 -35773 22419 74744 -4423 61975
2784F1975l9290N8763l7353l7861j9971N1661l1452k1552p3289J20170M6167m2767
2772C5201j10698r3739J17683L5421Q9143o8778q9653M6225j0528n9275Q02R8333
2760i863N1411j7810m5986K7476k6773l3067P8514K4113k9324L2291m3818L5773
2748D2937l7372J1297k3574j8580N4527k5499K6340Q727k8266q4034M6058P7701
2736E0262k1048j10867N1581R4926L3616p5917R1841m2927L2876j41345K2456
2725a4546j279N2331M2406n3207L2870r84K8885m8740K4243p6908J12735J6693
2713A14499K365l0507l9235r0661k0096k640L5140r9600Q2070N1222k0438P6259
2701E8378K7964p3465K8849l3073O905m7507l1448R6904M6271l077m4505J2199
$$ plain form
2784 61975 22685 81448 44095 6234 -13737 37924 6472 -15080 -88369 31801 77968 35201
2772 35201 -75497 -169236 -51553 -16132 73011 4233 -85420 -39195 -49723 -108998 -108196 -9863
2760 -9863 41548 23738 -22248 5228 -21545 -54612 23902 48015 18691 50982 7164 42937
2748 42937 5565 16862 -6712 -25292 29235 3736 30076 38803 10537 -73497 -27439 50262
2736 50262 29214 -81653 -30072 64854 98470 22553 114394 71467 104343 -37002 -14546
2725 -14546 -15825 36506 78912 25705 58575 57591 86476 37736 61979 -14929 97806 114499
2713 114499 116864 86357 47122 -43539 -63635 -66275 -31135 -130735 -48665 2557 -17881 58378
2701 58378 86342 12877 41726 8653 15558 -31949 -63397 33507 79778 76701 32196 44395
2689D4395p7016l4051P1138J07233r8274l3014M264l879n4682J43170q4832N267
2677a0281R2719j8809o895k2227J747j09798O9696j856l0295P5161m559n7108
2665b2505N250l9743m5141P2462m4987o0483J48003J4381o2169J69115k7586j55492
2653d8895J59020J3442k06602N2579Q5771J1708J978o4072l0093M3307K7480j4890
2641C0733k0497r52N315M1740j7075R690N0263l3072m5319j46530J59309J11823
2629A45428l2315Q3312j45463o1937J948m5543P723l052M9563r358l75j6801R6386
2616F9516J4723k6049k6624p8129P2179p3293N9480o6105j4858M3775M9421L2984
2604E7020m9628q5348O0909J27874m7323M2345q7630J9128l5981L505q8210R204
$$ plain form
2689 44395 -32621 -66672 4466 111699 13425 -19589 -15325 -19204 -73886 69284 -15548 -10281
2677 -10281 82438 63629 56734 34507 36254 -73544 -3848 -5704 -35999 39162 34603 -22505
2665 -22505 -17255 -56998 -102139 -29677 -74664 -135147 12856 27237 -34932 134183 106597 -48895
2653 -48895 110125 123567 -83035 -30456 55315 67023 69001 4929 -25164 18143 45623 30733
2641 30733 10236 9284 14599 56339 39264 48954 99217 66145 20826 -125704 33605 145428
2629 145428 113113 196425 50962 -10975 -9027 -54570 -46847 -49899 -336 -9694 -10069 -26870 69516
2616 69516 84239 58190 31566 -46563 25616 -47677 11803 -54302 -69160 -25385 24036 57020
2604 57020 7392 -77956 -17047 110827 63504 105849 18219 37347 1366 4871 -83339 -74135
2592g4135o1313p768J10987j5281K5369j5657j2394m6605P2984R538j1909Q2214
2580E6030j39983L7615k4419J1749K709k4658J5829J6715J54952j17359q6828
2569i7648J06078J9184L2326R206p3464o0794L3210K0833L0645M8220j24482j19252
2557a75938J54740J03222j06700K2939q8674J480K8285J36672J24183n9182r6770
2546D4257o6603J3624k3711J2462j9509P6324O1656q2568o2188J03322m9624o1546
2534e4104q009J11935K400o1013p1923J0700K8791R6407k2309n2040N2619k6444
2522G010l1808k511Q6675R342k555p8378P2721k4550n7569n09O4252q3906L5443
2509f343M3552L9947q6217k7988P3583L8868J437j17033p7229J04872J20203L1616
$$ plain form
2592 -74135 -135448 -143216 -32229 -47510 -22141 -37798 -50192 -96797 -23813 -14275 -26184 56030
2580 56030 -83953 -46338 -70757 -59008 -56299 -80957 -65128 -48413 106539 -10820 -97648
2569 -97648 8430 27614 59940 69146 -4318 -65112 -31902 -11069 19576 67796 -56686 -175938
2557 -175938 -21198 82024 -24676 -1737 -90411 -88931 -60646 76026 200209 141027 44257
2546 44257 -22346 -8722 -32433 -19971 -39480 36844 98500 15932 -46256 57066 7442 -54104
2534 -54104 -62113 49822 52222 -8791 -80714 -70014 -41223 55184 32875 -19165 33454 7010
2522 7010 -24798 -27309 59366 68708 66153 -12225 60496 35946 -21623 -22132 42120 -41786 -6343
2509 -6343 37209 77156 -9061 -37049 36534 75402 76839 -40194 -117423 -12551 107652 139268
2497A39268q4550m7066M467M2291k4248n2286l1659O9420p4179M2160P9271k1974
2485D0915J8780p3760O1416Q8612j37639o355l179L4381m1319L8679m681L0278
2473D6128k0720K1751n6669l9453O6030k6088M5143j4793m8868M6591J15542j24945
2461I649M0080N9633j24418l9879K7135k2385N0251J65287j6408k44806J06517
2450A0656P0526n5871j6110M0626J3186m4124q0168K8568L580J16563o7613m8053
2438b8234J6103k2896P5550m6136k0254J04773k1230q1509p3880L1312P0332j6314
2426a2383q77P406l792N9458r0141j0706P6171m3916p97K5384M1558l1186j8796
2413b617R0029o1413j04370K3858j02159l2038J53080O2214R6006r8534m1585
$$ plain form
2497 139268 54718 7652 12119 54410 30162 -22124 -53783 15637 -58542 -16382 62889 40915
2485 40915 59695 -14065 47351 135963 -1676 -8031 -11210 23171 -18148 20531 15850 46128
2473 46128 25408 47159 -9510 -48963 17067 -9021 36122 21329 -27539 19052 134594 9649
2461 9649 49729 109362 -15056 -54935 -27800 -50185 66 165353 148945 -95861 10656
2450 10656 81182 25311 9201 49827 63013 18889 -61279 -32711 -29131 87432 19819 -28234
2438 -28234 -12131 -35027 40523 -5613 -25867 78906 57676 -23833 -97713 -66401 3931 -12383
2426 -12383 -13260 -5854 -9646 49812 -40329 -51035 25136 -18780 -19577 5807 47365 16179 -2617
2413 -2617 87412 25999 -78371 -54513 -156672 -188710 -35630 26584 122590 24056 -17529
2402a7529L6447N7582p9066Q7486p5259n4777M4779n425q5044K6963J15396j43932
2390i2379Q8323Q3932J6849r2810l3539L0716O0814j5014j25168M8389L6890q8366
2378h1363P2190L517l9218N965P0375p2320Q1441K9633k4685K1753n0029j9545
2366b286N8554L6127j24059N3180k0775L8866m1658p7649K4687P2686J3497k4649
2354F521l0827K5053K0108O1890l2402m8260Q9042m8042l1506q2247P3211r3551
2342i1010O0909Q56m8088K8711P1229M6260N84p1366j0310J5473k404M1777k838
2329C9783n4024N8871Q714O4818j03847L0231k4070K9829j4748K6972M6615R494
2317A18638o5679l3719M2161o6335O9622j35328R5302l8353J5436l566M7221n7203
$$ plain form
2402 -17529 18918 76500 -2566 84920 9661 -45116 -337 -5762 -90806 -63843 51553 -92379
2390 -92379 -4056 79876 96725 3915 -29624 1092 61906 46892 -78276 -29887 7003 -81363
2378 -81363 -9173 -5656 -44874 -38909 31466 -40854 40587 70220 45535 67288 17259 -2286
2366 -2286 56268 92395 -31664 21516 741 39607 -2051 -79700 -55013 17673 31170 6521
2354 6521 -24306 747 20855 82745 50343 2083 91125 43083 11577 -70670 2541 -91010
2342 -91010 -30101 -29245 -77333 -48622 22607 68867 69451 -1915 -12225 3248 844 42621 39783
2329 39783 -14241 44630 53344 118162 14315 44546 20476 50305 35557 62529 109144 118638
2317 118638 52959 19240 61401 -4934 64688 -70640 24662 -13691 1745 -1821 45400 -11803
2305a1803K4788j64149Q7165Q7639q608L0735L2155m4631J13027j18952o9737
2294d2371R2831p0173J5124n2466p9074k9825n7388J13727J51637p1647l744q0040
2282a13409P0527Q5593l3443O620k6424l1518m0791m2059J02373q8605m6869J43758
2270a4247J6137N2741L5554k09999k1049J11715Q4002M4379O232j16992M6434
2259C4907N3077p7425n9588m3743P2591O6020O5255k7374p152L7776m1566j03178
2247c0400m9067L3693J50371m9761l1214l2980p8599K8936l3055L2402k9086Q6071
2235b689J05331o4420l8319J02264r2844K6101l8652J7715n1660N228J24L3431
2223A610M7335K9730m582j4121j20977L7184j858O5981R936k3522L7252j9384
$$ plain form
2305 -11803 12985 -151164 -63999 23640 15032 45767 77922 33291 146318 27366 -42371
2294 -42371 50460 -19713 -4589 -57055 -136129 -165954 -223342 -109615 42022 -29625 -33369 -113409
2282 -113409 -42882 42711 9268 15888 -10536 -42054 -82845 -124904 -22531 -111136 -158005 -14247
2270 -14247 1890 54631 90185 -119814 -140863 -29148 54854 99233 105465 -11527 34907
2259 34907 87984 10559 -49029 -92772 -20181 45839 111094 83720 76568 114344 72778 -30400
2247 -30400 -79467 -45774 104597 54836 23622 -9358 -87957 -59021 -92076 -59674 -88760 -2689
2235 -2689 102642 38222 -97 102167 9323 35424 -3228 14487 -37173 -31945 -31821 1610
2223 1610 48945 78675 74093 59972 -61005 -23821 -25679 40302 50238 26716 63968 44584
2211D4584K6735K8874r285O7350L2143j06545o0791j9192l8078J154m2871M059
2199g1863J34011m7057j02110M0343q754l2523J54796j36126m2540J60710l5053
2188A3834L6316J387k4199n9705j9874m1942M747J5951L6191L1382m7806R5465
2176D1747n9728O0747L800O8177j65507J1231M107k3618q761P9972p2656j440
2164f1929O0593p170j4796j2521o1558L5759P7042k0853L4856J22658j24622q2652
2152e5193O4031q6639J5687N1601n3675m2499m2650L883J08235n8102N7999K7604
2140i718j9308M5740n4979K5402q4813M7301p550J6793P163j7376O5855N3074
2128F7584j61899k9849R39J11015L7605o7492n2240R3950O6230k00119P6133J7506
$$ plain form
2211 44584 71319 100193 90908 158258 190401 83856 23065 3873 -34205 -33051 -75922 -71863
2199 -71863 62148 15091 -87019 -46676 -55430 -87953 66843 -69283 -111823 48887 13834
2188 13834 50150 51537 27338 -32367 -52241 -94183 -89436 -73485 -37294 -5912 -53718 41747
2176 41747 -17981 42766 46566 114743 -50764 -39533 -35426 -59044 -67805 12167 -60489 -61929
2164 -61929 -1336 -8506 -23302 -35823 -97381 -61622 15420 -5433 29423 152081 27459 -55193
2152 -55193 8838 -77801 -62114 -10513 -64188 -106687 -149337 -145454 -37219 -95321 -37322 -9718
2140 -9718 -29026 16714 -38265 -12863 -97676 -50375 -57925 -41132 -33969 -51345 14510 67584
2128 67584 -94315 -124164 -123225 -12210 25395 -42097 -94337 -387 65843 -134276 -58143 -40637
2116d0637O0767p054R6827j10134q3624o4897N9753P466P8782J01512j28300M4272
2104A4733J38102o1773k7078j08156l4872O5680l7339N8831o4424K1460l0840
2093f5676n7052J39228m523q427j33459L8671P953N9014N6803K2931P7348j12569
2081B0242j10212k0458J16225m3254L5338o8621N0654M3357k5309q2455K5379
2070e9114P4091K4702m2971O8963P2342m1028o012j43331M6408J6870l9766Q8733
2058E9887M222l8726L9289p3755J8754j8214M1903K8978k3774m6494M85r3636
2046a01081O1050O8234j16903L610K0082M3684O1962q51m1927M612j131M1664
2034D3005k4453j15599j494R2750N5983l1007p8200n0286k1300P4756L7221j1889
$$ plain form
2116 -40637 20130 13076 109903 -231 -83855 -148752 -88999 -81533 -2751 98761 -29539 14733
2104 14733 152835 91062 63984 -44172 -79044 -13364 -50703 8128 -56296 -34836 -65676
2093 -65676 -122728 16500 11977 3550 -129909 -91238 -83285 -24271 32532 55463 132811 20242
2081 20242 -89970 -110428 5797 -37457 -2119 -70740 -20086 23271 -2038 -84493 -59114
2070 -59114 14977 39679 -3292 65671 138013 96985 90973 -52358 -5950 10920 -28846 59887
2058 59887 64109 25383 64672 -9083 9671 -8543 33360 62338 38564 -7930 -7445 -101081
2046 -101081 -40031 28203 -88700 -85090 -65008 -21324 40638 39787 -2140 2472 1341 43005
2034 43005 18552 -97047 -98541 -5791 50192 19185 -59015 -109301 -130601 -55845 -18624 -30513
2022c0513O0386p2661N7662l7861j0226J5039N7593r2746l7734N1819n4371K5042
2010f8571J3823n9877j4719Q1280J3086L0581j6775J6486l7589L2438K0914J4818
1998B5895R5370K2999J0692o7306r6152m1693q002j5805r888O7718P1132o8020
1986a3060j2529J16649n8472l962k8790o1622J08061K7526L0788J9802l1430m0892
1974E2069j28898K9406q4433N6973n14J3802L3612k8054P107j2831J08978j19164
1962g1947K931J00384o164j28311O8402L8941l6183n5813m8634J10959R576o9062
1950h4921R5898N1397L157K408k1652k3226j05502L2964j0634O4318O4397k0719
1938D7885j35068o8487J18295O7244R862r8940j5421J16992m9486M795O7901p4391
$$ plain form
2022 -30513 29873 -42788 14874 -22987 -33213 -18174 39419 -53327 -91061 -39242 -93613 -68571
2010 -68571 -54748 -114625 -129344 -48064 -34978 -4397 -21172 -4686 -42275 -9837 11077 25895
1998 25895 121265 144264 154956 87650 -8502 -50195 -58197 -74002 -83890 -16172 54960 -13060
1986 -13060 -25589 91060 32588 28626 -164 -61786 46275 73801 104589 124391 92961 52069
1974 52069 -76829 -47423 -131856 -74883 -75397 -61595 -27983 -56037 -48930 -61761 47217 -71947
1962 -71947 -69016 31368 25204 -103107 -34705 4236 -31947 -87760 -136394 -25435 -15859 -84921
1950 -84921 10977 62374 65531 67939 46287 23061 -82441 -49477 -60111 4207 68604 47885
1938 47885 -87183 -155670 -37375 29869 39731 -59209 -74630 42362 -7124 -2329 65572 -8819
1926h819q3087K4676k6016O3286O0548K0450o8876M2939o2041M427J6742m472
1914b0243m5757R6039J2082j30030J14578j0102L0969N6164n4437P3596l0156
1903I2703j13212n9589O4396O971j14450M1032M0926R849j8464m7858k1532J21131
1891A903Q3183n7418M2755J0562M550q7074k7085O4643j1961p825J6907P899M569
1878D5608j1271j3185o3083l3731K4473Q101J15474j7617n8458j7512N1078M7464
$$ plain form
1926 -8819 -91906 -67230 -93246 -29960 30588 51038 -17838 25101 -36940 -32513 -15771 -20243
1914 -20243 -66000 30039 42121 -87909 26669 16567 47536 103700 49263 122859 92703
1903 92703 -20509 -80098 -15702 -8731 -123181 -82149 -41223 -31374 -49838 -97696 -119228 1903
1891 1903 85086 27668 70423 80985 85535 -1539 -28624 36019 24058 16233 33140 41039 45608
1878 45608 34337 21152 -41931 -75662 -51189 -43088 72386 54769 -3689 -21201 29877 77341
$$ [...]
##END NTUPLES=NMR SPECTRUM
##END=
