##TITLE=1H_CG-1217
 CDCl3
 8 sc, 
 1.11.2024
##JCAMPDX= 6.0         $$ Bruker NMR JCAMP-DX V2.0
##DATA TYPE= NMR SPECTRUM
##DATA CLASS= NTUPLES
##ORIGIN= UXNMR, Bruker Analytische Messtechnik GmbH
##OWNER= root
$$ XWIN-NMR		Version 3.5
$$ Fri Nov  1 14:01:11 2024 Russian Standard Time (UT+4h)  she@DPX200
##.OBSERVE FREQUENCY= 200.1318
##.OBSERVE NUCLEUS= ^1H
##.ACQUISITION MODE= SIMULTANEOUS
##.ACQUISITION SCHEME= undefined
##.AVERAGES= 8
##.DIGITISER RES= 18
##SPECTROMETER/DATA SYSTEM= spect
##.PULSE SEQUENCE= zg30
##.SOLVENT NAME= CDCl3
##.SHIFT REFERENCE= (INTERNAL, CDCl3, 0, 20.9958)
##AUDIT TRAIL= $$ (NUMBER, WHEN, WHO, WHERE, WHAT)
$$ ##TITLE= Audit trail, XWIN-NMR		Version 3.5
$$ ##JCAMPDX= 5.01
$$ ##ORIGIN= Bruker BioSpin GmbH
$$ ##OWNER= she
$$ F:/spectra/data/she/nmr/H-F/1/pdata/1/auditp.txt
$$ ##AUDIT TRAIL=  $$ (NUMBER, WHEN, WHO, WHERE, WHAT)
(   1,<2024-11-01 13:58:41.62 +0400>,<she>,<DPX200>,
      <created by zg, POWCHK disabled, PULCHK disabled
       configuration hash MD5:
       00 E9 B6 7A A2 85 ED C7 34 08 36 98 17 FE 4E 26
       data hash MD5: 16K
       69 FD 49 AB A4 51 39 CB 0C C9 F1 BF 73 28 06 6F>)
(   2,<2024-11-01 13:58:43.76 +0400>,<she>,<DPX200>,
      <Start of raw data processing
       efp BC_mod = 2 LB = 0.24 FT_mod = 6 PKNL = 1 PHC0 = -26346.76 PHC1 = 13.98743 SI = 16K 
       data hash MD5: 16K
       6E BD 24 E7 44 E8 A2 DF 5A 60 FF 91 06 FA 09 7A>)
(   3,<2024-11-01 13:58:57.73 +0400>,<she>,<DPX200>,
      <pk PHC0 = -0.4126826 PHC1 = 0 
       data hash MD5: 16K
       76 23 14 61 10 DB 6A 48 88 60 25 34 07 30 8D 58>)
(   4,<2024-11-01 13:59:00.87 +0400>,<she>,<DPX200>,
      <abs ABSG = 5 
       data hash MD5: 16K
       E4 80 2D 1F 1D C6 D3 60 D8 EE 33 0E 5A 16 67 49>)
$$ ##END=
$$ 
$$ hash MD5
$$ 28 D6 53 E3 64 11 9E 20 97 AC C8 03 FA 29 EF 16
##$RELAX= 
##$RELAX= 
##$RELAX= 
##$RELAX= 
##$RELAX= 
##$RELAX= 
$$ Bruker specific parameters
$$ --------------------------
##$DU= <F:/spectra>
##$EXPNO= 1
##$NAME= <H-F>
##$PROCNO= 1
##$TYPE= <nmr>
##$USER= <she>
##$AMP= (0..31)
100 100 100 100 100 100 100 100 100 100 100 100 100 100 100 100 100 100 
100 100 100 100 100 100 100 100 100 100 100 100 100 100 
##$AQSEQ= 0
##$AQ_mod= 1
##$AUNM= <au_zg>
##$AUTOPOS= <>
##$BF1= 200.13
##$BF2= 200.13
##$BF3= 200.13
##$BF4= 200.13
##$BF5= 200.13
##$BF6= 200.13
##$BF7= 200.13
##$BF8= 200.13
##$BYTORDA= 1
##$CFDGTYP= 0
##$CFRGTYP= 5
##$CHEMSTR= <none>
##$CNST= (0..31)
1 1 145 1 1 1 1 1 1 1 1 1 1 1 1 1 1 1 1 1 1 1 1 1 1 1 1 1 1 1 1 1 
##$CPDPRG= <>
##$CPDPRG1= <>
##$CPDPRG2= <>
##$CPDPRG3= <>
##$CPDPRG4= <mlev>
##$CPDPRG5= <mlev>
##$CPDPRG6= <mlev>
##$CPDPRG7= <mlev>
##$CPDPRG8= <mlev>
##$CPDPRGB= <>
##$CPDPRGT= <>
##$D= (0..31)
0 1.2 0 0 0 0 0 0 0 0.06 0 0.03 0 0 0 0 0.0002 0 0 0 0 0 0 0 0 0 0 0 0 
0 0 0 
##$DATE= 1730455121
##$DBL= (0..7)
120 120 120 120 120 120 120 120 
##$DBP= (0..7)
150 150 150 150 150 150 150 150 
##$DBP07= 0
##$DBPNAM0= <>
##$DBPNAM1= <>
##$DBPNAM2= <>
##$DBPNAM3= <>
##$DBPNAM4= <>
##$DBPNAM5= <>
$$ [...]
##$SUBNAM3= <"">
##$SUBNAM4= <"">
##$SUBNAM5= <"">
##$SUBNAM6= <"">
##$SUBNAM7= <"">
##$SUBNAM8= <"">
##$SUBNAM9= <"">
##$SW= 24.0689170037331
##$SWIBOX= (0..15)
0 0 2 0 0 0 0 0 0 0 0 0 0 0 0 0 
##$SW_h= 4816.95568400771
##$TD= 16384
##$TD0= 1
##$TE= 0
##$TE2= 300
##$TE3= 300
##$TEG= 300
##$TL= (0..7)
0 120 120 120 120 120 120 120 
##$TP= (0..7)
150 150 150 150 150 150 150 150 
##$TP07= 0
##$TPNAME0= <>
##$TPNAME1= <>
##$TPNAME2= <>
##$TPNAME3= <>
##$TPNAME4= <>
##$TPNAME5= <>
##$TPNAME6= <>
##$TPNAME7= <>
##$TPOAL= (0..7)
0.5 0.5 0.5 0.5 0.5 0.5 0.5 0.5 
##$TPOFFS= (0..7)
0 0 0 0 0 0 0 0 
##$TUNHIN= 0
##$TUNHOUT= 0
##$TUNXOUT= 0
##$USERA1= <user>
##$USERA2= <user>
##$USERA3= <user>
##$USERA4= <user>
##$USERA5= <user>
##$V9= 5
##$VALIST= <valist>
##$VCLIST= <CCCCCCCCCCCCCCC>
##$VD= 0
##$VDLIST= <DDDDDDDDDDDDDDD>
##$VPLIST= <PPPPPPPPPPPPPPP>
##$VTLIST= <TTTTTTTTTTTTTTT>
##$WBST= 1024
##$WBSW= 4
##$XGAIN= (0..3)
0 0 0 0 
##$XL= 0
##$YL= 0
##$YMAX_a= 548392
##$YMIN_a= -497839
##$ZGOPTNS= <>
##$ZL1= 120
##$ZL2= 120
##$ZL3= 120
##$ZL4= 120
##$ABSF1= 21.0076
##$ABSF2= -3.061533
##$ABSG= 5
##$ABSL= 3
##$ALPHA= 0
##$AQORDER= 0
##$ASSFAC= 0
##$ASSFACI= 0
##$ASSFACX= 0
##$ASSWID= 0
##$AUNMP= <proc_1d>
##$AZFE= 0.1
##$AZFW= 0.1
##$BCFW= 0
##$BC_mod= 2
##$BYTORDP= 0
##$COROFFS= 0
##$CY= -3
##$DATMOD= 1
##$DC= 0
##$DFILT= <>
##$DTYPP= 0
##$F1P= 0
##$F2P= 0
##$FCOR= 1
##$FTSIZE= 16384
##$FT_mod= 6
##$GAMMA= 0
##$GB= 0
##$INTBC= 1
##$INTSCL= 3.70164e-10
##$ISEN= 128
##$LB= 0.24
##$LEV0= 0
##$LPBIN= 0
##$MAXI= 10000
##$MC2= 0
##$MEAN= 0
##$ME_mod= 0
##$MI= 1.114404
##$NCOEF= 0
##$NC_proc= -6
##$NLEV= 6
##$NOISF1= 3.799351
##$NOISF2= 2.8
##$NSP= 0
##$NTH_PI= 0
##$NZP= 0
##$OFFSET= 20.99585
##$PC= 1
##$PHC0= -26347.17
##$PHC1= 13.98743
##$PH_mod= 1
##$PKNL= yes
##$PPARMOD= 0
##$PSCAL= 0
##$PSIGN= 0
##$REVERSE= no
##$SF= 200.130006577125
##$SI= 16384
##$SIGF1= 3
##$SIGF2= 2
##$SINO= 5.538805
##$SIOLD= 16384
##$SREGLST= <1H.CDCl3>
##$SSB= 0
##$STSI= 16384
##$STSR= 0
##$SW_p= 4816.95568400771
##$SYMM= 0
##$S_DEV= 0
##$TDeff= 16384
##$TDoff= 0
##$TI= <>
##$TILT= no
##$TM1= 0
##$TM2= 0
##$TOPLEV= 0
##$USERP1= <user>
##$USERP2= <user>
##$USERP3= <user>
##$USERP4= <user>
##$USERP5= <user>
##$WDW= 1
##$XDIM= 16384
##$YMAX_p= 373029292
##$YMIN_p= -1509232
$$ End of Bruker specific parameters
$$ ---------------------------------
##NTUPLES= NMR SPECTRUM
##VAR_NAME=  FREQUENCY,     SPECTRUM/REAL,   SPECTRUM/IMAG
##SYMBOL=    X,             R,               I
##VAR_TYPE=  INDEPENDENT,   DEPENDENT,       DEPENDENT
##VAR_FORM=  AFFN,          ASDF,            ASDF
##VAR_DIM=   16384,         16384,           16384
##UNITS=     HZ,            ARBITRARY UNITS, ARBITRARY UNITS
##FACTOR=    0.29402158847633, 1,            1
##FIRST=     4201.89952041655, 0,            0
##LAST=      -615.056163591164, 0,           0
##MIN=       -615.056163591164, -1509232,    0
##MAX=       4201.89952041655, 373029292,    0
$$ Real data points
##PAGE= N=1
##DATA TABLE= (X++(R..R)), XYDATA
$$ [...]
6908A7071265M01722M26738L58896M63655O98184O12269J030746J020253J044310
6899B3128038J071604R86710J297297J535844J771654K356876K605427L121001
6891C7874451K934563K270573J456376J204883P83905M05437K64232N74296N76340
6882D8345056j01189j030034j671261j626862k079847k537180k793088k714277
6874C3791318k192399j585376j042431p01846l39177O7902J02939K85563N60681
6865B8947174R04745J265524J713261K160304K829051L062093L352818K437987
6857D6672957J394778M50684K29975J22118q3213J37304J942l89232p35107j632367
6847D6169839j702367k094616k862220l119116l122148k669039j817067j482227
$$ plain form
6908 17071265 17472987 17899725 18258621 18722276 19420460 20032729 21063475 22083728 23128038
6899 23128038 24199642 25186352 26483649 28019493 29791147 32148023 34753450 37874451
6891 37874451 40809014 43079587 44535963 45740846 46524751 46930188 47194420 47768716 48345056
6882 48345056 48243867 47213833 45542572 43915710 41835863 39298683 36505595 33791318
6874 33791318 31598919 30013543 28971112 28269266 27930089 27997991 28100930 28386493 28947174
6865 28947174 29851919 31117443 32830704 34991008 37820059 40882152 44234970 46672957
6857 46672957 48067735 48518419 48748394 48870512 48787299 48924603 48926545 48537313 47802206 46169839
6847 46169839 44467472 42372856 39510636 36391520 33269372 30600333 28783266 27301039
6839B7301039j452143j011287r86182o55015n53368n73722j90155l4563K18211
6830B2062815J46176r5524M0850Q4124K56488M8919L62401N4377o9452m4543R712
6819B2856343q8053l77648l28203l11290l22454k33930j03685k51148j1929k4817
6809B0803186J99942K85655K36789L56521K84440L91760N53333R10228R84730
6800B5006584J447002J771316J971879J568639P13780M03832O12351M01797O0298
6791C3957478r8178Q2968L71704m19905j049405q36216j062310j302227j465384
6782B8178525j544418j298575j170746q11993k72506l55077n8859J90001M9478
6773B2905830M04806R46315J265701J575840K128146K570891K825159K119186
$$ plain form
6839 27301039 25848896 24837609 23851427 23196412 22643044 22069322 21879167 21844604 22062815
6830 22062815 22208991 22113467 22154317 22238441 22494929 22543848 22906249 22960626 22891174 22846631 22856343
6819 22856343 22768290 22390642 22062439 21751149 21428695 21194765 21091080 20839932 20828003 20803186
6809 20803186 21003128 21288783 21525572 21882093 22166533 22558293 23111626 24021854 25006584
6800 25006584 26453586 28224902 30196781 31765420 32479200 32883032 33495383 33897180 33957478
6791 33957478 33859300 33942268 34313972 33894067 32844662 32008446 30946136 29643909 28178525
6782 28178525 26634107 25335532 24164786 23352793 23080287 22725210 22666351 22856352 22905830
6773 22905830 23310636 24256951 25522652 27098492 29226638 31797529 34622688 36741874
6765C6741874J387306N37022L83571K77088p6079k97070j59203J56941m61679
6756C8489771q48473r82304j299621j710693j987309k122328k039404j558909
6748B5940730j036238q58060n38739o20565m30445k83845l54669q086J03244L19657
6738B2232984O42380R57558J040177O35186n680N9413j84216r4596k79544k72244
6728B4731418j76172j2624m09640p05962o86826o84322r61043j409876j248135
6719A8436818j027370o85579n84581m16642l72522j83341j14390j68633k18634
6710A4665126l83267l81229r9253k1365n44354l06386k13714k80605j93385m98856
6700A1742712m65768n36950l91952m11291m05321l25835o3464p7914j03191n630
$$ plain form
6765 36741874 38129180 38666202 39049773 39326861 39250782 38953712 38794509 38951450 38489771
6756 38489771 37641298 36658994 35359373 33648680 31661371 29539043 27499639 25940730
6748 25940730 24904492 24046432 23507693 22887128 22456683 22172838 21818169 21810083 21913327 22232984
6738 22232984 22875364 23832922 24873099 25508285 25502605 25562018 25377802 25283206 25003662 24731418
6728 24731418 24555246 24542622 24132982 23427020 22740194 22055872 21094829 19684953 18436818
6719 18436818 17409448 16723869 16139288 15722646 15350124 15166783 15052393 14883760 14665126
6710 14665126 14281859 13900630 13801377 13780012 13235658 12929272 12715558 12434953 12241568 11742712
6700 11742712 11276944 10739994 10348042 9936751 9531430 9205595 9142131 9064217 8961026 8955396
6690H955396j08132R1374n8301K59451k5484O3877J38711j69637k21319j84671
6680H741265l19287l89490k67056k41274k56459l22449j4993l13587l69505l38614
6670E908551j66201k05435k23463l29653k53440j76887q8406l8530j55011j83717
6660D087808j7183j06175j73431j05227K8143j28600r8304K6390p8840q5445k4193
6649C324943j0982j29486P2543j69065R8399K8697j04038j9213k2864m6827k29215
6638B792892j78422k8105j02772l1358j55921j63566j27612J0629l2238R3168
6628B076695j7493l21445M6591J74751N7970j11747M0620n9872q884l7333M8600
6617A888453J2464l3395L303q7083j19321k9280j4076m1964j87606O9293m6313
$$ plain form
6690 8955396 8847264 8938638 8880337 9139788 9114304 9178181 9316892 9147255 8925936 8741265
6680 8741265 8421978 8032488 7765432 7524158 7267699 6945250 6930257 6616670 6247165 5908551
6670 5908551 5742350 5536915 5313452 4983799 4730359 4553472 4465066 4426536 4271525 4087808
6660 4087808 4070625 3964450 3791019 3685792 3713935 3585335 3487031 3513421 3434581 3349136 3324943
6649 3324943 3313961 3184475 3257018 3087953 3186352 3215049 3111011 3091798 3068934 3022107 2792892
6638 2792892 2614470 2586365 2483593 2452235 2296314 2132748 2005136 2015765 1983527 2076695
6628 2076695 2059202 1737757 1784348 1959099 2017069 1905322 1945942 1886070 1877186 1839853 1888453
6617 1888453 1900917 1867522 1870825 1783742 1664421 1635141 1621065 1579101 1391495 1460788 1414475
6606A414475M4047j8432n2673K8543j22603p0118k0247N8491j09452P092M7189
6595A206312m6051n263J15997j13527j6892K6973j21585J78723l7822m2393J7541
6584A162013j02113J17542J10886o9526m7703K30925l115j68123j24012o345r0870
6573A009559m9918O7406l1485j03726J70983R417j88648J0531K5363k920j77826
6562G38736j3954j2345pJ05891J19180j53116M7392K9351r4115J15262J4115k4580
6550H71810l6976p2481M5125M9235j07463Q0755N0742K6498n5250R2605J16305
6539A060905p1220J00011m1155K7161j49940O3830L4235J66375J46058O0641n2936
6528A343965J8400L6156r7861K36619M1862J26760J4912R6946J30185P3341K67980
$$ plain form
6606 1414475 1458522 1440090 1387417 1415960 1293357 1223239 1202992 1261483 1152031 1159123 1206312
6595 1206312 1160261 1154998 1270995 1157468 1140576 1167549 1045964 1224687 1186865 1144472 1162013
6584 1162013 1059900 1177442 1288328 1218802 1171099 1402024 1398909 1230786 1106774 1100429 1009559
6573 1009559 959641 1027047 995562 891836 1062819 1072236 883588 894119 919482 916562 738736
6562 738736 724782 712437 712430 818321 937501 784385 831777 861128 767013 882275 896390 871810
6550 871810 834834 762353 807478 856713 749250 830005 880747 907245 851995 944600 1060905
6539 1060905 989685 1089696 1048541 1075702 925762 989592 1023827 1190202 1336260 1396901 1343965
6528 1343965 1362365 1398521 1300660 1537279 1579141 1705901 1720813 1817759 1947944 2021285 2289265
6517B289265M8802J53256N9018r3323K40678Q3558j55017K4858l3024J3891q4559
6506B547403P4077n9564j56915k12027L740q2955k98701n0115m0479J33719j58488
6495A699695k53327O9569M8574J07420j8812K12931j3662N2862J78396O1231J1773
6484B156650J8120K20531J49933J85483k19554l086L6970o8906K5377J39414j23391
6473B517541k49426n0998j75276j57739K2647l05046j28761j71470L7841o2080
6463A277233j70178o3443o6537l3637P3582j42859m1835l2767q7118M3023L1883
6452G87347M4532m574j33686k2560l2240K4582m3014q465M1773j27322m7710J29514
6440F08177o1047q644j1884K4274j9709J2681K2671M0960r9748L708J3929j5147
$$ plain form
6517 2289265 2338067 2491323 2550341 2457018 2697696 2781254 2626237 2651095 2618071 2631962 2547403
6506 2547403 2621480 2561916 2405001 2192974 2196714 2113759 1815058 1764943 1724464 1858183 1699695
6495 1699695 1446368 1515937 1564511 1671931 1653119 1866050 1852388 1905250 2083646 2144877 2156650
6484 2156650 2174770 2395301 2545234 2730717 2511163 2508077 2545047 2476141 2501518 2640932 2517541
6473 2517541 2268115 2217117 2041841 1884102 1906749 1601703 1472942 1301472 1339313 1277233
6463 1277233 1107055 1043612 977075 943438 1017020 874161 832326 799559 712441 755464 787347
6452 787347 831879 827305 693619 671059 638819 663401 620387 611922 653695 526373 478663 608177
6440 608177 547130 538486 526602 550876 531167 543848 566519 607479 507731 511439 525368 510221
6428E10221p496k2229Q6203n3338L4832j14094p6132l6192j21289J08638j2633
6417B96491o7807L4555J3750L2248K2481j51695J0678m0074R734l7619m0670J93860
6405B75932J75441k4634l0388k7801j08701l8922Q7970r160r514k18113N5570
6394A27680J16895j60939P1861J07992q2495p7512j51067O3961K0290J7379K09035
6383B63080j61842o2131N4033k3928K4397J57382j61538m33m5558P3001j33495
6372a7032q2427N3923J18895p1881J74637k6804n0238k5005J13249q2400Q4145
6361A89062q1070j50863J00118K9486j32249J6547r9389J45111m2796M8566n172
6350A7351P138N7510j9894o3474l6496j26498L1808m5397J88021P6404q0017K02979
$$ plain form
6428 510221 502725 480496 566699 513361 548193 434099 357967 321775 200486 309124 296491
6417 296491 228684 263239 276989 309237 331718 180023 190701 150627 160361 122742 82072 275932
6405 275932 451373 426739 396351 368550 259849 220927 308897 299737 290223 72110 127680
6394 127680 244575 83636 155497 263489 180994 103482 -47585 16376 36666 54045 263080
6383 263080 101238 39107 93140 69212 93609 250991 89453 89020 43462 116463 -17032
6372 -17032 -99459 -45536 73359 1478 176115 149311 99073 74068 187317 104917 189062
6361 189062 107992 -42871 57247 86733 -45516 -28969 -128358 16753 -26043 22523 17351
6350 17351 24489 81999 62105 -1369 -37865 -164363 -132555 -177952 10069 86473 6456 209435
6338B09435j36188K162q3183Q3727N5695J48929l35407J0705M4566q884o5544
6327g3987J08505n2369q9390K15329k09008j359J57825R4544m1460j41238j09604
6316a42212J60464j56916q0413K07062Q1245j15113j04909J13912P4864j00065
6306f2081P6027O3386N4889n3625P0577L0809k23031K0056P0941o4440j5091o1375
6294i2958j46934K24344j24244p422J14734m5156J58206j52173M2793N1004n0789
6283b8595n0521J34891N9987Q4113j19246K5159K00619j73408n4708j91405P8882
6272c4232O3157J55648j42604j5374J36869k9090q0486j5648N2354l4067o7201
6261a0674j2366l000L4694R4752l1667P547j2293l0291K3786o644O8169q3647
$$ plain form
6338 209435 73247 75409 -7774 75953 131648 280577 -54830 -44125 441 -8443 -73987
6327 -73987 34518 -17851 -107241 108088 -100920 -102279 55546 150090 108630 -32608 -142212
6316 -142212 18252 -138664 -219077 -12015 69230 -45883 -150792 -36880 37984 -62081
6306 -62081 13946 77332 132221 78596 149173 179982 -43049 -22993 47948 -16492 -31583 -92958
6294 -92958 -239892 -15548 -139792 -147214 -32480 -77636 80570 -71603 -28810 22194 -28595
6283 -28595 -79116 55775 115762 199875 80629 105788 306407 132999 78291 -113114 -34232
6272 -34232 28925 184573 41969 26595 163464 134374 53888 38240 90594 56527 -10674
6261 -10674 -23040 -26040 8654 103406 71739 79286 66993 36702 60488 53844 122013 38366
6249C8366J667N5643Q8584r4854p6773M0228P7796P4154j0360j02596j46140l6138
6237i0423K3356J51976J46507o8247P611j06574l9111O2990j1577N8721j20880
6226A4349J16202K5754q0906J1657j18891p998R1026Q4853m169j16216r2961Q3839
6214F539M9994n536o597J94354j20858l2955K9451r0133J3475j3992o1771R4286
6202E6257j2079O3903Q7550M9824k35355Q189J18417K11383k60823j59722O255
6191f6201J45321l6714R2370N4306j95683N4718m3112o6916M9808l0022k1629
6180f3754Q6931r8089P1763R6084K3897o1755q293P8536Q256j65856J34142J08934
6168B10796j9243R9228j74474O2634o4599j36463N0985R4050o1902m4234N6563
$$ plain form
6249 38366 40033 95676 184260 89406 12633 52861 130657 204811 194451 91855 -54285 -90423
6237 -90423 -67067 84909 231416 163169 170780 64206 25095 88085 76508 135229 14349
6226 14349 130551 156305 75399 87056 -31835 -39833 51193 136046 131877 15661 -77300 6539
6214 6539 56533 50997 44400 238754 117896 84941 114392 24259 37734 23742 -38029 56257
6202 56257 44178 108081 195631 245455 10100 18289 136706 348089 87266 -72456 -66201
6191 -66201 79120 42406 134776 189082 -6601 48117 5005 -61911 -12103 -42125 -63754
6180 -63754 23177 -74912 -3149 92935 116832 55077 46784 125320 133576 -32280 101862 210796
6168 210796 191553 290781 116307 178941 114342 -22121 28864 122914 61012 16778 73341
6157G3341q368J11980O106l1518m9819J16557j41772q1671j17343L026J02617
6146a6864N8666r8417Q8620N5004Q1352j07297j12371L8406J78803j38688Q0649
6135A07863J40732o71j07034k7009M5408L22526R1529J02472L6851m4037n9231
6124F09399K7894K69335r2380K0834r3576l091l9260k6484n0232J26522p9783
6113F69178r2031O5640j49238J0224k01212m8895k3696N2967p3812r561M2079
6102B41643L5770m110J16700o8883l7244N8376R658k62411m2158J42709J0170
6091B00220l5903n0818O3199J7104r7556J65335Q227k18690J0452P9268K22707
6080C63545L3655j06283J76236k4295j76954J36038K25575o0439O5539j54821
$$ plain form
6157 73341 64973 176953 183059 151541 101722 218279 76507 -5164 -122507 -119481 -16864
6146 -16864 41802 -56615 32005 87009 168361 61064 -51307 -12901 165902 27214 107863
6135 107863 248595 247924 140890 113881 159289 481815 573344 675816 712667 668630 609399
6124 609399 637293 906628 814248 835082 741506 738415 699155 672671 622439 748961 669178
6113 669178 577147 642787 493549 503773 302561 253666 229970 282937 209125 199564 241643
6102 241643 277413 273303 390003 321120 283876 342252 351910 89499 47341 190050 200220
6091 200220 164317 113499 176698 193802 96246 261581 269808 51118 61570 140838 363545
6080 363545 397200 290917 467153 442858 265904 401942 627517 567078 632617 477796
6070D77796J29113O237m1340P8210q1416k3439k4211J56194L7999O9962p7760
6059G07345r7109k5584J6891p7701O3585j59523N5501K889k1666j18920N2458
6048C98166j2121P9410J40991j84081l347J52787j70830n1910R833n1743K07416
6037E14571n7261j0758R5751k4890k9050k0717J05233M1624p4126J1077L7289
6026E88743j83604J18705L6246J34021m2697k29097Q6960J16356J9032j20955
6016E23710j09112j4443j3421R8399P3125k63508R4989J44833P7181N0626p5556
6005E86823l7104P4817K26788j67692J24168n144j34317J25851j5459J13632J63043
5994A055406O7113M7408j9264p854K11392L81045L2725L29374J01285J83310J36302
$$ plain form
6070 477796 606909 613146 571806 650016 568600 545161 520950 677144 715143 785105 707345
6059 707345 610236 584652 601543 523842 587427 427904 483405 486294 464628 345708 398166
6048 398166 386045 465455 606446 422365 419018 571805 400975 349065 358898 307155 514571
6037 514571 457310 446552 542303 517413 488363 467646 572879 614503 540377 551454 588743
6026 588743 405139 523844 560090 694111 651414 422317 509277 625633 644665 523710
6016 523710 414598 400155 386734 485133 558258 294750 389739 534572 611753 662379 586823
6005 586823 549719 624536 851324 683632 807800 802656 668339 794190 778731 892363 1055406
5994 1055406 1122519 1169927 1150663 1142809 1354201 1735246 1767971 2097345 2198630 2381940 2518242
5983B518242m7069J55792k540j46418j26910j48857r5368j44279k42517r9424
5973A620652j47011k4671l6944j27108j72016j28578m8379L3720k5695k4100J14743
5962A034613M3765J35212q6105r4642O309m0971J29202O8626N8494l2732Q6606
5951A308377J91159j4716K41993J47876K29186J25064N7283J32403J21004K0819
5941B560448R4224k17879k53324r8953j80705k19089j06681j6382P7351q9235
5931A549775k64213K7799L6636O1762j49331k0531J47757K33440j9368J01441
5921A705167k1409m4764p139l4320O5323m1848k02856m556k4424L8178M0340r4896
5909A372796J47001L5431o8350l1167j74458n750J33557J88847J24078N2315j11621
$$ plain form
5983 2518242 2471173 2626965 2624425 2478007 2351097 2202240 2106872 1962593 1720076 1620652
5973 1620652 1473641 1448970 1412026 1284918 1112902 984324 935945 969665 943970 919870 1034613
5962 1034613 1078378 1213590 1127485 1032843 1039152 998181 1127383 1196009 1254503 1221771 1308377
5951 1308377 1499536 1484820 1726813 1874689 2103875 2228939 2286222 2418625 2539629 2560448
5941 2560448 2654672 2436793 2183469 2084516 1903811 1684722 1578041 1561659 1639010 1549775
5931 1549775 1285562 1313361 1349997 1411759 1262428 1241897 1389654 1623094 1603726 1705167
5921 1705167 1683758 1638994 1631855 1597535 1662858 1621010 1418154 1413598 1389174 1427352 1467692 1372796
5909 1372796 1519797 1555228 1486878 1455711 1281253 1275503 1409060 1597907 1721985 1774300 1662679
5898A662679J60028j0777K7368j2208k3279O9181l2371P8984O8546j6411J0749
5887A982489K6740J13815n1364q1987q351J07746J21024O675p4938M1838J2610
5876B196297r1000J42926j5876L15368n4350P4241L48687J54012O7416O6387K21084
5865C425192m5877j86378J06531j80032l8547Q5293k80584l4213j39246j38911
5855B573228o224p6479j15046o6084j79579j2626o835l7103m467j41126J4217
5844A941876M8827n2838r9283J20220J02186q2006p2992q5843r2513j19132R3232
5833A701734Q7042m1214j55640J78066j8286p9846j53398K09170j4921J3473N892
5822A732072L8280n9694p049J37269Q2466L0142J88436K3563J13593o8055M4629
$$ plain form
5898 1662679 1822707 1811930 1839298 1827090 1803811 1872992 1840621 1919605 1988151 1971740 1982489
5887 1982489 2009229 2123044 2071680 1989693 1981342 2089088 2210112 2216787 2141849 2183687 2196297
5876 2196297 2105297 2248223 2232347 2547715 2493365 2567606 2916293 3070305 3137721 3204108 3425192
5865 3425192 3379315 3192937 3299468 3119436 3080889 3166182 2885598 2851385 2712139 2573228
5855 2573228 2567004 2490525 2375479 2309395 2129816 2117190 2110355 2073252 2068785 1927659 1941876
5844 1941876 1990703 1937865 1838582 1958802 2060988 1978982 1905990 1820147 1727634 1608502 1701734
5833 1701734 1788776 1747562 1591922 1769988 1751702 1671856 1518458 1727628 1712707 1726180 1732072
5822 1732072 1770352 1710658 1703609 1840878 1923344 1953486 2141922 2165485 2279078 2211023 2255652
5811B255652L12942K99841R3067P1251J08031P4198J72305k6729q6762p4469J9402
5800C218729j14095k40115l35114o4375j465o3723j07628j76245j81558p1508
5790A862903n5477N8084j65107m9455p7848o1197l394P6014Q901K3053j980P0899
5778A685396j19193J85873Q4475L8730K1007J5830r3949M5959J24778j727O8000
5767B055179J21954m9799L13492j1302O0067N0371L4471l4081q1263P6879J52172
5756B688140K8245L9915Q0506j4092M480Q1919Q8894q0421R8336J88928L24685
5745C529535P7851K10361K84745K65288M99963L84105N07790M48854O93505N22476
5735G424473L72074M94585J47819k44247l49386k03393o46462o39207m44053o06444
$$ plain form
5811 2255652 2568594 2868435 2961502 3032753 3140784 3214982 3387287 3360558 3273796 3199327 3218729
5800 3218729 3104634 2864519 2529405 2465030 2463565 2399842 2292214 2115969 1934411 1862903
5790 1862903 1807426 1865510 1700403 1650948 1573100 1511903 1508509 1584523 1593424 1616477 1614497 1685396
5778 1685396 1566203 1752076 1836551 1875281 1896288 1912118 1818169 1864128 1988906 1987179 2055179
5767 2055179 2177133 2127334 2440826 2429524 2489591 2539962 2574433 2540352 2459089 2535968 2688140
5756 2688140 2716385 2756300 2836806 2822714 2827194 2909113 2998007 2917586 3015922 3204850 3529535
5745 3529535 3607386 3817747 4102492 4367780 4867743 5251848 5759638 6208492 6901997 7424473
5735 7424473 7796547 8291132 8438951 8194704 7845318 7641925 6995463 6356256 5912203 5305759
5725E305759m51688k39529j79689k73748j71022q0540K8718m9869j11575N3987
5715C830804M1253l7756O5223p0150l5649Q8719n6190j18051j00641k79861m04259
5704B923442j73402j67498k84205j37097k71507j38407k2004j16674j92367j8394
5694A401887j53583K7692l4477j68975N6087m9663p2404j54910N7418N0790p4535
5683H85327P983M2913k8886r2797p7385K0139p0911K72109k5211j32789r5353
5672G05139Q8656j57289j8952K8076Q3466p4719l3179L0467N6699j18015O7902
5661F58251p7451J02152m3102j71112J5194l6758r8368K8932M3784L6703j4695
5650D43530j75512j95770O1508K18136l551o6335o0435R3352j24501n8556l8529
$$ plain form
5725 5305759 4854071 4614542 4434853 4161105 3990083 3909543 3938261 3888392 3776817 3830804
5715 3830804 3872057 3834301 3899524 3829374 3793725 3882444 3826254 3708203 3607562 3327701 2923442
5704 2923442 2750040 2582542 2298337 2161240 1889733 1751326 1729322 1612648 1420281 1401887
5694 1401887 1248304 1275996 1241519 1072544 1128631 1078968 1006564 851654 909072 959862 885327
5683 885327 893310 936223 907337 814540 737155 757294 686383 958492 933281 800492 705139
5672 705139 793795 636506 617554 645630 729096 654377 621198 651665 708364 590349 658251
5661 658251 580800 682952 639850 468738 483932 447174 348806 377738 421522 458225 443530
5650 443530 268018 72248 133756 351892 348341 282006 221571 314923 190422 131866 93337
5639I3337J55386o6207L3829k6988M0552l280p2627J66883o0603o9868J20043
5628C10457n1879r7345n6012L0142R3354j67838J27693j4671P8873j55967J8815
5617A15622K21158n7034j21421J14044N8666j6514q5266j06369P299J95988M5871
5606C72044n0047l6878j73765J2928O0323Q6454J44223p9029p9076K5705j9960
5595B62922Q9351L0978O54N5604o0751p4304p3524J08649j63698j7775R9370J18659
5583C76135j32566j34550q2843J749J48310k11912J86164N2007n6806K0513J64766
5572C30967J93Q2J3579N9584p9708L6043r7065Q4015p2628N3874o9868J21900
5560C80968N1577j8382r9657m8528n0134O3111J26392M691r8309j2048J55904
$$ plain form
5639 93337 248723 182516 216345 189357 229909 226629 154002 320885 260282 190414 310457
5628 310457 258578 161233 105221 135363 228717 60879 188572 173901 252774 96807 115622
5617 115622 336780 279746 158325 272369 331035 314521 229255 122886 130185 326173 372044
5606 372044 321997 285119 111354 124282 184605 271059 415282 336253 257177 282882 262922
5595 262922 352273 383251 383905 439509 378758 304454 230930 339579 175881 158106 257476 376135
5583 376135 243569 109019 26176 27925 176235 -35677 150487 202494 145688 166201 330967
5572 330967 331160 331242 344821 404405 324697 360740 263675 347690 275062 328936 259068 380968
5560 380968 432545 414163 314506 265978 215844 278955 405347 410038 311729 299681 455585
5549D55585j0422k17331p233N3404Q522q2567N8841p0882K7059M2941K7436L3662
5537C19015P3923N5707p5371K8820J54590r5228k11186L5784O6527J02959k03185
5526B52355O8461J50503j12046K6603M1341m9229p39M6316j23749o2248n7150
5515A80418k794J24719m890P6625j23877J693j47006J5055J57652j80707J54383
5504B51271m8580K7090J14788L5592L6379j30661J67381j24814R2784m4292R2389
5493D69327j06591J98027J166q1770j4106j12309J04721J19069Q9312l4181k4723
5482F07942R771j16224K06710j553j64804n4827k01166J80134J20408j53653R6112
5471E28850J27574j13995l2076K4117j2515j97874L8360Q0297k2881Q6555J14777
$$ plain form
5549 455585 445163 227832 220599 274003 282525 199958 258799 187917 214976 257917 285353 319015
5537 319015 392938 448645 373274 402094 556684 461456 250270 286054 352581 455540 252355
5526 252355 320816 471319 359273 385876 427217 377988 377249 423565 299816 237568 180418
5515 180418 177624 302343 297453 374078 250201 251894 104888 119943 277595 96888 251271
5504 251271 202691 229781 344569 380161 416540 285879 453260 328446 421230 376938 469327
5493 469327 362736 560763 561929 480159 466053 353744 458465 577534 666846 632665 607942
5482 607942 617713 501489 708199 706646 541842 487015 285849 465983 586391 432738 528850
5471 528850 656424 542429 510353 534470 521955 324081 362441 442738 419857 506412 621189
5460F21189j00278K5436n7270j14139K0556r8353m4988L815P0785k3518M9788
5449C53023n5949K499j01124K5607R0472j01441N3239P1300j57900J0598J20829
5438C11153J2270l9915J8587L1028m7147J0311o158l1965q6352p8066N2459L4194
5426A80399L7416l6054l5983j09088N3641Q0220n9232k0940n6632r87j07285J41297
5414F6772K86672j38008j60564J09843k4555P0853R2953n5233k9443J2320K5438
5403B57048l5052m7275J1213j29641R4937J06079j7893Q790l6963M8890J34839
5392C94972j63333r8069J17085k3250m6331J70453N3527J035r7629P4296q2447
5381C00309j61917Q0919k632j76091M0805K7230M4126L1852J44541J03851j41797
$$ plain form
5460 621189 520911 546347 489077 374938 395494 297141 252153 255968 326753 303235 353023
5449 353023 297074 299573 198449 224056 314528 213087 266326 337626 179726 190324 311153
5438 311153 323423 283508 302095 333123 285976 296287 290129 258164 171812 93746 146205 180399
5426 180399 217815 181761 145778 36690 90331 170551 111319 90379 33747 32760 -74525 66772
5414 66772 353444 215436 54872 164715 140160 211013 303966 248733 219290 231610 257048
5403 257048 221996 174721 185934 56293 151230 257309 239416 248206 211243 260133 394972
5392 394972 231639 133570 250655 227405 181074 351527 405054 406089 308460 382756 300309
5381 300309 138392 219311 216679 40588 81393 108623 152749 184601 329142 432993 291196
5370B91196j91456K9962J08936J05751q2160Q9881q3552p1716M2906J69208j06126
5359C02830m5104J45179M705L113J23157L5453p8150o4343r1660J07588k3630
5348D19138p7168k591k4007M0464K7820L4807Q1540p1640O8435k1239N437r489
5336D71507J11103j57018L6933N4786L8760L4370J83999r3252j01106N1449J27499
5325G59030j52462L1382N6556q587L7822J83888R7181J40796J09490J54988P705
5314A417789j2075k2776J05407k15219k2739n7368j2933j03145j57317l9371j2846
5303H67407J46603j68993J53135Q9386n8669j27695P0642j6074P9019R0399j00154
5292A025006o6808J28555j5792k0297p9711j26801L8049K9845J24938J21347o9636
$$ plain form
5370 291196 99740 129702 238638 344389 262229 352110 268558 196842 239748 408956 302830
5359 302830 257726 402905 407610 410723 533880 569333 491183 426840 335180 442768 419138
5348 419138 341970 339379 315372 355836 383656 418463 500003 428363 496798 475559 480996 471507
5336 471507 582610 425592 462525 517311 556071 590441 774440 681188 580082 631531 759030
5325 759030 606568 637950 694506 685919 723741 907629 1004810 1145606 1255096 1410084 1417789
5314 1417789 1405714 1382938 1488345 1273126 1250387 1193019 1180086 1076941 919624 880253 867407
5303 867407 1014010 845017 998152 1087538 1028869 901174 971816 955742 1034761 1125160 1025006
5292 1025006 958198 1086753 1070961 1050664 970953 844152 882201 912046 1036984 1158331 1088695
5281A088695k1821j48367Q0456K3368J13952J3393J17574K4495j3307R9518R1844
5270A469800P7222O154J72007Q872K03650M9569o7795J03669J8952K29293N1415
5259B322808L25872L04767M16823J16191J3351J07266J58840J44338r8051l2642
5249C779563j15735k93759p4609M1934J07246q6599k4740o3002k32374J32507
5239C170432L2336J56905p2511P9900l5060o1883p0368n0768j19502k18375O8658
5228B879764k291l568j26135q0799j69244j09041K55275n3297q8579J87314n8952
5217B630447j22687k4K38758j46129j18014m020J47071J07010M5169J74237j02524
5206B849294j4724Q5643j0207J4724Q8076J21300J48655m8364Q0323Q3190l336
$$ plain form
5281 1088695 1066874 918507 998963 1022331 1136283 1149676 1267250 1291745 1278438 1377956 1469800
5270 1469800 1547022 1553176 1725183 1734055 1937705 1987274 1919479 2023148 2042100 2271393 2322808
5259 2322808 2648680 2953447 3370270 3486461 3499812 3607078 3765918 3910256 3812205 3779563
5249 3779563 3663828 3370069 3295460 3337394 3444640 3358041 3333301 3270299 3037925 3170432
5239 3170432 3202768 3359673 3287162 3367062 3332002 3270119 3199751 3148983 3029481 2811106 2879764
5228 2879764 2877473 2873905 2747770 2666971 2497727 2388686 2643961 2590664 2502085 2689399 2630447
5217 2630447 2507760 2507736 2746494 2600365 2482351 2478331 2625402 2732412 2777581 2951818 2849294
5206 2849294 2834570 2920213 2910006 2924730 3012806 3134106 3282761 3234397 3314720 3397910 3394574
5195C394574L9748J46855N293J32502j38425p4600L38475J85058J39975J32370
5185D301825l0833M1041O8706J07057J00871j26974j7683j0158m0370N3490j66221
5174D280751j16764J15375r1830r6195q2323o5887q5707o4078n6975j07216L1943
5163C661094q5687J31360l2790j4679m3485m6449l7267m1010N9892J70195j01475
5152C619699K2940J85414M0381J42830n810R6658J18350Q4114K79799R9691J6637
5141D700703J29382K28891P1815J38552J83248K37934J20968K9682K71319J9252
5131F131746j69775r1937L7452r0989j29956k61543n2794m2399j81547l05943
5121D842315j33493m1686j38472j54132o145N5743o3860o629m6817L7166j10305
$$ plain form
5195 3394574 3434322 3581177 3586470 3718972 3580547 3505947 3844422 4029480 4169455 4301825
5185 4301825 4270992 4312033 4380739 4487796 4588667 4461693 4444010 4433852 4393482 4446972 4280751
5174 4280751 4163987 4279362 4187532 4091337 4009014 3943127 3857420 3793342 3736367 3629151 3661094
5163 3661094 3575407 3706767 3673977 3659298 3615813 3569364 3532097 3491087 3550979 3721174 3619699
5152 3619699 3642639 3828053 3868434 4011264 4005454 4102112 4220462 4304576 4584375 4684066 4700703
5141 4700703 4830085 5058976 5130791 5269343 5452591 5690525 5811493 5841175 6112494 6131746
5131 6131746 5961971 5870034 5907486 5816497 5686541 5424998 5372204 5329805 5148258 4842315
5121 4842315 4708822 4667136 4528664 4374532 4368387 4424130 4360270 4353641 4306824 4343990 4233685
5110D233685l1114J25912o8862p3698P7520N5931L7951j5520q6888Q0726j12071
5099D223572J65365m5730j50279O5783J02658R6741j02025K78413j14118P0668
5089D591048K63716L5689J25814M5979P4894P3370J10033L6637J8116J14656J93572
5078E683524J76773J20188J15797K60297J16043J26022K76756N7838j066J23594
5068G055766J17419K28849J03127J24734K48292J79594J13519K42543J28445J64621
5058H706909K49791K55251J79775K61845L35345K40902K51642L88421J00441K08220
5048A1178542L02431K21012L14739L36498K07253K51842J65117K82731K10606
5039A3470771K13112J25073J47030K40251l3347J98094K17989K22556M3510L13287
$$ plain form
5110 4233685 4202571 4328483 4259621 4185923 4263443 4319374 4357325 4341805 4254917 4335643 4223572
5099 4223572 4388937 4343207 4192928 4258711 4361369 4458110 4356085 4634498 4520380 4591048
5089 4591048 4854764 4890453 5016267 5062246 5137140 5210510 5320543 5357180 5375296 5489952 5683524
5078 5683524 5860297 5980485 6096282 6356579 6472622 6598644 6875400 6933238 6932172 7055766
5068 7055766 7173185 7402034 7505161 7629895 7878187 8057781 8171300 8413843 8542288 8706909
5058 8706909 8956700 9211951 9391726 9653571 9988916 10229818 10481460 10869881 10970322 11178542
5048 11178542 11480973 11701985 12016724 12353222 12560475 12812317 12977434 13260165 13470771
5039 13470771 13683883 13808956 13955986 14196237 14162890 14360984 14578973 14801529 14845039 15158326
5029A5158326M02646L60404L88589M40678M47892M21713L25203N08003K82913
5020A8736367M27464J95760J84855R7149J64029L9155n4461K65148K23174K50821
5010B0529461K71067K92181L54004J83211K76207L52531M14449L47018L18887
5001B3339016N12421L50302L87888K73720N33315M13611M89931O73848P92201
4992B7766253R96757Q77865R57972J188645J235273J419231J439164J610815J901023
4983C9392998K222817K481288K981913L300770M204588N117207N958239O344709
4975G2004529N238929L374087K729677K974441K849492K163813J550667J750931
4967I4636566K784945L447836K903305L886480N426743O503741O443681N076329
$$ plain form
5029 15158326 15560972 15921376 16309965 16750643 17198535 17620248 17945451 18453454 18736367
5020 18736367 19163831 19359591 19544446 19641595 19805624 19844779 19790318 20055466 20278640 20529461
5010 20529461 20800528 21092709 21446713 21629924 21906131 22258662 22673111 23020129 23339016
5001 23339016 23851437 24201739 24589627 24863347 25396662 25810273 26300204 26974052 27766253
4992 27766253 28763010 29640875 30598847 31787492 33022765 34441996 35881160 37491975 39392998
4983 39392998 41615815 44097103 47079016 50379786 54584374 59701581 65659820 72004529
4975 72004529 77243458 80617545 83347222 86321663 89171155 91334968 92885635 94636566
4967 94636566 97421511 100869347 103772652 107659132 113085875 119589616 126033297 131109626
4959A31109626L324049K533174K589229J721774Q25630n34215k724114l865590
4951A34979563k863348j420034o30373O0927J086818K546288K819680J969755
4943A38549276K149380L758122L698491K380883m59959l245709m758482n069190
4935A37002812n881648o999127p882626q253264p612392o640855n216471l809542
4927H4706887k730621j948857o82549K56729J206511J381571J126181j88044j024888
4918H2102920j867873k586556l471506m125813n047883m980355m722929m196076
4910E1103929l667240l315078k672473k527872k196996j845434j611409j604863
4902C1662564j356877j339887j143385j043163q60596p66061p38098r67533r19574
$$ plain form
4959 131109626 134433675 136966849 139556078 141277852 142103482 141569267 138845153 134979563
4951 134979563 132116215 130696181 130065808 130126735 131213553 133759841 136579521 138549276
4943 138549276 140698656 144456778 148155269 150536152 150076193 146830484 142072002 137002812
4935 137002812 131121164 124122037 116239411 107986147 100373755 93732900 88516429 84706887
4927 84706887 81976266 80027409 79344860 79601589 80808100 82189671 83315852 83127808 82102920
4918 82102920 80235047 77648491 74176985 70051172 65003289 60022934 55300005 51103929
4910 51103929 47436689 44121611 41449138 38921266 36724270 34878836 33267427 31662564
4902 31662564 30305687 28965800 27822415 26779252 25918656 25152595 24414497 23446964 22527390
4893B2527390q37040p96512j025679o91749p19758o09377o72596n53509n66930
4884A6054240n75952m66466l54743k52804m38167m17794l35074k91990m39214
4875A2482036k11261l67074l83396k14244k16018l58603k64450r3620l00494j31176
4865I941700k14812N4810j85078n3225j29439l25409j25967K979l3613j67210
4855H764736J811J4349j55259n9679k29601j69733j00617p8518p7808j62752j56388
4844G590541R748o7084K95P399j59285k2415N8993J35612M9220k10634j54811
4833G237579L336j50165j36602M5250K9389k24780j69240p5716j4436k39253J18329
4822F423691P6494o2691j04598L867Q3714p0897j73322N7817L7676n834R5325
$$ plain form
4893 22527390 21690350 20893838 19868159 19176410 18456652 17847275 17174679 16621170 16054240
4884 16054240 15478288 15011822 14657079 14404275 13966108 13548314 13213240 12921250 12482036
4875 12482036 12270775 11903701 11520305 11306061 11090043 10731440 10466990 10373370 10072876 9941700
4865 9941700 9726888 9781698 9596620 9543395 9413956 9088547 8962580 8965559 8931946 8764736
4855 8764736 8766547 8780896 8625637 8565958 8336357 8166624 8066007 7987489 7909681 7746929 7590541
4844 7590541 7600289 7533205 7533500 7540899 7381614 7359199 7418192 7553804 7603024 7392390 7237579
4833 7237579 7240915 7090750 6954148 6999398 7028787 6804007 6634767 6559051 6544615 6305362 6423691
4822 6423691 6500185 6437494 6332896 6336763 6420477 6349580 6176258 6234075 6271751 6265917 6361242
4811F361242j913j57333q4181l9662N5928R018q5816j4427o5537K1006n731j3124
4799E979470N8072j3095j36818J06805K23040j41594k0499l042J41908M7089j1698
4788F229638K1632j6069j79310J73701Q1077K5192m7518p786N5901J97133J10715
4777F644306J39567K1374o653J09228M0909J13100O0713J33067l2144L1290K38261
4766G493018J43874J40891P8238P4004K37510L09981N3132J60426O0273K35979
4756H987326J99573J02568K36337j35951j7457J49627K59574Q5313J81893Q9893
4746A0138696O3395K55805J15501K58155J03817K82657J86897M15908K52755R8626
4736A2172212J98464N5935J29756K63572L09745K02042K61109M15295L30722P9463
$$ plain form
4811 6361242 6359329 6201996 6117815 6078153 6134081 6143099 6057283 6042856 5977319 5998325 5992594 5979470
4799 5979470 6037542 6024447 5887629 5994434 6217474 6075880 6055381 6052339 6194247 6241336 6229638
4788 6229638 6251270 6235201 6055891 6229592 6310669 6335861 6288343 6280557 6336458 6533591 6644306
4777 6644306 6783873 6805247 6798594 6907822 6948731 7061831 7122544 7255611 7223467 7254757 7493018
4766 7493018 7636892 7777783 7856021 7930025 8167535 8477516 8530648 8691074 8751347 8987326
4756 8987326 9186899 9289467 9525804 9389853 9372396 9522023 9781597 9866910 10048803 10138696
4746 10138696 10202091 10457896 10573397 10831552 10935369 11218026 11404923 11820831 12073586 12172212
4736 12172212 12370676 12426611 12556367 12819939 13129684 13331726 13592835 14008130 14338852 14418315
4726A4418315M23384L07158L65908K25933M65338K91836L82326M44320M06085
4717A7730603K65725L18609L60222M00972K14313J96730O287J43619J22717Q4927
4707A9844724R1499J80696K5003J6330J858j2200J72036J66684J017J22840P2459
4696B0682946J49567K66809K12691K15347L05927L14652L73382L95133L38124
4687B3254578M59730N87229M51653O49232O55389N15425O73481N59379Q23233
4678B8629329R71128R20549R63271P54714J105869J004330R14928Q59010O68894
4669C6792022P71194Q22439N58487N55585P28601P89938O83153P94631J061483
4660D3557533Q90432J200405J023283J620509J461355J387541J666018J565029
$$ plain form
4726 14418315 14841699 15148857 15514765 15740698 16206036 16497872 16880198 17324518 17730603
4717 17730603 17996328 18314937 18675159 19076131 19290444 19487174 19493461 19637080 19759797 19844724
4707 19844724 19936223 20116919 20141922 20158252 20160110 20147910 20319946 20486630 20487647 20610487 20682946
4696 20682946 20832513 21099322 21312013 21527360 21833287 22147939 22521321 22916454 23254578
4687 23254578 23714308 24301537 24753190 25402422 26057811 26573236 27246717 27806096 28629329
4678 28629329 29600457 30521006 31484277 32238991 33344860 34349190 35264118 36123128 36792022
4669 36792022 37563216 38385655 38944142 39499727 40228328 41018266 41701419 42496050 43557533
4660 43557533 44447965 45648370 46671653 48292162 49753517 51141058 52807076 54372105
4652E4372105J765162K147341K387303K656664L019815L836806M403770M172037
4644G8761003L582378K231019J079595N29353j26680r06569j830775k189352j956818
4635G9173154j335501o90489J19698R57789J884681L167469M577443O081862O965202
4626A00901308O193090L680707J071200m32475j456753l189753n174856o422181
4618I5170287o594543n848569m625447l637543k819655j900374j161004r9573
4610F8483579O74415J576300J926352J309749M82186m16850j469424j823315k399165
4601F8343827l522581l703511l803403l287076l007791k454944k074802j798041
4593D4691678j662669j208135j002461j023776p50591o26100n32883m87936j88426
$$ plain form
4652 54372105 56137267 58284608 60671911 63328575 66348390 70185196 74588966 78761003
4644 78761003 82343381 84574400 85653995 86183348 86056668 85150099 83319324 81129972 79173154
4635 79173154 77837653 77147164 77266862 78224651 80109332 83276801 87854244 93936106 100901308
4626 100901308 107094398 110775105 111846305 111413830 109957077 106767324 101592468 95170287
4618 95170287 88575744 82727175 78101728 74464185 71644530 69744156 68583152 68483579
4610 68483579 69157994 70734294 72660646 73970395 74452581 74035731 72566307 70742992 68343827
4601 68343827 64821246 61117735 57314332 54027256 51019465 48564521 46489719 44691678
4593 44691678 43029009 41820874 40818413 39794637 39044046 38417946 37885063 37397127 37208701
4584C7208701k64545P2980k78214p7509j07088k43542n839j28459p8298J80688
4574C6278875J96135J67219K95498M15378L83870O20879N92301O30659P05107
4565D0285921J013545R27745R43185J121856J306747J220775J227296J573357
4557D9620427J702605J549140J596242J957330J974599K233086K265941K476308
4549F5375678K608927K547769K723616L010636L371975L807535M004135M827260
4541I2277531N838999O685872P717464Q783042R671764J0606003J1119777J1726604
4533A64427056J1931243J0814131Q644220O219035K070060j511512l659588n584482
4525A93350163p289822q641784q797022q044103p273700p038914n696369l470532
$$ plain form
4584 37208701 36944156 37017136 36738922 36661413 36554325 36310783 36304944 36176485 36098187 36278875
4574 36278875 36475010 36642229 36937727 37353105 37736975 38357854 38950155 39580814 40285921
4565 40285921 41299466 42227211 43170396 44292252 45598999 46819774 48047070 49620427
4557 49620427 51323032 52872172 54468414 56425744 58400343 60633429 62899370 65375678
4549 65375678 67984605 70532374 73255990 76266626 79638601 83446136 87450271 92277531
4541 92277531 98116530 104802402 112519866 121302908 130974672 141580675 152700452 164427056
4533 164427056 176358299 187172430 195816650 202035685 204105745 202594233 198934645 193350163
4525 193350163 186060341 177418557 168621535 160577432 153303732 146264818 140568449 137097917
4517A37097917j751211j125078q67504j795705k393650j758642q91327o50885
4509A25863915j304302l192800l804538k844607j689449j097501o32670n7018
4501A11241030P05754J233872j52864j879136k246744l015693l916537n338824
4493I6630858o287262o087310n766037m947630m569035m248234l511236l396155
4485E7817959k924859k823260k597446k343013k353511k117360j972817j866544
4477C8819149j464635j576651j779445j281282j235733j118076j224363j094286
4469B8044678r41732p43245q32542o54280q07814q65405q17629p26943p62529
4460B0892559n28064n54886m22908o09645n28350m21898l00425n48732l13519
$$ plain form
4517 137097917 135346706 134221628 133354124 131558419 129164769 127406127 126514800 125863915
4509 125863915 124559613 121366813 117562275 114717668 113028219 111930718 111298048 111241030
4501 111241030 111946784 113180656 113027792 111148656 108901912 105886219 101969682 96630858
4493 96630858 90343596 84256286 78490249 73542619 68973584 64725350 61214114 57817959
4485 57817959 54893100 52069840 49472394 47129381 44775870 42658510 40685693 38819149
4477 38819149 37354514 35777863 33998418 32717136 31481403 30363327 29138964 28044678
4469 28044678 27102946 26359701 25527159 24872879 24065065 23199660 22382031 21655088 20892559
4460 20892559 20364495 19809609 19386701 18777056 18248706 17826808 17526383 16977651 16664132
4451A6664132j80962l41109m74604m37005l06785k19289l16967l84917l07857
4442A3694637l27526m06331k12355k87418j09422j21302l04688j18943j55402
4433A1651250k74996k71262L6034k12539m46564k44676j60750k77858l14156l08762
4423I175721j80862k58897k94937m5126r4997l89508j29546j10657j46056r8510
4413G426625k02632J07140j19725N3609j81540j79528l4374m0522Q5951j52698
4403F762306j39940j8327Q7025j80466r4270q4286k34109M7567J84206j42714
4393F186992L0547J46517J36388k1492L56045K52982R33j0294L3257N7304Q1710
4382G250889j9655k3267j59560j89491l06613m09843j82107j22115k3727j62028
$$ plain form
4451 16664132 16483170 16142061 15667457 15230452 14923667 14704378 14387411 14002494 13694637
4442 13694637 13367111 12960780 12748425 12461007 12351585 12230283 11925595 11806652 11651250
4433 11651250 11376254 11104992 11141026 10928487 10481923 10237247 10076497 9798639 9484483 9175721
4423 9175721 8994859 8735962 8441025 8395899 8300902 7911394 7781848 7671191 7525135 7426625
4413 7426625 7223993 7331133 7211408 7265017 7083477 6903949 6869575 6829053 6915004 6762306
4403 6762306 6622366 6604039 6691064 6510598 6416328 6332042 6097933 6145500 6329706 6186992
4393 6186992 6217539 6364056 6500444 6478952 6834997 7087979 7088912 7078618 7111875 7169179 7250889
4382 7250889 7231234 7207967 7048407 6858916 6552303 6142460 5960353 5838238 5814511 5652483
4372E652483O9877j90562k45739O6346J070l0937J18901q1951J00947n0453j31587
4361E278395j11708j1835q129p091K20235j7922J82220r2386J47646K5927L6921
4350E642273r2810j44885m5642m1934j07810N1556M4231l3612j57005j47487J87719
4339E154594J53364J6129N6344r5394Q3898J97165J6548M39348O25628K75836
4329F923460K05539K11257O4555J98826j40293l31376k3150j50733m60274k22372
4319F275439k40278j19156j97415M1984r5458j58938P3871J17406K31268J27147
4309F055870K54236K09230K97698N83908N16889M63190J60959r1218M839L443
4299H459044l04203l54375l89000l10273m46828j66328k03997k09240M6091j03156
$$ plain form
4372 5652483 5722360 5531798 5286059 5352405 5353475 5322538 5441439 5359488 5460435 5409982 5278395
4361 5278395 5166687 5154852 5146723 5139632 5359867 5341945 5524165 5431779 5579425 5605352 5642273
4350 5642273 5549463 5404578 5358936 5317002 5209192 5260748 5304979 5271367 5114362 4966875 5154594
4339 5154594 5307958 5324087 5380431 5285037 5368935 5566100 5582648 6021996 6647624 6923460
4329 6923460 7128999 7340256 7404811 7603637 7463344 7131968 7108818 6958085 6497811 6275439
4319 6275439 6035161 5916005 5718590 5760574 5665116 5506178 5580049 5697455 5928723 6055870
4309 6055870 6310106 6519336 6817034 7400942 7917831 8381021 8541980 8450762 8455601 8459044
4299 8459044 8154841 7800466 7411466 7101193 6654365 6488037 6284040 6074800 6120891 6017735
4289F017735J40133O9319j86559R947k1308J36086J50101K42885M19627J64056
4279G142022O6667J48405Q1059l7547J69956m2377L2185j49854o4029q2139J84150
4268G448498n8487K2083N9136J17127j75587K4151M9341J87367N172J3669K53214
4257G945684N9238l0415K04780K84689K46648K7714K57056L85485L52800L79661
4247A0113340K60655L88526R0617K0103L8847k41681j06995k90142k00697k46484
4237I826089j58165j43566k82969j29169M8827k6659J4306J43485p5502m6588
4227I170089O0832J67589Q2090J68390N4804l1808K93091M34179R4812K07252
4217A0701320J75348K67397J29126J15934K04429L76473K39867K06241K34230
$$ plain form
4289 6017735 6157868 6227187 6040628 6050575 6029267 6165353 6315454 6558339 6977966 7142022
4279 7142022 7208689 7357094 7438153 7400606 7570562 7528185 7560370 7410516 7346487 7264348 7448498
4268 7448498 7390011 7412094 7471230 7588357 7412770 7436921 7486262 7673629 7678801 7692470 7945684
4257 7945684 8004922 7974507 8179287 8463976 8710624 8738338 8995394 9380879 9733679 10113340
4247 10113340 10373995 10762521 10853138 10873241 10912088 10670407 10563412 10273270 10072573 9826089
4237 9826089 9667924 9524358 9241389 9112220 9161047 9134388 9148694 9292179 9216677 9170089
4227 9170089 9230921 9398510 9480600 9648990 9703794 9671986 9965077 10399256 10494068 10701320
4217 10701320 10876668 11144065 11273191 11389125 11593554 11970027 12209894 12416135 12650365
4208A2650365K52961K83251L65011K75470K46201J48575K75428L74963L71511
4199A5243736K42211L44111M11526L80250O46670O05758M10790N76178O97628
4190A9558858O05909P20687O95109P16039N21314P22839O37474N88098O20440
4181B5386767M64198K78887J87738J51095J23459K20617p909J10354K91157O14204
4171B7820567P49870J112431J111637J492550R95033P78729M73894L48899R8366
4162C4981976n14825p10080r97824j185980j200733j076498r81832j027340r18981
4153B6367883o39850m44172n75374j23149k79989j91511l61637j07186l22706
4144B3322309R75j05643N8730R4216l3484o1632K22730o6200K24244j00291j42225
$$ plain form
4208 12650365 12903326 13186577 13551588 13827058 14073259 14221834 14497262 14872225 15243736
4199 15243736 15485947 15830058 16241584 16621834 17268504 17874262 18285052 18861230 19558858
4190 19558858 20164767 20885454 21580563 22296602 22817916 23540755 24178229 24766327 25386767
4181 25386767 25850965 26129852 26317590 26468685 26592144 26812761 26804852 26915206 27206363 27820567
4171 27820567 28570437 29682868 30794505 32287055 33282088 34060817 34534711 34883610 34981976
4162 34981976 34467151 33757071 32759247 31573267 30372534 29296036 28314204 27286864 26367883
4153 26367883 25728033 25283861 24708487 24585338 24305349 24113838 23752201 23645015 23322309
4144 23322309 23323284 23217641 23276371 23370587 23337103 23275471 23498201 23432001 23656245 23555954 23413729
4133B3413729o4484j23453r8615j76269p3339j38472j3720N8449P3496j5990J61475
4122B3002807J24325K48751J04442K40103L47932L05820K51282Q5940J27350K42488
4112B5081240J43549J84146L85052K05412K36105O74566Q86578J219659J601241
4103C0617548K132945K836770L454447M122215L352265N38102j70458j52485q22388
4094D5908961k195215l000696k754064k122117j547182q41828o02398k02300P3116
4085C2716277L38438M17506P57996Q14446J125999J250244J276227J520334J291477
4076D1508944J115151J343908J057150J013242R78926R53909J143507J496411
4068E0611148J362074J546187J412793J670280J774327J877677J732582J902654
$$ plain form
4133 23413729 23349245 23225792 23127177 22950908 22877569 22739097 22725377 22783826 22857322 22841332 23002807
4122 23002807 23127132 23375883 23480325 23720428 24068360 24374180 24625462 24711402 24838752 25081240
4112 25081240 25224789 25408935 25793987 25999399 26235504 26910070 27796648 29016307 30617548
4103 30617548 32750493 35587263 39041710 43163925 46516190 47054292 46883834 46731349 45908961
4094 45908961 43713746 40713050 37958986 35836869 34289687 33447859 32845461 32643161 32716277
4085 32716277 33054715 33472221 34230217 35044663 36170662 37420906 38697133 40217467 41508944
4076 41508944 42624095 43968003 45025153 46038395 47017321 47971230 49114737 50611148
4068 50611148 51973222 53519409 54932202 56602482 58376809 60254486 61987068 63889722
4060F3889722K071172K332625K501235K868355L137549L537873L819868M045583
4052H8203982M199970M608059M752556M751263M199473L861184L781451L787531
4044A22145469L529197L677360L832663M083520M085429M690492M860905M958223
4036A55863258M776291M750564M078450M089953L781292M099013L587546M242295
4028A89268662M301031M612235L906549L771132K914325K403646K081784J405330
4020B14664694o84514l2398J824692N205769P461657J2390326J7540466K5259532
4012B83630224K8937803L7850784K2610481q941910q945421n227689q056625k3410171
4004C18447476l3576302l5412631k9268149k3694364j7564852j4420324j2302047
$$ plain form
4060 63889722 65960894 68293519 70794754 73663109 76800658 80338531 84158399 88203982
4052 88203982 92403952 97012011 101764567 106515830 110715303 114576487 118357938 122145469
4044 122145469 125674666 129352026 133184689 137268209 141353638 146044130 150905035 155863258
4036 155863258 160639549 165390113 169468563 173558516 177339808 181438821 185026367 189268662
4028 189268662 193569693 198181928 202088477 205859609 208773934 211177580 213259364 214664694
4020 214664694 213980180 213947782 215772474 220978243 228439900 240830226 258370692 283630224
4012 283630224 312568027 350418811 373029292 364087382 355141961 349914272 341857647 318447476
4004 318447476 284871174 249458543 220190394 196496030 178931178 164510854 152208807
3997A52208807j1409112r738654p882306o380367n675795n102277n433765n213376
3989I5373155n019501m281526m260488m118220l780662l358714l154609k898012
3981F4501423k806959k363224k048983k136974j899848j577348j426510j151293
3973D9090284j074026j189191j220165j080174r12665r14969r59437r31538q03866
3964D0004253r43737q26538o17118m88966l25465k71565l42888j38430j38486
3955C5911060l02131j58377k15946l34396l09624o05038n71716o11795o06359
3946C2195678l00942l78376j28859m59643m19022r8798k46995k12933l10861q2236
3936B9557013l23244l47076j70552j41712j35952l6726k4216J439P7098M49792
$$ plain form
3997 152208807 140799695 131061041 123178735 116798368 111122573 106020296 100586531 95373155
3989 95373155 90353654 86072128 81811640 77693420 73912758 70554044 67399435 64501423
3981 64501423 61694464 59331240 57282257 55145283 53245435 51668087 50241577 49090284
3973 49090284 48016258 46827067 45606902 44526728 43614063 42699094 41739657 40808119 40004253
3964 40004253 39060516 38233978 37616860 37127894 36802429 36530864 36187976 36049546 35911060
3955 35911060 35608929 35450552 35234606 34900210 34590586 33985548 33413832 32802037 32195678
3946 32195678 31894736 31516360 31387501 30927858 30508836 30410038 30163043 29950110 29639249 29557013
3936 29557013 29233769 28886693 28716141 28574429 28438477 28401751 28377535 28378974 28456072 28905864
3926B8905864K53996N10852N47886N44863Q06037J242349J533142J998253K697329
3917C9040571L641820M589413N320978N245457J943906o91582p45964o75015j377424
3908E6292160l290963m694919n162051m173005l646464k724114k358216j889932
3900B8352496j648365j086952j010506j020391q12468n23961m02818m42375n79355
3891B0825305l50720j86703j47474n7761O9114L8195J64642R661J98648L67809
3881B0930716L12754M02699M55694L47033O77367O39764Q50985O64696P38004
3872B6019712N15871O88118P15431M99045M11986M93237P25107O75172P82458
3863C1526137R55822P71952J189115R00999R01962J147415J164916J143121J163656
$$ plain form
3926 28905864 29159860 29670712 30218598 30763461 31569498 32811847 34344989 36343242 39040571
3917 39040571 42682391 47271804 52592782 57838239 59782145 59090563 58344599 57669584 56292160
3908 56292160 53001197 48306278 43144227 38971222 35324758 32600644 30242428 28352496
3900 28352496 26704131 25617179 24606673 23586282 22773814 22249853 21847035 21404660 20825305
3891 20825305 20474585 20287882 20140408 20082647 20151761 20189956 20354598 20364259 20562907 20930716
3881 20930716 21243470 21646169 22101863 22448896 23126263 23766027 24617012 25281708 26019712
3872 26019712 26535583 27223701 27939132 28438177 28850163 29343400 30068507 30743679 31526137
3863 31526137 32481959 33253911 34443026 35344025 36245987 37393402 38558318 39701439 40865095
3854D0865095J305275J132124J279537J309045J328904J427425J558355J481068
3846E1686828J548091J662733J677710K052602K142823K230885K552788K891123
3838F8445583L304829L596153M139309M837219N483772O296340P380941Q938794
3830A12422940J0547927J2551814J4520786J5738619J8140530K2129838K4403039
3823B30455493K2725960J2827045L51602n050967q361341j4342868k1046289k4128140
3815A93430495k2072052j8464479j4594611j1537668r439055p494312o102585
3808A03725733m370216l148527k371022j840369j726172k165964k950762l287565
3800H1865136l491632l995534m266891m365246m045506l776123l658446l370283
$$ plain form
3854 40865095 42170370 43302494 44582031 45891076 47219980 48647405 50205760 51686828
3846 51686828 53234919 54897652 56575362 58627964 60770787 63001672 65554460 68445583
3838 68445583 71750412 75346565 79485874 84323093 89806865 96103205 103484146 112422940
3830 112422940 122970867 135522681 150043467 165782086 183922616 206052454 230455493
3823 230455493 253181453 266008498 266360100 261309133 252947792 238604924 217558635 193430495
3815 193430495 171358443 152893964 138299353 126761685 117322630 109828318 103725733
3808 103725733 99355517 96206990 93835968 91995599 90269427 88103463 85152701 81865136
3800 81865136 78373504 74377970 70111079 65745833 61700327 57924204 54265758 50895475
3792E0895475k872395k883927k382541k465732k099607k070161j943786j440567
3784C2736759j438204j248460j451467j206599p88488q86571q49210p26313o72660
3775B3468787n43389m72552n50779m57717o10320n66631n19404n22275o21165
3766A8604555o60586n33128n39253o91301m97120m34886n70147m14786m33130
3757A3830218l57758l35731l48153k94787m11481k69917l57383j40097k69703
3748A1045208l66469n8252k02392l93622j35512k00365j15911l43965L5620j27786
3738I136554k26044r8497m5068j56651k92651j84760O3124k3886j79943O0973
3728H053151k13827k24868j04817Q917J1820j75094k50619j88676r4103j42275
$$ plain form
3792 50895475 48023080 45139153 42756612 40290880 38191273 36121112 34177326 32736759
3784 32736759 31298555 30050095 28598628 27392029 26603541 25716970 24867760 24141447 23468787
3775 23468787 22925398 22452846 21902067 21444350 20834030 20267399 19747995 19225720 18604555
3766 18604555 17943969 17410841 16871588 16180287 15683167 15248281 14678134 14263348 13830218
3757 13830218 13472460 13136729 12788576 12493789 12082308 11812391 11455008 11314911 11045208
3748 11045208 10678739 10620487 10418095 10024473 9888961 9688596 9572685 9228720 9264340 9136554
3738 9136554 8910510 8812013 8766945 8610294 8317643 8132883 8196007 8172121 7992178 8053151
3728 8053151 7839324 7614456 7509639 7518556 7530376 7355282 7104663 6915987 6821884 6679609
3718F679609r8915j13109L1415l16579j10160j38896k18324j38711l1899j57092
3708E387339j5960j67587j8351r991j385o3301q1397p8837L483J6051J85579Q7352
3696E242995K08290R6288j93982q98j30772j50593j83223j09122j28342l7308
3686D613333k07575J9742j48907J8329l1844n4525j05460j03818n1115l5360p0581
3675C842219J47183r4952n0144P3835r1519J9439o2553k45108J75722o3561L6044
3664C686605P4066Q7410j29295J12424o1089J3942j3955J31303J44615N4059N2501
3653D152586K10719K66380K24749L94244L67147l0509K4777n8748j41879l93972
3643E015494m63279k33023k65307j56490m44690j72603J94972L9903j46024j6161
$$ plain form
3718 6679609 6580694 6467585 6499000 6182421 6072261 5933365 5715041 5576330 5544431 5387339
3708 5387339 5371379 5203792 5185441 5175450 5174065 5110764 5029367 4950530 4954013 4970064 5155643 5242995
3696 5242995 5451285 5547573 5353591 5352693 5221921 5071328 4888105 4778983 4650641 4613333
3686 4613333 4405758 4425500 4276593 4294922 4263078 4208553 4103093 3999275 3948160 3912800 3842219
3675 3842219 3989402 3894450 3844306 3918141 3826622 3846061 3783508 3538400 3714122 3650561 3686605
3664 3686605 3760671 3848081 3718786 3831210 3770121 3784063 3770108 3901411 4046026 4100085 4152586
3653 4152586 4363305 4629685 4854434 5248678 5615825 5585316 5610093 5551345 5409466 5015494
3643 5015494 4552215 4319192 4053885 3897395 3452705 3280102 3475074 3514977 3368953 3352792
3633C352792r9836O9457K3195o2584L0114j1349j00952P5122j57368j29216J19079
3622C108454N9315j00046q0414K6406o667q8800k41508Q6067J91883k1267j13297
3611B820126P8372k775p9612J03953j06080J20795J48525K7353k4909M315J60748
3600C250811K60949l7828J25629K32232J17105J18061k9440J5792j04113m760
3590C944438j32442j22543j19896j28721j35859L4169O4087M3694n3871j53299
3580C239757l0919J49674k3629K5526n7131L2948J0070J13957O752J7088O1169
3569C545262k2745q959Q068P6884J8452K50833K51728P760O3993J57938L53371
3558D702585M10706L85353K38048J55930k39522j71405M358j02632j77960k00180
$$ plain form
3633 3352792 3252956 3322413 3345608 3283024 3313138 3301789 3200837 3275959 3118591 2989375 3108454
3622 3108454 3167769 3067723 2987309 3013715 3007048 2918248 2676740 2762807 2954690 2933423 2820126
3611 2820126 2898498 2895723 2816111 2920064 2813984 2934779 3083304 3110657 3085748 3090063 3250811
3600 3250811 3511760 3473932 3599561 3831793 3948898 4066959 4037519 4053311 3949198 3944438
3590 3944438 3811996 3689453 3569557 3440836 3304977 3339146 3403233 3446927 3393056 3239757
3580 3239757 3208838 3358512 3334883 3360409 3303278 3336226 3346296 3460253 3467005 3484093 3545262
3569 3545262 3522517 3513558 3521626 3598510 3616962 3867795 4119523 4127283 4191276 4349214 4702585
3558 4702585 5113291 5498644 5736692 5892622 5653100 5481695 5486053 5383421 5205461 5005281
3548E005281l16493m14316j73652j22107k20819j81060n5735k93001r2041l2153
3538C103904j94865j8413O4914k40541J1171r9885L8681j56897j20242l6971J43640
3527B494496K0374k5363Q4705o2291K472L538j21555J13658j18942n6136J86574
3516B521530j26779n1374K21208j88479j01825j02326K7115j1003j1350K3427
3506B200144p5956J87589J5678m8822J81664K6265p3677m5764O2578j08462k24597
3495B096640Q6989J14285o7998N1456k50j72851J15151Q8043j81178k07126O7086
3484A990247o3616N9737L1725j2302J95136j16246j60426M0070O6219l2857M9901
3473B047588j51261N8473K02915p8209j894J33158j6249j41818K873J12596O9845
$$ plain form
3548 5005281 4688788 4274472 4100820 3978713 3757894 3576834 3521099 3228098 3136057 3103904
3538 3103904 2909039 2890626 2955540 2714999 2726170 2626285 2664966 2508069 2387827 2350856 2494496
3527 2494496 2514870 2489507 2574212 2511921 2514393 2517931 2396376 2510034 2391092 2334956 2521530
3516 2521530 2394751 2343377 2564585 2376106 2274281 2171955 2199070 2188067 2176717 2200144
3506 2200144 2124188 2311777 2327455 2278633 2460297 2486562 2412885 2367121 2429699 2321237 2096640
3495 2096640 2183629 2297914 2229916 2281372 2281122 2108271 2223422 2311465 2130287 1923161 1990247
3484 1990247 1926631 1986368 2018093 2005791 2200927 2084681 1924255 1964325 2030544 1997687 2047588
3473 2047588 1896327 1954800 2157715 2079506 2077612 2210770 2194521 2052703 2055576 2168172 2238017
3462B238017j59178J85172j65205p438J72512n7027L8641O0316n696j0203P0721
3451B360632q3772j67549O4873k7069O9688K10249k3402j10712K2606K37322m2981
3440B509885l9970m1360L1492K32360J35081n5354P0844p3626R1609k2446k66175
3429B572340N3562O9618J50061J4566j53645m5363O1700J76078j77119J74128
3419B895926K42076j22853Q8835j09282r2571n7748K05595j7393J6878J30129
3409C179592k68241N8576j9772j7836J97758N8737O2662j34140o9378L0176K05885
3398C284019k7497O065j3250K8646J99349M1549j88074O0105R7508L01706l3691
3387C756435P5701r6355j55447K33029M8557J49521o2540O5736N4928O6706J2004
$$ plain form
3462 2238017 2078839 2264011 2098806 2091368 2263880 2206853 2245494 2305810 2300114 2289911 2360632
3451 2360632 2276860 2109311 2174184 2147115 2216803 2427052 2403650 2292938 2315544 2552866 2509885
3440 2509885 2469915 2428555 2460047 2692407 2827488 2772134 2842978 2769352 2860961 2838515 2572340
3429 2572340 2625902 2695520 2845581 2860147 2706502 2661139 2722839 2898917 2721798 2895926
3419 2895926 3138002 3015149 3103984 2994702 2902131 2844383 3049978 3032585 3049463 3179592
3409 3179592 2911351 2969927 2950155 2932319 3130077 3188814 3251476 3117336 3047958 3078134 3284019
3398 3284019 3256522 3262587 3249337 3277983 3477332 3518881 3330807 3390912 3488420 3790126 3756435
3387 3756435 3832136 3735781 3580334 3813363 3861920 4011441 3948901 4014637 4069565 4136271 4148275
3376D148275J89324K42789Q8057L81174J12824j27788J7407J51715Q020O3076
3366E274873Q1687Q4975J69336M4848M4533R7221J78370J27943J41459q8645K0496
3355F177096K22456m6710J39988M21300K38988K50938n928k28016j01518l0504
3345G038090l32594n5202p7296k17666j04657L3999J46066j37592n4591p457k2100
3334F209000j63169j12647L4487j03323J72307j00007P3302o1759O7373J0520
3324F026084j66187k3718j59130r1335o1067r0978J09020L6222j19964j7603p4909
3313E366435M1690Q5314p4599J22002J02055k37006N8654n1361J17251J64161
3303E694596L7607O1271J42647J0282J820k2892j9074K02437m1445J98465n0617
$$ plain form
3376 4148275 4337599 4580388 4668445 5049619 5162443 5034655 5052062 5203777 5211797 5274873
3366 5274873 5356560 5441535 5610871 5655719 5700252 5797473 5975843 6103786 6245245 6156600 6177096
3355 6177096 6399552 6352842 6492830 6914130 7153118 7404056 7398128 7170112 7068594 7038090
3345 7038090 6705496 6650294 6572998 6355332 6250675 6284674 6430740 6293148 6238557 6231100 6209000
3334 6209000 6045831 5933184 5967671 5864348 6036655 5936648 6009950 5948191 6015564 6026084
3324 6026084 5859897 5836179 5677049 5585714 5524647 5433669 5542689 5578911 5458947 5441344 5366435
3313 5366435 5408125 5493439 5418840 5540842 5642897 5405891 5464545 5413184 5530435 5694596
3303 5694596 5732203 5793474 5936121 5946403 5948223 5925331 5906257 6108694 6067249 6265714 6215097
3292F215097K2900N2723J53585K12102l096L377J9594K18974p851J48575o235
3281G029745O6585J58457L5874J53868K99337j07089K00505K8334p1742J9281
3271G813155K55941M0554J04270j12045k8306K97428J8929k5500M1798J40076
3261H546300K42160R485L1948N3256p5220M522K4261K1113p5339J81683j39872
3250H824297K0246l0611J88944J07833p5972P8616p1140J16971M0450Q4083p9451
3239I204266K5509J03629P0439j7668J3548N5341j46559L45819k5929m8416J12155
3228I692134J09155n0777j01143J26280J42044r2828Q6250P5714k13040p140J41643
3217I908292l7230n1827j65633K7066j1917J1645J83937r5326n5757L1806M6077
$$ plain form
3292 6215097 6237997 6290720 6444305 6656407 6653311 6656688 6676282 6895256 6887405 7035980 7029745
3281 7029745 7096330 7254787 7290661 7444529 7743866 7636777 7837282 7865616 7793874 7813155
3271 7813155 8069096 8109650 8213920 8101875 8073569 8370997 8389926 8364426 8406224 8546300
3261 8546300 8788460 8797945 8829893 8883149 8807929 8812451 8836712 8857825 8782486 8964169 8824297
3250 8824297 8844543 8813932 9002876 9110709 9034737 9113353 9042213 9159184 9199634 9283717 9204266
3239 9204266 9229775 9333404 9403843 9386175 9399723 9455064 9308505 9654324 9628395 9579979 9692134
3228 9692134 9801289 9750512 9649369 9775649 9917693 9824865 9911115 9986829 9773789 9766649 9908292
3217 9908292 9871062 9819235 9653602 9680668 9668751 9680396 9864333 9769007 9713250 9745056 9791133
3206I791133k5352j55021l707J70042k87326j3835J00769l4800M1548J68212P7753
3195I829416j28420j2813J27938j7565J9291q222o6322J24459o9993N9529l387
3184I853911J24660R5029j3652J49019j2195J90532J02390M390J54565j13577
3174A0535072P4607J92533M5161O1751N5905L6519L3102J73094k876q3114J20521
3163A1242275n6776J92572J06660J05710j03066Q1891J53439R8296J34301j6386
3153A1938916J37575J8651L8124J16242J54590N2974P7938J47988J2126m1713
3143A2653411P0855J91253Q3192j63140k0726J71327l251P6265k0723K31246J47176
3132A3416885j19657K12693J78889n0548o6877J67506o5066r8881J66341J13892
$$ plain form
3206 9791133 9765781 9610760 9607053 9777095 9489769 9475934 9576703 9541903 9583451 9751663 9829416
3195 9829416 9700996 9688183 9816121 9798556 9817847 9809625 9743303 9867762 9797769 9857298 9853911
3184 9853911 9978571 10073600 10059948 10208967 10196772 10387304 10489694 10494084 10648649 10535072
3174 10535072 10609679 10802212 10847373 10909124 10965029 11001548 11034650 11207744 11204868 11121754 11242275
3163 11242275 11185499 11378071 11484731 11590441 11487375 11569266 11722705 11821001 11955302 11938916
3153 11938916 12076491 12095142 12133266 12249508 12404098 12457072 12535010 12682998 12695124 12653411
3143 12653411 12724266 12915519 12998711 12835571 12814845 12986172 12982921 13059186 13038463 13269709 13416885
3132 13416885 13297228 13509921 13688810 13638262 13571385 13738891 13673825 13574944 13741285 13855177
3122A3855177o1378j70223K829K4772M7227p4106J86020K26243O9156l260j35790
3111A3966667O9815O4267Q1229L2098J29621Q2454J62313O1873L1699l5088O0218
3100A4707166m6668J99842K11929r1582K0328r9233K24090L5140l3641J03275
3090A5230646J01630J54483R9079K62195P5607m494Q4609J18193R6384J50983
3080A6369315J89510J59248P9412Q7070J90830K24213j11677P4811K80170K01768
3070A7744670J62793J26072J41107J28426K48284K4723K51632J24387L09084J29168
3060A9390346J15532J60694K87047L47868K37570J39201J02222K54283K72880
3051B1307643L23813J01549L37993K64731L59076K33682K65319L29908K15991
$$ plain form
3122 13855177 13793799 13623576 13626405 13651177 13698404 13624298 13810318 14036561 14105717 14102457 13966667
3111 13966667 14036482 14100749 14181978 14214076 14343697 14426151 14588464 14650337 14682036 14646948 14707166
3100 14707166 14660498 14860340 15072269 14980687 15001015 14901782 15125872 15161012 15127371 15230646
3090 15230646 15332276 15486759 15585838 15848033 15923640 15919146 16003755 16121948 16218332 16369315
3080 16369315 16558825 16718073 16797485 16884555 17075385 17299598 17187921 17262732 17542902 17744670
3070 17744670 17907463 18033535 18174642 18303068 18551352 18576075 18827707 18952094 19261178 19390346
3060 19390346 19505878 19666572 19953619 20301487 20539057 20678258 20780480 21034763 21307643
3051 21307643 21631456 21733005 22070998 22335729 22694805 22928487 23193806 23523714 23739705
3042B3739705J93178N00531L13552K74229L36709M53564L07926K87515M26443
3033B6833352K73484L80155M49192M66432M23120M31104N13613M57399N86410
3024C0814261K10696N41549O08051M58029O14675N33292N70238O10454N99129
3015C5560374O81286P62377O69202P85138O58613R37388P36463Q89541R09673
3006D2590055R24195J054294J021327J192944J040683J043219J193561J318395
2998E1378673J278321J345784J349115J360371J534253J472105J551036J713777
2990F2983435J509151J839292J710075J879824K030107J866932J911516J942910
2982G7673242J968132K160550K112589K218409K153621K366603K560078K564474
$$ plain form
3042 23739705 23932883 24433414 24746966 25021195 25357904 25811468 26119394 26406909 26833352
3033 26833352 27106836 27486991 27936183 28402615 28825735 29256839 29770452 30227851 30814261
3024 30814261 31024957 31566506 32174557 32632586 33247261 33780553 34350791 34961245 35560374
3015 35560374 36241660 37004037 37673239 38458377 39116990 40054378 40790841 41680382 42590055
3006 42590055 43514250 44568544 45589871 46782815 47823498 48866717 50060278 51378673
2998 51378673 52656994 54002778 55351893 56712264 58246517 59718622 61269658 62983435
2990 62983435 64492586 66331878 68041953 69921777 71951884 73818816 75730332 77673242
2982 77673242 79641374 81801924 83914513 86132922 88286543 90653146 93213224 95777698
2974I5777698K541935K666846K717109K983554L117922L085240L286873L564042
2966A19741219L935795M141695M545344N058147N593335O173559O997145P764022
2958A63950261Q639428R504398J0571166J1781928J2701181J3648429J4074512
2951B44871303J3626695J2737240J0385252O848986K332709k473573o454279r251590
2943B72622743j1604801j2351996j2421215j1634438j0372287r403560q420031
2936A96414415p486037o967467o319841n725882n330828m809890m355692m406758
2928A51012020l859792l494297l229142l323622l178669l007057k952687k948804
2920A25017950k977880l086188l013199k982333k720611k652369k507207k185265
$$ plain form
2974 95777698 98319633 100986479 103703588 106687142 109805064 112890304 116177177 119741219
2966 119741219 123677014 127818709 132364053 137422200 143015535 149189094 156186239 163950261
2958 163950261 172589689 182094087 192665253 204447181 217148362 230796791 244871303
2951 244871303 258497998 271235238 281620490 288469476 290802185 288328612 281874333 272622743
2943 272622743 261017942 248665946 236244731 224610293 214238006 204834446 196414415
2936 196414415 188928378 181960911 175641070 169915188 164584360 159774470 155418778 151012020
2928 151012020 147152228 143657931 140428789 137105167 133926498 130919441 127966754 125017950
2920 125017950 122040070 118953882 115940683 112958350 110237739 107585370 105078163 102892898
2912A02892898k027629k294377k562211k183202k162284k635640k691813k426624
2904H3909118k548727k272012j977997k005676j561284j332031j414153j170610
2896F9626628j349282j282108j292069j013828p82681j110577j108931q25530
2888F0861622o48065q41104r48223r75991q65267j055676j156468j049769j052898
2879E2268161j013784r51267p55730n88145p16692o62653n26765q37724o70828
2870D5544573p25016o53720n03246o58462o97806n56366o12439o67729n67612
2861C9902177m74742n15654n95329m63172m98803l56053l15276l60301l44528
2852C5978319l65508k91689k34284k91947m20512k20701m71436l23034k28931
$$ plain form
2912 102892898 100865269 98570892 96008681 93825479 91663195 89027555 86335742 83909118
2904 83909118 81360391 79088379 77110382 75104706 73543422 72211391 70797238 69626628
2896 69626628 68277346 66995238 65703169 64689341 63906660 62796083 61687152 60861622
2888 60861622 60213557 59372453 58424230 57448239 56582972 55527296 54370828 53321059 52268161
2879 52268161 51254377 50303110 49547380 48959235 48242543 47579890 47053125 46215401 45544573
2870 45544573 44819557 44165837 43662591 43004129 42306323 41749957 41137518 40469789 39902177
2861 39902177 39427435 38911781 38316452 37853280 37354477 36998424 36683148 36322847 35978319
2852 35978319 35612811 35321122 35086838 34794891 34374379 34153678 33682242 33359208 33130277
2843C3130277l25648k12282j67904k97178o4464l68875l21102j66299k57395j50636
2833C0798494q3862j59732k59585m6032j05658j55428j57207j02920j56681j12481
2823B9458908k54006l17151k31537l30333j00783j92185l49808r5543j37698k35988
2813B7213876k91937l02090l07440k34580l0943k00228k34039k43989k9147j19221
2803B5220262q8191j82280k20121k15707k17019j40718k75794k10498j25993j93327
2793B3350614k30520k41140j83654j32326k52776l87541q5877Q7676j96065j23745
2783B1604646j08050l74431J13205j65990n1519M4794n569L6381K9537J10210
2773B1233214j06878n03N6540l7648k4705J92272J92734p9025K38633J82169N2555
$$ plain form
2843 33130277 32804629 32592347 32424443 32127265 32062801 31693926 31372824 31206525 30949130 30798494
2833 30798494 30714632 30554900 30295315 30249283 30143625 29988197 29830990 29728070 29571389 29458908
2823 29458908 29204902 28887751 28656214 28325881 28225098 28032913 27683105 27587562 27449864 27213876
2813 27213876 26921939 26619849 26312409 26077829 26046886 25846658 25612619 25368630 25339483 25220262
2803 25220262 25132071 24949791 24729670 24513963 24296944 24156226 23880432 23669934 23543941 23350614
2793 23350614 23120094 22878954 22695300 22562974 22310198 21922657 21836780 21924456 21728391 21604646
2783 21604646 21496596 21122165 21235370 21069380 21017861 21062655 21057086 21093467 21123004 21233214
2773 21233214 21126336 21125833 21182373 21144725 21120020 21312292 21505026 21426001 21664634 21846803 21899358
2762B1899358N7218J47879L67277K24004K25663K41085K54298K59962M69818K93176
2752B4439738L11747M51548K73990R0729N13821L42332M75392M29291N16371L58680
2742B8203639J27702M62882K63799K51224N92776N47206L87180O65334O46800
2733C2148542P61960P40389Q19833J004512Q12943R96748J082642J029561J157416
2724D0554546J126798J291664J406920J558382J607468J437333J657394J693798
2716E2334303J723740J853786J680576J652974J385179J295479J418535J125534
2708F4470106J103743J143035J280299J291773J701211J756374J817131K331931
2700G6895603K753961K986382L342483L504378L889134M101391M115734L527375
$$ plain form
2762 21899358 21956576 22104455 22471732 22695736 22921399 23162484 23416782 23676744 24146562 24439738
2752 24439738 24751485 25203033 25477023 25567752 26081573 26423905 26899297 27328588 27844959 28203639
2742 28203639 28331341 28794223 29058022 29309246 29902022 30449228 30836408 31501742 32148542
2733 32148542 32910502 33650891 34470724 35475236 36288179 37284927 38367569 39397130 40554546
2724 40554546 41681344 42973008 44379928 45938310 47545778 48983111 50640505 52334303
2716 52334303 54058043 55911829 57592405 59245379 60630558 61926037 63344572 64470106
2708 64470106 65573849 66716884 67997183 69288956 70990167 72746541 74563672 76895603
2700 76895603 79649564 82635946 85978429 89482807 93371941 97473332 101589066 105116441
2692A05116441K765653J524314L84782r68675j706398k136399k335081k194466
2684A00450171j529887o04013j03447M77248J230205J719705K006521K391638
2676A06038141K350860K690093K387605J914813J303446L37242o52255j386473
2668A14983472k492822l179567l609684l863733l717312l541783l134590k392134
2660H9051847j709060j180421r39280m86042m96718o39100q24359j053243j274505
2651H0449119k010885k648193l077748l232692l284474l430085l406975l131191
2643E6226876k871610k644913k363621k191583k004996j805366j473591j443360
2635C9427836j308742j083212j102727j004492j150228j290498j045719j055938
$$ plain form
2692 105116441 107882094 109406408 109791190 108822515 107116117 104979718 102644637 100450171
2684 100450171 98920284 98316271 98212824 98690072 99920277 101639982 103646503 106038141
2676 106038141 108389001 111079094 113466699 115381512 116684958 117022200 116369945 114983472
2668 114983472 112490650 109311083 105701399 101837666 98120354 94578571 91443981 89051847
2660 89051847 87342787 86162366 85223086 84737044 84240326 83601226 82776867 81723624 80449119
2651 80449119 78438234 75790041 72712293 69479601 66195127 62765042 59358067 56226876
2643 56226876 53355266 50710353 48346732 46155149 44150153 42344787 40871196 39427836
2635 39427836 38119094 37035882 35933155 34928663 33778435 32487937 31442218 30386280
2627C0386280j109144j027805j201651r85290p96127p47905r17785p58009o24056
2618B2218508o60818p19547o42892n36581n29030m75875m32911l11352l65874
2609A7543628n05433j73765k41079m41824k76667l66729j10398m68805l19618
2600A4639310l23227m17775k32975k72830l78376m78518l46446m50916k11457
2591A1526790q9713m40696j19181k34913l50837j39399r3795j63248k41107j03277
2581I550624l06118L2968j51823m19255k75004m9711k76206k12441l35999j39513
2571G417522j71798k48754j7057l0871k92580j48008r8687j65961j95821j0705
2561F037280j20903j60647L3331j62789o7144j86862j11605j08598j58964N9423
$$ plain form
2627 30386280 29277136 28249331 27047680 26062390 25266263 24518358 23600573 22842564 22218508
2618 22218508 21557690 20838143 20195251 19658670 19129640 18653765 18220854 17909502 17543628
2609 17543628 17038195 16864430 16623351 16181527 15904860 15538131 15427733 14958928 14639310
2600 14639310 14316083 13898308 13665333 13392503 13014127 12535609 12189163 11738247 11526790
2591 11526790 11437077 10996381 10877200 10642287 10291450 10152051 10058256 9895008 9653901 9550624
2581 9550624 9244506 9277474 9125651 8706396 8431392 8381681 8105475 7893034 7557035 7417522
2571 7417522 7245724 6996970 6979913 6949042 6656462 6508454 6409767 6243806 6047985 6037280
2561 6037280 5916377 5755730 5789061 5626272 5559128 5372266 5260661 5152063 4993099 5052522
2551E052522q3313k5871o3832j25073K8940j06150k56251k9358J06836k00579
2541D297871L3409L529M6071l896j74564j34551N6022m0369k03742k7452O2068
2530C914396K7949K0831r7213k216J0037m0254o3082r6855k2688k549M9493r938
2518C687911j26090q2922o4698J8236K9294l8593j53958K20522q4231P8555k5327
2507C458699k28145r4312J4840O9491J23717l4816r265j21508J4186k37926n0873
2496B904088O1282J30378j16777R3061J22582j02655J5195p7013l148j22879p6643
2485B827471K896j428O8138j05428O2332j03547J13632O2257j36121Q4501k0053
2474B854650j10095l6966o2841j71877J96187P774K2572j02205M5913q5309K4197
$$ plain form
2551 5052522 4969209 4943338 4879506 4754433 4783373 4677223 4420972 4391614 4498450 4297871
2541 4297871 4331280 4334809 4380880 4376984 4202420 4067869 4123891 4083522 3879780 3852328 3914396
2530 3914396 3942345 3963176 3865963 3863747 3873784 3833530 3770448 3673593 3650905 3648356 3697849 3687911
2518 3687911 3561821 3478899 3414201 3432437 3461731 3423138 3269180 3489702 3405471 3484026 3458699
2507 3458699 3230554 3136242 3151082 3220573 3344290 3309474 3300209 3178701 3192887 2954961 2904088
2496 2904088 2965370 3095748 2978971 3072032 3194614 3091959 3107154 3030141 3026993 2904114 2827471
2485 2827471 2830367 2828939 2897077 2791649 2853981 2750434 2864066 2926323 2790202 2874703 2854650
2474 2854650 2744555 2707589 2644748 2472871 2669058 2676832 2699404 2597199 2643112 2557803 2582000
2463B582000l3196R9678j54928M8057o0382j39204j6246R9959O2437o243m5674
2452B436258j67816o7939N2770O7139n3293l6062K857o5506n3393K58184o9683
2441B303516j55351k8545k4907P6533j05543j29345j40573Q6758J4620n4078p6372
2430A766713N630N3265J2341j32972J03369j42910L6285r6011n1640J67690k4705
2419A697055n1018o7040m5182K7162q4750N98J39688j09792m9619L6877J4054
2408A508033j04279m8167M2614O2016N1515k01583O2832j06751N3219m370n9859
2397A255220M9898K0196k0194O2859N5535q9105k14627j8152L8410r1814J38164
2386A186390l9953r4029j58520J27020K08405J51406j92757o2820q5853l7282
$$ plain form
2463 2582000 2548804 2648482 2493554 2541611 2481229 2342025 2325779 2425738 2488175 2481932 2436258
2452 2436258 2268442 2200503 2253273 2320412 2267119 2231057 2233914 2168408 2115015 2373199 2303516
2441 2303516 2148165 2119620 2094713 2171246 2065703 1936358 1795785 1882543 1897163 1843085 1766713
2430 1766713 1772343 1825608 1837949 1704977 1808346 1665436 1701721 1605710 1554070 1721760 1697055
2419 1697055 1646037 1578997 1533815 1560977 1476227 1476825 1616513 1506721 1457102 1493979 1508033
2408 1508033 1403754 1355587 1398201 1460217 1511732 1310149 1372981 1266230 1319449 1315079 1255220
2397 1255220 1305118 1325314 1305120 1367979 1423514 1334409 1119782 1101630 1140040 1048226 1186390
2386 1186390 1146437 1052408 893888 1020908 1229313 1380719 1187962 1125142 1039289 1002007
2376A002007m4698k3309m9495K7803P7659K2044J10137O4103j83571o588p5606
2365I20486k02705P1299J11468k0281K3021m6474N6123M8760j14077j2489L5588
2354H70719j19123J84806n0165j76390N1644m6801l3380P634M6679q1195k2995
2343F31433k0643J56249j5128q9249m9260j188P7087j57192l463J42721N6085
2332G27452j52342N9547n2477j51155J33467q4422R7400M977j41266k5642J01427
2321E16966P708m52M0004J11088k09090q1846R4044M1845R813j29982p4560l6490
2309B89048J95325k5280l0081p8438Q4398J36930j83156K0119L499Q647R1395
2298E12406k08461l2545K13982l6396j20862P2841M348N0009R8455m4589r6839
$$ plain form
2376 1002007 957309 934000 884505 912308 989967 1012011 1122148 1186251 1002680 996092 920486
2365 920486 717781 789080 900548 880267 903288 856814 912937 961697 847620 835131 870719
2354 870719 751596 936402 886237 709847 761491 714690 681310 688944 735623 654428 631433
2343 631433 610790 767039 751911 662662 613402 612214 689301 532109 528646 671367 727452
2332 727452 575110 634657 582180 431025 564492 480070 577470 582447 441181 415539 516966
2321 516966 524674 524222 564226 675314 466224 384378 478422 520267 530080 400098 325538 289048
2309 289048 484373 459093 429012 350574 434972 571902 388746 408865 412364 421011 512406
2298 512406 303945 271400 485382 448986 328124 400965 405313 455322 553777 509188 412349
2287D12349M2347p7906o3652L333J12197j16687j8164n92J06186q0737n3891L5491
2275C00274j6861j74807J34253K21423M2375q9291q9726j16532l6654N7553l2036
2264A99971K174p062O0999j59367K08570k57467O6090J73066R4319k1274n7305
2253C02714q5311N4564N808Q852J25181q1235q3189m4126j02523N8661Q8357J4150
2241B61903k11568j14210K76359K8597o5248q0331P9577J20159j04043o5117K213
2230A28291N0908k9376J3115m2959n5793N705P2210L9274j71249m9574K39274
2219A99826j1848r7725k1164R212Q2298N8187r8230l1620J06218k0353l2268J7085
2207A59618l6808L292N2793j373l0145m4366K4282j62773K06755j12201J3477
$$ plain form
2287 412349 454696 376790 313138 316471 428668 311981 293817 293225 399411 318674 264783 300274
2275 300274 283413 108606 242859 464282 506657 417366 327640 211108 174454 232007 199971
2264 199971 202145 195083 256082 96715 305285 47818 113908 286974 381293 360019 302714
2253 302714 217403 271967 277775 286627 411808 330573 247384 203258 100735 159396 247753 261903
2241 261903 50335 -63875 212484 241081 175833 95502 175079 295238 191195 126078 128291
2230 128291 179199 149823 162938 119979 64186 69891 142101 181375 10126 -39448 199826
2219 199826 187978 90253 69089 78301 160599 218786 120556 88936 195154 174801 142533 159618
2207 159618 122810 126102 178895 177522 147377 103011 127293 -35480 171275 59074 72551
2196G2551J56825J4437r5825L5677l445Q4043p8045M3604J0023j29701m2915k853
2184F4376J50370m5770K2132J18546l7433j05481O836N1609j52581M6371o5634
2173E3341n0966R4228J24075j3573O7901r3249l5685P7254O2652n4745J11536
2162C42769M7639j60945R500k1452N3326m7727M3319K4218J30238J94568p2657
2151E42796l1525R7565r2338J07383m4310n4313J09942L8306K175Q9152m1982
2140G22851J7677K7950J24804n2287J87J37164p8092l0307R3299m942K66050L3865
2128A258219J04321M2954o7960L2331J19624N6937L0323O3587R9946J39844K3811
2117A903937L6252J80920J07446J14337K89072J05864J4439L04651J19325K50631
$$ plain form
2196 72551 229376 243813 147988 183665 180220 264263 186218 229822 239845 110144 67229 64376
2184 64376 214746 168976 191108 309654 272221 166740 173576 225185 72604 118975 53341
2173 53341 2375 96603 220678 207105 275006 181757 146072 223326 285978 231233 342769
2162 342769 390408 229463 238963 217511 270837 223110 266429 290647 420885 615453 542796
2151 542796 511271 608836 516498 623881 579571 525258 635200 673506 675681 764833 722851
2140 722851 740528 768478 893282 840995 841182 978346 900254 869947 963246 958304 1224354 1258219
2128 1258219 1362540 1405494 1337534 1369865 1489489 1546426 1576749 1640336 1740282 1880126 1903937
2117 1903937 1940189 2121109 2228555 2342892 2631964 2737828 2752267 3056918 3176243 3426874
2107C426874M06805K71108L65455L69980K19204N52319N43232P97152P93654J293553
2097I039336J797343K488042K811300L879931K358498j038582p56954p17259k282014
2088A7579641l217170k647308k032718j224601j082304q00416o21331o32013q14905
2079D506875n01037k26573l47123j86319l97106l64900j75547j28796j51021j44863
2069A883590p9228j59698k87093J15002j01334j94498P5427j45337j08905M7610
2059A045536j40186M8943p0153m5466l3422k41486P8818J58075r3154j52828L1982
2048E86659O8272J8653N982j3725r5688m6126q3351N0583M8908p6602m0755J21377
2036E44187q7045J93869r5135K182j51119K1324q6323o1959M2347n9408K5811
$$ plain form
2107 3426874 3833679 4104787 4470242 4840222 5059426 5611745 6154977 6952129 7745783 9039336
2097 9039336 10836679 13324721 16136021 20015952 22374450 21335868 20578914 19861655 17579641
2088 17579641 14362471 11715163 9682445 8457844 7375540 6575124 5953793 5321780 4506875
2079 4506875 4005838 3779265 3432142 3245823 2848717 2483817 2308270 2179474 2028453 1883590
2069 1883590 1804362 1644664 1357571 1472573 1371239 1176741 1252168 1106831 997926 1045536
2059 1045536 905350 954293 884140 838674 805252 563766 642584 800659 707505 554677 586659
2048 586659 654931 673584 679566 665841 570153 524027 440676 491259 540167 463565 422810 544187
2036 544187 457142 651011 555876 558058 406939 428263 341940 279981 322328 262920 288731
2025B88731p7695L1156j10905J47019R6583j45281J4864p101j66489K00581q3599
2014A87864j2897J29261K3911k8144J3386p5788j67683J82539m6173j53775p8560
2003b6059J48820l5793R3184o1780J44981n5743m00740O5084R3774l3782P5850
1992G796K0998o307K4649r543P1310r469J39752k04248m7527k0877j15383J02000
1980d6849J50018j27309j00405K16342K6163K6336k39521o656P67L9995l1558
1969i2677N0597J359J48832l3094p7629J01294o9936l8219o5647L1636J67866
1958A24382j13229j47002L176O6940J57306q745K16011j31928o6231r5673Q7381
1947I2388j7777J7614k16551J9470K09211n0652K3887l4730M2522m2765N698j03948
$$ plain form
2025 288731 211036 242192 131287 278306 374889 229608 244472 237371 70882 271463 187864
2014 187864 174967 304228 328139 299995 313381 237593 69910 252449 206276 52501 -26059
2003 -26059 122761 86968 180152 118372 263353 207610 -193130 -128046 -34272 -68054 7796
1992 7796 28794 22487 47136 37593 108903 99434 239186 34938 -12589 -33466 -148849 -46849
1980 -46849 103169 -24140 -124545 91797 117960 144296 -95225 -101881 -101114 -61119 -92677
1969 -92677 -42080 -40721 108111 75017 -2612 98682 28746 -9473 -75120 -43484 124382
1958 124382 11153 -135849 -132673 -65733 91573 82828 298839 166911 100680 5007 92388
1947 92388 74611 92225 -124326 -104856 104355 53703 77590 42860 85382 42617 48315 -55633
1935e5633Q786J07970R5773r0136Q8868o8902L5037k522j77846j4372N5404M4347
1923B6774L476m4614K0526p7463p2784K6844J13857r1173N2300m210j0742o670
1911f3879o4930n4717J6665J63996N5159j4866L2263m7697l1989J58982j42499
1900F488o1612l0718J07889m4524J76661j72724j08581J11408J27303J51233r7901
1889A64922j30619L6988k5176l8794k1867L5273p8583m0831K06135r6018P4110
1878H5540m004j09034J17445j16655R8620n5908j11768j3762l0094J06732m7906
1867h0794k706J5617O9273L4852j44784J7976M3702j14489j59216J63100l328
1856a60797J31314R1247j43620M0893J7545n7487L013N0253q3750r5528L2134
$$ plain form
1935 -55633 -46847 61123 156896 66760 155628 86726 121763 119241 -58605 -72977 -17573 26774
1923 26774 30250 -14364 6162 -71301 -144085 -117241 -3384 -94557 -42257 -46467 -57209 -63879
1911 -63879 -128809 -183526 -166861 -2865 52294 37428 69691 21994 -9995 148987 6488
1900 6488 -55124 -85842 22047 -22477 154184 -18540 -127121 -15713 111590 262823 164922
1889 164922 34303 71291 46115 7321 -14546 20727 -57856 -98687 107448 11430 85540
1878 85540 81536 -27498 89947 -26708 71912 16004 -95764 -109526 -139620 -32888 -80794
1867 -80794 -83500 -67883 1390 36242 -108542 -90566 -46864 -161353 -320569 -157469 -160797
1856 -160797 -29483 61764 -81856 -40963 -23418 -80905 -77892 -27639 -111389 -206917 -174783
1845a74783O5459k3188M610O7294L94M9640j35206R1894m1160L1851O7997K1534
1833B6336j4237j55530n942M6484K9241M5595j9690j15169k9239J99220m6137
1822c9068n1647O1387p4080L7825N0828J4245n203j43322Q4505P3291k499O6629
1810G2891j11757M7279q4105l3852J14146N346P4720L8534k18652K6088O339J32481
1798F9458M1831r0763o1365j51941M4679m9661J49016m611q2589o9480l329J4072
1786a94683J31843P3127k5452n894n1168Q7257j29660M4721P072J5338O1703Q9916
1774A04120j24918q7175o7184R6055R4296j44625m2022J583M9210J98416j10103
1763c2347R643q2607L9330R929n8412Q276o8995P7128L1780q4708j08585J57354
$$ plain form
1845 -174783 -109324 -132512 -127902 -60608 -60214 -10574 -145780 -53886 -95046 -63195 4802 26336
1833 26336 12099 -143431 -149373 -102889 -73648 -28053 -47743 -162912 -192151 7069 -39068
1822 -39068 -90715 -29328 -103408 -65583 -14755 -510 -5713 -149035 -64530 8761 6262 72891
1810 72891 -38866 8413 -75692 -109544 4602 9948 84668 123202 -95450 -69362 -63023 69458
1798 69458 111289 20526 -40839 -192780 -148101 -197762 -48746 -53357 -135946 -205426 -208755 -194683
1786 -194683 -62840 10287 -15165 -21059 -72227 15030 -114630 -69909 -62837 -47499 14204 104120
1774 104120 -20798 -107973 -175157 -79102 15194 -129431 -171453 -169870 -120660 77756 -32347
1763 -32347 -22704 -105311 -65981 -56052 -114464 -106188 -175183 -98055 -66275 -150983 -259568 -102214
1751a02214r088O6316m9756l0910k2390m5875o2385K0515J32526k6513J19671
1740a0103j27898o3252J05468O133j9663O2429n1488Q4219r3732q5113j7534J07893
1728a02641j4448O9436P7559m4322l0682o3756q6342M0480J803J32874J0588l258
1716a2709j2674l1048J0894Q664L0524k1532o5314j3307j08294J94088R1908m4618
1704B6582o5528k3442k1975M1949M7476m1022o558p118L2612J7381j89294J48674
1692d0263P8599J3000o8572j01726k6717J12530N1973j55475j56958j970K08438
1681h7141r590L9575o6947J16408j04360r9965K04903o9713J0637L8396Q3746
1670E5949J436m850k0310j27860K1636J37136j33126j14541J34877o8841j9702
$$ plain form
1751 -102214 -111302 -44986 -94742 -125652 -148042 -193917 -256302 -235787 -103261 -129774 -10103
1740 -10103 -138001 -201253 -95785 -89652 -109315 -46886 -98374 -14155 -107887 -193000 -210534 -102641
1728 -102641 -117089 -47653 29906 -14416 -45098 -108854 -195196 -154716 -152913 -20039 -9451 -12709
1716 -12709 -25383 -56431 -45537 -36873 -6349 -27881 -93195 -106502 -214796 -20708 71200 26582
1704 26582 -38946 -62388 -84363 -42414 5062 -35960 -42518 -49636 -17024 357 -188937 -40263
1692 -40263 38336 51336 -17236 -118962 -145679 -33149 18824 -136651 -293609 -295579 -87141
1681 -87141 -96731 -57156 -124103 -7695 -112055 -212020 -7117 -76830 -66193 -27797 55949
1670 55949 57385 52535 32225 -95635 -73999 63137 -69989 -184530 -49653 -118494 -138196
1659a38196j52706J14438J5641J04499L2713L4099l9176R9765j87994n8453L1659
1648a43711J19443j50364L4368J6811K8251l2041N4537j90732Q334K26207n0531
1637g9428j9280j41523K5060K65746j57867p5562k7063K5778m5639O1094N9680
1626a09004M9747K5445k3653J8206k9892l4904r0103K8591M4151P4156M6689J53895
1614A53324j28768j73350p4286L4707N8322Q8849k4648J11986j0604P3040j59534
1603e0962l6031O1352j37132J6240Q6918M9751j30860Q9254j20668P9697N5875
1592c6566m2829L7665R6851j15057j6167O4496l7179o0937N1363j25291j23893
1581c07544J62211R5040j9575J46543N2752j65251j98952k4245J13468J56704
$$ plain form
1659 -138196 -290902 -176464 -160823 -56324 -23611 10488 -28688 71077 -116917 -175370 -143711
1648 -143711 -24268 -174632 -140264 -123453 -95202 -127243 -72706 -263438 -255104 -28897 -79428
1637 -79428 -98708 -240231 -215171 50575 -107292 -182854 -209917 -184139 -229778 -168684 -109004
1626 -109004 -59257 -33812 -57465 -39259 -69151 -104055 -194158 -165567 -121416 -47260 -571 153324
1614 153324 24556 -148794 -223080 -188373 -130051 -41202 -65850 46136 35532 108572 -50962
1603 -50962 -86993 -25641 -162773 -146533 -59615 -9864 -140724 -51470 -172138 -92441 -36566
1592 -36566 -79395 -41730 55121 -59936 -76103 -11607 -48786 -109723 -58360 -183651 -307544
1581 -307544 -145333 -50293 -69868 76675 129427 -35824 -234776 -259021 -145553 11151
1571A1151m6903n8547J20182R805r3259O7420r2223P6343M5621j24016P2963N9597
1559D8134j08412p6035P9468j17043J776j14661j01080J74256j5215L9387L5671
1548a53754P5859p8841K2237m3075l6556K15124J25998k16402k8430M7210n0225
1537a20855Q6263j07057k8423j5421M2486j53578J21297o1709J88589q9993M3846
1526i4555k5914R2410o4715N801o2384P0287m9083J7950J1536K7132J07849Q9791
1514A26105J11558k96478J7449N1125r5043n7277q6702R0992k087J05807k9070
1503f3621L1215n7627k3043J52467o4376j86226Q9127m1551J87519O0521k27122
1492a42717K6929j8342m5743R2412J4589o9774Q823J60753P1546r0662j82039
$$ plain form
1571 11151 -35752 -94299 25883 35688 -57571 9849 -82374 -6031 39590 -84426 -11463 48134
1559 48134 -60278 -136313 -56845 -173888 -172112 -286773 -387853 -213597 -228812 -189425 -153754
1548 -153754 -77895 -156736 -134499 -177574 -214130 994 126992 -89410 -117840 -70630 -120855
1537 -120855 -34592 -141649 -170072 -185493 -143007 -296585 -175288 -236997 -48408 -138401 -94555
1526 -94555 -120469 -28059 -92774 -86973 -149357 -79070 -128153 -110203 -98667 -71535 36314 126105
1514 126105 237663 -58815 -41366 9759 -85284 -142561 -229263 -138271 -140358 -34551 -63621
1503 -63621 -32406 -90033 -113076 39391 -24985 -211211 -122084 -163635 23884 84405 -142717
1492 -142717 -115788 -134130 -179873 -87461 -72872 -142646 -133823 26930 98476 7814 -174225
1481a74225K6181J19638o3258P3857J3993J8692n7292o1251J5494m7055K10768
1470G5542j93350j4648L9349m981N79L116Q4137N3672n2874N1971r5838O4053
1458A0728j3468k8539P3326j40009j057K2320j7765k9208K3314J10870J27897
1447A38409o3115q3j17696N6894m367J7408p6960j5146L394j7649j6629j2075
1435a07615j5820P2707O3210l4133K7176m8174j23159J46103N7038j04886M50
1424f7103J87280j26092k8006l485j0964J8914J3084l2983p7852m4118P3128P064
1412i1133P3082q4358l8515o3604O3016r6578J9730J48791N9082N0817K6805p8982
1400a1847j6586J9033k7798j23576R9891r8282Q5394N8537M7992j56508j4672
$$ plain form
1481 -174225 -148044 -28406 -91664 -17807 -3814 14878 -42414 -103665 -88171 -135226 75542
1470 75542 -117808 -132456 -93107 -98088 -97509 -94393 -10256 43416 -9458 42513 -53325 10728
1458 10728 -2740 -31279 42047 -97962 -99019 -76699 -94464 -123672 -100358 10512 138409
1447 138409 75294 75211 -42485 14409 10042 27450 -49510 -64656 -61262 -78911 -95540 -107615
1435 -107615 -123435 -50728 12482 -21651 5525 -42649 -165808 -19705 37333 -67553 -67103
1424 -67103 120177 -5915 -33921 -37406 -48370 -29456 -16372 -49355 -127207 -171325 -98197 -91133
1412 -91133 -18051 -102409 -140924 -204528 -141512 -238090 -218360 -69569 -10487 40330 67135 -11847
1400 -11847 -28433 -9400 -37198 -160774 -60883 -159165 -73771 -15234 32758 -123750 -138422
1389a38422J51560o120p9713j65868J13508r5088J08658K8091j64513K3632J34815
1378h9460P5451J9270L5433l0485l0121J5039l8111o5501L1928k3216M7054j5394
1366f8113R5671j06295m201p3516r385R6811J09928j11488P4024J77982j80563
1355H55M6866J69130k18915l6494K9740L9672M1844j05062k34197O5322K28030
1344B6791j73240q9675L5720Q5590l7510K7231l1040J55215N456q3274L4197N2768
1332H229J76116j27564j01779l9699r3134M8655J04943L3546l1299j66531R551
1321a78966J32701k9463N7488m7090P349r6103M1153R0170k8640j20810M6470
1310a25741J62461l7629n0976P6405j51631J10469O674j30806M8096Q3790n4246
$$ plain form
1389 -138422 13138 7018 -72695 -238563 -125055 -220143 -111485 -83394 -247907 -224275 -89460
1378 -89460 -14009 5261 40694 10209 -19912 -4873 -42984 -108485 -76557 -99773 -52719 -68113
1366 -68113 27558 -78737 -82938 -156454 -165839 -69028 40900 -70588 3436 181418 855
1355 855 47721 216851 -2064 -38558 -8818 30854 72698 -32364 -266561 -201239 26791
1344 26791 -146449 -236124 -200404 -114814 -152324 -125093 -156133 -918 4538 -78736 -44539 8229
1332 8229 184345 56781 -44998 -84697 -177831 -129176 -24233 9313 -21986 -188517 -178966
1321 -178966 -46265 -75728 -18240 -65330 -57981 -154084 -112931 -22761 -51401 -172211 -125741
1310 -125741 36720 -909 -51885 24520 -127111 -16642 -9968 -140774 -92678 -8888 -63134
1299f3134K38433j86840j97491L180N3453M7421J41916j03500j01094J57060J0358
1288b38j19628J47563j66648N7717m72N1930o7314j5714K20396j24245j10617
1277a27270J40422o222n5259j05070M712J6801K4303J45897M9152L148r5284L6441
1265C1771Q8911j33879O3980j12721n3819p8996J19184l7857K3578K33971j16439
1254B7684o3042l6505j9422Q6694Q4505j21259n4325k9166J02041N0982N3297
1243H1484r9277o0098P6973J00047j18728k6405l7309J8343k20763Q4072N7702
1232a43959J16782J07807N9258k50856J3134J26644q7876n2605R062R4552K4237
1221A6180M4393J0102j38747j7266M179L3997J25642p1074n8919j8131P7286j27584
$$ plain form
1299 -63134 175299 -11541 -209032 -205852 -152399 -104978 36938 -66562 -167656 -10596 -238
1288 -238 -119866 27697 -138951 -81234 -81706 -29776 -97090 -112804 107592 -16653 -127270
1277 -127270 13152 6930 -48329 -153399 -148687 -131886 -107583 38314 87466 90614 -4670 31771
1265 31771 120682 -13197 50783 -61938 -115757 -194753 -75569 -113426 -89848 144123 27684
1254 27684 -35358 -71863 -91285 -4591 79914 -41345 -95670 -124836 -22795 28187 81484
1243 81484 -17793 -77891 -918 99129 -19599 -46004 -83313 -64970 -285733 -201661 -143959
1232 -143959 -27177 80630 139888 -110968 -97834 28810 -59066 -111671 -102609 -8057 16180
1221 16180 60573 70675 -68072 -85338 -81159 -47162 78480 7406 -51513 -69644 7642 -119942
1209a19942L9413m614Q0246m0175L3879L015K1898K7173J9277N3296k13755K1534
1197g8755J36684M0031r4360m0852J9285m6495L6461p5277m2682J05344J8817
1186b1799j9313p211J50084j92586j28220J59627L7306j17349J26590m0724o1634
1175a15229O6841P7711j13599J2587N9114l8490j3783L1233J58493j25739j86523
1164a87384J65857j00416k7363R8530j419J5607k0396L0542n656R3297p4737k17640
1152b31178M4227J13110K1858r5501O6656J43390j7436j60668r003J8317n2489
1141a58717J8707J21982K2228L4982j28661N7140J28243O068l9222j1095J1351
1130F3006n6619p4510j18902J43648P3332l4932K4968n6471j41054N1477O7720
$$ plain form
1209 -119942 -80529 -85143 -4897 -45072 -11193 -8178 13720 40893 60170 113466 -100289 -78755
1197 -78755 57929 97960 3600 -37252 -17967 -64462 -28001 -103278 -145960 -40616 -21799
1186 -21799 -41112 -48323 101761 -90825 -219045 -59418 -22112 -139461 -12871 -53595 -115229
1175 -115229 -48388 29323 -84276 -71689 -12575 -51065 -64848 -33615 124878 -861 -187384
1164 -187384 -21527 -121943 -149306 -50776 -52195 -36588 -56984 -26442 -32098 61199 -13538 -231178
1152 -231178 -186951 -73841 -51983 -147484 -80828 62562 45126 -115542 -124545 -106228 -158717
1141 -158717 -140010 -18028 4200 39182 -89479 -32339 95904 101972 62750 51655 63006
1130 63006 6387 -68123 -187025 -43377 29955 -4977 19991 -36480 -177534 -126057 -58337
1119e8337J47380J0344O1826p0557l3258O4626j91597l2064J09768j7875j5881
1108b5625k5962K04937L387j55995K873k9720k0048o6011J07214Q3539l4998J24173
1096A67764j56439k4440o4998j9280L9115k1530q8920J91772r417L6636N5569
1085A05832M0125n4967r0731J12488l8949l4787K9936J09100k04174J59288j84770
1074e1609j28726J47555J76285l3578r9004J4886p5548j6358J5523n8294L7843
1063g1025J38104j17281m9921J9312k8775J46434r8598l2333J30920j10962p2491
1052a46616J99860K6869j76179J07972r3382m0105r1789O287J61650O5187N417
$$ plain form
1119 -58337 89043 99387 161213 90656 57398 122024 -69573 -101637 8131 -9744 -25625
1108 -25625 -51587 153350 156737 742 3615 -26105 -46153 -112164 -4950 78589 43591 167764
1096 167764 11325 -13115 -78113 -97393 -58278 -79808 -168728 23044 13627 50263 105832
1085 105832 145957 90990 259 112747 73798 39011 68947 178047 -26127 133161 -51609
1074 -51609 -180335 -32780 143505 109927 10923 25809 -49739 -66097 -50574 -108868 -71025
1063 -71025 67079 -50202 -100123 -80811 -109586 36848 -61750 -94083 36837 -74125 -146616
1052 -146616 53244 80113 -96066 11906 -81476 -121581 -213370 -207083 -45433 19754 25171
$$ [...]
##END NTUPLES=NMR SPECTRUM
##END=
