##TITLE=1H_CG-1216
 CDCl3
 8 sc, 
 31.10.2024
##JCAMPDX= 6.0         $$ Bruker NMR JCAMP-DX V2.0
##DATA TYPE= NMR SPECTRUM
##DATA CLASS= NTUPLES
##ORIGIN= UXNMR, Bruker Analytische Messtechnik GmbH
##OWNER= root
$$ XWIN-NMR		Version 3.5
$$ Thu Oct 31 14:08:21 2024 Russian Standard Time (UT+4h)  she@DPX200
##.OBSERVE FREQUENCY= 200.1318
##.OBSERVE NUCLEUS= ^1H
##.ACQUISITION MODE= SIMULTANEOUS
##.ACQUISITION SCHEME= undefined
##.AVERAGES= 8
##.DIGITISER RES= 18
##SPECTROMETER/DATA SYSTEM= spect
##.PULSE SEQUENCE= zg30
##.SOLVENT NAME= CDCl3
##.SHIFT REFERENCE= (INTERNAL, CDCl3, 0, 20.99)
##AUDIT TRAIL= $$ (NUMBER, WHEN, WHO, WHERE, WHAT)
$$ ##TITLE= Audit trail, XWIN-NMR		Version 3.5
$$ ##JCAMPDX= 5.01
$$ ##ORIGIN= Bruker BioSpin GmbH
$$ ##OWNER= she
$$ F:/spectra/data/she/nmr/H-F/1/pdata/1/auditp.txt
$$ ##AUDIT TRAIL=  $$ (NUMBER, WHEN, WHO, WHERE, WHAT)
(   1,<2024-10-31 14:07:08.26 +0400>,<she>,<DPX200>,
      <created by zg, POWCHK disabled, PULCHK disabled
       configuration hash MD5:
       00 E9 B6 7A A2 85 ED C7 34 08 36 98 17 FE 4E 26
       data hash MD5: 16K
       A6 BF 53 9E 90 72 6D 93 A6 04 C3 B9 F6 34 18 E7>)
(   2,<2024-10-31 14:07:10.42 +0400>,<she>,<DPX200>,
      <Start of raw data processing
       efp BC_mod = 2 LB = 0.24 FT_mod = 6 PKNL = 1 PHC0 = -26351.22 PHC1 = 19.18743 SI = 16K 
       data hash MD5: 16K
       B0 D9 28 AE CD 5E 2C 99 86 49 12 65 3B 9E A3 22>)
(   3,<2024-10-31 14:07:30.56 +0400>,<she>,<DPX200>,
      <pk PHC0 = -0.4810252 PHC1 = -0.9999998 
       data hash MD5: 16K
       2B DF B2 C4 AD B2 B9 6D 7E 14 4E F5 9A 5A 40 17>)
(   4,<2024-10-31 14:07:34.48 +0400>,<she>,<DPX200>,
      <abs ABSG = 5 
       data hash MD5: 16K
       BB C8 41 12 88 3A F6 A8 46 14 50 76 B3 7E 20 90>)
$$ ##END=
$$ 
$$ hash MD5
$$ 57 25 FE 7C 4E 07 CF 51 B8 3A E7 EE 72 68 AB 9A
##$RELAX= 
##$RELAX= 
##$RELAX= 
##$RELAX= 
##$RELAX= 
##$RELAX= 
$$ Bruker specific parameters
$$ --------------------------
##$DU= <F:/spectra>
##$EXPNO= 1
##$NAME= <H-F>
##$PROCNO= 1
##$TYPE= <nmr>
##$USER= <she>
##$AMP= (0..31)
100 100 100 100 100 100 100 100 100 100 100 100 100 100 100 100 100 100 
100 100 100 100 100 100 100 100 100 100 100 100 100 100 
##$AQSEQ= 0
##$AQ_mod= 1
##$AUNM= <au_zg>
##$AUTOPOS= <>
##$BF1= 200.13
##$BF2= 200.13
##$BF3= 200.13
##$BF4= 200.13
##$BF5= 200.13
##$BF6= 200.13
##$BF7= 200.13
##$BF8= 200.13
##$BYTORDA= 1
##$CFDGTYP= 0
##$CFRGTYP= 5
##$CHEMSTR= <none>
##$CNST= (0..31)
1 1 145 1 1 1 1 1 1 1 1 1 1 1 1 1 1 1 1 1 1 1 1 1 1 1 1 1 1 1 1 1 
##$CPDPRG= <>
##$CPDPRG1= <>
##$CPDPRG2= <>
##$CPDPRG3= <>
##$CPDPRG4= <mlev>
##$CPDPRG5= <mlev>
##$CPDPRG6= <mlev>
##$CPDPRG7= <mlev>
##$CPDPRG8= <mlev>
##$CPDPRGB= <>
##$CPDPRGT= <>
##$D= (0..31)
0 1.2 0 0 0 0 0 0 0 0.06 0 0.03 0 0 0 0 0.0002 0 0 0 0 0 0 0 0 0 0 0 0 
0 0 0 
##$DATE= 1730369227
##$DBL= (0..7)
120 120 120 120 120 120 120 120 
##$DBP= (0..7)
150 150 150 150 150 150 150 150 
##$DBP07= 0
##$DBPNAM0= <>
##$DBPNAM1= <>
##$DBPNAM2= <>
##$DBPNAM3= <>
##$DBPNAM4= <>
$$ [...]
##$SUBNAM3= <"">
##$SUBNAM4= <"">
##$SUBNAM5= <"">
##$SUBNAM6= <"">
##$SUBNAM7= <"">
##$SUBNAM8= <"">
##$SUBNAM9= <"">
##$SW= 24.0689170037331
##$SWIBOX= (0..15)
0 0 2 0 0 0 0 0 0 0 0 0 0 0 0 0 
##$SW_h= 4816.95568400771
##$TD= 16384
##$TD0= 1
##$TE= 0
##$TE2= 300
##$TE3= 300
##$TEG= 300
##$TL= (0..7)
0 120 120 120 120 120 120 120 
##$TP= (0..7)
150 150 150 150 150 150 150 150 
##$TP07= 0
##$TPNAME0= <>
##$TPNAME1= <>
##$TPNAME2= <>
##$TPNAME3= <>
##$TPNAME4= <>
##$TPNAME5= <>
##$TPNAME6= <>
##$TPNAME7= <>
##$TPOAL= (0..7)
0.5 0.5 0.5 0.5 0.5 0.5 0.5 0.5 
##$TPOFFS= (0..7)
0 0 0 0 0 0 0 0 
##$TUNHIN= 0
##$TUNHOUT= 0
##$TUNXOUT= 0
##$USERA1= <user>
##$USERA2= <user>
##$USERA3= <user>
##$USERA4= <user>
##$USERA5= <user>
##$V9= 5
##$VALIST= <valist>
##$VCLIST= <CCCCCCCCCCCCCCC>
##$VD= 0
##$VDLIST= <DDDDDDDDDDDDDDD>
##$VPLIST= <PPPPPPPPPPPPPPP>
##$VTLIST= <TTTTTTTTTTTTTTT>
##$WBST= 1024
##$WBSW= 4
##$XGAIN= (0..3)
0 0 0 0 
##$XL= 0
##$YL= 0
##$YMAX_a= 425783
##$YMIN_a= -299989
##$ZGOPTNS= <>
##$ZL1= 120
##$ZL2= 120
##$ZL3= 120
##$ZL4= 120
##$ABSF1= 20.99732
##$ABSF2= -3.071812
##$ABSG= 5
##$ABSL= 3
##$ALPHA= 0
##$AQORDER= 0
##$ASSFAC= 0
##$ASSFACI= 0
##$ASSFACX= 0
##$ASSWID= 0
##$AUNMP= <proc_1d>
##$AZFE= 0.1
##$AZFW= 0.1
##$BCFW= 0
##$BC_mod= 2
##$BYTORDP= 0
##$COROFFS= 0
##$CY= -3
##$DATMOD= 1
##$DC= 0
##$DFILT= <>
##$DTYPP= 0
##$F1P= 0
##$F2P= 0
##$FCOR= 1
##$FTSIZE= 16384
##$FT_mod= 6
##$GAMMA= 0
##$GB= 0
##$INTBC= 1
##$INTSCL= 3.70164e-10
##$ISEN= 128
##$LB= 0.24
##$LEV0= 0
##$LPBIN= 0
##$MAXI= 10000
##$MC2= 0
##$MEAN= 0
##$ME_mod= 0
##$MI= 1.114404
##$NCOEF= 0
##$NC_proc= -7
##$NLEV= 6
##$NOISF1= 3.799351
##$NOISF2= 2.8
##$NSP= 0
##$NTH_PI= 0
##$NZP= 0
##$OFFSET= 20.98998
##$PC= 1
##$PHC0= -26351.7
##$PHC1= 18.18743
##$PH_mod= 1
##$PKNL= yes
##$PPARMOD= 0
##$PSCAL= 0
##$PSIGN= 0
##$REVERSE= no
##$SF= 200.130007754003
##$SI= 16384
##$SIGF1= 3
##$SIGF2= 2
##$SINO= 5.538805
##$SIOLD= 16384
##$SREGLST= <1H.CDCl3>
##$SSB= 0
##$STSI= 16384
##$STSR= 0
##$SW_p= 4816.95568400771
##$SYMM= 0
##$S_DEV= 0
##$TDeff= 16384
##$TDoff= 0
##$TI= <>
##$TILT= no
##$TM1= 0
##$TM2= 0
##$TOPLEV= 0
##$USERP1= <user>
##$USERP2= <user>
##$USERP3= <user>
##$USERP4= <user>
##$USERP5= <user>
##$WDW= 1
##$XDIM= 16384
##$YMAX_p= 437874500
##$YMIN_p= -1610889
$$ End of Bruker specific parameters
$$ ---------------------------------
##NTUPLES= NMR SPECTRUM
##VAR_NAME=  FREQUENCY,     SPECTRUM/REAL,   SPECTRUM/IMAG
##SYMBOL=    X,             R,               I
##VAR_TYPE=  INDEPENDENT,   DEPENDENT,       DEPENDENT
##VAR_FORM=  AFFN,          ASDF,            ASDF
##VAR_DIM=   16384,         16384,           16384
##UNITS=     HZ,            ARBITRARY UNITS, ARBITRARY UNITS
##FACTOR=    0.29402158847633, 1,            1
##FIRST=     4200.72499977343, 0,            0
##LAST=      -616.230684234278, 0,           0
##MIN=       -616.230684234278, -1610889,    0
##MAX=       4200.72499977343, 437874500,    0
$$ Real data points
##PAGE= N=1
##DATA TABLE= (X++(R..R)), XYDATA
$$ [...]
5607B206031J5587K69103l7446J6959K04582k57077O2636k8225r6776l69616K95964
$$ 2206031 2221618 2490721 2453275 2470234 2674816 2417739 2480375 2452150 2355374 1985758 2281722
5596B281722J8546l0936j34243m07811L95656n4896M5684l78600Q7058J12986
$$ 2281722 2300268 2269332 2135089 1727278 2122934 2068038 2113722 1735122 1822180 1935166
5586A935166j06061k88794J66766K73211j55932L35181k95147O6118L5277k09240
$$ 1935166 1829105 1540311 1707077 1980288 1824356 2159537 1864390 1930508 1965785 1756545
5576A756545J20121j16297q5538R365K8375J3972l78722k869N00799m2370q8334
$$ 1756545 1876666 1760369 1674831 1684196 1712571 1726543 1347821 1344952 1845751 1803381 1715047
5565A715047j18280j58293K12924L251q0098N2040k25978K76881L27100j63158
$$ 1715047 1596767 1438474 1651398 1654649 1574551 1626591 1400613 1677494 2004594 1841436
5555A841436r0292O7226k10525J087K26022J6431j22173L62160p9218j59189k89844
$$ 1841436 1751144 1818370 1607845 1608932 1834954 1851385 1729212 2091372 2012154 1852965 1563121
5544A563121q1324N6123L02463k39741M285J33212J0811K67401o8850J04205k68521
$$ 1563121 1481797 1537920 1840383 1600642 1604927 1738139 1748950 2016351 1947501 2051706 1783185
5533A783185j26787J04081r4742j81208K64124K90374K70491k68715L6499J62802
$$ 1783185 1656398 1760479 1665737 1484529 1748653 2039027 2309518 2040803 2077302 2240104
5523B240104k0381j88721l76215J70077K7560K2008J40716j7887m8783m0680j70793
$$ 2240104 2219723 2031002 1654787 1824864 1852424 1874432 2015148 1997261 1948478 1907798 1737005
5512A737005K06700k15653m0471L14901j5079K13364j87621J0054n7727j80492
$$ 1737005 1943705 1728052 1687581 2002482 1987403 2200767 2013146 2023200 1965473 1784981
5502A784981L68903J26588l36654J40680J37497j57182p5282K47184p6055j08809
$$ 1784981 2153884 2280472 1943818 2084498 2221995 2064813 1989531 2236715 2160660 2051851
5492B051851k93748m0607K85803Q7109Q5721k78J22278J02328k17065m5001J07970
$$ 2051851 1758103 1717496 2003299 2090408 2176129 2175851 2298129 2400457 2183392 2138391 2246361
5481B246361J31493m3589l52120L837J07036J97808J07380K87784Q2784k20004
$$ 2246361 2377854 2334265 1982145 1985982 2093018 2290826 2398206 2685990 2768774 2548770
5471B548770P8246M36196L0544J32376J5275m11667k98889L48222r1024J5139
$$ 2548770 2627016 3063212 3093756 3226132 3241407 2829740 2530851 2879073 2788049 2803188
5461B803188j5142L01042M62731j00267l32565K49756L19275R5254L21939J94506
$$ 2803188 2788046 3089088 3551819 3451552 3118987 3368743 3688018 3783272 4105211 4299717
5451D299717M16485N11622L77596J74644J01443l41175n71393l09413j6341L8046
$$ 4299717 4716202 5227824 5605420 5780064 5881507 5540332 4968939 4659526 4643185 4681231
5441D681231K02666o0517n6627Q5315k9500N1000J64489L95980K72053M75266
$$ 4681231 4883897 4823380 4766753 4852068 4822568 4873568 5038057 5434037 5706090 6181356
5431F181356N90846L92379P25671R28077N45577j94654m82343n15314l79893n37094
$$ 6181356 6772202 7164581 7890252 8818329 9363906 9169252 8686909 8171595 7791702 7254608
5421G254608l60075l20363j39517L99836j59292k90501J59887M05420N59595k30293
$$ 7254608 6894533 6574170 6434653 6834489 6675197 6384696 6544583 6950003 7509598 7279305
5411G279305M67981O94848R69739P54297R25540Q01870Q1628o04362o29776o58276
$$ 7279305 7747286 8442134 9411873 10166170 11091710 11893580 11975208 11370846 10741070 10082794
5401A0082794r36371o64097n90623l20332j72193j34622O1402J45886j72992j46758
$$ 10082794 9146423 8482326 7891703 7571371 7399178 7264556 7325958 7471844 7298852 7152094
5391G152094p6941M76733N43247M58651J182884O65777N01844M1711m67910o46702
$$ 7152094 7075153 7551886 8095133 8553784 9736668 10402445 10904289 10946000 10478090 9831388
5381I831388p30067r08441q74508l69827n23544L21m85472j77169J72096j07503
$$ 9831388 9101321 8192880 7318372 6948545 6425001 6425322 5939850 5762681 5934777 5827274
5371E827274J23007m2208l09336J48147J01314M65236Q89879o8557Q9672l21909
$$ 5827274 5950281 5908073 5598737 5746884 5848198 6313434 7203313 7134756 7224428 6902519
5361F902519n79622j44215l61724o52961l38659q5900l10913j3728k20016J38108
$$ 6902519 6322897 6178682 5816958 5163997 4825338 4739438 4428525 4414797 4194781 4332889
5351D332889j89031j83791K82786j03536q2052q7879q3757l577J59950P8577k50154
$$ 4332889 4143858 3960067 4242853 4139317 4057265 3969386 3885629 3882052 4042002 4120579 3870425
5340C870425J05641M5095k29279O4653m34624m62588N0890K59479K2959J83100
$$ 3870425 3976066 4021161 3791882 3856535 3421911 2959323 3010213 3269692 3292651 3475751
5330C475751J24031q9813k69542r0517L62745l47453k8349K4845k93214r7659
$$ 3475751 3599782 3509969 3240427 3149910 3512655 3165202 3136853 3161698 2868484 2770825
5320B770825J58520J44475k16547k71084k58226K47385J2008J99922r2699j04450
$$ 2770825 2929345 3073820 2857273 2586189 2327963 2575348 2587356 2787278 2694579 2590129
5310B590129n0737L6333J73725J32798N8993k41361p1084K72734M14612m54595
$$ 2590129 2539392 2575725 2749450 2882248 2941241 2699880 2628796 2901530 3316142 2861547
5300B861547k51379L13412J12564q6330j77865j76069J26618q0740o6485k17511
$$ 2861547 2610168 2923580 3036144 2949814 2771949 2595880 2722498 2641758 2575273 2357762
5290B357762L01714K73778k32743J8321K9892L1331j00949R3709K01012P6731
$$ 2357762 2659476 2933254 2700511 2718832 2748724 2780055 2679106 2772815 2973827 3050558
5280C050558o1663l24394J03424M8363r9023j44075J89824K04700K04557o6974
$$ 3050558 2988895 2664501 2767925 2816288 2717265 2573190 2763014 2967714 3172271 3105297
5270C105297j88704L4949K50502K62381R0784R2380j24536J63641J49439k4644
$$ 3105297 2916593 2951542 3202044 3464425 3555209 3647589 3523053 3686694 3836133 3811489
5260C811489J215M339J70985o7437N1328j88769K07005P0367k203j5908q6462
$$ 3811489 3812704 3817043 3988028 3920591 3971919 3783150 3990155 4060522 4058319 4042411 3955949
5249C955949k271J39316j11622l4615J13602J02908K21829Q0485L1930J34689
$$ 3955949 3953678 4092994 3981372 3946757 4060359 4163267 4385096 4465581 4497511 4632200
5239D632200l2834R0432K66929J17693k37587L41J43259o2352K01389k61966j9387
$$ 4632200 4599366 4689798 4956727 5074420 4836833 4837174 4980433 4918081 5119470 4857504 4838117
5228D838117L7959K2972K09925k19355n5427j21998j29197K51568M7206j91058
$$ 4838117 4876076 4899048 5108973 4889618 4834191 4712193 4582996 4834564 4881770 4690712
5218D690712j44170M29862l76881m135J60551p4046j99535K4682K70280J29981
$$ 4690712 4546542 4976404 4599523 4595388 4755939 4681893 4482358 4507040 4777320 4907301
5208D907301N1886K66110K40809K7664M36301K76412j89698J92777J4342k1939
$$ 4907301 4959187 5225297 5466106 5493770 5930071 6206483 6016785 6209562 6223904 6201965
5198F201965n1054L43704j29090M9362p9570K69128K2251m57166n66248j08951
$$ 6201965 6150911 6494615 6365525 6414887 6335317 6604445 6626696 6169530 5603282 5494331
5188E494331M7318L4417m35094l37868o8337j4120r4021j25135J11193k45412
$$ 5494331 5541649 5576066 5140972 4803104 4734767 4720647 4626626 4501491 4612684 4367272
5178D367272L44864J93745r4050q2265J4801O2950N5196k30785K20310J16798
$$ 4367272 4712136 4905881 4811831 4729566 4744367 4807317 4862513 4631728 4852038 4968836
5168D968836j07832L1953L86915m12453J19022K31974j03408J07476L43423k54171
$$ 4968836 4861004 4892957 5279872 4867419 4986441 5218415 5115007 5222483 5565906 5311735
5158E311735r9024M03093l0921k22326J34857k20535p5868Q3463J64779J40646
$$ 5311735 5212711 5615804 5584883 5362557 5497414 5276879 5201011 5284474 5449253 5589899
5148E589899j59045J82674K47045J33778J65964l04403j15236J34505K12291M0611
$$ 5589899 5430854 5613528 5860573 5994351 6160315 5855912 5740676 5875181 6087472 6128083
5138F128083l48117k0827M1766K97166j33678R2610k94001j50079J41072M68869
$$ 6128083 5779966 5759139 5800905 6098071 5964393 6057003 5763002 5612923 5753995 6222864
5128F222864J74510k28560M1731N1799J81787J46191K83461o7167P107J1088J50430
$$ 6222864 6397374 6168814 6210545 6262344 6444131 6590322 6873783 6806616 6813723 6824811 6975241
5117F975241J37826o5410j00414K58999K02041m1277L21915J05136R830N6444
$$ 6975241 7113067 7047657 6947243 7206242 7408283 7367006 7688921 7794057 7803887 7860331
5107G860331O4873p5503K67349K02979j48586J76354K17754J10078j26193R1380
$$ 7860331 7925204 7849701 8117050 8320029 8171443 8347797 8565551 8675629 8549436 8640816
5097H640816M99750K15834l18927N9003L18613L05669j07128K67435K5684j10513
$$ 8640816 9140566 9356400 9037473 9096476 9415089 9720758 9613630 9881065 9906749 9796236
5087I796236K94094K22613L34587J93119N64877O4296L961n3588M7611M16930
$$ 9796236 10090330 10312943 10647530 10840649 11405526 11469822 11473783 11420195 11467806 11884736
5077A1884736K68847L52119L26794J88935L27606N09214j11250K51546M67985
$$ 11884736 12153583 12505702 12832496 13021431 13349037 13858251 13747001 13998547 14466532
5068A4466532L16255L93346N6296K46541L44453O54689O11874L25991M43273K34978
$$ 14466532 14782787 15176133 15232429 15478970 15823423 16478112 17089986 17415977 17859250 18094228
5058A8094228P91468K54119J98921Q73483N79114M56520L64288Q15725P53132
$$ 18094228 18885696 19139815 19338736 20212219 20791333 21247853 21612141 22427866 23180998
5049B3180998M41965P38474R51273O48291J039068J064696J288851R21768J269045
$$ 23180998 23622963 24361437 25312710 25961001 27000069 28064765 29353616 30275384 31544429
5040C1544429J142642J312203J921556J676201J743995J898095K299462K733262
$$ 31544429 32687071 33999274 35920830 37597031 39341026 41239121 43538583 46271845
5032D6271845K444632L074178L626603L935113M088411M053874M159706L718978
$$ 46271845 48716477 51790655 55417258 59352371 63440782 67494656 71654362 75373340
5024G5373340L579942K357743J586189J113306P14770K21559M73227J267866J479497
$$ 75373340 78953282 81311025 82897214 84010520 84725290 84946849 85420076 86687942 88167439
5015H8167439K422051L368418L443458N158638N780906N068348N197390L794499
$$ 88167439 90589490 93957908 97401366 102560004 108340910 113409258 118606648 122401147
5007A22401147K396428M38380j481816k711918l526155m294057l910474l798567
$$ 122401147 124797575 125235955 123754139 121042221 117516066 113222009 109311535 105512968
4999A05512968l484047k408574j578581r06521l48097N06470M19281M25036R2008
$$ 105512968 102028921 99620347 98041766 97135245 96787148 97293618 97712899 98137935 98229943
4990I8229943r56830j730078k561536l371378m045878l637235l590438l286714
$$ 98229943 97273113 95543035 92981499 89610121 85564243 81927008 78336570 75049856
4982G5049856k870220k593157k074445k033919j495275j165464q41560r64841
$$ 75049856 72179636 69586479 67512034 65478115 63982840 62817376 61975816 61010975
4974F1010975q75300n11629o13340j23489J1517m65357J57419m2709J53526J18391
$$ 61010975 60135675 59624046 59010706 58887217 58898734 58433377 58590796 58548087 58701613 58820004
4964E8820004m6551P4888L85097N88128O48210P00405N97915R99315J146981J311098
$$ 58820004 58773453 58848341 59233438 59821566 60469776 61170181 61768096 62767411 63914392 65225490
4954F5225490J524153J290864J927356J751597K100054J763241R49008J33042
$$ 65225490 66749643 68040507 69967863 71719460 73819514 75582755 76531763 76664805
4946G6664805r2795j031278j331343p88780o54148k33012N25165L31512P13616
$$ 76664805 76572010 75540732 74209389 73420609 72766461 72533449 73058614 73390126 74103742
4937G4103742J102471R14589Q25237J231824J201098J279920K73845l5910r32141
$$ 74103742 75206213 76120802 76946039 78177863 79378961 80658881 80932726 80896816 79964675
4928G9964675j524893k053006k346964k231782k792576k101809j776475j217321
$$ 79964675 78439782 76386776 74039812 71808030 69015454 66913645 65137170 63919849
4920F3919849j179481m49715l04774j47642k46930q09996j336113j408278j930663
$$ 63919849 62740368 62290653 61985879 61838237 61591307 60781311 59445198 58036920 56106257
4911E6106257j634860k061295j693510k176254k406369k259376j770386j798745
$$ 56106257 54471397 52410102 50716592 48540338 46133969 43874593 42104207 40305462
4903D0305462j745464j498993j326544j373998j381661p02159q82265q50498m38091
$$ 40305462 38559998 37061005 35734461 34360463 32978802 32276643 31394378 30543880 30105789
4894C0105789j006039j009136p70886n12715p38242n08369n76268o02766n36121
$$ 30105789 29099750 28090614 27319728 26807013 26068771 25560402 24984134 24381368 23845247
4885B3845247o08415o50488j38060j09532l39737R7333O3986j09886k73703j17650
$$ 23845247 23236832 22586344 22448284 22338752 21999015 22096348 22160334 22050448 21776745 21659095
4875B1659095r08708m21843j8620l30956p7659n5330J19830J45424k05285K75176
$$ 21659095 20750387 20328544 20309924 19978968 19901309 19845979 19965809 20111233 19905948 20181124
4865B0181124j25029L81977M73342O51195Q65062P14712J107004J086761R39005
$$ 20181124 20056095 20438072 20911414 21562609 22427671 23142383 24249387 25336148 26275153
4856B6275153J82739k17008p65412j202326m04701l33330j92908k10501j6908
$$ 26275153 26457892 26240884 25475472 24273146 23868445 23535115 23342207 23131706 23114798
4847B3114798J96414K68164P83089N61371N61872J221098J234981J371016K399390
$$ 23114798 23311212 23579376 24362465 24923836 25485708 26706806 27941787 29312803 31712193
4838C1712193K789904K855964K779767P31916j827677k206053k634033j960344
$$ 31712193 34502097 37358061 40137828 40869744 39042067 36836014 34201981 32241637
4830C2241637j820356j214206q48145m73649j37515L89216K20628L38438R70551
$$ 32241637 30421281 29207075 28358930 27885281 27747766 28136982 28357610 28696048 29666599
4821B9666599J153906J347066J965681K578921L550346M265511L409417Q08397
$$ 29666599 30820505 32167571 34133252 36712173 40262519 44528030 47937447 48745844
4813D8745844k133048l604593l643021l407228l152020j627572j539558j204404
$$ 48745844 46612796 43008203 39365182 35957954 32805934 31178362 29638804 28434400
4805B8434400o96155o48189M9755Q3929M83802N43758Q01241J348793J634615
$$ 28434400 27738245 27090056 27139811 27223740 27707542 28251300 29052541 30401334 32035949
4796C2035949K463818L076026K533352K21343k035609k753346l110273k757955
$$ 32035949 34499767 37575793 40109145 40330488 38294879 35541533 32431260 29673305
4788B9673305j851669k371705j383685q14692p91737n49162r2937j65178k41668
$$ 29673305 27821636 25449931 24066246 23251554 22459817 21910655 21817718 21652540 21410872
4779B1410872j07297O4342J44052M85852P09709J094108Q40137o1248r38500j322337
$$ 21410872 21303575 21367917 21511969 21997821 22707530 23801638 24641775 24580527 23642027 22319690
4769B2319690j327149j310555j113464o37724l75224n22955p42528o02175p3746
$$ 22319690 20992541 19681986 18568522 17930798 17555574 17032619 16290091 15687916 15614170
4760A5614170l11148k931l39190k54614M334p7207j55106K16654K67085k5210
$$ 15614170 15303022 15300091 14960901 14706287 14710621 14633414 14478308 14694962 14962047 14936837
4750A4936837k08366l62829m06116p7428o6593k78334J47501l11561l64488q2380
$$ 14936837 14728471 14365642 13959526 13882098 13815505 13537171 13684672 13373111 13008623 12926243
4740A2926243L60548L8705O7648o332L6040k43293M6629J47500j78064J06600
$$ 12926243 13286791 13325496 13393144 13386812 13422852 13179559 13226188 13373688 13195624 13302224
4730A3302224n0805J08391J54278m6449J50773o7166J59508L26525m8363L6133
$$ 13302224 13251419 13359810 13514088 13467639 13618412 13551246 13710754 14037279 13988916 14025049
4720A4025049J64487J86467j21484Q5123K22808K41640L94917r7673J00086K29450
$$ 14025049 14189536 14376003 14254519 14339642 14562450 14804090 15199007 15101334 15201420 15430870
4710A5430870k71474M87505L18891J53149M79257M396J29601K00085n1098J71794
$$ 15430870 15159396 15646901 15965792 16118941 16598198 16602594 16732195 16932280 16881182 17052976
4700A7052976N46354M3670L25623K23655L40075O6743M81265O32859P1891L36880
$$ 17052976 17599330 17643000 17968623 18192278 18532353 18599096 19080361 19713220 19785111 20121991
4690B0121991J18995K47552L88451P96311L73555J82866M40394M42042K55222
$$ 20121991 20240986 20488538 20876989 21673300 22046855 22229721 22670115 23112157 23367379
4681B3367379N07268P87884L73172M28210L96645P40083O01642L79395O78931
$$ 23367379 23874647 24662531 25035703 25463913 25860558 26600641 27202283 27581678 28260609
4672B8260609J024261P65984Q08958P84394O71822R67032J193536J148842J210800
$$ 28260609 29284870 30050854 30859812 31644206 32316028 33283060 34476596 35625438 36836238
4663C6836238J359807J359724J570611J410100J440929J696371K005250K332917
$$ 36836238 38196045 39555769 41126380 42536480 43977409 45673780 47679030 50011947
4655E0011947K576144K712012K965160L410291L777771M106893M826753M999495
$$ 50011947 52588091 55300103 58265263 61675554 65453325 69560218 74386971 79386466
4647G9386466M994729M608634M155809K828028K085617R89975J89310J92112M13772
$$ 79386466 84381195 88989829 93145638 95973666 98059283 99049258 99238568 99430680 99844452
4638I9844452J79250R93666K223616K988737L687853M619195N816729O086739
$$ 99844452 100023702 101017368 103240984 106229721 109917574 114536769 120353498 126440237
4630A26440237N691263M896265L166414J582536q58014k258919k867720l732323
$$ 126440237 132131500 137027765 140194179 141776715 140918701 138659782 135792062 132059739
4622A32059739l434356l263691l318344k853990k506848j778256o39405j67323
$$ 132059739 128625383 125361692 122043348 119189358 116682510 114904254 114264849 114097526
4614A14097526q1755R19133M05279q28571j568111j943767k486061k448319k155931
$$ 114097526 114015771 114934904 115340183 114511612 112943501 110999734 108513673 106065354 103909423
4605A03909423j827325j440029j236255q10237j533844k057089k532952k858251
$$ 103909423 102082098 100642069 99405814 98595577 97061733 95004644 92471692 89613441
4597H9613441k611094k429115k362439j682590j088713o55293n44954P8608K35831
$$ 89613441 87002347 84573232 82210793 80528203 79439490 78784197 78239243 78317851 78553682
4588G8553682O17503M74717J13987N99225m84050n64005k46853m08956m93901
$$ 78553682 79171185 79645902 79759889 80359114 79875064 79311059 79064206 78655250 78161349
4579G8161349o67573q96804q36243r0419K1277M7853K34979P70654P80159L53188
$$ 78161349 77493776 76596972 75760729 75670310 75691587 75739440 75974419 76745073 77525232 77878420
4569G7878420L07358M50404P45386M78470M98683N48226N95382L67628P46808
$$ 77878420 78185778 78636182 79381568 79860038 80358721 80906947 81502329 81869957 82616765
4560H2616765J266883J740654J832060K355369K862094K905824L028524L282546
$$ 82616765 83883648 85624302 87456362 89811731 92673825 95579649 98608173 101890719
4552A01890719L245613K622684K351333J848894J346198K50737j14382j081525
$$ 101890719 105136332 107759016 110110349 111959243 113305441 113556178 113441796 112360271
4544A12360271j417769j651636j536885j817795j635469j644757j663549j616852
$$ 112360271 110942502 109290866 107753981 105936186 104300717 102655960 100992411 99375559
4536I9375559j408604q17533n56902l15375n3271L37919Q39107R90010J485783
$$ 99375559 97966955 97149422 96592520 96277145 96223874 96561793 97400900 98390910 99876693
4527I9876693K449532K254317K932764L193309L934736M663429M231729L504018
$$ 99876693 102326225 104580542 107513306 110706615 114641351 119304780 123536509 127040527
4519A27040527K283302J580437R33827J024156J164192K116605K939938L668044
$$ 127040527 129323829 130904266 131838093 132862249 134026441 136143046 139082984 142751028
4511A42751028M027093M611993M597592M988773M308179L441903K441890J466813
$$ 142751028 146778121 151390114 155987706 160976479 165284658 168726561 171168451 172635264
4503A72635264O78500m31625j627848k271013l131555l658084l446833l145461
$$ 172635264 173313764 172882139 171254291 168983278 165851723 162193639 158746806 155601345
4495A55601345k756378k586877k004140k010318j049984j279443j664551k421419
$$ 155601345 152844967 150258090 148253950 146243632 145193648 143914205 142249654 139828235
4487A39828235l402748m664891m946700n729367n033968m343513l698890l356952
$$ 139828235 136425487 131760596 126813896 121084529 116050561 111707048 108008158 104651206
4479A04651206l010685k481233k927010k663320k306173k228378j734509j401200
$$ 104651206 101640521 99159288 96232278 93568958 91262785 89034407 87299898 85898698
4471H5898698j719111j323731j078369j140829r67719p03089j093448n85175r43525
$$ 85898698 84179587 82855856 81777487 80636658 79668939 78965850 77872402 77287227 76343702
4462G6343702o28105o12563j052248p67147l09822q89136q96403k87787q00266
$$ 76343702 75715597 75103034 74050786 73283639 72973817 72084681 71188278 70900491 70100225
4453G0100225o42191J92933K92815O80136P22426M36552j234911k422134k529316
$$ 70100225 69458034 69650967 69943782 70623918 71346344 71782896 70547985 68125851 65596535
4444F5596535k591010k363247k129486j693223j364650q76810j055243p47543
$$ 65596535 63005525 60642278 58512792 56819569 55454919 54578109 53522866 52775323
4436E2775323p91778n27897o17695n93577l83339o94223n91006r67395l29706
$$ 52775323 51983545 51455648 50837953 50244376 49861037 49166814 48575808 47608413 47278707
4427D7278707l94198J65956j55143r23034r23447l63392l16096j180124o86891
$$ 47278707 46884509 47050465 46895322 45972288 45048841 44685449 44369353 43189229 42502338
4418D2502338l12927K4442m70043p97620n86341o24428o12659l87009n96207j63461
$$ 42502338 42189411 42213853 41743810 40946190 40359849 39735421 39122762 38735753 38139546 37976085
4408C7976085j36795k99132o25144K52729l94628j92752Q7495j5754j98763p20511
$$ 37976085 37839290 37540158 36915014 37167743 36773115 36580363 36667858 36652104 36453341 35732830
4398C5732830o14565l28261p44291m87478p23313n77249p8693n21674n68405j77844
$$ 35732830 35118265 34790004 34045713 33558235 32834922 32257673 32178980 31657306 31088901 30911057
4388C0911057j75186l16567j19466j07152K13240k19682k7420J65474o1989K33826
$$ 30911057 30735871 30419304 30299838 30192686 30405926 30186244 30158824 30324298 30262309 30496135
4378C0496135l46074l67704R6945k30430k63495k46988q9985j58447n3902J08160
$$ 30496135 30150061 29782357 29879302 29648872 29385377 29138389 29048404 28889957 28836055 28944215
4368B8944215L76860K40775M13734L89218J010463N53585J35899K03138l38857
$$ 28944215 29321075 29561850 29975584 30364802 31375265 31928850 32064749 32267887 31929030
4359C1929030l01261n21819r70891q15067m64858p17220o10619k97080j59290
$$ 31929030 31627769 31105950 30135059 29319992 28855134 28137914 27527295 27230215 27070925
4350B7070925j26272J33075k39535o5404J93081K69292M49552K03124o9210l82633
$$ 27070925 26944653 27077728 26838193 26772789 26965870 27235162 27684714 27887838 27818628 27435995
4340B7435995q2745k96918j70516j05582K54181j46076J24838K71709N57060R16181
$$ 27435995 27353250 27056332 26885816 26780234 27034415 26888339 27013177 27284886 27841946 28758127
4330B8758127O66455Q64162J493683J853868J232391J245306P88094M82070r48456
$$ 28758127 29424582 30288744 31782427 33636295 34868686 36113992 36902086 37384156 36435700
4321C6435700j052104j849298j699330k066203j972478j784560j431275j242624
$$ 36435700 35383596 33534298 31834968 29768765 27796287 26011727 24580452 23337828
4313B3337828j130836j100967j111813q20344o75474q08321o26003n62956o37660
$$ 23337828 22206992 21106025 19994212 19173868 18498394 17690073 17064070 16501114 15863454
4304A5863454m04837k67082l87430n72121k59917o8472l20023l45975l07134N2578
$$ 15863454 15458617 15191535 14804105 14231984 13972067 13903595 13583572 13237597 12930463 12983041
4294A2983041L7502l38575n0832j69935j11082r8064l24622l8397K39159j89352
$$ 12983041 13020543 12681968 12631136 12461201 12350119 12252055 11927433 11889036 12128195 11938843
4284A1938843m7759l49878k06365M4572R9619k47390j86927r1758L2791n56537
$$ 11938843 11891084 11541206 11334841 11379413 11479032 11231642 11044715 10952957 10985748 10429211
4274A0429211r15J80359j12837j50929O4800l54668P107J69882l23009m83773
$$ 10429211 10428296 10608655 10495818 10344889 10409689 10055021 10062128 10232010 9909001 9425228
4264I425228M60505j92389k0034o6076J22640J78110k38398m47106J40613p86
$$ 9425228 9885733 9693344 9673310 9607234 9729874 9907984 9669586 9222480 9363093 9362307
4254I362307J06275j81055k7418M2642L9377K47685L8271j92390r1629j27671
$$ 9362307 9468582 9287527 9260109 9302751 9342128 9589813 9628084 9435694 9344065 9216394
4244I216394L9078J28320j02681J08103m53505j74938L21349M8649k65535L78865
$$ 9216394 9255472 9383792 9281111 9389214 8935709 8760771 9082120 9130769 8865234 9244099
4234I244099J18653Q1492K21313L22263o3117p9153j80047P3883K62965j65977
$$ 9244099 9362752 9444244 9665557 9987820 9924703 9845550 9665503 9739386 10002351 9836374
4224I836374P831j48654j04998j93027p2706j40101J6671K092J85675N0950M10704
$$ 9836374 9844205 9695551 9590553 9397526 9324820 9184719 9201390 9203482 9389157 9440107 9850811
4213I850811l07666M760L38246L5787j66309r1891K95819R1217l2121R319J1003
$$ 9850811 9543145 9547905 9886151 9921938 9755629 9663738 9959557 10050774 10018653 10027972 10038975
4202A0038975J13822K48222M0462L22383K17598J04418k8593K90925N5093Q7929
$$ 10038975 10152797 10401019 10441481 10763864 10981462 11085880 11057287 11348212 11403305 11491234
4192A1491234l45245j71860J81163q0580k51001L87100j60496K01340k5877q9702
$$ 11491234 11145989 10974129 11155292 11074712 10823711 11210811 11050315 11251655 11225778 11136076
4182A1136076l54591K99382J94688L2886l55272J38497p4861J4242J09734J72179
$$ 11136076 10781485 11080867 11275555 11308441 10953169 11091666 11016805 11031047 11140781 11312960
4172A1312960l09026l48183J84266K16599J19972o1673k43975j21735J62066N75719
$$ 11312960 11003934 10655751 10840017 11056616 11176588 11114915 10870940 10749205 10911271 11486990
4162A1486990j50908k40939J96157R8114j27772K83705L8853j95108K69916j4279
$$ 11486990 11336082 11095143 11291300 11389414 11261642 11545347 11584200 11389092 11659008 11644729
4152A1644729K04040j40405L65630p7939K61553L60603K45048L87448J37425J51139
$$ 11644729 11848769 11708364 12073994 11996055 12257608 12618211 12863259 13250707 13388132 13539271
4142A3539271N34756k55838J53564J50796N5951O94731l50177L83155J87328K6144
$$ 13539271 14074027 13818189 13971753 14122549 14178500 14873231 14523054 14906209 15093537 15119681
4132A5119681L34268J53839O5300K98794O65009M32303J10760M8235J54520L36329
$$ 15119681 15453949 15607788 15673088 15971882 16636891 17069194 17179954 17228189 17382709 17719038
4122A7719038L74226p072L46861M70165k0113K91455J95725M76477L72752M82150
$$ 17719038 18093264 18086192 18433053 18903218 18883105 19174560 19370285 19846762 20219514 20701664
4112B0701664M75355K31893M62417N32280L06611L30196L45950P47918O48940
$$ 20701664 21177019 21408912 21871329 22403609 22710220 23040416 23386366 24134284 24783224
4103B4783224M31599Q28688M26012O93202R25638Q02842J111725Q87458M91402
$$ 24783224 25214823 26043511 26469523 27162725 28088363 28891205 30002930 30890388 31381790
4094C1381790R46280R19716J074697N99032J309848J040985R60534J403696J790231
$$ 31381790 32328070 33247786 34322483 34921515 36231363 37272348 38232882 39636578 41426809
4085D1426809J521217K199622J813538J786837K061685K789607K853233L044899
$$ 41426809 42948026 45147648 46961186 48748023 50809708 53599315 56452548 59497447
4077E9497447L532667L920986M734804M872674N149169O205552O822650P516796
$$ 59497447 63030114 66951100 71685904 76558578 81707747 87913299 94735949 102252745
4069A02252745Q578654R484955J0980625J2137640J2581346J2312957J0181894
$$ 102252745 110831399 120316354 131296979 143434619 156015965 168328922 178510816
4062A78510816N829227O57018m383249p978615r723361j0479327r713811q915482
$$ 178510816 184340043 184997061 180613812 172635197 162911836 152432509 142718698 133803216
4054A33803216p140037o405592n342390m777840l962406l599278k994964k195309
$$ 133803216 126663179 120257587 114915197 110137357 106174951 102575673 99580709 97385400
4046I7385400k219327j507361j514277q99144q96306l45670o22930l89267m80379
$$ 97385400 95166073 93658712 92144435 91245291 90348985 90003315 89380385 88991118 88510739
4037H8510739j97463l03425m3952M37238j72715m47586n04562j431660j354995
$$ 88510739 88313276 88009851 87965899 88403137 88230422 87782836 87278274 85846614 84491619
4028H4491619k114831k294363k273402j797333j405964p25151J28997R03301J833291
$$ 84491619 82376788 80082425 77809023 76011690 74605726 73880575 74009572 74912873 76746164
4019G6746164K716815K517972m8672k060872l485540m661645m099476m106662
$$ 76746164 79462979 81980951 81932279 79871407 76385867 71724222 67624746 63518084
4011F3518084l603969l016825k630586k049201j355741j401188j635938p18139
$$ 63518084 59914115 56897290 54266704 52217503 50861762 49460574 47824636 47106497
4003D7106497p94320r09457j049121j049399q77083j027145j182813q24165j188561
$$ 47106497 46312177 45402720 44353599 43304200 42427117 41399972 40217159 39392994 38204433
3994C8204433r51100p61362o54627p37135p80896l58737k98920r69670l35691
$$ 38204433 37253333 36491971 35837344 35100209 34319313 33960576 33661656 32691986 32356295
3985C2356295m48975m42491j95074n55083l50295k75275q37160k32354n42230
$$ 32356295 31907320 31464829 31269755 30714672 30364377 30089102 29251942 29019588 28477358
3976B8477358l63396l99854q90478m5910m70198r85726l45370l07467o24130l46387
$$ 28477358 28113962 27714108 26823630 26777720 26307522 25321796 24976426 24668959 24044829 23698442
3966B3698442k05977l1711n18649n41132l4151k13594n3999l39511l25135O433
$$ 23698442 23492465 23460754 22942105 22400973 22366822 22153228 22099229 21759718 21434583 21441016
3956B1441016Q6086k20503k62730m23356K5775k49781l73295O8498l36090j01741
$$ 21441016 21527102 21306599 21043869 20620513 20646288 20396507 20023212 20091710 19755620 19653879
3946A9653879k77761j13180j56413o6511J04400j27074j07099O8248O0724J50596
$$ 19653879 19376118 19262938 19106525 19040014 19144414 19017340 18910241 18978489 19039213 19189809
3936A9189809J06969K9291J13395k06602k57574o7758m30361l94966j31495k26112
$$ 19189809 19296778 19326069 19439464 19232862 18975288 18907530 18477169 18082203 17950708 17724596
3926A7724596l45634m15759j13278l129m36635j67098j96907q0347m33921n0755
$$ 17724596 17378962 16963203 16849925 16846796 16410161 16243063 16046156 15965809 15531888 15481133
3916A5481133k26544n4238k42333J68783j41206M0822J96649K05882p4814l0342
$$ 15481133 15254589 15200351 14958018 15126801 14985595 15026417 15223066 15428948 15354134 15323792
3906A5323792n0601k69277m0541J75144J09479J08034K9245J91184K18646M54084
$$ 15323792 15273191 15003914 14963373 15138517 15247996 15356030 15385275 15576459 15795105 16249189
3896A6249189O869O759J77172J35644J79000L0257K79426K95795L67238N61443
$$ 16249189 16256058 16262817 16439989 16575633 16754633 16784890 17064316 17360111 17727349 18288792
3886A8288792L0392J05686M29047J69206K05389J85040k21603P27484L47932j22321
$$ 18288792 18319184 18424870 18853917 19023123 19228512 19413552 19191949 19919433 20267365 20145044
3876B0145044J17195P4959M78280J89464K81575O5114M34822L62875K78001N4464
$$ 20145044 20262239 20337198 20815478 21004942 21286517 21351631 21786453 22149328 22427329 22481793
3866B2481793M08734N84294O15635N98241M40324O76403Q45233M15688O44315
$$ 22481793 22890527 23474821 24090456 24688697 25129021 25805424 26650657 27066345 27710660
3857B7710660Q05246R11094P42952J082593O17200P56516J140302J199497Q59280
$$ 27710660 28515906 29427000 30169952 31252545 31869745 32626261 33766563 34966060 35825340
3848C5825340J088612J171160J379614J548998J345611J414929J887660K193471
$$ 35825340 36913952 38085112 39464726 41013724 42359335 43774264 45661924 47855395
3840D7855395K550609K550285K902207K695985L405724M083178M163676M407484
$$ 47855395 50406004 52956289 55858496 58554481 61960205 66043383 70207059 74614543
3832G4614543N327440O596098P539974R345145J0037369R949062O949082J638173
$$ 74614543 79941983 86538081 94078055 103423200 113460569 123409631 130358713 131996886
3824A31996886l075030o539302q012176q224521o925241n899163m678276l483940
$$ 131996886 128921856 122382554 114370378 106145857 99220616 93321453 88643177 85159237
3816H5159237k428716k123799j715075j483782j574217q89423l21498j99792K87028
$$ 85159237 82730521 80606722 78891647 77407865 75833648 74944225 74622727 74422935 74709963
3807G4709963R17516M69410L47459M43548n0355r22173j357335k077469k207974
$$ 74709963 75627479 76096889 76444348 76887896 76837541 75915368 74558033 72480564 70272590
3798G0272590k639834k771735k284712k548930j595726j661792j489569j331301
$$ 70272590 67632756 64861021 62576309 60027379 58431653 56769861 55280292 53948991
3790E3948991j113502r36032j029459o02712p46313q54471n58636n41579j96260
$$ 53948991 52835489 51899457 50869998 50267286 49520973 48666502 48107866 47566287 47370027
3781D7370027o7996k19137L3405M07848N47690K46981Q32753P37802J159320J407505
$$ 47370027 47302031 47082894 47116299 47524147 48071837 48318818 49151571 49889373 51048693 52456198
3771E2456198J138157J858415K137279J947905K130931K687898K639354K855142
$$ 52456198 53594355 55452770 57590049 59537954 61668885 64356783 66996137 69851279
3763F9851279L307880L539012M042539M387332L685085L021359K197673R96764
$$ 69851279 73159159 76698171 80740710 85128042 88813127 91834486 94032159 95028923
3755I5028923P70273m89190j61616J75769R31738J395369K271461K619061L206072
$$ 95028923 95799196 95310006 95148390 95324159 96255897 97651266 99922727 102541788 105747860
3746A05747860L498496L250926J970139J524644Q50512n69706j361632k206606
$$ 105747860 109246356 112497282 114467421 115992065 116842577 116272871 114911239 112704633
3738A12704633l217024m336772m109315l667060l273915k722753k108799j132962
$$ 112704633 109487609 105150837 101041522 97374462 94100547 91377794 89268995 88136033
3730H8136033m47186l30466q5053k95068r86015k255649l406215l839149m286118
$$ 88136033 87688847 87358381 87273328 86978260 85992245 83736596 80330381 76491232 72205114
3721G2205114m499374m531228m222651l557275l371009l028157k594458k180638
$$ 72205114 67705740 63174512 58951861 55394586 52023577 48995420 46400962 44220324
3713D4220324j715563j939505j981055j465871j746393p69585j176263j237575
$$ 44220324 42504761 40565256 38584201 37118330 35371937 34602352 33426089 32188514
3705C2188514q00966r33884p63654n02662l29591p18701o07134l87293m87331
$$ 32188514 31387548 30453664 29690010 29187348 28857757 28139056 27531922 27144629 26657298
3696B6657298n57497l68335m70233m78122k16925n96996m57278k22651l90838
$$ 26657298 26099801 25731466 25261233 24783111 24566186 23969190 23511912 23289261 22898423
3687B2898423l37666j82395n06422k81261k92161k13422k45637l0620l4413l72290
$$ 22898423 22560757 22378362 21871940 21590679 21298518 21085096 20839459 20808839 20774426 20402136
3677B0402136R4711J8953m28290j39859J03651j36488K02861l87598j85797J009
$$ 20402136 20496847 20515800 20087510 19947651 20051302 19914814 20117675 19730077 19544280 19545289
3667A9545289Q1580k12475K40605n9454l0282J20006q2386k07785M12375L5833
$$ 19545289 19626869 19414394 19654999 19595545 19565263 19685269 19602883 19395098 19807473 19843306
3657A9843306J87905j08265p129L35880k07659O9661P9040L21930j76319l5821
$$ 19843306 20031211 19922946 19915817 20251697 20044038 20113699 20192739 20514669 20338350 20302529
3647B0302529r7309N42O410n7693p6570k6277J19316p7222K8148o9235Q6562Q2968
$$ 20302529 20205220 20205762 20212172 20154479 20077909 20051632 20170948 20093726 20121874 20052639 20139201 20222169
3635B0222169L63621R2961j73670J57621k98348K10801j71494J24312k4242o4509
$$ 20222169 20585790 20678751 20505081 20662702 20364354 20575155 20403661 20527973 20503731 20439222
3625B0439222K51191j13468j17518K2392J08876K53142J622N04371j05324q6940
$$ 20439222 20690413 20576945 20459427 20481819 20590695 20843837 20845459 21349830 21244506 21157566
3615B1157566k58609K97017L80332L26Q4994L35077J65148K31869O68002J41272
$$ 21157566 20898957 21195974 21576306 21576632 21661626 21996703 22161851 22393720 23061722 23202994
3605B3202994N00881L3362l642L05825K24987K36974J06445K27161N34644N2257
$$ 23202994 23703875 23737237 23733595 24039420 24264407 24501381 24607826 24834987 25369631 25421888
3595B5421888K36037J51761K12147J19805J86514L70700L97135O8383K04341L62678
$$ 25421888 25657925 25809686 26021833 26141638 26328152 26698852 27095987 27164370 27368711 27731389
3585B7731389P30934K86716M13941M79754L30178M09276K88534P11378M95214
$$ 27731389 28462323 28749039 29162980 29642734 29972912 30382188 30670722 31382100 31877314
3576C1877314O83299R62772R75479P40498Q89483J075685N77432O20871J322459
$$ 31877314 32560613 33523385 34498864 35239362 36128845 37204530 37781962 38402833 39725292
3567C9725292R60015J228086J398327J353941J549565J754379K104316K023572
$$ 39725292 40685307 41913393 43311720 44665661 46215226 47969605 50073921 52097493
3559E2097493K383688K808858K658313K766776K729328K323362J760063J126873
$$ 52097493 54481181 57290039 59948352 62715128 65444456 67767818 69527881 70654754
3551G0654754M86608L54033M10556R48534Q56238Q80274J386294J915704J303206
$$ 70654754 71141362 71495395 71905951 72854485 73710723 74590997 75977291 77892995 79196201
3542G9196201J633171J378052N65174k9951k8544l31984l77247o87805p84219
$$ 79196201 80829372 82207424 82772598 82742647 82714103 82382119 82004872 81317067 80532848
3533H0532848m14246m01421l2259K53886L15361L64808L16036P21678J153087
$$ 80532848 80118602 79717181 79684922 79938808 80254169 80618977 80935013 81656691 82809778
3524H2809778P15351J134510J324678J383501J649705J597271J638803J630584
$$ 82809778 83525129 84659639 85984317 87367818 89017523 90614794 92253597 93884181
3516I3884181J487438J653674J503129J242418Q03463Q49642O63404J042450J291008
$$ 93884181 95371619 97025293 98528422 99770840 100574303 101423945 102087349 103129799 104420807
3507A04420807K048680K207268K298001K007188P97438q29203k392415l258191
$$ 104420807 106469487 108676755 110974756 112981944 113779382 112950179 110557764 107299573
3499A07299573l843406m281582l697401l582669l014805k069730k029904j647315
$$ 107299573 103456167 99174585 95477184 91894515 88879710 86809980 84780076 83132761
3491H3132761j417561j097097n53738k45197l9542L93276N28483Q50091J834277
$$ 83132761 81715200 80618103 80064365 79819168 79779626 80172902 80701385 81551476 83385753
3482H3385753J909387K899131L491726M664436M474665M805816M525350L792692
$$ 83385753 85295140 88194271 91685997 96350433 100825098 105630914 110156264 113948956
3474A13948956K659875J640008L40894j73174p76764r02344p59471j259126j013258
$$ 113948956 116608831 118248839 118589733 118416559 117639795 116737451 115977980 114718854 113705596
3465A13705596j497818j982222k699139l380285l511129l247498l858385l855347
$$ 113705596 112207778 110225556 107526417 104146132 100635003 97387505 93529120 89673773
3457H9673773l416598l146576k752737k242765j985343j532504r95834n00628
$$ 89673773 86257175 83110599 80357862 78115097 76129754 74597250 73601416 73100788
3449G3100788q48018j99733o2117Q72026O31590J323631K044238K319573L037109
$$ 73100788 72252770 72053037 71990920 72862946 73494536 74818167 76862405 79181978 82219087
3440H2219087L571051M125877M587547N550798O532099P680235Q649715R785651
$$ 82219087 85790138 89916015 94503562 100054360 106586459 114266694 122916409 132702060
3432A32702060J1971628J4594631J7286406K0661063K4256530K5092970K1564149
$$ 132702060 144673688 159268319 176554725 197215788 221472318 246565288 268129437
3425B68129437J2228359q24713j2239248j9388015k2428012k2800383k0537132
$$ 268129437 280357796 279533083 267293835 247905820 225477808 202677425 182140293
3418A82140293j7947346j5234882j2346749j1070707q944957p881002p227733
$$ 182140293 164192947 148958065 136611316 125540609 116595652 108714650 101486917
3411A01486917n941018n497136m902038m067472l860504l851243l089875l394042
$$ 101486917 95545899 90048763 85146725 81079253 77218749 73367506 70277631 66883589
3403F6883589l567165k534241k637349k385228k126567j867549j902139j868655
$$ 66883589 63316424 60782183 58144834 55759606 53633039 51765490 49863351 47994696
3395D7994696j550055j250189q98022j328438q72164q04399j205351q61755j147003
$$ 47994696 46444641 45194452 44296430 42967992 42095828 41291429 40086078 39224323 38077320
3386C8077320r88287r41866o41876p87682j257176o35975j013993r89185n36153
$$ 38077320 37089033 36147167 35505291 34717609 33460433 32824458 31810465 30821280 30285127
3377C0285127q06283j239304r13452q50342o51834q63901p13101l76229o34551
$$ 30285127 29478844 28239540 27326088 26475746 25823912 24960011 24246910 23870681 23236130
3368B3236130n43978n38798n34544k05024l57823j55447l88652j19257m63128
$$ 23236130 22692152 22153354 21618810 21413786 21055963 20900516 20511864 20392607 19929479
3359A9929479l54710m948j32158l25420m3558k30513o7437J59767N5039P9442
$$ 19929479 19574769 19569821 19437663 19112243 19068685 18838172 18770735 18930502 18985541 19064983
3349A9064983J56354O7948J60799P58519L85930K34132L18385J51243J96288O77449
$$ 19064983 19221337 19289285 19450084 20208603 20594533 20828665 21147050 21298293 21494581 22172030
3339B2172030M00784n5511k0676J17820O0408m1695r3103j40600o4402r6314k73306
$$ 22172030 22572814 22517303 22496627 22614447 22674855 22633160 22540057 22399457 22335055 22238741 21965435
3328B1965435m66333l44049l11639o46675j38993p05995k90137j83267j29370
$$ 21965435 21499102 21155053 20843414 20196739 20057746 19351751 19061614 18878347 18748977
3319A8748977n00138K35363m32261l63403J41492k08188p0981N9886K55972n5613
$$ 18748977 18248839 18484202 18051941 17688538 17830030 17621842 17550861 17610747 17866719 17811106
3309A7811106O27449R9197k22366k9895M17398R0552M04042L96723J16300L49846
$$ 17811106 18438555 18537752 18315386 18285491 18702889 18793441 19197483 19594206 19710506 20060352
3299B0060352N17077L56430L92128n3538P23181O89831o7127N65950N70279M32069
$$ 20060352 20577429 20933859 21325987 21272449 21995630 22685461 22618334 23184284 23754563 24186632
3289B4186632M37865L96665K55502M53833K38886M14082L89631K29997K48111
$$ 24186632 24624497 25021162 25276664 25730497 25969383 26383465 26773096 27003093 27251204
3280B7251204L15738J51773Q08173R2451L56002P72001M11486L95556M26960P49821
$$ 27251204 27566942 27718715 28526888 28619339 28975341 29747342 30158828 30554384 30981344 31731165
3270C1731165N84587Q32180M33546Q47444P13667J007470J410705J247481R45646
$$ 31731165 32315752 33147932 33581478 34428922 35142589 36150059 37560764 38808245 39753891
3261C9753891J125872J552201J875997J874046J945008J584801K108183K227934
$$ 39753891 40879763 42431964 44307961 46182007 48127015 49711816 51819999 54047933
3253E4047933K618520L094475L888340L468068L779825M064437M069979L948728
$$ 54047933 56666453 59760928 63649268 67117336 70897161 74961598 79031577 82980305
3245H2980305L588840L280337K652202K892238K660152L087756L646402M069062
$$ 82980305 86569145 89849482 92501684 95393922 98054074 101141830 104788232 108857294
3237A08857294L869806M430256L617550L260674J951376R64297K44438k46357
$$ 108857294 112727100 117157356 120774906 124035580 125986956 126951253 127195691 126949334
3229A26949334M0252N92834J145294Q99333J027852N23031q11577j825576k954332
$$ 126949334 126989586 127582420 128727714 129627047 130654899 131177930 130366353 128540777 125586445
3220A25586445l527499l731690m129326m180898l811200l854942l915580l462797
$$ 125586445 122058946 118327256 114197930 110017032 106205832 102350890 98435310 94972513
3212I4972513l866678m504369m551642m714785m348153m499315m139856l472920
$$ 94972513 91105835 86601466 82049824 77335039 72986886 68487571 64347715 60874795
3204F0874795l239513k559880k655645k487998j993763j868658j843990j618018
$$ 60874795 57635282 55075402 52419757 49931759 47937996 46069338 44225348 42607330
3196D2607330j533683j239433r07397r53992r51823p99816j149870m92715q55722
$$ 42607330 41073647 39834214 38926817 37972825 37021002 36221186 35071316 34578601 33722879
3187C3722879o72467m62934o97565q05004l50907j15175n43816n21998n56878
$$ 33722879 33050412 32587478 31889913 31084909 30734002 30618827 30075011 29553013 28996135
3178B8996135n28087n99534q05846n39384n46327o57593k88706o74206o39472
$$ 28996135 28468048 27868514 27062668 26523284 25976957 25319364 25030658 24356452 23716980
3169B3716980l31738k68701p54499o89873m24750m62123n86191r02844j63414
$$ 23716980 23385242 23116541 22362042 21672169 21247419 20785296 20199105 19296261 19132847
3160A9132847n31322p49553l01690n36516j34599l88158l45372l91325n15763
$$ 19132847 18601525 17851972 17550282 17013766 16879167 16491009 16145637 15754312 15238549
3151A5238549J16433r8437m38814J22980j40171k56544m07062m7045m3415M9308
$$ 15238549 15354982 15256545 14817731 14940711 14800540 14543996 14136934 14089889 14046474 14095782
3141A4095782j18122J30304n68813l8994L78252M3765r3431k32618N59700k75722
$$ 14095782 13977660 14107964 13539151 13500157 13878409 13922174 13828743 13596125 14155825 13880103
3131A3880103J54684k44565j0384k83187k10682l93526r4707O4443j45133k07800
$$ 13880103 14034787 13790222 13779838 13496651 13285969 12892443 12797736 12862179 12717046 12509246
3121A2509246l49243q3243R1825J68429m59677J35637K68003J51920K8234M26766
$$ 12509246 12160003 12076760 12168585 12337014 11877337 12012974 12280977 12432897 12461131 12887897
3111A2887897K16123K3123K81533P4040j54731j61101Q7688j04102k52028J35657
$$ 12887897 13104020 13127143 13408676 13482716 13327985 13166884 13254572 13150470 12898442 13034099
3101A3034099k54714k61714L94752o6764Q3559K16098k05246L55645J20009O51601
$$ 13034099 12779385 12517671 12912423 12845659 12929218 13145316 12940070 13295715 13415724 14067325
3091A4067325J83285j36337O29890L70968J96890L70717L12196O2502l4970R7820
$$ 14067325 14250610 14114273 14744163 15115131 15312021 15682738 15994934 16057436 16022466 16120286
3081A6120286L71339K22364l9609k7509j22416R985k59195j16221L5408n27463
$$ 16120286 16491625 16713989 16674380 16646871 16524455 16534440 16275245 16159024 16194432 15666969
3071A5666969j03200J21284l18755m76641o7673M08090k89099l32493M2117P9204
$$ 15666969 15563769 15685053 15366298 14889657 14821984 15230074 14940975 14608482 14650599 14729803
3061A4729803k93250J08683M089R425K39534M68928l2907k10710M49296K14945
$$ 14729803 14436553 14545236 14549325 14558750 14798284 15267212 15234305 15023595 15472891 15687836
3051A5687836N41388J88288L00693o2667n0782L29135K16984J8340L48130J26625
$$ 15687836 16229224 16417512 16718205 16655538 16604756 16933891 17150875 17169215 17517345 17643970
3041A7643970p4540K9791L30778K2791L08640N37826K60955m8628M09365L72666
$$ 17643970 17569430 17599221 17929999 17952790 18261430 18799256 19060211 19011583 19420948 19793614
3031A9793614M55920M00363O86361K97477J78110N57442L51734N61313M74955
$$ 19793614 20249534 20649897 21336258 21633735 21811845 22369287 22721021 23282334 23757289
3022B3757289M91970N55186O73594N44184M61961O21407R22267J080166Q98172
$$ 23757289 24249259 24804445 25478039 26022223 26484184 27105591 28027858 29108024 30006196
3013C0006196J181465J293825J184928Q74960N69427N55139P55646R52871J415767
$$ 30006196 31187661 32481486 33666414 34541374 35110801 35665940 36421586 37374457 38790224
3004C8790224J743037J768387K014785K590797K355358K569220K891185L800023
$$ 38790224 40533261 42301648 44316433 46907230 49262588 51831808 54722993 58523016
2996E8523016M778590N950451P609521R210107J1796443J1392706M406414j736724
$$ 58523016 63301606 69252057 76861578 86071685 97868128 109260834 113667248 111930524
2988A11930524m634035o825820p332806n991221l721075k865911j393710n71058
$$ 111930524 107296489 100470669 93137863 87146642 83425567 80559656 79165946 78594888
2980G8594888N39387R62073J147085J394027K160035L225352M895612O443118
$$ 78594888 79134275 80096348 81243433 82637460 84797495 88022847 92918459 99361577
2972I9361577Q163010J0856904J2518943P402492o20092n186986p441607q466923
$$ 99361577 107524587 118381491 130900434 138302926 137682834 132495848 125054241 116587318
2964A16587318o839100n008232l417817j910921o30134N162J050660J298346J295068
$$ 116587318 109748218 104739986 101322169 99411248 98781114 98786276 99836936 101135282 102430350
2955A02430350K541720K972918L714559M402078M433482K416496k90j342523j995890
$$ 102430350 104972070 107944988 111659547 116061625 120495107 122911603 122911313 121568790 119572900
2946A19572900j935198j458739j522600j157037r86048j205562n5174r083N08036
$$ 119572900 117637702 116178963 114656363 113499326 112513278 111307716 111252542 111243459 111751495
2937A11751495J091046K039703L309472M310282N829135O873874Q156824R125730
$$ 111751495 112842541 114882244 118191716 122501998 128331133 135205007 143361831 152487561
2929A52487561Q670677P476647P220429Q386057J0985957J4839794K0285155K7214585
$$ 152487561 161158238 168634885 175855314 184241371 195227328 210067122 230352277 257566862
2921B57566862L6214409M7009345N9091552L7992332j0903473l6502624m2906335
$$ 257566862 293781271 340790616 399882168 437874500 426971027 390468403 347562068
2914C47562068m3117822l4150190k4335973j7260351j1883361q061451m308195
$$ 347562068 304444246 270294056 245958083 228697732 216814371 208752920 204444725
2907B04444725j062634J262681K864421O028137R110936J4049672J9980792K9305347
$$ 204444725 203382091 204644772 207509193 213537330 222648266 236697938 256678730 285984077
2899B85984077M0859643N4200289L7277824j1481376l8971079m6384993m7125166
$$ 285984077 326843720 381044009 418321833 406840457 367869378 321484385 274359219
2892B74359219l8519799k9760786k3469961j7939669j5006825j2539222j0053297
$$ 274359219 235839420 206078634 182608673 164669004 149662179 137122957 127069660
2885A27069660p751906p109651o229518n642518n181188n134272m643441m192644
$$ 127069660 119317754 112208103 105978585 100336067 95154879 90020607 85377166 81184522
2877H1184522l893540k497470k197969j801728p34779j137985k460913l102893
$$ 81184522 77290982 74793512 72595543 70793815 70059036 68921051 66460138 63357245
2869F3357245l288481l285019l083136k761504k227693j632602q28551j072069
$$ 63357245 60068764 56783745 53700609 50939105 48711412 47078810 46250259 45178190
2861D5178190p27738p01614q45943q61634q97558o59786m16669K9662L87176Q01685
$$ 45178190 44450452 43748838 42902895 42041261 41143703 40483917 40067248 40096910 40484086 41285771
2851D1285771K68322j127056j978980j906720k275579k029543j974237j651732
$$ 41285771 41554093 40427037 38448057 36541337 34265758 32236215 30261978 28610246
2843B8610246o86328r60360o60208J07124p0248p62573r04606j346360o96833
$$ 28610246 27923918 26963558 26303350 26410474 26340226 25577653 24673047 23326687 22629854
2834B2629854p22461q76097p09618o08209n37931m99552n48569k98710p19699
$$ 22629854 21907393 21031296 20321678 19713469 19175538 18675986 18127417 17828707 17109008
2825A7109008n25328K2297p43363o14668N2219k13107j14918o25845m46704k80904
$$ 17109008 16583680 16605977 15862614 15247946 15300165 15087058 14972140 14346295 13899591 13618687
2815A3618687l64316j49036m52663m42714k00188k75915l80747R1143k3367j24442
$$ 13618687 13254371 13105335 12652672 12209958 12009770 11733855 11353108 11444251 11420884 11296442
2805A1296442o00564l19891j95717m5483j96234L7631l24950k05194l7926J21848
$$ 11296442 10695878 10375987 10180270 10134787 9938553 9976184 9651234 9446040 9408114 9529962
2795I529962l42576l16401j12078p3850p7660N7764j98661k54489J4274k90867
$$ 9529962 9187386 8870985 8758907 8685057 8607397 8665161 8466500 8212011 8226285 7935418
2785G935418l58843O0160L2149K56961j46462l11610m2732k20214p1439K33481
$$ 7935418 7576575 7636735 7668884 7925845 7779383 7467773 7425041 7204827 7133388 7366869
2775G366869O867r3651k49126P7747J17098k89370k54568j6231J85265J51943
$$ 7366869 7373736 7280085 7030959 7108706 7225804 6936434 6681866 6665635 6850900 7002843
2765G002843l67167M0486J83360j86647k0865n24747L34151O1218k62952k77755
$$ 7002843 6635676 6676162 6859522 6672875 6652010 6127263 6461414 6522632 6259680 5981925
2755E981925l9174K55575M8203R9881J43710K32147m47816j9828J26972k31969
$$ 5981925 5942751 6198326 6246529 6346410 6490120 6722267 6274451 6254623 6381595 6149626
2745F149626J8116R6263J81135L3308k50812r2836m2200Q1473J12970L18558L83786
$$ 6149626 6167742 6264005 6445140 6478448 6227636 6134800 6092600 6174073 6287043 6605601 6989387
2734F989387K8559Q8437m1083J32117J05766J73078L21978M34802M18551N06770
$$ 6989387 7017946 7106383 7065300 7197417 7303183 7476261 7798239 8233041 8651592 9158362
2724I158362N78609M36739O67875J41542l56321j65235k09432l85294l20492J10506
$$ 9158362 9736971 10173710 10841585 10983127 10626806 10461571 10252139 9866845 9546353 9656859
2714I656859m15927J65362O8861J82841J99503l56482N02031L19544J43904N79337
$$ 9656859 9240932 9406294 9475155 9657996 9857499 9501017 10003048 10322592 10466496 11045833
2704A1045833M35369L95167Q16390M62217J77117j37147K3252l59606m43408M9233
$$ 11045833 11481202 11876369 12692759 13154976 13332093 13194946 13218198 12858592 12415184 12464417
2694A2464417o43250m38447m82123k22613l13732k75392j20884k91594k17617
$$ 12464417 11821167 11382720 10900597 10677984 10364252 10088860 9967976 9676382 9458765
2685I458765k30618K44604K17739j28388M7650k3931l00896j54372J33299k77639
$$ 9458765 9228147 9472751 9690490 9562102 9609752 9585821 9284925 9130553 9263852 8986213
2675H986213k53916q5491k8774j91129l93919k01164m12933j71559k21042q6692
$$ 8986213 8732297 8646806 8618032 8426903 8032984 7831820 7418887 7247328 7026286 6939594
2665F939594m03358k66589p8716r6812J0763j74415j03660k17208L24629K02110
$$ 6939594 6536236 6269647 6190931 6094119 6104882 5930467 5826807 5609599 5934228 6136338
2655F136338m02140n47157k19987K77608l61648m73514j06871L938K099k19434
$$ 6136338 5734198 5187041 4967054 5244662 4883014 4409500 4302629 4306567 4308666 4089232
2645D089232p7999p8429j48712n9918k19070N09K5944k38705L8816j11967m5387
$$ 4089232 4011233 3932804 3784092 3724174 3505104 3505613 3531557 3292852 3331668 3219701 3174314
2634C174314l58164J8239j6363k24026l05776K57233J15915j37047J0273M5659
$$ 3174314 2816150 2834389 2818026 2594000 2288224 2545457 2661372 2524325 2534598 2580257
2624B580257l60107k36009j65423K70814J47751r681j21725n1255K01068l80041
$$ 2580257 2220150 1984141 1818718 2089532 2237283 2227602 2105877 2054622 2255690 1875649
2614A875649K48353l86313L48665o9318l69174R1700J31463k4416q9805j42263
$$ 1875649 2124002 1737689 2086354 2017036 1647862 1739562 1871025 1846609 1756804 1614541
2604A614541J63538q8966J3663P4399J84106j25238j78844p0304l9138J49849
$$ 1614541 1778079 1689113 1702776 1777175 1961281 1836043 1657199 1586895 1547757 1697606
2594A697606j04783K14158O426j98683k86467O4080k3614K0676j39487J60618
$$ 1697606 1592823 1806981 1813407 1614724 1328257 1392337 1368723 1389399 1249912 1410530
2584A410530k44010K74051J75063l34401k57160J9707K56456K9006j85728j12570
$$ 1410530 1166520 1440571 1615634 1281233 1024073 1043780 1300236 1329242 1143514 1030944
2574A030944J55421j70836j98563o584l2692K14064K79791q8633j19224K90286
$$ 1030944 1186365 1015529 816966 810382 777690 991754 1271545 1182912 1063688 1353974
2564A353974j84505k08975j68568p1476J37941k62241K47938R6076k59434J80981
$$ 1353974 1169469 960494 791926 720450 858391 596150 844088 940164 680730 861711
2554H61711J09776L5680J46472k69865l45313p2001L43397K75518l508N024M2813
$$ 861711 971487 1007167 1153639 883774 538461 466460 809857 1085375 1081867 1086891 1129704
2543A129704l90432k0586J48039j8834p8011N0869Q1907l89634o387K12999l5381
$$ 1129704 739272 718686 866725 847891 769880 820749 902656 513022 506635 719634 684253
2532F84253N2913j88609L76302r4563m15275L04490K98672Q4128j19648l56028
$$ 684253 737166 548557 924859 830296 415021 719511 1018183 1102311 982663 626635
2522F26635J97684k32993K50670j73292j06958k12583J48818J12468O8286j60870
$$ 626635 824319 591326 841996 668704 561746 349163 497981 610449 678735 517865
2512E17865M16219l24548j80656K52413j4524L27119m03885J77652O3056k89884
$$ 517865 934084 609536 428880 681293 666769 993888 590003 767655 830711 540827
2502E40827m7975L33830l3833m1983j06993K05351k66475J06140Q9834l6840M9880
$$ 540827 492852 826682 792849 750866 643873 849224 582749 688889 778723 741883 791763
2491G91763k24049Q8969m8367L28042R2694j28059J79430k77745k3310j90265
$$ 791763 567714 656683 608316 936358 1029052 900993 1080423 802678 779368 589103
2481E89103j80572j00525K73203j23980M65874J20266l74981j47606n970J19069
$$ 589103 408531 308006 581209 457229 923103 1043369 668388 520782 514812 633881
2471F33881n7233L0219l4999o3124j64083R5853j79772m8009K98078J28754r4872
$$ 633881 576648 606867 571868 508744 344661 440514 260742 212733 510811 639565 544693
2460E44693j9018R1237M4168P5885n8021L99751k34011M6737l08411j07770R5431
$$ 544693 525675 616912 661080 736965 678944 1078695 844684 891421 583010 475240 570671
2449E70671j79810P5336L6720K1497n5092J11903M57186m71795l5023j0644j92191
$$ 570671 390861 466197 502917 524414 469322 581225 1038411 566616 531593 520949 328758
2438C28758K26707J97720k29493j15655K97331J00508N6407l7371j74920p0308
$$ 328758 555465 753185 523692 408037 705368 805876 862283 824912 649992 579684
2428E79684K0504j25590N3045l5092n1602K2986l5308n0919j01660K38726j78116
$$ 579684 600188 474598 527643 492551 440949 463935 428627 377708 276048 514774 336658
2417C36658M8416J78275j3945R2073l63909O0436j03255k8480o99J22729O5015
$$ 336658 385074 563349 549404 641477 277568 338004 234749 206269 205570 328299 393314
2406C93314K4390j43712J71769j35198j78113j46068J70659K19966J31813p2890
$$ 393314 417704 273992 445761 310563 132450 -13618 157041 377007 508820 435930
2396D35930N8404J57246Q9965j88899k0961R3476k8863P7413j14519j94769j0237
$$ 435930 494334 651580 741545 552646 531685 625161 596298 673711 559192 364423 354186
2385C54186k77646J35717K71687j9072j59539j27605K5347k20205j34455L91754
$$ 354186 76540 212257 483944 464872 305333 177728 203075 -17130 -151585 240169
2375B40169J89993m1520J06876J7735k91537J80401J90897j68138l1793j78361
$$ 240169 430162 388642 495518 513253 221716 402117 593014 424876 393083 214722
2365B14722K40877j90850K38404M7731k5096j37381J61071l37333j1677Q669M6215
$$ 214722 455599 264749 503153 550884 525788 388407 549478 212145 200468 209137 255352
2354B55352Q6716J42535J63948r9499J66233l21054J04882J9511K14297j98400
$$ 255352 342068 484603 648551 549052 715285 394231 499113 518624 732921 534521
2344E34521Q5955J97287j50196J8169k71958l17521K31781k1739r0406j19981
$$ 534521 620476 817763 667567 685736 413778 96257 328038 306299 215893 95912
2334I5912J51430j70706J41860P6032O0742j99918K0883L3379j12534K33589J64199
$$ 95912 247342 76636 218496 294528 355270 155352 176235 209614 97080 330669 494868
2323D94868j32267j55866l57827L76147M94330k30314j85259Q7673K8083J917
$$ 494868 362601 206735 -151092 225055 719385 489071 303812 391485 419568 421485
2313D21485o0724j27598Q4860k47167J07811L2111m0315J60122k51839J34512
$$ 421485 360761 233163 318023 70856 178667 210778 170463 330585 78746 213258
2303B13258J73129j71365K47227k24887K74012j49364K97509k08249N076K69772
$$ 213258 386387 215022 462249 237362 511374 362010 659519 451270 456346 726118
2293G26118m80933K36373q9407k9139o7049K22546m53009j19685L59350p1800
$$ 726118 245185 481558 392151 363012 295963 518509 65500 -54185 305165 233365
2283B33365K69859J31862l7049k6359K97085j18953m36021J70942K05966j23384
$$ 233365 503224 635086 598037 571678 868763 749810 313789 484731 690697 567313
2273E67313j99311k86100J72928m9432l4826J82172J69715O3524j98964L86501
$$ 567313 368002 81902 254830 205398 170572 352744 522459 585983 387019 773520
2263G73520k49714k28986L41934l21280M3871n3349R4160j83292J28886J50280
$$ 773520 523806 294820 636754 315474 359345 305996 400156 216864 345750 496030
2253D96030r6484M7877J02063j44185J2807p658k46737M206L03499j21117J57197
$$ 496030 399546 447423 549486 405301 418108 410450 163713 167919 471418 350301 507498
2242E07498R6501j77688Q8418q2614k766k36674j61741L27421K37137m2069j27168
$$ 507498 603999 426311 514729 432115 429349 192675 30934 358355 595492 553423 426255
2231D26255n180j59844J57106j01238l0794M9029P3798j55590j9138J29602J49285
$$ 426255 421075 261231 418337 317099 286305 335334 409132 253542 234404 364006 513291
2220E13291K8632j38539k14307O6496M77767l09010p9577l0350l52984K75818
$$ 513291 541923 403384 189077 255573 733340 424330 344753 314403 -38581 237237
2210B37237L29090j54467J3770r4411K66040k19021l8378J56705J09230j4256
$$ 237237 566327 411860 425630 331219 597259 378238 339860 496565 605795 591539
2200E91539j37389k06820L01943J07094J6146k79045n8884k2722j3109K88025
$$ 591539 454150 247330 549273 656367 672513 393468 334584 311862 298753 586778
2190E86778o2964J2742K08237L4315l09322J43796p9382p8241J03589P5431N0905
$$ 586778 523814 536556 744793 779108 469786 613582 534200 455959 559548 634979 685884
2179F85884J98016J36350l96746j5804J9189K57806l7899j75351K09322l5559
$$ 685884 883900 1020250 623504 607700 626889 884695 846796 671445 880767 845208
2169H45208J26619N8424K17641j72562M6626J40850m771m9995j31458L76230k23243
$$ 845208 971827 1030251 1247892 1075330 1121956 1262806 1258035 1208040 1076582 1452812 1229569
2158A229569l047L1277R4726m7199L82001n6976q3879L0229k90960K56714K6638
$$ 1229569 1226522 1257799 1352525 1305326 1687327 1630351 1546472 1576701 1285741 1542455 1569093
2147A569093L5100J4980k721K32556M1807r61J68919K00991k6309l52980K34915
$$ 1569093 1604193 1619173 1616452 1849008 1890815 1889854 2058773 2259764 2233455 1880475 2115390
2136B115390M4773J95649o0055L15552J82831O1743J16228J85572J81614J0781
$$ 2115390 2160163 2355812 2295757 2611309 2794140 2855883 2972111 3157683 3339297 3350078
2126C350078j13956J00181O5147J57658M53143j38157L59258J40109K70199N1162
$$ 3350078 3236122 3336303 3401450 3559108 4012251 3874094 4233352 4373461 4643660 4694822
2116D694822K64531L05232P73012O09636P13447P91054L99319J138668J126967
$$ 4694822 4959353 5264585 6037597 6647233 7360680 8151734 8551053 9689721 10816688
2107A0816688J146504J146171Q86398J339088J793275K207588L219078M527730
$$ 10816688 11963192 13109363 13995761 15334849 17128124 19335712 22554790 27082520
2099B7082520O132843P903965R779039L035045n196703p113394p217523o036339
$$ 27082520 33215363 41119328 50898367 53933412 48736709 41623315 34405792 28369453
2091B8369453m448883l526716k238787j719746j332759j383870o32210r02855
$$ 28369453 23920570 20393854 18155067 16435321 15102562 13718692 13086482 12183627
2083A2183627j275674q88412r57836p59979p10033o88220k16848m11555n74232
$$ 12183627 10907953 10019541 9061705 8301726 7591693 6903473 6686625 6275070 5700838
2074E700838j52352k11450k71829o98180M28290o24108n50346j51555j4439j88051
$$ 5700838 5548486 5337036 5065207 4367027 4795317 4171209 3620863 3469308 3454869 3266818
2064C266818k67228J72898j95140j39208J27609Q7760k51874j77970j26731K5841
$$ 3266818 2999590 3172488 2977348 2838140 2965749 3053509 2801635 2623665 2496934 2522775
2054B522775J43502l56763k19869L2002j54838k65156J60257r2548k97787K29606
$$ 2522775 2666277 2309514 2089645 2121647 1966809 1701653 1861910 1769362 1471575 1701181
2044A701181k45245r3919J74452l20275J13818J58148k58870M4817K2439r6799
$$ 1701181 1455936 1362017 1536469 1216194 1330012 1488160 1229290 1274107 1296546 1199747
2034A199747j8982o0803k11658l9138J1200R2312J00923N6054M5127n4852J40678
$$ 1199747 1180765 1119962 908304 869166 880366 972678 1073601 1129655 1174782 1119930 1260608
2023A260608J67098l28580K0284j40127J72384r3374j6152p1400k53074n8685
$$ 1260608 1427706 1099126 1119410 979283 1151667 1058293 1042141 970741 717667 658982
2013F58982l054K70747l68835K73254J62783j04661p7147K20535j79619j4146
$$ 658982 655928 926675 557840 831094 993877 889216 812069 1032604 852985 838839
2003H38839k41254k01606L0185J20953J54538m3268j48202k3544R7491m9537L5579
$$ 838839 597585 395979 426164 547117 701655 658387 510185 486641 584132 534595 570174
1992E70174J9762K03644j28633j72715k39839M4696K07264K5907j32136k39249
$$ 570174 589936 793580 664947 492232 252393 297089 504353 530260 398124 158875
1982A58875k7030J09457k860J22140P4218k09238J85288M8694j73915l1208n7146
$$ 158875 131845 241302 238442 360582 434800 225562 410850 459544 285629 254421 197275
1971A97275P3518P2854j457l5156L5019k21399o9612J20866k02648K05114N07935
$$ 197275 270793 343647 342190 307034 342053 120654 51042 171908 -30740 174374 682309
1960F82309j88989k53669J40338k10704R1234R2053l18206K40145n8805R0458
$$ 682309 493320 239651 379989 169285 260519 352572 34366 274511 215706 306164
1950C06164j27018K36051J7519J61596j90028O4056r3600m8750J74764M9908k79431
$$ 306164 179146 415197 432716 594312 404284 468340 374740 325990 500754 550662 271231
1939B71231o6670q1821j70767q9747k32384L51362K92103L3497P8661m3914l56157
$$ 271231 204561 122740 -48027 -137774 -370158 -18796 273307 306804 385465 341551 -14606
1928a4606p355K33307j3956j58221n2464K60751j82302N6547O5782p0830K92872
$$ -14606 -21961 211346 197390 39169 -13295 247456 65154 121701 187483 116653 409525
1917D09525q2489o1251j51772K6033L33151k29580o1844J80339J4437N0641m56432
$$ 409525 327036 265785 114013 140046 473197 243617 181773 362112 376549 427190 -29242
1906b9242J07291j15876N88316j67932j02661j62893J1738J66326o9549j1874
$$ -29242 78049 -37827 550489 382557 279896 117003 128741 295067 225518 213644
1896B13644l26626K63597P0922J75757j75215K99212l08289j80829L22489p5019
$$ 213644 -112982 150615 221537 397294 222079 521291 213002 32173 354662 279643
1886B79643q954k37524K86145j84053q2643K39224j56959j73886K53409J6323
$$ 279643 270689 33165 319310 135257 52614 291838 134879 -39007 214402 230725
1876B30725R1487L3364k18718k21215Q6735J66906J8401K8152j44490k94226J17084
$$ 230725 322212 355576 136858 -84357 2378 169284 187685 215837 71347 -222879 -105795
1865a05795J68681j34697K50856j39067j93026J08574j6483Q9987O8756N8067
$$ -105795 62886 -71811 179045 39978 -153048 -44474 -60957 29030 97786 155853
1855A55853k3145J35670k37357k16885J84319L20068n1256l05876K03706K78213
$$ 155853 132708 268378 31021 -185864 -1545 318523 267267 -38609 165097 443310
1845D43310k03444j04094J83822O7078l82205l371J20380P8392j40284l21444
$$ 443310 239866 135772 319594 386672 4467 1096 121476 199868 59584 -261860
1835b61860K702M82704K9570k21468K12701j77358j48152J28639P8468r6058n611
$$ -261860 -259158 223546 253116 31648 244349 66991 -81161 47478 125946 29888 24277
1824B4277J60045m29834n772J40682K97019o6899m0268k84481k8632N23312k44053
$$ 24277 184322 -245512 -251284 -110602 186417 119518 79250 -205231 -233863 289449 45396
1813D5396L1920k20460K39613Q6995O1860J34700j84535L261m4159J82992j87081
$$ 45396 77316 -143144 96469 183464 245324 380024 195489 198750 154591 337583 150502
1802A50502l50607L35938J77506q2419k95061K64596J04790m49677Q2241J82694
$$ 150502 -200105 135833 313339 230920 -64141 200455 305245 -144432 -62191 120503
1792A20503J01629j81574l7803k4708j59710k7396Q8231O3358j46477J88224K70830
$$ 120503 222132 40558 2755 -21953 -181663 -209059 -120828 -57470 -203947 -15723 255107
1781B55107j4985k43707r2295n1664K22110j24467M58327j05844k03744K79608
$$ 255107 240122 -3585 -95880 -147544 74566 -49901 408426 302582 98838 378446
1771C78446m4255m1221M2629p5775p7151l13993P7061J80877J52848l9975l25669
$$ 378446 334191 292970 335599 259824 182673 -131320 -54259 126618 279466 239491 -86178
1760h6178J01719K11249l9613J678j29064Q0036l50327J30995J47089J01820j49978
$$ -86178 15541 226790 187177 188855 59791 139827 -210500 -79505 67584 169404 19426
1749A9426r4919K46458k07440L63235J04068r5372j80109k4026Q9319j67912j28464
$$ 19426 -75493 170965 -36475 326760 430828 335456 155347 131321 220640 52728 -75736
1738g5736j98808J91315r4699M52450j5897r1378q8783l37801N1701K781J17217
$$ -75736 -274544 -83229 -177928 274522 258625 167247 78464 -259337 -207636 -204855 -87638
1727h7638J17083l10570L84511P1754j1937J32930k13111M0190k98591j77885
$$ -87638 29445 -281125 103386 175140 163203 296133 83022 123212 -175379 -353264
1717c53264L67726M43383m82637q040j05076K32033O4143N305k60286K17240M4933
$$ -353264 14462 457845 -24792 -32832 -137908 94125 158268 163573 -96713 120527 165460
1706A65460J53406O5385k76959K3777R5282k00575r8637K55628m3492M3702J35612
$$ 165460 318866 384251 107292 131069 226351 25776 -72861 182767 139275 182977 318589
1695C18589j25638k47601k553J19074j02513P8232k09643L30567k40561K14981
$$ 318589 192951 -54650 -57203 61871 -40642 37590 -172053 158514 -82047 132934
1685A32934q3993J57015r5436k07279K4450j82362L29149J70088j72123k2968
$$ 132934 48941 205956 110520 -96759 -72309 -254671 74478 244566 72443 49475
1675D9475J30724k30246m5009j6244M10261P2294j62660p6446j12621J38913j06117
$$ 49475 180199 -50047 -95056 -111300 298961 371255 208595 132149 19528 158441 52324
1664E2324P5204j04455L33856k38945n7268n5236K4861K33833p453K08028r5289
$$ 52324 127528 23073 356929 117984 60716 5480 30341 264174 256721 464749 369460
1653C69460j32500l93605M59341P0893l7989j13409k22044k2048J9495j72k66021
$$ 369460 236960 -156645 302696 373589 335600 222191 147 -21901 -2406 -2578 -268599
1642b68599q9903L46650q4835J26425j36027L00582J83780l42670J33548J89812
$$ -268599 -358502 -11852 -96687 29738 -106289 194293 378073 35403 168951 358763
1632C58763j68466l80520k10781M48410K52359o790k84343K5022L9873k62475
$$ 358763 190297 -190223 -401004 47406 299765 292975 8632 33654 73527 -188948
1622a88948k49643K05789K39405r591o6248r023Q6765M9749K21680m66158q3052
$$ -188948 -438591 -232802 6603 -2988 -69236 -78259 8506 58255 279935 -186223 -269275
1611b69275J30287J84844M316q3049K48761l25171K08492p9566k1749J63270o7824
$$ -269275 -138988 45856 50172 -32877 215884 -109287 99205 19639 -2110 161160 93336
1600I3336K33292k47605k65738L13617k533M0923O267k62106J48868l52128L6018
$$ 93336 326628 79023 -186715 126902 124369 165292 171559 -90547 58321 -293807 -257789
1589b57789J53910n0380J02546k78759r4565J43009M22456k7911l3227j10161
$$ -257789 -103879 -154259 -51713 -330472 -425037 -282028 140428 112517 79290 -30871
1579c0871k79331R3516L64309r532k98237P9419K63698j77656k7768J55312k48393
$$ -30871 -310202 -216686 147623 138091 -160146 -80727 182971 5315 -22453 132859 -115534
1568a15534j80910o9707L93218L8007j44523O4858q2760k7623j55006K93444L25951
$$ -115534 -296444 -366151 27067 65074 -79449 -14591 -97351 -124974 -279980 13464 339415
1557C39415l7456k09992k30804p5157J45680O3561j28677J10936m0230J76964
$$ 339415 301959 91967 -138837 -213994 -68314 -4753 -133430 -22494 -62724 114240
1547A14240J17417n8644k10358j51923K76545J01123j678M8383j28942j72040
$$ 114240 231657 173013 -37345 -189268 87277 188400 186722 235105 106163 -65877
1537f5877j09960J77046K13756j23032N3578j50111r1666m9839k90261P5568R963
$$ -65877 -175837 1209 214965 91933 145511 -4600 -96266 -146105 -436366 -360798 -350835
1526c50835N6013J42090K37274R6555l19149J36195L74255l41661j96509m34508
$$ -350835 -294822 -152732 84542 181097 -138052 -1857 372398 30737 -165772 -600280
1516f00280L38881K78996J13907j66766k66036M8727P1346N81588j33340k77309
$$ -600280 -261399 17597 131504 -35262 -301298 -252571 -181225 400363 267023 -10286
1506a0286J28811j77267L57588j21q5230k18815J4919j52807k4247K03755K19035
$$ -10286 118525 -58742 298846 298725 213495 -5320 9599 -143208 -167455 36300 255335
1495B55335k43398k22379J03453J572K68052l08501k8289J63805Q3994k9499n6379
$$ 255335 11937 -210442 -106989 -105417 162635 -145866 -174155 -10350 73644 44145 -12234
1484a2234r5388J93388J06479L9496k06297p8163K8868m6619J41468J08079j52618
$$ -12234 -107622 85766 192245 231741 25444 -52719 -23851 -70470 70998 179077 26459
1473B6459K18764j07389K71973l03121j19511J99495k46527M1818L25967O8644
$$ 26459 245223 137834 409807 106686 -12825 186670 -59857 -18039 307928 376572
1463C76572l06015k69790k1180L75782l42109K00922L30375m10022K52772j06265
$$ 376572 70557 -199233 -220413 155369 -186740 14182 344557 -65465 187307 81042
1453H1042j50468o0692j98815n7042J51352K42269J5549j25452j75138J74670
$$ 81042 -69426 -130118 -328933 -385975 -234623 7646 23195 -102257 -277395 -102725
1443a02725l5701r518O2337r520P7081J43022k19059J62350J54651M4625k51164
$$ -102725 -138426 -147944 -85607 -95127 -18046 124976 -94083 68267 222918 267543 16379
1432A6379j34799L1522n555P9375j85260m2015K66724r8280j08759j40016K63610
$$ 16379 -118420 -86898 -92453 -13078 -198338 -240353 26371 -71909 -180668 -320684 -57074
1421e7074L11378j24178j60536o6631q393K5665K92294k91303J76226K19813j01373
$$ -57074 254304 130126 -30410 -97041 -105434 -79769 212525 -78778 97448 317261 215888
1410B15888o0694K31446k69509j04056j45969J69502M7540O6684L04333n00993
$$ 215888 155194 386640 117131 13075 -132894 36608 84148 150832 455165 -45828
1400d5828J5856K49245L1413N9841l7054N5860k1411j19366K2801J0627J49662
$$ -45828 -29972 219273 250686 310527 273473 329333 307922 188556 211357 221984 371646
1389C71646J70481j50832J92074l12890K6628k94737j0351J90544j24162J09138
$$ 371646 542127 391295 583369 270479 297107 2370 -7981 182563 58401 167539
1379A67539l08681r4103L91599J66920l51403j36060r2891o9957J57660j55125
$$ 167539 -141142 -235245 156354 323274 -28129 -164189 -257080 -327037 -169377 -324502
1369c24502J20284L16004k19567J83627K39814J65690k77041K01511k49571j07506
$$ -324502 -204218 111786 -107781 75846 315660 481350 204309 405820 156249 48743
1359D8743o9859J07850K8395n14823J87363K77153o2472O3996J2523J93973k33896
$$ 48743 -21116 86734 115129 -399694 -212331 64822 2350 66346 78869 272842 38946
1348C8946j8055K94543L7281p8314j72724K6494j85983n1391J88447K8527j55050
$$ 38946 20891 315434 352715 274401 101677 128171 -57812 -109203 79244 107771 -47279
1337d7279r722O1297j3793J34134j23572M90688J4184k94875n3981k32140k07206
$$ -47279 -57001 4296 -9497 124637 1065 491753 505937 211062 157081 -75059 -282265
1326b82265M6597L20443P9572J102r4122N5117J9817R3076l27969O0355O4428
$$ -282265 -235668 84775 164347 165449 71327 126444 146261 239337 -88632 -28277 36151
1315C6151j42747K46202r162j33677J4285j14842j68009M6757q3680M479J40993
$$ 36151 -106596 139606 130444 -3233 11052 -103790 -271799 -225042 -308722 -304243 -163250
1304a63250Q9434Q2103O6947j13573M7126K0742j02242o9858K0741m5109k32L60670
$$ -163250 -73816 8287 75234 -38339 8787 29529 -72713 -142571 -121830 -166939 -167171 193499
1292A93499k2817k44624r302J29940K22504l5263j40735j74471P9129k3022O9437
$$ 193499 170682 -73942 -83244 46696 269200 233937 93202 -81269 -2140 -25162 44275
1281D4275O6848j19521J46581m1610J84650j11775m0374l1736k61827P2739K04708
$$ 44275 111123 -8398 138183 96573 281223 169448 129074 97338 -164489 -91750 112958
1270A12958k33099L6049L85766M7634j50913j89709k46605J53916o2850K38472
$$ 112958 -120141 -84092 301674 349308 198395 8686 -237919 -84003 -146853 91619
1260I1619k3215l65365M00261q0023m37498o8467M50389K0347J17842m7885k65605
$$ 91619 68404 -296961 103300 23277 -414221 -482688 -32299 -11952 105890 58005 -207600
1249b07600J41940K49383j97008j30966K10418k49464L59479J26258j42352J75222
$$ -207600 -65660 183723 -13285 -144251 66167 -183297 176182 302440 160088 335310
1239C35310l45679k77045R0036J40584J89324k04148l8098J56906k3109j69680
$$ 335310 -10369 -287414 -197378 -56794 132530 -71618 -109716 47190 24081 -145599
1229a45599l7240K09713J00724J3075r3856l5678K82468l66450r2986j25339J25794
$$ -145599 -182839 26874 127598 140673 46817 11139 293607 -72843 -165829 -291168 -165374
1218a65374j23702J06096r9218L73018l24213k09836L61441j41051J72222j12036
$$ -165374 -289076 -182980 -282198 90820 -233393 -443229 -81788 -222839 -50617 -162653
1208a62653m50616K01236O27520j5693q539r2755K7491m6487j32408l17284K67554
$$ -162653 -613269 -412033 215487 199794 191255 98500 125991 79504 -52904 -370188 -102634
1197a02634J18034J70706l84296k8565p9267K42241N5700j29073j49163J36923
$$ -102634 15400 186106 -198190 -226755 -306022 -63781 -8081 -137154 -286317 -149394
1187a49394L59449J8995j07560j0662p7515r5190L9590K16701J6838l17614N0784
$$ -149394 210055 229050 121490 110828 33313 -61877 -22287 194414 211252 -106362 -55578
1176e5578j7915N1180K07175K707j31797N3647k25845k06078J40677M1691l8044
$$ -55578 -73493 -22313 184862 187569 55772 109419 -116426 -322504 -181827 -140136 -178180
1165a78180j06309P9447P6706J43804K45128J81290O344k99033j47200K82968
$$ -178180 -284489 -205042 -128336 15468 260596 441886 448230 149197 1997 284965
1155B84965q1988j8336K01298l23225l0676L55765j63567j05531k07439J43389
$$ 284965 202977 184641 385939 62714 32038 387803 224236 118705 -88734 54655
1145E4655N4089k30599J41944J13222k39012j52785K02407r2527J45465L1955
$$ 54655 108744 -121855 20089 133311 -105701 -258486 -56079 -148606 -3141 28814
1135B8814j91583J52006j78561Q0794O6533l01472L48574K26661j54536r1668
$$ 28814 -162769 -10763 -189324 -108530 -41997 -343469 5105 231766 77230 -14438
1125a4438r177k35321M4356M4218k258o6424J98084m4621J75637j15511J2399
$$ -14438 -23615 -258936 -214580 -170362 -172620 -239044 -40960 -85581 90056 -25455 -13056
1114a3056j49622J48450p7213L1283o6806j64199L64601q1653L17129k68538q8352
$$ -13056 -162678 -14228 -91441 -60158 -126964 -291163 73438 -8215 308914 40376 -47976
1103d7976N9392j28750q1913Q3320r6946M00697l01875j93593N21486m8781N8918
$$ -47976 11416 -117334 -199247 -115927 -212873 187824 -114051 -307644 213842 165061 223979
1092B23979j44722p2591j47966J47290P0057j49737N4174J45493q9657j59923
$$ 223979 79257 6666 -141300 5990 76047 -73690 -19516 125977 36320 -123603
1082a23603J52286k59345k86575M45644n9534j70803n1619L50996p8194K39424
$$ -123603 28683 -230662 -517237 -71593 -131127 -301930 -353549 -2553 -80747 158677
1072A58677n5607j25508j36665R1283L72985l7801k63178k64345K85208j87199
$$ 158677 103070 -22438 -159103 -67820 305165 267364 4186 -260159 25049 -162150
1062a62150J07513J16152J04151k69434k82869j22349L81423l93123L53898J6720
$$ -162150 -54637 61515 165666 -103768 -386637 -508986 -127563 -520686 -166788 -150068
1052a50068N3317L3581k94303L17231N7634o1362j16427K63920j385j30843K8609
$$ -150068 -96751 -63170 -357473 -40242 17392 -43970 -160397 103523 102138 -28705 -96
1041i6K78013k05988l30475N609L80298r4217J01869j65325j16852J20330L5292
$$ -96 277917 71929 -258546 -252937 127361 33144 135013 -30312 -147164 -26834 8458
1030H458M7310j82255p928j46590J12239r6656J04829L05533j89876n0288j52492
$$ 8458 55768 -126487 -134415 -281005 -168766 -265422 -160593 144940 -44936 -95224 -247716
1019b47716J89114Q4550J5445J37152j84341j1728j9148p0559O1983K87933m6734
$$ -247716 -58602 25948 41393 178545 -5796 -17524 -36672 -107231 -45248 242685 195951
1008A95951j97751q3437J30469L45k04508M4292q5480Q7283O3217j71379J79044
$$ 195951 -1800 -85237 45232 45577 -158931 -114639 -200119 -112836 -49619 -220998 -41954
997d1954J14939q5447r6538p5300p9584J95535m2514j17789L07816k79334M5762
$$ -41954 72985 -12462 -109000 -184300 -263884 -68349 -110863 -228652 79164 -200170 -154408
986a54408J66014J33400l28342j84561K08402K5502L14960j61028M0836K36654
$$ -154408 11606 145006 -183336 -367897 -159495 -133993 180967 19939 60775 297429
976B97429o8421k21395K33366k13332k90081N7716Q788L3596l6731n7406J74742
$$ 297429 229008 7613 240979 27647 -262434 -204718 -195930 -162334 -199065 -256471 -81729
965h1729R0858K9187n2031J12206l2830N7603J26420j28315l88643J28664J64341
$$ -81729 9129 38316 -13715 98491 65661 123264 249684 121369 -267274 -138610 25731
954B5731o2428p8985L4853J62247k25061J0072Q3355j36517p7450J81816L5042
$$ 25731 -36697 -115682 -80829 81418 -143643 -133571 -50216 -186733 -264183 -82367 -47325
943d7325R7523O9843K45132k55519l21974k868L45162P8547k97999K19951p8568
$$ -47325 50198 120041 365173 109654 -212320 -215188 129974 208521 -89478 130473 51905
932E1905J15651R9951j48684j25761J08699k10558k35620J91574K35599m5399
$$ 51905 167556 267507 118823 -6938 101761 -108797 -344417 -152843 82756 37357
922C7357M47j26821M8957Q7893l8601k9940k05409K14653k25949N3188k6774K07691
$$ 37357 37804 -89017 -40060 47833 9232 -20708 -226117 -11464 -237413 -184225 -210999 -3308
910c308N7668j37802J07210j83944j36467q4895J06470J64596j40643K08629J37885
$$ -3308 54360 -83442 23768 -160176 -296643 -381538 -275068 -110472 -251115 -42486 95399
899I5399j4210o0980j2339n1122J98478l4559R444K3068l28495L55795K63709
$$ 95399 81189 20209 7870 -43252 155226 120667 130111 153179 -175316 180479 444188
888D44188l03745o3301k54288Q7812N8873m7868K64516j17933K81253m30884Q7795
$$ 444188 140443 77142 -177146 -89334 -30461 -78329 186187 68254 349507 -81377 6418
877F418j00489o6867K11031l58823J34668O236J90585J23337k61526m9795J39213
$$ 6418 -94071 -160938 50093 -308730 -174062 -167826 22759 146096 -115430 -165225 -26012
866b6012N1535L83342m50709j3809P6011Q3098j65307k51274M5776J07637J06365
$$ -26012 25523 408865 -41844 -55653 20358 103456 -61851 -313125 -267349 -159712 -53347
855e3347N2159n7161J60232J17011k43700M4609l4932K19790j33191o7674K85980
$$ -53347 -1188 -58349 101883 218894 -24806 19803 -15129 204661 71470 3796 289776
844B89776J2797j69844j65145J00659k03094J9703Q2839j7997j15210J5602L88715
$$ 289776 302573 132729 -32416 68243 -134851 -115148 -32309 -50306 -165516 -149914 238801
833B38801j85492O791j77467J42877j61882J33923R9943r3588J24167r5652J06183
$$ 238801 53309 60100 -117367 25510 -136372 -2449 97494 3906 128073 32421 138604
822A38604j77235j92180M0848L35472k11042n9889L971K47929M6542j6667J4069
$$ 138604 -38631 -230811 -189963 145509 -65533 -125422 -121451 126478 173020 156353 170422
811A70422k33416K37797j99932J8010j9026J04949J40662j19113p8440q6326K4753
$$ 170422 -62994 174803 -25129 -7119 -26145 78804 219466 100353 21913 -64413 -39660
800c9660O323m0297J25880n4938k4947r135k52880l69012J47473K87745J61344
$$ -39660 -33337 -73634 52246 -2692 -27639 -36774 -289654 -658666 -511193 -223448 -62104
789f2104l0613K42697j43500o0558j39373P1131K48405n7009j03687Q8609J98656
$$ -62104 -92717 149980 6480 -54078 -193451 -122320 126085 69076 -34611 53998 252654
778B52654j79982r456j50234l1237K27461P0852n9360k16909J80873j46840N5098
$$ 252654 72672 63216 -87018 -118255 109206 180058 120698 -96211 84662 -62178 -7080
767g080J03993k70224J49342k85709J6022K46340K67165L9197m98414J12048K48467
$$ -7080 96913 -173311 -23969 -309678 -293656 -47316 219849 259046 -239368 -127320 121147
756A21147o5475j71962l84513K00926O8226K58804r2318j82059K94752m8924k56212
$$ 121147 55672 -116290 -500803 -299877 -231651 27153 -65165 -247224 47528 -1396 -257608
745b57608K67938J24003N7596r1098k20443m4673j5651L57197j53729o3102q1348
$$ -257608 10330 134333 191929 100831 -119612 -164285 -179936 177261 23532 -39570 -120918
734a20918L1524l43714J81618J72332J84322L38772k5203k80182j70013j92061
$$ -120918 -89394 -433108 -251490 -79158 105164 443936 418733 138551 -31462 -223523
724b23523J17444K01181Q7267R5220k25780j81065J5640r109m3049K2290j92312
$$ -223523 -106079 95102 182369 277589 51809 -129256 -113616 -122725 -165774 -143484 -335796
713c35796K15234P6811J58274k62290K2952n2812J24K04231J61808K01172k67978
$$ -335796 -120562 -43751 114523 -147767 -124815 -177627 -177503 26728 188536 389708 121730
702A21730o2253j69004l9424O3203m3396P1157k27170m2559L03970R7514K33715
$$ 121730 59477 -109527 -148951 -85748 -129144 -57987 -285157 -327716 -23746 73768 307483
691C07483j0048l83649j66492J6287O4712K39198j58689Q1650q3773P3400r0784
$$ 307483 297435 -86214 -252706 -236419 -171707 67491 -91198 -9548 -93321 -19921 -110705
680a10705p5033o4451J27084L05703k35254l55459Q8174M83811r5593K9197m4192
$$ -110705 -185738 -250189 -123105 182598 -52656 -408115 -319941 163870 68277 97474 53282
669E3282K48609m11248J11024O5811n4188J69013l7985j3078L375m6908K68185
$$ 53282 301891 -109357 1667 67478 13290 182303 144318 131240 134615 87707 355892
658C55892r1636k57357r8760J14557o8843q0555o9377L44384K49247N2978l89043
$$ 355892 264256 6899 -91861 22696 -46147 -126702 -196079 148305 397552 450530 61487
647F1487l44946n1289J32812K19204q3120o9744j0063J49511j58526J45926K30151
$$ 61487 -283459 -334748 -201936 17268 -65852 -135596 -145659 3852 -154674 -8748 221403
636B21403J7591k20347k37035J92501K37535j72443j03413L52835j9142j76058
$$ 221403 238994 18647 -218388 -25887 211648 39205 -64208 288627 269485 93427
626I3427l59141J70296k64410K37062K0490O3781N5821q3043k6647J38238J40052
$$ 93427 -265714 -95418 -359828 -122766 -102276 -38495 17326 -65717 -92364 45874 185926
615A85926p2650q1218q5128L23722j74151k5837l690K93920n1863j37569n1734
$$ 185926 113276 32058 -53070 270652 96501 70664 66974 360894 309031 171462 119728
604A19728o9714J32228J02770l42451q0075o524j42949o3456K35407j66011J16047
$$ 119728 50014 182242 285012 -57439 -137514 -144038 -286987 -350443 -115036 -281047 -165000
593a65000l3336j29127k30544J58123n7807R9989o2482J72157L65558j35134R787
$$ -165000 -198336 -327463 -558007 -399884 -457691 -357702 -420184 -248027 117531 -17603 -7816
582g816k27644J13350M654j46746J69965j01789k0741K06479r6179M6745K86591
$$ -7816 -235460 -122110 -117456 -264202 -94237 -196026 -216767 -10288 -106467 -59722 226869
571B26869n70401L31590L3190j5255o0119j06566K8218k03350L54335j24142O9976
$$ 226869 -343532 -11942 21248 5993 -54126 -160692 -132474 -335824 18511 -105631 -35655
560c5655m9913J94977l57232j12055P0409k10981q9427l536M03763m2378M8049
$$ -35655 -85568 109409 -247823 -359878 -289469 -500450 -589877 -593413 -189650 -232028 -183979
549a83979O5812J56201j6048j70197Q5052j17982J5071M03442l35906M8466j13024
$$ -183979 -118167 38034 21986 -148211 -63159 -181141 -166070 237372 -98534 -50068 -163092
538a63092J0683r2527J25650N8210Q6615j59413O7350k94444J345K45451J5822
$$ -163092 -152409 -244936 -119286 -61076 25539 -133874 -66524 -360968 -359623 -114172 -98350
527i8350J72255j0972m1019J5514j43204O2805j98129J86117M6175K0350O034
$$ -98350 73905 62933 21914 37428 -105776 -42971 -241100 -54983 -8808 11542 17576
516A7576j61285K92565O2918j83805j87731M9235j43397K61680P2688P0066r1491
$$ 17576 -143709 148856 211774 27969 -159762 -110527 -253924 7756 80444 150510 59019
505E9019J40642j86470j82475J49772N8272j07541j53570j1384J06881J11525
$$ 59019 199661 13191 -169284 -19512 38760 -68781 -222351 -233735 -126854 -15329
495a5329k19400j02589J71007L9167K77784m08200K35938J12363m0953O6283j39655
$$ -15329 -234729 -337318 -166311 -127144 150640 -257560 -21622 90741 49788 116071 -23584
484b3584l66088M55397j66406j00080M5575L11966k15281j36894l56446M71571
$$ -23584 -389672 65725 -100681 -200761 -155186 156780 -58501 -195395 -551841 -80270
474h0270J54923j17143m434L0691J19333k62410M2182K84062k75783k85159K12555
$$ -80270 74653 -42490 -46924 -16233 103100 -159310 -117128 166934 -108849 -394008 -181453
463a81453K55144j19876O8883J49900P2282k15654k29599k87544M76060J22460
$$ -181453 73691 -46185 22698 172598 244880 29226 -200373 -487917 -11857 110603
453A10603j76608P2088j87501J3843j59115N9536L09612J83358k23493o9717k85284
$$ 110603 -66005 6083 -181418 -167575 -326690 -267154 42458 225816 2323 -67394 -352678
442c52678j52043J65168L30571k42471L69145j84740j03664j19217K67663o1429
$$ -352678 -504721 -339553 -8982 -251453 117692 -67048 -170712 -289929 -22266 -83695
432h3695n3862L9544k35193l19166L67461K72010r0603O7855R0734Q1313l81282
$$ -83695 -137557 -98013 -333206 -652372 -284911 -12901 -103504 -35649 55085 136398 -244884
421b44884k36453J97931J83517j48031m4227P9721L59793J78504j55483P2856
$$ -244884 -481337 -283406 -99889 -247920 -292147 -212426 147367 325871 170388 243244
411B43244k26422k06168J70957K45428l23470J19797l27L85903k92852K0037q6795
$$ 243244 16822 -189346 -18389 227039 -96431 23366 23039 408942 116090 136127 49332
400D9332p5617l1719j88440K63577J27558O125k16926K21343l28219j133L21641
$$ 49332 -26285 -58004 -246444 17133 144691 150816 -66110 155233 -172986 -174119 147522
389A47522k13897Q0689r122J13481q6873l08061k1904K57065r3107r8123q0522
$$ 147522 -66375 14314 5192 118673 31800 -276261 -298165 -41100 -134207 -232330 -312852
378c12852j01650K19748R7322K59782o2433k53642K56218J5353j09743j55188
$$ -312852 -414502 -194754 -97432 162350 99917 -153725 102493 117846 8103 -147085
368a47085L361K20184k12629L34844p5708j1873l33943j35446K81657K53389O8609
$$ -147085 -143724 76460 -136169 198675 122967 111094 -222849 -358295 -76638 176751 245360
357B45360j60449k61768j46290R8120K9940l306M05101r9068l7300M2926j16004
$$ 245360 84911 -176857 -323147 -225027 -195087 -198393 206708 107640 70340 113266 -2738
346b738m58609N27039j0679K5049J61538j13427j26556L4113L4325m8309O3104
$$ -2738 -461347 65692 55013 80062 241600 128173 1617 35730 70055 21746 84850
335H4850j59518J54253K11783k6203k37873L29304l09982l1907m2529j72889J13152
$$ 84850 -74668 79585 291368 265165 27292 356596 46614 14707 -27822 -200711 -87559
324h7559P7568j58378J48638n9944J73976J14813j92854l0061P0400j92117K08919
$$ -87559 -9991 -168369 -19731 -79675 94301 209114 16260 -13801 56599 -135518 73401
313G3401l9292k55445k35466j76909L79035M86752j87604Q580q7222J64559o5540
$$ 73401 34109 -221336 -456802 -633711 -254676 232076 44472 53052 -34170 130389 64849
302F4849m37395K70108K90898r2487j46188j27494j44264L08945r4305N5025l3384
$$ 64849 -372546 -102438 188460 95973 -50215 -177709 -321973 -13028 -107333 -52308 -85692
291h5692N951m9807K68904J259m0353M1078k06217J13248M8616j4807k82157Q9944
$$ -85692 -79741 -129548 139356 140615 100262 141340 -64877 48371 96987 82180 -199977 -110033
279a10033J10931J05357J42117k2613k56393k62700J4598L827j04360k01396K04920
$$ -110033 898 106255 248372 225759 -30634 -293334 -278736 -274909 -379269 -580665 -375745
268c75745J72512K50406p4589n2614j07343Q0774k28615J65566K74213l7222R3535
$$ -375745 -203233 47173 -27416 -80030 -187373 -106599 -335214 -169648 104565 67343 160878
257A60878k48525J08431J29126k12084j43463K25138P8415k13394j16773J07163
$$ 160878 -87647 20784 149910 -62174 -205637 19501 97916 -115478 -232251 -125088
247a25088J70567M66126j81289l78731j7940J46927J39552j12320p6282J2756
$$ -125088 45479 511605 330316 -48415 -66355 80572 220124 107804 31522 44278
237D4278q1646p118J0002M6454j55838J36086J08826k32969j18368L18140K18679
$$ 44278 -37368 -44486 -34484 11970 -143868 -7782 101044 -131925 -250293 67847 286526
226B86526l75956o0651N7138K88693l33103J11140J70858K0503j02790l8296J20121
$$ 286526 -89430 -150081 -92943 195750 -137353 -26213 144645 165148 62358 24062 144183
215A44183q7016j71069K2089q1826o0195o4610Q343L01256j91114J49342o6204
$$ 144183 57167 -113902 -91813 -173639 -233834 -298444 -290101 11155 -179959 -30617 -96821
204i6821m1414Q2157J35467k3926K23924k69913j61902K0690J09253r8506j43494
$$ -96821 -138235 -56078 79389 55463 279387 9474 -152428 -131738 -22485 -120991 -264485
193b64485K30675q2873j53193K646M8991J45472k95581n4058L10243p900K59663
$$ -264485 -33810 -116683 -269876 -267230 -218239 -72767 -368348 -422406 -112163 -120063 139600
182A39600m0216j40428j2047k30462J07214O1609J23670J5656l2238j57331J22899
$$ 139600 99384 -41044 -53091 -283553 -176339 -114730 8940 24596 -7642 -164973 -42074
171d2074J90213k60344J1275l6400J94367J40512l18464K36802M950j18621L31770
$$ -42074 148139 -112205 -100930 -137330 57037 197549 -120915 115887 120837 2216 333986
160C33986n47774j51686K17417J17000j22872N4429o5204j02458L25920j4486
$$ 333986 -213788 -365474 -148057 -31057 -153929 -99500 -164704 -267162 58758 44272
150D4272K0079n1606k70797J28121q7158Q4570k6206J46461L26837k13339j89444
$$ 44272 64351 12745 -258052 -129931 -217089 -132519 -158725 -12264 314573 101234 -88210
139h8210j1570J01827k873j12029j58327L38673J00360m28055M71899Q7358m44128
$$ -88210 -99780 2047 -826 -112855 -271182 67491 167851 -260204 211695 299053 -145075
128a45075L2344J38738j04371K04358k2225J34756m27940m6072J10880j67325
$$ -145075 -112731 26007 -78364 125994 103769 238525 -189415 -235487 -124607 -291932
118b91932J03944m7505L04913O5090r7639j50642Q4785j25431q8180J88805K9895
$$ -291932 -187988 -235493 69420 134510 36871 -113771 -28986 -154417 -242597 -53792 -23897
107b3897n6327J34825q60j02087R3265l2977l8998r8595K05491k97310L456m8262
$$ -23897 -80224 54601 53741 -48346 44919 11942 -27056 -125651 79840 -217470 -214014 -262276
95b62276J00399J33357r9531r8678q0971o4427J15829J31429n5787P3390K1248
$$ -262276 -161877 -28520 -128051 -226729 -307700 -372127 -256298 -124869 -180656 -107266 -86018
84h6018P6672o6459J763j27978K55391l42412J12455K45989J28011k42408j11262
$$ -86018 -9346 -75805 -74042 -202020 53371 -289041 -176586 69403 197414 -44994 -156256
73a56256O3528o6509j75504K13871M4356K00459k27061j22045J84529Q5967L916
$$ -156256 -92728 -159237 -334741 -120870 -76514 123945 -103116 -225161 -40632 45335 49251
62D9251j62680P512N9590l6471K8809o7656j26306R0995J278J87795j02319j57060
$$ 49251 -113429 -105917 -46327 -82798 -53989 -121645 -247951 -156956 -155678 32117 -70202 -227262
50b27262J14721O9324J00752k260k27453P5084L8348K10856N6200j7241j82345
$$ -227262 -112541 -43217 57535 55275 -172178 -97094 -58746 152110 208310 191069 8724
39H724j89879O7383k41053K59514K2241j34651O6611j21187R1153J75257j7113
$$ 8724 -181155 -113772 -354825 -95311 -73070 -207721 -141110 -262297 -171144 4113 -13000
28a3000j12611j50731m4480J72267L3806n0897J79407Q6052R5434k17977l7210
$$ -13000 -125611 -276342 -320822 -148555 -114749 -165646 13761 99813 195247 -22730 -59940
17e9940K17386k77628K5633K67603P482k46344Q0404K6970j24587r4550r6764
$$ -59940 157446 -120182 -94549 173054 180536 -65808 14596 41566 -83021 -177571 -274335
6b74335J62442q307j33179j16549j7981K51750
$$ -274335 -111893 -120200 -253379 -369928 -387909 -136159
0a36159
$$ -136159
$$ Imaginary data points
##PAGE= N=2
##DATA TABLE= (X++(I..I)), XYDATA
16383c395489m4074r6939M5325J88105J08107j7035J08217k11717J84359k8943
$$ -3395489 -3439563 -3536502 -3491177 -3303072 -3194965 -3212000 -3103783 -3315500 -3131141 -3160084
16373c160084J04828P8125J37612J31419o7566M4997k0375J04115K33798j8277
$$ -3160084 -3055256 -2977131 -2839519 -2708100 -2775666 -2730669 -2751044 -2646929 -2413131 -2431408
16363b431408M9617j28743r4624O3338J39203J71370J70718j22749J42386q0313
$$ -2431408 -2381791 -2510534 -2605158 -2541820 -2402617 -2231247 -2060529 -2183278 -2040892 -2121205
16353b121205M2632L2897J06281J86365p9328j3886R0664J12268L3171K61859
$$ -2121205 -2078573 -2045676 -1939395 -1753030 -1832358 -1846244 -1755580 -1643312 -1610141 -1348282
16343a348282r4602j00622Q5486n5333J63110K30751N9720j29517J1234J28373
$$ -1348282 -1442884 -1543506 -1458020 -1513353 -1350243 -1119492 -1059772 -1189289 -1178055 -1049682
16333a049682N6134Q8613q4112J64580l21195J16679K56681l8441p5828J41934
$$ -1049682 -993548 -904935 -989047 -824467 -1145662 -1028983 -772302 -810743 -886571 -744637
16323g44637J04435j25402N5612K93420p9344l9383R6705K9589R1977J52224Q7753
$$ -744637 -640202 -765604 -709992 -416572 -495916 -535299 -438594 -409005 -317028 -164804 -77051
16312g7051m3245J88021q0250q2992K60750k1573n8594K72970j95165K8859J11772
$$ -77051 -120296 67725 -12525 -95517 165233 143660 85066 358036 162871 191730 303502
16301C03502r5263J06902J50890m2782J3251J51937k6414J72246N9457j71918
$$ 303502 208239 315141 466031 423249 436500 588437 562023 734269 793726 621808
16291F21808J50615J52300j74411N4340O0357K20844j51754J38154J8634r9429
$$ 621808 772423 924723 750312 804652 865009 1085853 934099 1072253 1090887 991458
16281I91458L6731r0773j0856J25493J39350J80994K2433q2841J06826J36186
$$ 991458 1028189 937416 926560 1052053 1191403 1372397 1394830 1311989 1418815 1555001
$$ [...]
##END NTUPLES=NMR SPECTRUM
##END=
