##TITLE=1H_CG-1216-1
 CDCl3
 8 sc, 
 31.10.2024
##JCAMPDX= 6.0         $$ Bruker NMR JCAMP-DX V2.0
##DATA TYPE= NMR SPECTRUM
##DATA CLASS= NTUPLES
##ORIGIN= UXNMR, Bruker Analytische Messtechnik GmbH
##OWNER= root
$$ XWIN-NMR		Version 3.5
$$ Thu Oct 31 14:01:46 2024 Russian Standard Time (UT+4h)  she@DPX200
##.OBSERVE FREQUENCY= 200.1318
##.OBSERVE NUCLEUS= ^1H
##.ACQUISITION MODE= SIMULTANEOUS
##.ACQUISITION SCHEME= undefined
##.AVERAGES= 8
##.DIGITISER RES= 18
##SPECTROMETER/DATA SYSTEM= spect
##.PULSE SEQUENCE= zg30
##.SOLVENT NAME= CDCl3
##.SHIFT REFERENCE= (INTERNAL, CDCl3, 0, 20.9973)
##AUDIT TRAIL= $$ (NUMBER, WHEN, WHO, WHERE, WHAT)
$$ ##TITLE= Audit trail, XWIN-NMR		Version 3.5
$$ ##JCAMPDX= 5.01
$$ ##ORIGIN= Bruker BioSpin GmbH
$$ ##OWNER= she
$$ F:/spectra/data/she/nmr/H-F/1/pdata/1/auditp.txt
$$ ##AUDIT TRAIL=  $$ (NUMBER, WHEN, WHO, WHERE, WHAT)
(   1,<2024-10-31 14:00:19.43 +0400>,<she>,<DPX200>,
      <created by zg, POWCHK disabled, PULCHK disabled
       configuration hash MD5:
       00 E9 B6 7A A2 85 ED C7 34 08 36 98 17 FE 4E 26
       data hash MD5: 16K
       E1 46 54 93 68 20 01 BC 0A 93 A4 DB 8C DE A4 AB>)
(   2,<2024-10-31 14:00:41.71 +0400>,<she>,<DPX200>,
      <Start of raw data processing
       efp BC_mod = 2 LB = 0.24 FT_mod = 6 PKNL = 1 PHC0 = -26351.71 PHC1 = 19.98743 SI = 16K 
       data hash MD5: 16K
       0B 2E 24 7A C0 82 22 CB D8 1B 57 69 58 C1 E6 E7>)
(   3,<2024-10-31 14:01:00.65 +0400>,<she>,<DPX200>,
      <pk PHC0 = 0.4898267 PHC1 = -0.7999998 
       data hash MD5: 16K
       6C 1F 16 72 6A 31 05 88 30 B2 8B 42 91 C3 FF E0>)
(   4,<2024-10-31 14:01:04.81 +0400>,<she>,<DPX200>,
      <abs ABSG = 5 
       data hash MD5: 16K
       89 01 12 78 B8 1D EB B7 88 35 BC 83 17 00 78 00>)
$$ ##END=
$$ 
$$ hash MD5
$$ 5C 71 62 D2 F0 DB 51 FD 1B CE 48 16 F0 36 CB AC
##$RELAX= 
##$RELAX= 
##$RELAX= 
##$RELAX= 
##$RELAX= 
##$RELAX= 
$$ Bruker specific parameters
$$ --------------------------
##$DU= <F:/spectra>
##$EXPNO= 1
##$NAME= <H-F>
##$PROCNO= 1
##$TYPE= <nmr>
##$USER= <she>
##$AMP= (0..31)
100 100 100 100 100 100 100 100 100 100 100 100 100 100 100 100 100 100 
100 100 100 100 100 100 100 100 100 100 100 100 100 100 
##$AQSEQ= 0
##$AQ_mod= 1
##$AUNM= <au_zg>
##$AUTOPOS= <>
##$BF1= 200.13
##$BF2= 200.13
##$BF3= 200.13
##$BF4= 200.13
##$BF5= 200.13
##$BF6= 200.13
##$BF7= 200.13
##$BF8= 200.13
##$BYTORDA= 1
##$CFDGTYP= 0
##$CFRGTYP= 5
##$CHEMSTR= <none>
##$CNST= (0..31)
1 1 145 1 1 1 1 1 1 1 1 1 1 1 1 1 1 1 1 1 1 1 1 1 1 1 1 1 1 1 1 1 
##$CPDPRG= <>
##$CPDPRG1= <>
##$CPDPRG2= <>
##$CPDPRG3= <>
##$CPDPRG4= <mlev>
##$CPDPRG5= <mlev>
##$CPDPRG6= <mlev>
##$CPDPRG7= <mlev>
##$CPDPRG8= <mlev>
##$CPDPRGB= <>
##$CPDPRGT= <>
##$D= (0..31)
0 1.2 0 0 0 0 0 0 0 0.06 0 0.03 0 0 0 0 0.0002 0 0 0 0 0 0 0 0 0 0 0 0 
0 0 0 
##$DATE= 1730368818
##$DBL= (0..7)
120 120 120 120 120 120 120 120 
##$DBP= (0..7)
150 150 150 150 150 150 150 150 
##$DBP07= 0
##$DBPNAM0= <>
##$DBPNAM1= <>
##$DBPNAM2= <>
##$DBPNAM3= <>
##$DBPNAM4= <>
$$ [...]
##$SUBNAM3= <"">
##$SUBNAM4= <"">
##$SUBNAM5= <"">
##$SUBNAM6= <"">
##$SUBNAM7= <"">
##$SUBNAM8= <"">
##$SUBNAM9= <"">
##$SW= 24.0689170037331
##$SWIBOX= (0..15)
0 0 2 0 0 0 0 0 0 0 0 0 0 0 0 0 
##$SW_h= 4816.95568400771
##$TD= 16384
##$TD0= 1
##$TE= 0
##$TE2= 300
##$TE3= 300
##$TEG= 300
##$TL= (0..7)
0 120 120 120 120 120 120 120 
##$TP= (0..7)
150 150 150 150 150 150 150 150 
##$TP07= 0
##$TPNAME0= <>
##$TPNAME1= <>
##$TPNAME2= <>
##$TPNAME3= <>
##$TPNAME4= <>
##$TPNAME5= <>
##$TPNAME6= <>
##$TPNAME7= <>
##$TPOAL= (0..7)
0.5 0.5 0.5 0.5 0.5 0.5 0.5 0.5 
##$TPOFFS= (0..7)
0 0 0 0 0 0 0 0 
##$TUNHIN= 0
##$TUNHOUT= 0
##$TUNXOUT= 0
##$USERA1= <user>
##$USERA2= <user>
##$USERA3= <user>
##$USERA4= <user>
##$USERA5= <user>
##$V9= 5
##$VALIST= <valist>
##$VCLIST= <CCCCCCCCCCCCCCC>
##$VD= 0
##$VDLIST= <DDDDDDDDDDDDDDD>
##$VPLIST= <PPPPPPPPPPPPPPP>
##$VTLIST= <TTTTTTTTTTTTTTT>
##$WBST= 1024
##$WBSW= 4
##$XGAIN= (0..3)
0 0 0 0 
##$XL= 0
##$YL= 0
##$YMAX_a= 316551
##$YMIN_a= -296490
##$ZGOPTNS= <>
##$ZL1= 120
##$ZL2= 120
##$ZL3= 120
##$ZL4= 120
##$ABSF1= 20.99879
##$ABSF2= -3.070341
##$ABSG= 5
##$ABSL= 3
##$ALPHA= 0
##$AQORDER= 0
##$ASSFAC= 0
##$ASSFACI= 0
##$ASSFACX= 0
##$ASSWID= 0
##$AUNMP= <proc_1d>
##$AZFE= 0.1
##$AZFW= 0.1
##$BCFW= 0
##$BC_mod= 2
##$BYTORDP= 0
##$COROFFS= 0
##$CY= -3
##$DATMOD= 1
##$DC= 0
##$DFILT= <>
##$DTYPP= 0
##$F1P= 0
##$F2P= 0
##$FCOR= 1
##$FTSIZE= 16384
##$FT_mod= 6
##$GAMMA= 0
##$GB= 0
##$INTBC= 1
##$INTSCL= 3.70164e-10
##$ISEN= 128
##$LB= 0.24
##$LEV0= 0
##$LPBIN= 0
##$MAXI= 10000
##$MC2= 0
##$MEAN= 0
##$ME_mod= 0
##$MI= 1.114404
##$NCOEF= 0
##$NC_proc= -7
##$NLEV= 6
##$NOISF1= 3.799351
##$NOISF2= 2.8
##$NSP= 0
##$NTH_PI= 0
##$NZP= 0
##$OFFSET= 20.99732
##$PC= 1
##$PHC0= -26351.22
##$PHC1= 19.18743
##$PH_mod= 1
##$PKNL= yes
##$PPARMOD= 0
##$PSCAL= 0
##$PSIGN= 0
##$REVERSE= no
##$SF= 200.130006284233
##$SI= 16384
##$SIGF1= 3
##$SIGF2= 2
##$SINO= 5.538805
##$SIOLD= 16384
##$SREGLST= <1H.CDCl3>
##$SSB= 0
##$STSI= 16384
##$STSR= 0
##$SW_p= 4816.95568400771
##$SYMM= 0
##$S_DEV= 0
##$TDeff= 16384
##$TDoff= 0
##$TI= <>
##$TILT= no
##$TM1= 0
##$TM2= 0
##$TOPLEV= 0
##$USERP1= <user>
##$USERP2= <user>
##$USERP3= <user>
##$USERP4= <user>
##$USERP5= <user>
##$WDW= 1
##$XDIM= 16384
##$YMAX_p= 355632933
##$YMIN_p= -1638838
$$ End of Bruker specific parameters
$$ ---------------------------------
##NTUPLES= NMR SPECTRUM
##VAR_NAME=  FREQUENCY,     SPECTRUM/REAL,   SPECTRUM/IMAG
##SYMBOL=    X,             R,               I
##VAR_TYPE=  INDEPENDENT,   DEPENDENT,       DEPENDENT
##VAR_FORM=  AFFN,          ASDF,            ASDF
##VAR_DIM=   16384,         16384,           16384
##UNITS=     HZ,            ARBITRARY UNITS, ARBITRARY UNITS
##FACTOR=    0.29402158847633, 1,            1
##FIRST=     4202.193818609, 0,              0
##LAST=      -614.761865398707, 0,           0
##MIN=       -614.761865398707, -1638838,    0
##MAX=       4202.193818609, 355632933,      0
$$ Real data points
##PAGE= N=1
##DATA TABLE= (X++(R..R)), XYDATA
$$ [...]
5932A2730995M00101l53491J80207k0386N45936L41184j37395j399731j387027
5923A0900393j003006p51795n75591p29793o94085j09911k31994j09826k71052
5914F423340k88942K39976k716j88366J88328l05501k3095L14229p980J45916
5904F495189L50547M22485j32597L22286M78192P982L79036J50438M6938L61296
5894H881792L02233L5671N26186O1916N22417L42285k18704J08374Q0644J90975
5884A0833789J16594J34440R8387R2638K09824K10496O46300N87571K55380P58370
5874A3943789J249445Q07452K57099l28531k5552k36159l50756R3169k57135n17317
5864A4635504r32028j026573p08918r88548m56234k90931J12426n75395j75985
$$ plain form
5932 12730995 13131096 12777605 12957812 12937426 13483362 13824546 13687151 12287420 10900393
5923 10900393 9897387 9145592 8570001 7840208 7146123 7036212 6804218 6694392 6423340
5914 6423340 6134398 6374374 6371658 6183292 6371620 6066119 6043024 6357253 6349273 6495189
5904 6495189 6845736 7268221 7135624 7457910 7936102 7944084 8323120 8473558 8520496 8881792
5894 8881792 9184025 9219696 9745882 9807798 10330215 10672500 10453796 10562170 10642814 10833789
5884 10833789 10950383 11084823 11183210 11275848 11485672 11696168 12342468 12930039 13185419 13943789
5874 13943789 15193234 16000686 16257785 15929254 15903702 15667543 15316787 15409956 15152821 14635504
5864 14635504 13703476 12676903 11967985 10979437 10523203 10232272 10344698 9769303 9593318
5855I593318J38355j82374N4096K34929j51785Q7017l5600J8080M2709j80347
5845I618398N2115j79329m727k97671j50378k33398k1400k75017m0277m62811
5835H005505k87695m08382j03465n11845l7256n38998j3908K85726l46856k48747
5825E794079J24403l51166m07244k84256K86079K03566j73785J1535j36628j50334
5815D916249K77322K24852J38151K4435J03765J26439L40997L20244K35144L68770
5805G076368M47012L20439K13165N61495N84682J190673J096566J742709J075867
5796A4308976O20125L9553n51202k59859j36500J43371k3689p32444j099713j447808
5786A0860810j069828j045183o98336n13548k43855k55992r35287j66360j32627
$$ plain form
5855 9593318 9731673 9549299 9603395 9838324 9686539 9773556 9737956 9756036 9798745 9618398
5845 9618398 9670513 9491184 9486457 9188786 9038408 8805010 8783610 8508593 8468316 8005505
5835 8005505 7717810 7309428 7205963 6694118 6656862 6117864 6103956 6389682 6042826 5794079
5825 5794079 5918482 5567316 5160072 4875816 5161895 5365461 5191676 5203211 5066583 4916249
5815 4916249 5193571 5418423 5556574 5581009 5684774 5811213 6152210 6472454 6707598 7076368
5805 7076368 7523380 7843819 8056984 8618479 9203161 10393834 11490400 13233109 14308976
5796 14308976 14929101 14968654 14417452 14157593 14021093 14164464 14140775 13408331 12308618 10860810
5786 10860810 9790982 8745799 8047463 7533915 7290060 7034068 6098781 5932421 5799794
5777E799794k83765m07147J37358j32309N8460L4721L5442L86617J79438M4556
5767E853165k01560J43683J75443L88938O56612O31453O71741P90706P43582J226636
5757A1080399J024101N81470p3238j13624j64012R0853J58118n08805m72811q56078
5747A0746373j177682j450300o43314p04430q64810l37095j46979p65067j75434
5738D481262k16967n67313L07083k34606o7030P1790l58870j80203j1296j20807
5728C103043l34575J09127p4003k57109M43750J0867j49507J99662j85710L7430
5718B902975M6551P4134M79352R0866q5072j89827l2985J69581j14249K77686
5708C619012O32507M26428M08528P52098Q75186Q15910K8872o37913j135939p52129
$$ plain form
5777 5799794 5516029 5108882 5246240 5113931 5172391 5207112 5242554 5629171 5808609 5853165
5767 5853165 5651605 5795288 5970731 6359669 7016281 7647734 8319475 9110181 9853763 11080399
5757 11080399 12104500 12685970 12612732 12499108 12335096 12425949 12584067 12075262 11602451 10746373
5747 10746373 9568691 8118391 7475077 6770647 5905837 5568742 5421763 4656696 4481262
5738 4481262 4264295 3696982 4004065 3769459 3702429 3774219 3415349 3235146 3223850 3103043
5728 3103043 2768468 2877595 2803592 2546483 2990233 3001100 2851593 3051255 2865545 2902975
5718 2902975 2949526 3023660 3503012 3593878 3508806 3318979 3285994 3455575 3341326 3619012
5708 3619012 4251519 4677947 5086475 5838573 6713759 7529669 7558541 6920628 5784689 5032560
5698E032560m44771m47971l20058n9753j23266m91589M9607m17273m1431k77885
5688B458170k97692k20929j98268J08216k30708r198Q611m5558Q5217m07113J07972
5677A358720K79696j05492l4770R849k08509O53k34528R8019j14061j31951J09783
5666A027409r1466j23426J97355o704J1472j86951j51064N00370j31968k70981
5656G74046K58864P2009m4715J87169l99937J22075j47246j40805p0294J41097
5646G52263j78128j18440J04718L32185j78544k76826q5884J65819m4683j56845
5636C15635K27466o7443Q2614o3592r4170J27823R9693K10898M3946j03050L1427
5625H11247l14628o9746j27103M3194L89557j26799o6732J4971m00084K1575j39336
$$ plain form
5698 5032560 4587789 4139818 3819760 3760007 3636741 3145152 3194759 2777486 2736055 2458170
5688 2458170 2160478 1939549 1741281 1849497 1618789 1609591 1618202 1572644 1657861 1250748 1358720
5677 1358720 1638416 1532924 1498154 1508003 1299494 1300147 1065619 1163638 1049577 917626 1027409
5666 1027409 935943 812517 1009872 1003168 1014640 827689 676625 1176995 1045027 774046
5656 774046 1032910 1104919 1060204 1247373 847436 969511 822265 681460 611166 752263
5646 752263 574135 455695 560413 892598 714054 437228 351344 517163 472480 315635
5636 315635 543101 475658 558272 494680 400510 528333 628026 838924 882870 779820 811247
5625 811247 496619 426873 299770 342964 732521 605722 538990 553961 153877 175452 36116
5614C6116J51028J5918L19200p7739J32877P308P3055J1439J24462J57637J13929
5603A065230j6281J31594J09785j31905j58343r3730J9948j69852k95608k07910
5593B52928N05086l23275k97335L04499L08900O6998o0348k29183J95991o7623
5583F56638k81513J89262r7173o9325l78943n0864J99867M15231r9364l64677
5573A19139J46100k4021J66982k05116J27371L8060j55883r527J87570j37458
5563B53217j12324l8665m6703J13109J2588j96542n768M45612j97242j1435R8549
5552C14396j08853j59169j14475L82952k7097l35201p1623J95291L42361k10327
5542B08255M8389J6831j43716K71282O7576j42804k14143n2436j17333Q3090O0305
$$ plain form
5614 36116 187144 203062 522262 444523 577400 584708 657763 669202 793664 951301 1065230
5603 1065230 1048949 1180543 1290328 1158423 1000080 906350 926298 756446 460838 252928
5593 252928 758014 434739 137404 441903 750803 817801 757453 528270 724261 656638
5583 656638 375125 564387 467214 397889 18946 -31918 167949 583180 483816 119139
5573 119139 265239 241218 408200 203084 330455 368515 212632 203105 390675 253217
5563 253217 140893 102228 55525 168634 181222 -15320 -21088 424524 227282 215847 314396
5552 314396 205543 46374 -68101 314851 287754 -47447 -119070 76221 418582 208255
5542 208255 256644 273475 129759 401041 468617 325813 111670 59234 -58099 24991 85296
5531H5296K79803j84168j10107K36091K9074l87321L42542R2852j76874K01320
5521D08508q4587K2762K73688r7564j12234r9137P7507J20479m4657j78302j22092
5510A64371K00196j34510J9571L97883J5927j88568j66802L648j2854j10179R0494
5499B79177M9149O984k30749n5597R0890J77031J58619m6809Q135j24077R8127
5488D10880j35677L54686P1738l64476R3454K20529J30646j99491j55832K4465
5478D50922l6418k29413p9998O2656O1733O9377j32120m277R3554J05743k3958
5467C37801j48730N7022q3548K68111J19106J20677k6106o1464j68591J105J23854
5456E39237J21404j33784j11596m0504K23362K2005o8289K1222K06690l7514k46422
$$ plain form
5531 85296 365099 180931 70824 306915 335989 -51332 291210 384062 207188 408508
5521 408508 323921 346683 620371 522807 410573 311436 388943 509422 464765 286463 164371
5510 164371 364567 230057 249628 647511 663438 474870 308068 311716 298862 188683 279177
5499 279177 328326 335310 104561 48964 139854 316885 475504 428695 436830 312753 410880
5488 410880 275203 629889 701627 337151 430605 651134 781780 582289 426457 450922
5478 450922 414504 185091 105093 167749 229482 298859 166739 162462 256016 361759 337801
5467 337801 189071 246093 162545 430656 549762 670439 644333 582869 414278 415383 539237
5456 539237 660641 526857 415261 374757 598119 620124 551835 573057 779747 742233 495811
5445D95811O06150j09788J07364J58101k27811O509m089J57429m23585j6221K46491
5434I96361m5961j50352K32499k26684m5437L8460M46996K53710m2075J48001
5424A605518J93251j24965M86566N2609k92806k49147k92457K72528J48135K3488
5414A822720l87510K17974m0643P72j8178q1986o5342j855M77499M7273N398O05018
5402B581140J83549J02145N34173m49031n91685l27009l82144o9126o8895Q7430
5392A600547j43414J48753L3519J95087k79683r9830l0980J23080L23356L55922
5382B226357o7818N5375Q9538j57495K50542j95862r0879j22084j84218r8710
5372A704746j22829j83919N8350O1057K1389q2489o5145J02830L4501j04577k41504
$$ plain form
5445 495811 1101961 992173 1099537 1257638 1029827 1036336 1032247 1189676 766091 749870 996361
5434 996361 950400 800048 1032547 805863 760426 798886 1245882 1499592 1457517 1605518
5424 1605518 1798769 1673804 2160370 2212979 1920173 1671026 1378569 1651097 1799232 1822720
5414 1822720 1435210 1653184 1612541 1613313 1595135 1513149 1447807 1445952 1923451 1970724 1976122 2581140
5402 2581140 2764689 2866834 3401007 2951976 2360291 2033282 1651138 1582012 1513117 1600547
5392 1600547 1457133 1605886 1639405 1834492 1554809 1454979 1423999 1547079 1870435 2226357
5382 2226357 2158539 2213914 2303452 2145957 2396499 2200637 2109758 1987674 1803456 1704746
5372 1704746 1581917 1397998 1456348 1517405 1538794 1456305 1391160 1493990 1528491 1423914 1182410
5361A182410q1824L75478q7045P7937M760j08407K09602k03224l63526k27185
5351G78976o9771n0276J51931k804J71618j08961L07803J78780j27474m28940
5341H00882Q6481R7304k03256P4636J21365L6965j08215k70773M4171q3782K18927
5330H14705L17340m09228j44916J33239J39543K9156Q0996m43373J09607L1165
5320F58234k7175Q4877R8550o6129j6756j94121J00753j27055J31783J30099o4391
5309G08669P1557o4120R9652p4435r2154o5597j96571J48554J1099K08004R9495
5298H54153l13337m2402J340n4748J07831o6279J89779K225J0840m7356j17960
5287E24086L19552k5904k59436l23892L25300k74558j00535L32474J68026l34465
$$ plain form
5361 1182410 1100586 1476064 1389019 1466956 1471716 1363309 1572911 1369687 1006161 778976
5351 778976 709205 658929 810860 808056 979674 870713 1178516 1357296 1229822 800882
5341 800882 887363 984667 781411 856047 977412 1014377 906162 635389 679560 595778 814705
5330 814705 1132045 722817 577901 711140 850683 879839 960835 517462 627069 658234
5320 658234 631059 715936 814486 748357 731601 537480 638233 511178 642961 773060 708669
5309 708669 780226 716106 815758 741323 649169 583572 387001 535555 546654 754658 854153
5298 854153 540816 498414 499754 445006 552837 486558 676337 678562 689402 642046 524086
5287 524086 843638 817734 558298 234406 559706 285148 184613 517087 685113 350648
5277C50648M30348M9102K9052k15135M4699J9153j99529J23563j31895P9367p8873
5266E00500K8418j22400M36078Q2277j05939K19473J8122J94533q7316l3996J73727
5255A303477k61971J16815m1457P6621J7646k42026j365K44179r5544m3385J144
5244A074134K305L68996J84127k30695K9524m865l03510j27051K42668p7035k0220
5233A138378M19722k50789J38365k2503n6235J11813j17417K84693p125O2004
5223A700906M07147O4326J26463r3661O7157k00187o0958j02718L51345k89251
5213A970569j4778p4597R6201j06799j77015R942k9518O26986j06130j07220K1139
5202B108780L0086K32688j27776j73537L38935j040m6423k4838o058J26950l2737
$$ plain form
5277 350648 780996 830098 859150 644015 688714 707867 508338 631901 500006 579373 500500
5266 500500 528918 406518 842596 924873 818934 1038407 1056529 1251062 1163746 1129750 1303477
5255 1303477 1041506 1158321 1116864 1193485 1211131 969105 967740 1211919 1116375 1072990 1074134
5244 1074134 1076439 1445435 1629562 1398867 1428391 1423526 1120016 992965 1235633 1158598 1138378
5233 1138378 1558100 1307311 1445676 1423173 1366938 1478751 1361334 1646027 1638902 1700906
5223 1700906 2108053 2172379 2298842 2205181 2272338 2072151 2011193 1908475 2259820 1970569
5213 1970569 1955791 1881194 1977395 1870596 1693581 1703523 1674005 2300991 2194861 2087641 2108780
5202 2108780 2138866 2371554 2243778 2070241 2409176 2408136 2361713 2336875 2330817 2457767 2425030
5191B425030J56925p8375p7759k82616p0849k85596k53113J7574J18165N81256
5181B250642o05414K4908j28260K88788l59110J22807l15401k2769J90655Q2465
5171A529311K04857k25339J54766k03417M1046O6181k47027L27562j56475K59331
5161A750796r7806j48677K05972K79998k46393L7007J46749j71892k6704k09337
5151A519713K50526P8924o1808j00935J04910J03545j34916j30526K13484k0208
5141A822709j34647M5777r1627K62021j7065n2822K46392q0794r4334j57721K43198
5130A991087l091M0995k37163R469Q5565L03150k75146K88157J5882O0268M4682
5119B323855K5450J8031m5642K69932J34845J20721k35478K21453p7477J03842
$$ plain form
5191 2425030 2581955 2503580 2425821 2143205 2072356 1786760 1533647 1551221 1669386 2250642
5181 2250642 1645228 1670136 1541876 1830664 1471554 1594361 1278960 1256191 1446846 1529311
5171 1529311 1734168 1508829 1663595 1460178 1501224 1567405 1320378 1647940 1491465 1750796
5161 1750796 1652990 1504313 1710285 1990283 1743890 1780897 1927646 1755754 1729050 1519713
5151 1519713 1770239 1849163 1787355 1686420 1791330 1894875 1759959 1629433 1842917 1822709
5141 1822709 1688062 1733839 1642212 1904233 1887168 1834346 2080738 1999944 1905610 1747889 1991087
5130 1991087 1987996 2028991 1791828 1801297 1886862 2190012 1914866 2203023 2218905 2279173 2323855
5119 2323855 2349305 2367336 2321694 2591626 2726471 2847192 2611714 2833167 2755690 2859532
5109B859532M63802l61480N1137k54257L11978j62404o6379L16371K56108j41969
5099C272439o9732r6436k991J68216K64929m3482o0478L6068L23051q4846q1339
5088C625399J80177J72694K61722m2686j27857J54586L9050L9185O5098k4359
5078D343009L29099l38662P05828Q0745J574J76802M1291J52723K01407p6913
5068E616903M77523l01258p6046J33815l9127J6303L88700L86087J43657M28622
5058G175179k25127K42995K83359K04191M69945M25655K61558J95174m6370J93730
5048I180289N39374R4137L47518O40335J52677K9662P34545L67471P18334P25394
5038A3529736P38727K50286M72411Q58323M13007R93431P77532J196108R85204
$$ plain form
5109 2859532 3323334 2961854 3012991 2758734 3070712 2908308 2841929 3158300 3414408 3272439
5099 3272439 3202707 3106271 3103280 3271496 3536425 3492943 3432465 3468533 3791584 3706738 3625399
5088 3625399 3805576 3978270 4239992 4197306 4069449 4224035 4263085 4302270 4367368 4343009
5078 4343009 4672108 4333446 5039274 5120019 5121593 5298395 5339686 5492409 5693816 5616903
5068 5616903 6094426 5793168 5717122 5850937 5811810 5828113 6216813 6602900 6746557 7175179
5058 7175179 6950052 7193047 7476406 7680597 8150542 8576197 8837755 9032929 8986559 9180289
5048 9180289 9719663 9813800 10161318 10801653 10954330 10983992 11718537 12086008 12804342 13529736
5038 13529736 14268463 14518749 14991160 15849483 16262490 17255921 18033453 19229561 20214765
5029B0214765R79831J545352J531012J391220J598437J318928J431111J403770
5021C1414426R65522M80250L50193Q8393J30476J54555M88105Q54160J132900
5012C6058980J068575J592224K267085J650936J917534J998441J992406R75566
5004D9521747L31530k80257m69081j610713j692799j326109j298667j210726q59049
4995D1105876m22583k19349N19395M42007p6320O84783P16504J9944n0028n19073
4985D2201156j137788j066906o59536n77536j4469l84735l24359M81270R36498
4976C9453595J002134R86573N52262j16392m30558r50851o08202k84043P38938
4967D0343456J089009J116864J373099J159428J103225J198347J760604J799611
$$ plain form
5029 20214765 21194596 22739948 24270960 25662180 27260617 28579545 30010656 31414426
5021 31414426 32379948 32860198 33210391 33298784 33429260 33583815 34071920 34926080 36058980
5012 36058980 37127555 38719779 40986864 42637800 44555334 46553775 48546181 49521747
5004 49521747 49853277 49573020 49103939 47493226 45800427 44474318 43175651 41964925 41105876
4995 41105876 40683293 40463944 40983339 41425346 41349026 42033809 42750313 42770257 42720229 42201156
4985 42201156 41063368 39996462 39336926 38759390 38744921 38360186 38035827 38517097 39453595
4976 39453595 40455729 41442302 41994564 41878172 41447614 40496763 39888561 39604518 40343456
4967 40343456 41432465 42549329 43922428 45081856 46185081 47383428 49144032 50943643
4959E0943643J295700J033673P42013j16619j92402L01858M5581k19749R2917
4950E3926615J03044J018153J421661K083074K662039L065275K563241J587697
4942F8430799O75937k6697j35329K80833m75498q95054j279911j898684j624210
4933F3052186j309227m14242l91412M27159J127662J027149J928653J349427J135603
4924F7932958J042758K75942r43887j281010j622308j987477k471862k585717
4916E8359397k302461j670735j592253r31310n62909p12334p97135q23240r11920
4907D8055100r38419r57085j523120j884176k436152k360822k454656j820702
4899C3679968j707733j509128j195904j119853j101906j415493r36967n18407
$$ plain form
4959 50943643 52239343 53273016 54015029 53898410 53706008 54007866 54053447 53833698 53926615
4950 53926615 54029659 55047812 56469473 58552547 61214586 64279861 66843102 68430799
4942 68430799 69106736 69080039 68944710 69225543 68750045 67854991 66575080 64676396 63052186
4933 63052186 61742959 61328717 60937305 61364464 62492126 63519275 65447928 66797355 67932958
4924 67932958 68975716 69251658 68307771 67026761 65404453 63416976 60945114 58359397
4916 58359397 56056936 54386201 52793948 51862638 51299729 50587395 49790260 48967020 48055100
4907 48055100 47116681 46159596 44636476 42752300 40316148 37955326 35500670 33679968
4899 33679968 31972235 30463107 29267203 28147350 27045444 25629951 24692984 24174577
4891B4174577j479735q38304o98751p87345p82214j054318p38983n81986o19808
4882A6593133l72565o20370n70145p71563n70900k44979k34809j79416m65772
4873A2562614m38634j68256j08431l32185l45160k99458l23491l8295n1017N5900
4863A0513587J91264K1859n87831J7448n6306J28228K36257J40402J85632L65860
4853A1156400L49592J64217K33425j33994j65837k44669J50364q4259R7355r7615
4843A1424979j61838Q515m168J57225K45353K89766L16868L55403P31458O25309
4833A3988870R38011Q44135P41716J48828R9733o31159r64328o90367o36657p32882
4823A3105900o04315L76073q5993l55016O8791M43807L35789L72912K45260J12026
$$ plain form
4891 24174577 22694842 21856538 21157787 20370442 19588228 18533910 17794927 17212941 16593133
4882 16593133 16220568 15600198 15030053 14258490 13687590 13442611 13207802 13028386 12562614
4873 12562614 12123980 11955724 11847293 11515108 11169948 10870490 10546999 10508704 10457687 10513587
4863 10513587 10704851 10726710 10138879 10156327 10100021 10228249 10464506 10604908 10790540 11156400
4853 11156400 11505992 11670209 11903634 11769640 11603803 11359134 11509498 11425239 11522594 11424979
4843 11424979 11263141 11271656 11267488 11424713 11670066 11959832 12276700 12632103 13363561 13988870
4833 13988870 14926881 15771016 16512732 16661560 16761293 16130134 15165806 14475439 13838782 13105900
4823 13105900 12501585 12877658 12791665 12436649 12505440 12949247 13285036 13657948 13903208 14015234
4813A4015234R70835J001716O54473K52731j63940p32935j135959r07284r60776
4804A2994095q98947o63473q19063m45335j25273j02780r2335j2607J87928j45525
4794I876685K98581L78873M08884M71670J52730K43763N1821k06392r26453j234383
4784I515779q44492l76089n72020l57816k36229J01330R2950n22753m0775J28448
4774F888333j28341J89679L76739J48304K36632P0130l3316Q3518l55703l50890
4764G125085n198m88511p4152r5201K8366J51811k82303r4964j1945j50680R4340
4753F196648k16724J25797m3672J63270K1617o9590p6292q1112Q6941o6966P2314
4742F112231O6865R1860l7773K58455K07327j15256q1755j42895r5747j59518
$$ plain form
4813 14015234 14986069 15987785 16642258 16894989 16731049 15998114 14862155 13954871 12994095
4804 12994095 12095148 11431675 10612612 10167277 10042004 9939224 9846889 9834282 10022210 9876685
4794 9876685 10175266 10554139 10963023 11434693 11587423 11831186 11883007 11676615 10750162 9515779
4784 9515779 8671287 8295198 7723178 7365362 7129133 7230463 7323413 6800660 6759885 6888333
4774 6888333 6759992 6949671 7326410 7474714 7711346 7781476 7748160 7831678 7475975 7125085
4764 7125085 7119887 6631376 6557224 6462023 6490389 6642200 6359897 6264933 6252988 6102308 6196648
4753 6196648 5979924 6105721 6062049 6225319 6246936 6177346 6101054 6019942 6106883 6039917 6112231
4742 6112231 6179096 6270956 6233183 6491638 6698965 6583709 6501954 6359059 6263312 6103794
4732F103794J6997O1702O031M15161J23906j07442m89974K31962J27713k52470
4722F237380L00218J37783J29285o8111R9550K41226q8360J36581M68670J35094
4712G729316j51549j10945n9493L07524L42636l67009p0769K78071K33824J42014
4702H273620k24719J29121J42481q9105M11206K17135Q2581L24070R7145k7904
4692I335631L79442j44531j84360L40214J05317K17740K51447q3267M20572J12718
4682A0750923j30284K21986K9325j13214M12850J3387L43460L13200L66838L09038
4672A2517509O5069M02022L55173M28111K78613L26924J76510N40791N58391M69117
4662A6118230M16571N59834P46425M23858N32742J015568O39922Q21896J159361
$$ plain form
4732 6103794 6120791 6182493 6188524 6603685 6727591 6620149 6130175 6362137 6489850 6237380
4722 6237380 6537598 6675381 6804666 6736555 6836105 7077331 6988971 7125552 7594222 7729316
4712 7729316 7577767 7466822 7407329 7714853 8057489 7690480 7619711 7897782 8131606 8273620
4702 8273620 8048901 8178022 8320503 8231398 8642604 8859739 8942320 9266390 9363535 9335631
4692 9335631 9715073 9570542 9386182 9726396 9831713 10049453 10300900 10217633 10638205 10750923
4682 10750923 10620639 10842625 10871950 10758736 11171586 11184973 11528433 11841633 12208471 12517509
4672 12517509 12582578 12984600 13339773 13767884 14046497 14373421 14549931 15090722 15649113 16118230
4662 16118230 16534801 17094635 17841060 18264918 18797660 19813228 20453150 21275046 22434407
4653B2434407J125636N08223J581121J493833J645455J954429K269357K401269
4645C5413730K611907K901502K825935K746642K074725P70655K59230p29507j022383
4636D7852436n69589j25044L33334P65420J066291J396381K237975K551035L278937
4627E8787176L566832L393176L654949L577356J584942M23875j156630k430280
4619G1401396k874114k581132k425556j791372j056367o45031k67391p08342M7721
4610E9099812M11011N74172O67735R04489J90547K37511M56193n7660l12858J08108
4600F2279060l16550m05382n41906q07415q68523j208067n17974n51102n6297
4591E7005844K76317R52245P33754P16965M33876J55204k43773q24454m16912
$$ plain form
4653 22434407 23560043 24068266 25649387 27143220 28788675 30743104 33012461 35413730
4645 35413730 38025637 40927139 43753074 46499716 48574441 49345096 49604326 48874819 47852436
4636 47852436 47282847 47157803 47491137 48256557 49322848 50719229 52957204 55508239 58787176
4627 58787176 62354008 65747184 69402133 72979489 74564431 74988306 73831676 71401396
4619 71401396 68527282 65946150 63520594 61729222 60672855 60027824 59760433 59052091 59099812
4610 59099812 59510823 60084995 60752730 61657219 61847766 62085277 62541470 62483810 62170952 62279060
4600 62279060 61962510 61557128 61015222 60207807 59339284 58131217 57613243 57062141 57005844
4591 57005844 57282161 58234406 58968160 59685125 60119001 60274205 60030432 59205978 58789066
4582E8789066N2446K34831M7596L75899L57213N99861O91817J064172J216192
4573F3429093J089494J729274K350420J959751J397168L77992r58868j561200
4565F9813124j689433j740385j176108l11853k53871p814J36619O35136Q94358
4556F6299773J210375J850109K047079K598056K153171K689309K561438K451905
4548H3861215K546370K422648K964008L305729L916677M116083M151765M249085
4540A11533580M091167L491512K268301R18985L96589j31681q80865k022188k384314
4531A17281086l101243k733483k253158j722310j675418k186596l123632l335060
4523I7150186k652085j877453j829448q59627j69954M87504J06466L40992N04535
$$ plain form
4582 58789066 58841512 59076343 59123939 59499838 59857051 60456912 61148729 62212901 63429093
4573 63429093 64518587 66247861 68598281 70558032 71955200 72333192 71374324 69813124
4565 69813124 68123691 66383306 65207198 64895345 64641474 64633660 64770279 65405415 66299773
4556 66299773 67510148 69360257 71407336 74005392 76158563 78847872 81409310 83861215
4548 83861215 86407585 88830233 91794241 95099970 99016647 103132730 107284495 111533580
4540 111533580 115624747 119116259 121384560 122303545 122700134 122568453 121687588 119665400 117281086
4531 117281086 114179843 111446360 109193202 107470892 105795474 103608878 100485246 97150186
4523 97150186 94498101 92620648 90791200 89931573 89761619 90249123 90355589 90696581 91201116
4514I1201116R24783J514458J262943J146157N3473Q9256j6182M51721Q15894
4505I7443619Q57481N13525J089001J402427J960414K710011K041884J757357
4497A09775719J045761j29298j591631l122514m211856m092521m511102l671881
4489H9490677k982774k783765k024214j794462j197361j124507n64932o69972
4481G6348690j443040j448508j486174j372342j464259j277564j399822q57949
4473F5599032o28194l76031m76605j05466L80781j67650K90688k70132m20087
4464F3826336l02393m54485l87761K04764K92945P17454J473734Q18107P33536
4455F6922237O82818O8455m03919j100265j014415r48589j30202J82125O57296
$$ plain form
4514 91201116 92125899 93640357 94903300 96049457 96102930 96192186 96176004 96627725 97443619
4505 97443619 98301100 98814625 99903626 101306053 103266467 105976478 108018362 109775719
4497 109775719 110821480 110692182 109100551 105978037 101766181 97673660 93162558 89490677
4489 89490677 86507903 83724138 81699924 79905462 78708101 77583594 77018662 76348690
4481 76348690 74905650 73457142 71970968 70598626 69134367 67856803 66456981 65599032
4473 65599032 64970838 64594807 64118202 64012736 64393517 64225867 64516555 64246423 63826336
4464 63826336 63523943 63069458 62681697 62886461 63179406 63896860 65370594 66188701 66922237
4455 66922237 67605055 67673510 67269591 66169326 65154911 64206322 64076120 64258245 64915541
4446F4915541Q63971J020598N16625N15690j62818Q2690Q82915M07217k26759
4437F8815670n18860j322348j760212j778142k325599k501275k030430j997730
4429E4581074j850141j573750j578382l43580m23501n28811n17746l43483j80749
4420D7240931m17461j380185j594300j813833k338530j799374j719700j530670
4412C4646878j133331j277998q48546p42770j52265q03909r55932j160530j429448
4403B6142149j042537j047458r23751j015010o45959m35206m87085n32417J2760
4394B0025486q26220n95841k35651k02456l89192j05366J35491o1758k92285l52291
4384A7099917j45741k05697l89292j65817l11623j97484m29029M8574K03138j81013
$$ plain form
4446 64915541 65779512 66800110 67316735 67832425 67669607 67752297 68635212 69042429 68815670
4437 68815670 68296810 66974462 65214250 63436108 61110509 58609234 56578804 54581074
4429 54581074 52730933 51157183 49578801 49235221 48811720 48282909 47765163 47421680 47240931
4420 47240931 46823470 45443285 43848985 42035152 39696622 37897248 36177548 34646878
4412 34646878 33513547 32235549 31387003 30644233 30491968 29688059 28732127 27571597 26142149
4403 26142149 25099612 24052154 23128403 22113393 21467434 21032228 20545143 20012726 20025486
4394 20025486 19199266 18603425 18367774 18165318 17776126 17670760 17806251 17744493 17452208 17099917
4384 17099917 16954176 16748479 16359187 16193370 15881747 15684263 15255234 15303808 15506946 15325933
4374A5325933m39696R752M809K25618j04847k69628k60696j54018m73324p2762
4364A3791141j15025l4151l74104j24809m9188m07810k9905l96191m246j04870
4354A2150842L09525l43227m21870l89323L73259m03588n82475j91925q096k87608
4344A0205514n31693m72341L8284j63271j38966J61820j86285j31636P1282j26846
4334H725862o4913j83107j7004j9880j3774K75742P5933m48441P4537J0564O1058
4323H476577Q746L47855J40153l44536M3501P9603p6140k07998k23193l89375
4313G855193n03199P8493n4498r1706j02853l44774j7289k83559m0363J21551
4303F616996K4709n80598k42158p7172k23725P4872L2635J54680j21874k72948
$$ plain form
4374 15325933 14886237 14895989 14900798 15126416 15021569 14751941 14491245 14337227 13863903 13791141
4364 13791141 13676116 13641965 13267861 13143052 13093864 12686054 12656149 12259958 12255712 12150842
4354 12150842 12460367 12117140 11695270 11305947 11679206 11275618 10693143 10501218 10493122 10205514
4344 10205514 9673821 9201480 9239764 9076493 8937527 9099347 8913062 8781426 8852708 8725862
4334 8725862 8660949 8477842 8460838 8440958 8427184 8702926 8778859 8330418 8404955 8415519 8476577
4323 8476577 8485323 8833178 8973331 8628795 8672296 8751899 8675759 8467761 8244568 7855193
4313 7855193 7351994 7430487 7375989 7284283 7181430 6836656 6819367 6535808 6495445 6616996
4303 6616996 6641705 6061107 5818949 5741777 5518052 5592924 5625559 5780239 5658365 5385417
4293E385417K42922j16537J23380k42586l41363K72558j74862j45128m0726j29118
4283D833957l56L27101J70758r638l87371o800j85738J4477Q2395k19381K30435
4272D849839J39456j11071p6754j43225K28914j01967k96845j35751l4806M12202
4262D729992m7073j84763j18789K07545l83040L40513o2695k56271K58164n4955
4252D428628K04840q1071m43861K58063o6169J47670o9108k03344K64053N0857
4242D490558m77664R940J82877Q6092j27530o6117J91798j4407k61562O4647L7191
4231D115823o4126K06497m9410K6031R2506o4431J35088L9169J38327R0693m44402
4220D221765K43831K15721K7187R223J82706K2007R170j53447P5523J91423j41474
$$ plain form
4293 5385417 5628339 5511802 5635182 5392596 5051233 5323791 5148929 5003801 4963075 4833957
4283 4833957 4833601 5160702 5331460 5321822 4934451 4927651 4741913 4756390 4838785 4619404 4849839
4272 4849839 4989295 4878224 4801470 4658245 4887159 4785192 4488347 4352596 4317790 4729992
4262 4729992 4682919 4498156 4379367 4586912 4203872 4544385 4481690 4225419 4483583 4428628
4252 4428628 4633468 4552397 4108536 4366599 4300430 4448100 4378992 4175648 4439701 4490558
4242 4490558 4012894 4022834 4205711 4291803 4164273 4098156 4289954 4275547 4013985 4078632 4115823
4231 4115823 4051697 4258194 4208784 4234815 4327321 4262890 4397978 4437147 4575474 4666167 4221765
4220 4221765 4465596 4681317 4708504 4717727 4900433 4922440 4931610 4778163 4853686 5045109 4903635
4209D903635J62504K04501k4116j4023K04724P7665j38579K63991L57230P9415
4199F076947m230R1033M1234Q7708j23605J28056J64536M88445N3774k75292q8697
4188F639909P0140J011r7127L45566O9783l42069J48532J20170j22026k5798J59247
4177F967338k82077K86516j35550j37698L9912j42961J15209j71163J0887O1553
4167F611966k2656J83877O6817J97494k02476J1692J10466l81787r7236J20944
4157F599101P9539j40904l91817J76676R3399m0999J44854l9231K24863j81841
4147F523640j47137k9655M4775J41711J65980r8529K5363o5579J51791o5632n39849
4136F106879K95533J74785p7254K29239k13463N47608J34973j1056Q2703K32869
$$ plain form
4209 4903635 5066139 5270640 5246524 5232501 5437225 5514890 5376311 5640302 5997532 6076947
4199 6076947 6072717 6163750 6204984 6292692 6169087 6297143 6461679 6950124 7003898 6728606 6639909
4188 6639909 6710049 6711060 6613933 6959499 7029282 6687213 6835745 6955915 6833889 6808091 6967338
4177 6967338 6685261 6971777 6836227 6698529 6738441 6595480 6710689 6539526 6550413 6611966
4167 6611966 6589310 6773187 6840004 7037498 6835022 6846714 6957180 6575393 6478157 6599101
4157 6599101 6678640 6537736 6145919 6322595 6415994 6374995 6519849 6480618 6705481 6523640
4147 6523640 6376503 6346848 6391623 6533334 6699314 6600785 6626148 6560569 6712360 6646728 6106879
4136 6106879 6402412 6577197 6499943 6729182 6515719 7063327 7198300 7187244 7269947 7502816
4126G502816l1052K25797r4102J66527K28324J46464M6303K47770R4587L23644
4116H857078R6030L29757N43283p5579Q5568L22031L05932K41370L32967P9687
4106A1118124l71M13581L56070K43218K13116M03186K00037N63793N30114K95707
4096A4336575N77755L47017P74713M99335M83347O39723K94674J19034M85493
4087A8557666O31035P06736L42027P12523P09116J299583P90801P83849R49410
4078B5482746Q70813J386227Q77855J254391J377555J389531J261746J454718
4070C5355582J896324J408115J424909K046319J716795J572284K009677K028039
4062D9458044K386371K657957K754951K809172L399136L652869M388650M962423
$$ plain form
4126 7502816 7471764 7697561 7603459 7769986 7998310 8144774 8191077 8438847 8533434 8857078
4116 8857078 8953108 9282865 9826148 9750569 9836137 10158168 10464100 10705470 11038437 11118124
4106 11118124 11117753 11531334 11887404 12130622 12343738 12746924 12946961 13510754 14040868 14336575
4096 14336575 14914330 15261347 16036060 16535395 17018742 17658465 17953139 18072173 18557666
4087 18557666 19188701 19895437 20237464 20949987 21659103 22958686 23749487 24533336 25482746
4078 25482746 26353559 27739786 28617641 29872032 31249587 32639118 33900864 35355582
4070 35355582 37251906 38660021 40084930 42131249 43848044 45420328 47430005 49458044
4062 49458044 51844415 54502372 57257323 60066495 63465631 67118500 71507150 76469573
4054G6469573N521540N851365O568953O892665O333054N212127K714254L57117
4046A15920648q41218j679456j866817j559242r08086l80348N93853O80241J161447
4037A11121022J315284J351985J421022J087052J140641J358678J034412J584875
4029A21414971J892114J720759J925613J407219Q39003j91149j119917r06411
4021A26982202j560366l30964J653135M591665P849800J1769598J0130722K21533
4013A61307325p499012j3023974j3918590j2187218j0398255r198409p399809
4006H7682058o136254m786558m291686l417000k721783k161279j680411k049581
3998F0437506j213578r68734n33282q47661o74839p28883j411893j491172j813881
$$ plain form
4054 76469573 81991113 87842478 94411431 101304096 107637150 112849277 115563531 115920648
4046 115920648 115079430 113399974 111533157 109973915 109065829 108685481 109279334 109959575 111121022
4037 111121022 112436306 113788291 115209313 116296365 117437006 118795684 119830096 121414971
4029 121414971 123307085 125027844 126953457 128360676 129199679 129008530 127888613 126982202
4021 126982202 125421836 125090872 126744007 131335672 139185472 150955070 161085792 161307325
4013 161307325 153808313 140784339 126865749 114678531 104280276 95081867 87682058
4006 87682058 81545804 76759246 72467560 69050560 66328777 64167498 62487087 60437506
3998 60437506 59223928 58255194 57721912 56874251 56199412 55470529 54058636 52567464 50753583
3989E0753583j551994j329726j341591j050900n49831r45706n39096j065960j076314
3980D1302465j157310j150416p78585q19245o27175m21729j127092j129258q39229
3971C3252426q15855r12368r17563l80238l49217m50861j50678l29080l14052
3962B8632514J75909K23555K23453L00402M73110L76456K72374N07308M00211
3953C1585292K92184m5748J86932K13707k85626m47557r57066j068704r76145
3944B8497269j229587q62577o35126j154956p37669l65579n99109m52436n45334
3935B1914896N3226m2281q43751o06387o66523m82957o60919p90379n50081k85189
3925A7039655n53430j46198l67087j74777m83115n90084j85372q64m55188n11267
$$ plain form
3989 50753583 49201589 47871863 46530272 45479372 44929541 43983835 43444739 42378779 41302465
3980 41302465 40145155 38994739 38216154 37396909 36769734 36348005 35220913 34091655 33252426
3971 33252426 32436571 31524203 30606640 30226402 29877185 29426324 29275646 28946566 28632514
3962 28632514 28808423 29031978 29255431 29555833 30028943 30405399 30677773 31185081 31585292
3953 31585292 31877476 31831728 32018660 32232367 31946741 31499184 30542118 29473414 28497269
3944 28497269 27267682 26405105 25769979 24615023 23877354 23511775 22912666 22460230 21914896
3935 21914896 21968122 21925841 21082090 20475703 19809180 19326223 18665304 17874925 17324844 17039655
3925 17039655 16486225 16340027 15972940 15798163 15315048 14724964 14539592 14538728 14083540 13572273
3915A3572273J43888R765k94132M3151j44614L57451k2822j05633m1983j25943
3905A3391401k07067q3815L51398o5055O2877n5393J26642O1159J54145K91137
3895A4027429J24369M25157O11628M42333J40070P410N09435J021043Q08252O58006
3885A8775132N97214J90564M61938N09967N0887L20728N58470O08750O66222O71796
3875B3411668R12064M41041P53171J108773R23340J040432J552447J544155J482673
3866C3169764J873780K387777J686842J191196Q81740L57675L25679J06754P52425
3857D2733632P24031J078899M44023P93880J574798J813033J893992K536465K318513
3848E5911266K604834K226209J905876J528921O21020M55584j76802K80914N31783
$$ plain form
3915 13572273 13716161 13725926 13431794 13474945 13330331 13687782 13664960 13559327 13517344 13391401
3905 13391401 13184334 13100519 13451917 13386862 13449739 13394346 13520988 13582147 13736292 14027429
3895 14027429 14151798 14576955 15188583 15630916 15770986 15778396 16287831 17308874 18117126 18775132
3885 18775132 19372346 19562910 20024848 20534815 20585702 20906430 21464900 22073650 22739872 23411668
3875 23411668 24323732 24764773 25517944 26626717 27550057 28590489 30142936 31687091 33169764
3866 33169764 35043544 37431321 39118163 40309359 41191099 41548774 41874453 41981207 42733632
3857 42733632 43457663 44536562 44980585 45774465 47349263 49162296 51056288 53592753 55911266
3848 55911266 58516100 60742309 62648185 64177106 64798126 65253710 65076908 65357822 65889605
3839F5889605R85033J409811J819472J835261K306872L108634L763847L988527
3831H5107062N202580N502138N888394O485027P115324P847668R305422J1044782
3823A43498397J3522703J5864449J6594870J3778472N724418m550497j2669843
3816A91762969j5964906j5519166j3026318j0727188r355445q149280p337583
3809A11683083o143894n464614m574550l562420k831444j880564j484491j397895
3801H4343211j144752j365494j835114j861368k388193k914155l593440l914189
3793F5326506l518658l874185l664555l371978l297946l008956k403594k130239
3785D0056395k036248j422690j832513j308458j291202j151440q72728j211909
$$ plain form
3839 65889605 66874638 68284449 70103921 71939182 74246054 77354688 81118535 85107062
3831 85107062 90309642 95811780 101700174 108185201 115300525 123148193 132453615 143498397
3823 143498397 157021100 172885549 189480419 203258891 208983309 204432812 191762969
3816 191762969 175798063 160278897 147252579 136525391 127169946 119020666 111683083
3809 111683083 105539189 100074575 95500025 91937605 89106161 87225597 85741106 84343211
3801 84343211 83198459 81832965 79997851 78136483 75748290 72834135 69240695 65326506
3793 65326506 61807848 57933663 54269108 50897130 47599184 44590228 42186634 40056395
3785 40056395 38020147 36597457 34764944 33456486 32165284 31013844 30141116 28929207
3777B8929207o59627o82125p93541l73802m58122k87794l42206p13220l96672
3768B4222098l79335j06696K27961k89502p3696L80173j50970L63333j12433K44152
3758B4325085J63645K18288M63490L97247N69577O57325R55405J046010J207963
3749C0004035Q81562R80303J207762L08566J19214j55554m31379n01647l71414
3740C2041448j97614J72002N19985O31168N99568R41004Q12461J111928L16613
3731C6948563k60290j41553j70306j028625j571870j067356r41601j240284j083260
3722B9443418n39465p23614Q143l32695l9081M52949j2711p23533m79624j117227
3712B5936560j336030j701696j655594j229441j186588j034991n99499r98361
$$ plain form
3777 28929207 28269580 27587455 26793914 26420112 25961990 25674196 25331990 24618770 24222098
3768 24222098 23842763 23736067 23964028 23674526 23600830 23981003 23830033 24193366 24080933 24325085
3758 24325085 24488730 24707018 25170508 25567755 26137332 26794657 27750062 28796072 30004035
3749 30004035 30885597 31865900 33073662 33382228 33501442 33345888 32914509 32412862 32041448
3740 32041448 31843834 32015836 32535821 33166989 33766557 34707561 35520022 36631950 36948563
3731 36948563 36688273 36546720 36376414 35347789 33775919 32708563 31766962 30526678 29443418
3722 29443418 28903953 28180339 28188482 27855787 27816706 28269655 28256944 27533411 27053787 25936560
3712 25936560 24600530 22898834 21243240 20013799 18827211 17792220 17192721 16194360
3704A6194360m59571l80432p42513q60301k64363k77161l90952k98783n41506
3695A1978778l10281j88274q1666k04929n63259k01962l47769m6364n49437j16113
3685I368724j46147J22572n0753j28602j99578m78178k06901J50637K3067o14422
3675G840419J38814M6678k56894k01881J54183K63308j40259j37540k4805N1809
3665G733832R2147j12400j957N6705O8639o5126j00828O0532j36736P0713k14583
3654G450938r4344Q0744M00533l46947J87488K4643Q0459K61211j20648j7668
3644G906409K37089J97724N061P9459j53255M95584m77730j49875L9005J94197
3634H373668L0215n4758K48209N86647M47372K27413k66097n31405l55469k99374
$$ plain form
3704 16194360 15734789 15354357 14611844 13751543 13487180 13210019 12819067 12520284 11978778
3695 11978778 11668497 11480223 11398557 11193628 10630369 10428407 10080638 10034274 9484837 9368724
3685 9368724 9222577 9345149 9294396 9165794 8966216 8488038 8281137 8431774 8454841 7840419
3675 7840419 7979233 8025911 7769017 7567136 7721319 7984627 7844368 7706828 7682023 7733832
3665 7733832 7825979 7713579 7711622 7768327 7836966 7771840 7671012 7731544 7594808 7665521 7450938
3654 7450938 7356594 7437338 7837871 7490924 7678412 7703055 7783514 8044725 7924077 7906409
3644 7906409 8143498 8341222 8346283 8425742 8272487 8768071 8290341 8140466 8179471 8373668
3634 8373668 8403883 8349125 8597334 9183981 9631353 9858766 9592669 9061264 8705795 8406421
3624H406421o4252k1916j50678K75676P703j3365K5273j6252K46202l39984P2762
3613H427590K55797J94195J61189j52852J02906J7946M46361k4492P6820Q0564
3603I586024J09089L80908L67669o5631J36417L84848J40264L75200M10115k4590
3593A1800313K02613L58939M02487J28583L19907J08148L51861K96702M07089
3584A4376642P4148N84283L71065L79281M15449N74484P56044M41816N94718N30395
3574A9098325N07301J016197Q49625Q70981O92000R00951J310735J276310J024613
3565B7547038J175233J641418J813302J956089J966276K072302J816734K121886
3557D2110278J993235K222481J929004K768964K641952J740404J584667J085985
$$ plain form
3624 8406421 8342169 8320253 8169575 8445251 8452954 8439589 8464862 8448610 8694812 8354828 8427590
3613 8427590 8683387 8877582 9038771 8885919 8988825 9006771 9453132 9428640 9505460 9586024
3603 9586024 9695113 10076021 10443690 10378059 10514476 10899324 11039588 11414788 11824903 11800313
3593 11800313 12002926 12361865 12764352 12892935 13212842 13320990 13672851 13969553 14376642
3584 14376642 14450790 15035073 15406138 15785419 16200868 16775352 17531396 17973212 18567930 19098325
3574 19098325 19605626 20621823 21471448 22342429 23034429 23935380 25246115 26522425 27547038
3565 27547038 28722271 30363689 32176991 34133080 36099356 38171658 39988392 42110278
3557 42110278 44103513 46325994 48254998 51023962 53665914 55406318 56990985 58076970
3549E8076970N23849J3596l746j5102n93065K3084l45247K4286N20280O21643
3539E8846548M93438k51192K3623r4197l83307o16380k70356o91249j138089j384736
3529E4534103j142643j073544j299691o45420j089155o38577l08537l08023J95916
3520D8224429M6689J02563L95447N91555N06461N53899Q74234J025816J333044
3511E3654137J121039J140461J499813J951204J492096J719524K106567J847748
3503F6532589K249101K249319K661714L058213K442894K392949K840330K308182
3495H6735291K000275K241097J818620J964572J907563J908951J900861K033970
3487A02511200K045484J607843J853117J644303J211628J248384P70077P48217
$$ plain form
3549 58076970 58600819 58614415 58610669 58595567 58002502 58025586 57680339 57704625 58224905 58846548
3539 58846548 59339986 59088794 59112417 59018220 58634913 58018533 57748177 57056928 55918839 54534103
3529 54534103 53391460 52317916 51018225 50372805 49283650 48645073 48336536 48028513 48224429
3520 48224429 48271118 48373681 48769128 49360683 49867144 50421043 51295277 52321093 53654137
3511 53654137 54775176 55915637 57415450 59366654 60858750 62578274 64684841 66532589
3503 66532589 68781690 71031009 73692723 76750936 79193830 81586779 84427109 86735291
3495 86735291 88735566 90976663 92795283 94759855 96667418 98576369 100477230 102511200
3487 102511200 104556684 106164527 108017644 109661947 110873575 112121959 112892036 113640253
3479A13640253M33570P46746K88988P92089J262939L89625L38429J02959k70295
3470A17725303p04133j322970j512819j113883j320102j306731j353171k238396
3462A06853098j855952j825246k335155k288227k882551l440284k897947k953062
3454H6374674l006089k775345k679213k536347k476028k529849k848067j948290
3446F5575446k228226k239983j569155k075699j569981j844580j503655j436238
3438E1107929j399969j222572p84660m75125l74707J53217r9333J8754O93272
3429D7616806J436981J168852J843571K313877L037734L939420N116951N952831
3421G2427023P021012O744446M729635J456145l100403n699136p111319p792893
$$ plain form
3479 113640253 114073823 114820569 115109557 115901646 117164585 117554210 117892639 117995598 117725303
3470 117725303 117021170 115698200 114185381 113071498 111751396 110444665 109091494 106853098
3462 106853098 104997146 103171900 100836745 98548518 95665967 92225683 89327736 86374674
3454 86374674 83368585 80593240 77914027 75377680 72901652 70371803 67523736 65575446
3446 65575446 63347220 61107237 59538082 57462383 55892402 54047822 52544167 51107929
3438 51107929 49707960 48485388 47700728 47225603 46850896 47004113 46904780 46923534 47616806
3429 47616806 49053787 50222639 52066210 54380087 57417821 61357241 66474192 72427023
3421 72427023 79448035 86192481 90922116 92378261 89277858 83578722 76467403 68674510
3413F8674510o768222n578033m460849m077580l241193k632116k558628k141178
3405C7216711j967336j728589j950776j228181j095317j034344q65695q77357
3397B6469116p11440p82505p06032k61933q40437j28326p77409m87911l12951
3388B1460172m23331M3288q2856l64935l18565K2166j14990m82350l35759J1376
3378A9414216k83860r252k19703n0167p891k62720l98217j7537m99227K14184
3368A7879826l11119j51411r7482k47454k23144K01042K6557q1690j67194P5415
3358A6903346L08945J63214j5985K67424k138K66439N27021J51323J9991J73100
3348A8762680J13597L97887O95488J60387q957L80525M00098L06303J43694M03531
$$ plain form
3413 68674510 61906288 56328255 51867406 47789826 44548633 41916517 39357889 37216711
3405 37216711 35249375 33520786 31570010 30341829 29246512 28212168 27346473 26469116
3397 26469116 25757676 24975171 24269139 24007206 23166769 23038443 22261034 21773123 21460172
3388 21460172 21036841 21080129 20997273 20632338 20313773 20335939 20220949 19738599 19402840 19414216
3378 19414216 19130356 19121104 18901401 18851234 18843343 18580623 18182406 18164869 17665642 17879826
3368 17879826 17568707 17417296 17319814 17072360 16849216 17050258 17076815 16995125 16827931 16903346
3358 16903346 17212291 17375505 17359520 17626944 17624806 17891245 18418266 18569589 18589580 18762680
3348 18762680 18876277 19274164 19969652 20130039 20121082 20501607 20901705 21208008 21351702 21755233
3338B1755233N64438L59193J79099P5916K3701l70648K857j79217j09167L53670
3328B2655075J2730J93550n5027j97508J74455j91840j33013O3944j16337K61664
3318B2667693q2034J81268N01496P3588M68747M0849P36398R10367N07437N02273
3308B6508082P62185M49778K61562R96103O67854L99985O95921M38469O24702
3299C1804641O22310O37474O02986M00518O51410Q08486K94902R61775K32865
3290C7017367O69462N24350P04111J60494L28739P74139R26552O46593N62178
3281D2313985P71643N88949N94437P47208J063472P66510R12905Q76465J158032
3272D9793606P65799J240364J159975P99995J407968J571636J307684J629979
$$ plain form
3338 21755233 22319671 22678864 22857963 22933879 22957580 22586932 22589789 22410572 22301405 22655075
3328 22655075 22667805 22861355 22806328 22608820 22783275 22591435 22458422 22522366 22406029 22667693
3318 22667693 22585659 22766927 23268423 23342011 23810758 23851607 24588005 25498372 26005809 26508082
3308 26508082 27270267 27720045 27981607 28977710 29645564 30045549 30741470 31179939 31804641
3299 31804641 32426951 33064425 33667411 34067929 34719339 35527825 35822727 36784502 37017367
3290 37017367 37686829 38211179 38915290 39075784 39404523 40178662 41105214 41751807 42313985
3281 42313985 43085628 43674577 44269014 45016222 46079694 46846204 47759109 48635574 49793606
3272 49793606 50559405 51799769 52959744 53759739 55167707 56739343 58047027 59677006
3264E9677006J665806K371730J816314J927463K445374K775523K545240K751164
3256G7975620K885724L267434L751614L866956L699310M321635L852318M121464
3248A07742075L985627L825234L854503L428673L836973L866174M001570L826263
3240A38367092L626011L274534K419002K139672J879665J053811J072508P70741
3232A54603036P27950J52983M82985J72579l76863l66847m60575o48009p49422
3223A53537817q89693m21403l41838l68530J43084K08319K75531Q38239J088656
3214A54070182J465960K397100K729975L150616L654909L826738M230685M510047
3206A80036212M416581M479165M997517N503186N575140O333948O646421O302478
$$ plain form
3264 59677006 61342812 63714542 65530856 67458319 69903693 72679216 75224456 77975620
3256 77975620 80861344 84128778 87880392 91747348 95446658 99768293 103620611 107742075
3248 107742075 111727702 115552936 119407439 122836112 126673085 130539259 134540829 138367092
3240 138367092 141993103 145267637 147686639 149826311 151705976 152759787 153832295 154603036
3232 154603036 155330986 155483969 155966954 156139533 155762670 155395823 154935248 154287239 153537817
3223 153537817 152648124 152226721 151884883 151516353 151659437 151867756 152143287 152981526 154070182
3214 154070182 155536142 157933242 160663217 163813833 167468742 171295480 175526165 180036212
3206 180036212 184452793 188931958 193929475 199432661 205007801 211341749 217988170 224290648
3198B24290648N972095N735176N401192N205322M653445M535939M173567L609170
3190B63576554L189868K673881K277528K147728K050945J530592J428905J400031
3182B80276032J483929J321532J249983J154785J582546K079204K397885L006135
3174B94552031M566690O049410Q237747R468619J0088405R790909P402870M619025
3166C54775706Q57227l554195n947861p628996p741017o729891o483248n983204
3158C11564521o367312q205320j1046336j4576636j7167245j8384964j8996525
3151B16820183j8072245j6119424j4282324j2403457j0440627r257038p806893
3144A28438175o853498n941495m685933m529192l739191l379900l174012k808478
$$ plain form
3198 224290648 230262743 235997919 241399111 246604433 251257878 255793817 259967384 263576554
3190 263576554 266766422 269440303 271717831 273865559 275916504 277447096 278876001 280276032
3182 280276032 281759961 283081493 284331476 285486261 287068807 289148011 291545896 294552031
3174 294552031 299118721 305168131 313405878 322874497 332962902 342753811 350156681 354775706
3166 354775706 355632933 352078738 346130877 338501881 330760864 324030973 317547725 311564521
3158 311564521 305197209 296991889 285945553 271368917 254201672 235816708 216820183
3151 216820183 198747938 182628514 168346190 155942733 145502106 136245068 128438175
3144 128438175 121584677 115643182 110957249 106428057 102688866 99308966 96134954 93326476
3136I3326476k514521k443684k723100k794334k229669k495556k352864j959746
3128G3813002j787500j942518j421493j807405k014332k159345j855573j546900
3120E9277936j941606j860016j312488j556910j737608j239792j267563j232995
3112D7128958j432299j113472r01754q25501q86516n40447q00546n43790n87673
3103C9496960m20261p64680l87307j26750j1660l22765o77620j93300L5375j50452
3093C6477540k40353J72851J03168o9956P19990M81423L58084O89989M21983K81497
3083C9396216O91594R83649R67014R24654J408286J923424J878900K207348K256666
3074E2637751K411536K340711K196136K323105K580283K511004K375957K718477
$$ plain form
3136 93326476 90811955 88368271 85645171 82850837 80621168 78125612 75772748 73813002
3128 73813002 72025502 70082984 68661491 66854086 64839754 62680409 60824836 59277936
3120 59277936 57336330 55476314 54163826 52606916 50869308 49629516 48361953 47128958
3112 47128958 45696659 44583187 43681433 42855932 41969416 41428969 40628423 40084633 39496960
3103 39496960 39076699 38312019 37924712 37797962 37786302 37463537 36785917 36592617 36627992 36477540
3093 36477540 36237187 36410038 36513206 36443250 37163240 37644663 38002747 38692736 39114719 39396216
3083 39396216 40087810 41071459 42038473 42963127 44371413 46294837 48173737 50381085 52637751
3074 52637751 55049287 57389998 59586134 61909239 64489522 67000526 69376483 72094960
3066G2094960L030411L352938L749437M088392M662491N259577N487283N042514
3058A06768003M549363L279147J974573Q82719o03060j483559j557407j163750
3050A12646029j300375j110489j025443j548837l119818m312064m849243n666351
3042H9713409o902883o553435o253754o019853n226824l784223l758813l305511
3034D7908113k944717k835256k147192k021435k019314j560934j609810j150806
3026C1618649j359605q04595q88391p45059q77955p38680p05142p47653k76886
3017B4474683m58551l16054n38229n7287n90861j25098l4865n1223j89239m44903
3007B1668373k00892o4659j30353j01951L2086O7929L66826k3778K02655J7507
$$ plain form
3066 72094960 75125371 78478309 82227746 86316138 90978629 96238206 101725489 106768003
3058 106768003 111317366 114596513 116571086 117453805 116850745 115367186 113809779 112646029
3050 112646029 111345654 110235165 109209722 107660885 104541067 100229003 95379760 89713409
3042 89713409 82810526 76257091 70003337 63983484 58756660 54972437 51213624 47908113
3034 47908113 44963396 42128140 39980948 37959513 35940199 34379265 32769455 31618649
3026 31618649 30259044 29454449 28566058 27820999 26943044 26204364 25499222 24751569 24474683
3017 24474683 24016132 23700078 23161849 23104562 22513701 22388603 22353738 22302515 22113276 21668373
3007 21668373 21467481 21402822 21272469 21170518 21202604 21270533 21637359 21613581 21816236 21833743
2997B1833743M39180K25165N18500R66236N53166N83417J096542J522918J871837
2988B9610704K868276K633948K626232Q71450j352237k235062k354997j869368
2980C0798946q40598j101126q22262m24404P1956l10159p2194N85915M69797K69850
2970B8625721J255159J391679J906121K337024K916596L386335J896149j01022
2962D3613762j695997k063865j983640j425789r70339q34687j36621o8076M5146
2953C4479894M13973M28587R86881O69253J035738J593037J572391K002965K220496
2944D5403215K492433K423543K228225J136636m70759j843439k279465k023350
2936D7067039j827616k189968j595721j279959p86286j80813l17961q6065Q55622
$$ plain form
2997 21833743 22272923 22498088 23016588 23982824 24535990 25119407 26215949 27738867 29610704
2988 29610704 32478980 35112928 37739160 38610610 37258373 35023311 32668314 30798946
2980 30798946 29958348 28857222 28034960 27610556 27682512 27372353 27300159 27886074 28355871 28625721
2970 28625721 29880880 31272559 33178680 35515704 38432300 41818635 43714784 43613762
2962 43613762 41917765 39853900 37870260 36444471 35474132 34639445 34502824 34434748 34479894
2953 34479894 34893867 35322454 36309335 36978588 38014326 39607363 41179754 43182719 45403215
2944 45403215 47895648 50319191 52547416 53684052 53213293 51369854 49090389 47067039
2936 47067039 45239423 43049455 41453734 40173775 39387489 39206676 38888715 38802650 39658272
2927C9658272P72301J101202J322882J174690Q68814J299658J241628K149135
2919D9588582K681894L485403M764907N622061P821038J0270660J1314890O330299
2911A01879734P08071k310665o899403q560305q968229q042199n790846l956033
2903E8060125k764749k005016r22652m65792M74399J386118K264860L326870L990571
2894F3344734O181330Q221320J0100314O606093J513682k388306p911719r377709
2886G6289739j0202901q977801o849514n222159m181505k777194k373952k149921
2878C3554792k184905j391304j046476o54172j115515j173912r41138m59342m76045
2869B4111983r9198J37876j8346j081007j589361j340007q93977j156418r53864
$$ plain form
2927 39658272 40430573 41531775 42854657 44029347 44898161 46197819 47439447 49588582
2919 49588582 52270476 55755879 60520786 66142847 73963885 84234545 95549435 101879734
2911 101879734 102587805 100277140 93377737 84817432 75849203 67807004 62016158 58060125
2903 58060125 55295376 53290360 52367708 51901916 52376315 53762433 56027293 59354163 63344734
2894 63344734 69526064 77747384 87847698 94453791 95967473 93579167 85667448 76289739
2886 76289739 66086838 57109037 50259523 45037364 40855859 38078665 35704713 33554792
2878 33554792 31369887 29978583 28932107 28277935 27162420 25988508 25047370 24588028 24111983
2869 24111983 24012785 24150661 24132315 23051308 21461947 20121940 19227963 18071545 17117681
2860A7117681n05994m89624k05399j71690n33724j26028j67726j89123J56461
2851A4884834k55167k5969L65627O89431M66125j54979n88200r87714j221004
2842A3172984o90278o45959l31928m18268k65719k30023l72755m12401J92778
2833I998431J82286m96770j50930k70449l20994k12617m67740l75804q4610j06197
2823G694606l55832j66433m69443j01350K2681j41049j74466q1918k56544m2809
2813E927443k57279j85050j20516M5694k01913Q553J41659l79021N728K6347j30532
2802D881113j42618J67234k79956K3595m67385J23259K14241j10548j50063j85969
2792D072903j64391j1139L6543p3502J2666p7678M4956n0104r8049q8l09173J16203
$$ plain form
2860 17117681 16611687 16122063 15916664 15744974 15211250 15085222 14917496 14728373 14884834
2851 14884834 14629667 14603698 14969325 15658756 16124881 15969902 15381702 14393988 13172984
2842 13172984 12482706 11836747 11504819 11086551 10820832 10590809 10218054 9805653 9998431
2833 9998431 10180717 9683947 9533017 9262568 8941574 8728957 8261217 7885413 7800803 7694606
2823 7694606 7338774 7172341 6702898 6601548 6624229 6483180 6308714 6226796 5970252 5927443
2813 5927443 5670164 5485114 5364598 5410292 5208379 5216932 5358591 4979570 4985298 5011645 4881113
2802 4881113 4738495 4905729 4625773 4649368 4181983 4305242 4519483 4408935 4258872 4072903
2792 4072903 3908512 3897373 3933916 3860414 3873080 3795402 3840358 3790254 3692205 3692117 3382944 3499147
2780C499147Q5625k60413Q8442l457Q6592Q1015j06280j01901J16008r4206j58129
2769C232443K15037Q4316n3077N0861M902k42529J64738q4189J672p7027k91340
2758C005807L34891j70767P5150o4906l7113m8128l16409l177n154L12709K30064
2747C312967k36668L53749q2364n42627J76448L15852k87546r395J42722o2466
2737C080672J85045K80503j41129m5543K36710K13986r7982M4961R0841O3421
2727C911485M7142R4660K43644J3157M15709O2570M04272L72477M75258O24886
2717F665260M98477M55222K24621m74568o33640m20105k05431j18480k84032k32826
2707E474498m39416K08495k0622j14343Q5636J56600J46326J33901R1422J94376
$$ plain form
2780 3499147 3584772 3324359 3412801 3409344 3495936 3576951 3470671 3368770 3484778 3390572 3232443
2769 3232443 3447480 3531796 3478719 3529580 3534482 3291953 3456691 3372502 3374174 3297147 3005807
2758 3005807 3340698 3169931 3245081 3180175 3143062 3094934 2778525 2775348 2770194 3082903 3312967
2747 3312967 3076299 3430048 3347684 2805057 2981505 3297357 3009811 3000416 3143138 3080672
2737 3080672 3265717 3546220 3405091 3359548 3596258 3810244 3712262 3757223 3848064 3911485
2727 3911485 3958627 4053287 4296931 4310088 4725797 4788367 5192639 5565116 6040374 6665260
2717 6665260 7163737 7618959 7843580 7369012 6735372 6315267 6109836 5991356 5707324 5474498
2707 5474498 5035082 5243577 5222955 5108612 5194248 5350848 5497174 5631075 5722497 5916873
2697E916873M14759N80950M95302M29260K6432N418m77362m79194l82652m59887
2687F069899m36574q7947k44080n13986n9196m76926M6808J78260O3710j67862
2677D372106p107J2343l48328K24215J04484k80769N5499O7955J04384k65776
2667D039006j89406R9443r3505J81102j0055o7059l44724j8017L6647J74843J16111
2656C924386J27305k51645n6199j72925l04656j0052J30984j68817M7956j95708
2646C070629j77621Q1338O099m78002l71032L1004J59661L27678j84690k01284
2636B263780j14596o5795l63903K12679M20010o166p52882M51238L47961l94046
2626A998280k14949j8433j67976J97431J22980j86980J97640j21755n2296k24475
$$ plain form
2697 5916873 6331632 6912582 7407884 7837144 7863576 7868994 7391632 6912438 6529786 6069899
2687 6069899 5633325 5545378 5301298 4787312 4728116 4251190 4297998 4476258 4539968 4372106
2677 4372106 4364999 4377342 4029014 4253229 4357713 4076944 4132443 4200398 4304782 4039006
2667 4039006 3849600 3949043 3855538 4036640 4026585 3959526 3614802 3596785 3633432 3808275 3924386
2656 3924386 4051691 3800046 3743847 3570922 3266266 3256214 3387198 3218381 3266337 3070629
2646 3070629 2893008 2974346 2980445 2502443 2131411 2162415 2322076 2649754 2465064 2263780
2636 2263780 2149184 2083389 1719486 1932165 2352175 2346009 1593127 2044365 2392326 1998280
2626 1998280 1783331 1764898 1596922 1794353 1917333 1730353 1927993 1806238 1753942 1529467
2616A529467J54842j57794P9972n7781J8779Q7531k78879k40300j390r0110K9690
2605A074027K46925k53746J3499j5367J19033j32444K00527j68918L8503j23238
2595I98801K35104j85572R5091O8608l15629J66655q3828N2768k8883J05212j81110
2584I27217K72689k55482J97474p0388m09090j65746K99331J3197K7998J83425
2574A020625O5989m23973J40355J9971N2857k07757J0759J42385o7540J81817
2564I35488P0263k14870p1975J18574L3802J98704m20437J78478j55421j47679
2554E24927k05297K39255o6514p7595J49699N9832R5497O8063P3325K73221l93550
2543G40863J01317L6999j49122n9644J02425K0962o7253J50371M78380j10913
$$ plain form
2616 1529467 1684309 1526515 1606487 1548706 1567485 1655016 1376137 1135837 1134447 1044337 1074027
2605 1074027 1320952 1067206 1080705 1065338 1184371 1051927 1252454 1083536 1122039 998801
2595 998801 1233905 1048333 1143424 1212032 896403 1063058 979230 1031998 1003115 1108327 927217
2584 927217 1199906 944424 1141898 1071510 662420 496674 796005 809202 837200 1020625
2574 1020625 1086614 662641 802996 822967 875824 668067 678826 821211 753671 935488
2564 935488 1005751 790881 718906 837480 871282 1069986 649549 828027 672606 524927
2554 524927 319630 558885 492371 414776 564475 624307 719804 787867 861192 1134413 740863
2543 740863 842180 879179 730057 670413 772838 793800 726547 876918 1355298 1244385
2533A244385m03737J15766Q5710j57426O405K7052P6547k97539r4503o3149L4186
2522E73697K4873K58699j39362N6653k21032J9995j42302J69109K34852l47929
2512D87253R3082k44442K36289j18097R7797K77838m52151J54980J66109J43623
2502H42281j33035q6379J47032k42557J72598j4816Q2685j45280l00627J04845
2492D26747M13203k58264L4555p6398n3215j70043J15423J04994k31973J83086
2482D88115j06603l0454J59598J41689r3819k1183q7206K19941o3806l04197J82030
2471D84105J93421j48663R8012q9602l54390K89915O7238j51795p8054O4768K1827
2460C96782K86104k90232K01326J16194j57700k34384J21870K12707q0056J4575
$$ plain form
2533 1244385 840648 956414 1042124 884698 891103 918155 994702 697163 602660 539511 573697
2522 573697 598570 857269 717907 774560 553528 573523 431221 600330 835182 487253
2512 487253 580335 335893 572182 454085 551882 829720 377569 532549 698658 842281
2502 842281 709246 622867 769899 527342 699940 685124 767809 622529 321902 426747
2492 426747 839950 581686 616241 539843 486628 316585 432008 537002 305029 488115
2482 488115 381512 351058 510656 652345 558526 537343 450137 670078 606272 302075 484105
2471 484105 677526 528863 626875 537273 182883 472798 540036 388241 310187 374955 396782
2460 396782 682886 392654 593980 710174 552474 318090 439960 652667 572611 587186
2450E87186l86693O0054J93687N3998J69411j55900k29910j76124l446J9268M67296
2439E98827O1145k03086J49544J16251j74037L592L1651n6311m8867j28176k09929
2428A40604j43574K92646J23560j11582k43754L45838L5359j0678K7179L7872
2418D93470K41901m94634j95256J59411J55744J4863J32296k45198O910R7931
2408C67438k17007J07850l9983j95936J46833L44329n1074m35515K81513j5559
2398B92889K61848P7433p0848j59714r4284L1399K46903r7255m8196K489q4770
2387C57894L5799q5707r0737J74967l3573j88567k987M29633r4274l61144m61525
2376c20221L31881K36983o2012J91694j93332j64526q9009K09509K31224J34796
$$ plain form
2450 587186 200493 260547 454234 508232 677643 521743 291833 115709 112263 131531 598827
2439 598827 659972 456886 606430 722681 548644 552236 583887 527576 478709 350533 140604
2428 140604 -2970 289676 413236 301654 57900 403738 439097 428419 455598 493470
2418 493470 735371 240737 45481 204892 360636 375499 507795 262597 269507 367438
2408 367438 150431 258281 218298 22362 169195 513524 462450 26935 308448 292889
2398 292889 554737 632170 561322 401608 307324 338723 585626 488371 440175 442664 357894
2387 357894 393693 307986 217249 392216 358643 170076 167089 596722 502448 141304 -320221
2376 -320221 11660 248643 186631 378325 184993 20467 -68542 140967 372191 506987
2366E06987p0318r2042l36854K43642k0354J46819n7750L09000k13029K5473Q558
2355D50132o974K84770r3696k78240j33539M269n7969J35987o3258Q0593J29727
2344D51802j55815k03262l1924K94440j15512p413K99085L433n8108n2810k88999
2333A34917J18675K33079r4407j22073J91694j75898l6331J35203j62190K13050
2323D35719j19655R3699L4787j44506j25236m0743o1463j28926L61472P0596J79857
2312E55601k65914n3964j46162j18471M35830P5498l35516J7724N907m8030M4779
2301A67282K3260J16825K0154m7622J32122R0339J25488J23639l5649o6413p5819
2290E73606N2915j38654j718l20J02398o4874r3048J04446j70306J92984n4226
$$ plain form
2366 506987 436669 344627 7773 251415 231061 377880 320130 629130 416101 441574 450132
2355 450132 443158 727928 634232 355992 222453 226722 168753 304740 241482 322075 451802
2344 451802 295987 92725 60801 355241 239729 232316 531401 534834 476726 423916 134917
2333 134917 253592 486671 392264 270191 461885 285987 249656 384859 222669 435719
2323 435719 316064 409763 444550 300044 174808 134065 72602 -56324 305148 375744 555601
2312 555601 289687 235723 89561 -28910 406920 482418 146902 164626 170533 122503 167282
2301 167282 190542 307367 327521 279899 412021 502360 627848 751487 715838 649425 573606
2290 573606 626521 487867 486149 485829 588227 523353 430305 534751 364445 557429 503203
2279E03203J0910P1895j32580q1602j07590k57896K77677j12399M7574J13022
2269C32214k6861J73076r0829j40223k7541P8220J86583j42198M3532o2744M0388
2258C63617O7813K68582k32455j91013j8067j39840o2041J27806K13551L43728
2248G41681j48780k59720j39743P3448j464l1816M95477m68156j25300M7701p4313
2237A09015J76369P2912j35830J34066r3746m6877k36968J57244l7297J75869
2227B74757j2028J09356j48299M6480N7918j44991k70505k0842K82033J59751
2217C33630K548l52386J4213R18P7094K17557j45910K44803m4455q9962K46935
2206E04985q3287m2217k79181n0228J12924J79359K54544o2707k09975J71117
$$ plain form
2279 503203 514113 586008 453428 371826 264236 6340 284017 171618 219192 332214
2269 332214 305353 478429 387600 247377 219836 298056 484639 342441 385973 323229 363617
2258 363617 431430 700012 467557 276544 258477 118637 56596 184402 397953 741681
2248 741681 592901 333181 193438 266886 265422 233606 729083 260927 135627 183328 109015
2237 109015 285384 358296 222466 356532 262786 215909 -21059 136185 98888 274757
2227 274757 262729 372085 223786 270266 328184 183193 -87312 -108154 173879 333630
2217 333630 336178 -16208 -1995 -1077 76017 293574 147664 392467 348012 258050 504985
2206 504985 421698 379481 100300 50072 162996 342355 596899 534192 324217 495334
2196D95334K8706Q0799k21281m1003j853O9465q1927l130R6671k3188L3282j3645
2184D18230K30936N1007j29935N3406j57494k4608l6153l9731j53749R0899L24670
2173F27478j48330l1642j03853K81017Q1670J6805j92530l25011K87849L83945
2163H77398q537k73139k81248J27208M47336l144p0395J80826k19603k3913r1983
2152F60806K01451J28717K39999k72930r5180k972L67673k09282K79108r0846
2142A206544J48682J55350m5059J33704j41972Q1311J38271J54593K37508j20360
2132A948572O6781K49342l40493L22296n3950J0284L28221L5331K19971J18709
2122B905064J34345L48226O19463k2255O3725Q7726J85448J59322L77482K11823
$$ plain form
2196 495334 524040 604839 383558 342555 340702 410167 328240 325110 421781 398593 431875 418230
2184 418230 649166 700173 570238 623644 466150 441542 405389 365658 211909 302808 627478
2173 627478 479148 447506 343653 624670 706340 723145 530615 205604 493453 877398
2163 877398 868861 595722 314474 441682 889018 885874 815479 996305 776702 752789 660806
2152 660806 862257 990974 1230973 958043 862863 859891 1227564 1018282 1297390 1206544
2142 1206544 1355226 1510576 1465517 1599221 1457249 1538560 1676831 1831424 2068932 1948572
2132 1948572 2015353 2264695 1924202 2246498 2192548 2202832 2531053 2566384 2786355 2905064
2122 2905064 3039409 3387635 4007098 3984843 4048568 4136294 4321742 4481064 4858546 5070369
2112E070369L55302L42579M38475M17081O33814L23809M66753O25596N64918J177131
2102A0415827J327730R26168J037943J260320J657806J885404K581817L278622
2094B4371637M492502O589514Q672987R769989K538030m374668q404592q804461
2086C4850938o131338m492576l667269k530116k039280j165332j224220j185680
2078A2415127j420078j134606q15745p74189q62738k62422n05011o63372n58233
2069E418733j95024l42677o72q2958m05794K27164m08284p47184O0636o021k86869
2058C231050j81873q1373p4315q5146q9132J69339j25216l1054m43342l78109
2048A910829K17612K37448k77469j02931L39316j31546p0938n55220j24583K84264
$$ plain form
2112 5070369 5425671 5768250 6206725 6623806 7257620 7581429 8048182 8673778 9238696 10415827
2102 10415827 11743557 12669725 13707668 14967988 16625794 18511198 21093015 24371637
2094 24371637 28864139 35453653 44126640 53896629 56434659 52059991 43655399 34850938
2086 34850938 28719600 24227024 20559755 18029639 15990359 14825027 13600807 12415127
2078 12415127 10995049 9860443 9044698 8270509 7407771 7145349 6640338 5976966 5418733
2069 5418733 5223709 4881032 4880360 4797402 4391608 4618772 4210488 3463304 3523940 3517919 3231050
2058 3231050 3049177 2967804 2893489 2808343 2719211 2888550 2763334 2732280 2288938 1910829
2048 1910829 2128441 2365889 2088420 1985489 2324805 2193259 2122321 1567101 1442518 1726782
2038A726782j37039j37627K58300K4591k70270P8537p9163r5592j3576R1757n6791
2027A389909k53423m14637L90730j21716J29244j08962k20926o481P9959L8461
2017I02158l14607J2649r6340q7793L1655M72770j29662j81038j0483M80630o1534
2006A018405k37481j61093l8398L58287k02724K68409m47597o3106J1461J27006
1996F33169k00338k39635L43611l20713J25017R8033j03561L4161r2385J18778
1986C96137J07435J09059o7472k39403N32915q9901k64876K75352l42690r8145
1976C18411K58139k78592L99359O3165k99818J77817O8648l8794j25033k10297
1966C33005L1987J3330R051M1581j00687Q7112R5115l43291r5089K10211J29539
$$ plain form
2038 1726782 1589743 1452116 1710416 1735007 1464737 1543274 1464111 1368519 1354943 1446700 1389909
2027 1389909 1136486 721849 1112579 990863 1120107 1011145 790219 783738 863697 902158
2017 902158 587551 600200 503860 416067 447722 920492 790830 609792 599309 1079939 1018405
2006 1018405 780924 619831 581433 939720 736996 1005405 557808 494702 506163 633169
1996 633169 432831 193196 536807 216094 341111 439144 335583 369744 277359 396137
1986 396137 503572 612631 545159 305756 838671 748770 483894 759246 416556 318411
1976 318411 576550 297958 697317 760482 460664 638481 707129 668335 543302 333005
1966 333005 364992 378322 387373 428954 328267 415379 510494 167203 72114 282325 411864
1955D11864j38649M3650K2277j68827k8380J69263M9720l99513j78416j1038M04472
1944A76423J58091l51614J97681J33294J42638j35577J91461k82891N668O3970
1934B99144P8673n0531j24340L18980j07538k11222r6800k40937K11973k85766
1924b08364L40771j66815K13534P5896q1903J17513P1258j48058r2083l6985K58593
1913C43357J11975p7480r6592J24683r4553j49776L3705L1848j10311J81700N922
1902C04478K0260l58263K0128L52643O2069j31608m02220M88868L3641q5169J65688
1891D70515j07816R2569J35314P6595j86089j1133l7932j08118K2397l60669j10961
1880a25328L24883k47950J1693O21093n6542l82082O4748L7209P7157J26602m63400
$$ plain form
1955 411864 273215 316865 339142 170315 141935 311198 360918 -38595 -217011 -228049 176423
1944 176423 334514 -17100 180581 313875 456513 320936 512397 229506 235174 299144
1934 299144 377817 327286 202946 521926 414388 203166 106366 -134571 77402 -208364
1924 -208364 132407 -34408 179126 255022 173119 290632 361890 213832 121749 84764 343357
1913 343357 455332 377852 281260 405943 311390 161614 195319 227167 116856 298556 304478
1902 304478 324738 -33525 -13397 339246 401315 269707 -132513 356355 389996 304827 470515
1891 470515 362699 455268 590582 667177 481088 469955 432023 323905 346302 -14367 -125328
1880 -125328 199555 -48395 -36702 584391 527849 145767 210515 247724 324881 451483 -11917
1869a1917P8348j48084J06142L9581j46197N8511M5700j54088J60673p58N43383
1858E71294k41937j78823m07990J0306r1871L60472j20326J51433q2562j41618
1848a71622K33667L0109j34585J12981m1716K61721k41629k00940K52676j26941
1838b6279M5593k11340J99215M6769R1827o2373j93140l6959j7270q3296O9198
1827a78055K28314K4408k27801n9072J99768P9531L45149M657k97866q5584J43046
1816A76495k38651j27386K10460l2978L43127r6571j91363p1928J65067N9743
1806A96015J37366l67123j05690J49548R8838k15367N1255P7726m44213M14865
1796f780K60667j65470J8467n6316j04901K25404O8666K10034J02695m67763k63410
$$ plain form
1869 -11917 66431 -81653 24489 64070 -82127 -23616 22084 -132004 28669 27911 571294
1858 571294 329357 150534 -257456 -247150 -339021 21451 -98875 52558 -30004 -171622
1848 -171622 62045 92154 -42431 70550 28834 290555 48926 -152014 100662 -26279
1838 -26279 19314 -192026 7189 53958 145785 83412 -109728 -146687 -163957 -247253 -178055
1827 -178055 50259 74667 -153134 -212206 -12438 67093 412242 416899 119033 33449 176495
1816 176495 -62156 -189542 20918 -12060 331067 234496 43133 -28795 136272 196015
1806 196015 333381 -33742 -139432 10116 108954 -106413 -55158 22568 -421645 -6780
1796 -6780 253887 88417 106884 50568 -54333 171071 239737 449771 552466 84703 -178707
1785a78707K02074J54379j06450J00522N7549m5649k88455J50392K53030m08567
1775a09882J56996j05146o4631M3720k5538J37043j10751J44627Q7639k87613
1765a33536J42728P7527R205J4187p8509n1322J55582K30601k63424j63494j03158
1754a63613K83529R6876J84728j4584o3582k34400O4953o389p5681J24868k21409
1743b4704l73232R3571J87646k4331p502j7731r0522N5573J45511J05726O7307
1732A17312o6584n1406r5302K59302q7515j89748L95273K27263l00144m20261
1722b11810l2547M24825N1493N6885R2802j06942r3382M0236P7324l7589K8795
1711B90090m6079l33737K54487l1595Q953k31822J53053M21356m06556k82588
$$ plain form
1785 -178707 23367 177746 71296 171818 229367 183718 -104737 45655 298685 -109882
1775 -109882 47114 -58032 -122663 -78943 -104481 32562 -78189 66438 154077 -133536
1765 -133536 9192 86719 95924 110111 31602 -19720 135862 366463 103039 -60455 -163613
1754 -163613 119916 216792 401520 386936 323354 88954 153907 147518 71837 196705 -24704
1743 -24704 -397936 -304365 -116719 -141050 -148552 -166283 -256805 -201232 -55721 50005 117312
1732 117312 50728 -678 -95980 163322 75807 -113941 281332 508595 208451 -211810
1722 -211810 -244357 180468 231961 288846 381648 274706 181324 221560 298884 261295 290090
1711 290090 244011 -89726 164761 133166 142119 -89703 63350 484706 78150 -204438
1701b04438K72143n6771L7062P0909k66653j22693L37532K65115j25791n4764
1691A51651j64642p7233K38309k38262n65111L44870n7056r3340K83914R0905
1681h5995J72237M03786j78390n5175k27598j57476J15610j36661j44774J84904
1671a09532k76553L10188J49058j14554j52950R4561O388j20284J84554M0082
1661A0958P4619m9990J37019j18346k59036J79183P5770o941J5332L7953N3345
1650A49866q7462k73662J29484K73560o6573J1412k2257K49222k08281k63674
1640a08365K51151r1639j9769J91196j23095m4699J27040j37043j26418k21015
1630c02656L63788K6907k76453L5845N5304j81555J68220j6393O0197K90463l50320
$$ plain form
1701 -204438 67705 10934 47996 118905 -147748 -270441 67091 332206 206415 151651
1691 151651 -12991 -90224 148085 -90177 -655288 -310418 -367474 -460814 -176900 -85995
1681 -85995 86242 490028 311638 256463 28865 -128611 -13001 -149662 -294436 -109532
1671 -109532 -386085 -75897 73161 -41393 -194343 -99782 -93394 -213678 -29124 10958
1661 10958 85577 35587 172606 54260 -204776 -25593 50177 43236 58568 96521 149866
1650 149866 62404 -211258 -81774 191786 125213 136625 114368 363590 155309 -108365
1640 -108365 142786 51147 31378 222574 99479 54780 181820 44777 -81641 -302656
1630 -302656 61132 88039 -188414 -152569 -97265 -278820 -110600 -126993 -66796 223667 -126653
1619a26653M6298K69951j04410K0214k18444J28836n4948j15867N3375N4558K34248
1608A87158n07543J94421K58119j32117j39472K29103j09012r5354N5607J20643
1598F1553k38899N6369N2630K97576k9551p4068k27977r8162K87777j3645J2542
1587H6145n1393k46036L85540k07821j14151N0100K97198j39919j47143J20236
1577C2756k59309K98609J42663J70085k03160q428J43328p5297k96463K93704
1567B38488k07392r9642m9299J68976J0128R1955o4096o5299J47853l4003J11820
1556B49489k01011q3429j28448J89117L4114j69153K01611J01625j56336k90333
1546b52754J78016j76795j749P1204j6975j34264K73471k07668K36035o0615k21204
$$ plain form
1619 -126653 -80355 189596 85186 105400 -113044 15792 -39156 -155023 -101648 -47090 187158
1608 187158 -320385 -125964 132155 38 -139434 89669 -19343 -114697 -59090 61553
1598 61553 -177346 -120977 -68347 229229 199678 125610 -102367 -200529 87248 73603 86145
1587 86145 34752 -211284 174256 -33565 -147716 -97616 199582 59663 -87480 32756
1577 32756 -226553 72056 214719 384804 181644 173216 316544 241247 -55216 238488
1567 238488 31096 -68546 -117845 51131 61259 153214 89118 23819 171672 137669 249489
1556 249489 48478 -34951 -163399 25718 59832 -109321 92290 193915 37579 -252754
1546 -252754 -74738 -251533 -253282 -182078 -199053 -333317 -59846 -267514 -31479 -92094 -313298
1535c13298J53465J68937j03240j39726K14701K1926N2421J00724L9750j64202
1525C1458r4510j34569K44659j08703M7251L1924J58784P5038o9105k09296O8495
1514D1426r8059q1025k52286P4399j3571N1313O7083K25182Q0180L7268j45085
1503a3175m48093K8318J54497k0421L17392K37591Q6252k30970k7856j14119M7613
1492A7029j22653M9135N8535j70501Q3635m1170O1970p5410J50921Q1479M1075
1481A34045O8133K6481M8634n37081K50405J89653k39382j6924j73110P5612j16227
1470b89761k8818q6563O0434O8636K99911M2227K44881j50885k00797R6163j93808
1459a38380M41469k61333j75070L11913K76056k37203j21560J78026k36073j96512
$$ plain form
1535 -313298 -159833 9104 -94136 -233862 -19161 2765 55186 155910 195660 31458
1525 31458 -63052 -197621 47038 -61665 -14414 17510 176294 251332 182227 -27069 41426
1514 41426 -56633 -137658 -389944 -315545 -329116 -277803 -210720 14462 94642 131910 -13175
1503 -13175 -461268 -432950 -278453 -298874 18518 256109 342361 111391 83535 -30584 17029
1492 17029 -105624 -56489 2046 -168455 -84820 -125990 -64020 -139430 11491 92970 134045
1481 134045 202178 228659 277293 -259788 -9383 180270 -59112 -76036 -249146 -173534 -289761
1470 -289761 -318579 -405142 -344708 -276072 23839 66066 310947 160062 -40735 55428 -138380
1459 -138380 303089 41756 -133314 178599 454655 217452 95892 273918 37845 -158667
1449a58667M6307K69166j71344K2554L9903j6339L75800j26376j96714j542n2265
1438C0483r336p4508j11942n3663o7414j06734J85050M40355k70800K63630o3937
1427A61184j64086P4595J8177q7317l8868O9244p6270K2788j07505J59824j71870
1416a40104K0219P6865j51225j6040O8603L20646Q7502j57337j51193K6015J00562
1405H4513K0264M9073k13910K22187l64688K77865J25800l9168J55197J31695
1395D48828m00077p3337R9646j81584J84338J33511j09602j80457j1385K55486
1385A65367m43609l6548K37706K19260l5059K04817k32742o7088k02504K09234
1375A8834O6963p6669k21240L18997O3081K83264j2845j43833m9812q0811Q9141
$$ plain form
1449 -158667 -112360 156806 -14538 8016 47919 31580 407380 281004 84290 82748 30483
1438 30483 21147 -53361 -165303 -218966 -286380 -393114 -208064 232291 -38509 225121 161184
1427 161184 -2902 71693 89870 2553 -36315 32929 -43341 -20553 -128058 31766 -140104
1416 -140104 -119885 -43020 -194245 -210285 -141682 178964 266466 109129 -42064 -16049 84513
1405 84513 104777 153850 -60060 162127 -202561 75304 201104 161936 317133 448828
1395 448828 48751 -24586 75060 -106524 77814 211325 101723 -78734 -90119 165367
1385 165367 -278242 -314790 -77084 142176 107117 311934 79192 12104 -190400 18834
1375 18834 85797 9128 -212112 106885 169966 453230 440385 296552 246740 165929 255070
1364B55070l22034o0250j2614q9670n8566M23719j85085L7316j19024K89926l82462
1353b23674L47099j71122p3780o0735l2397j60624k62593M52619j20028K97139
1343h096K44507r0144j24489M3026K0415k67870J12169K48568j0308m17385j89236
1332d38843j13711K98134M8705k03865J31025L34834K5749n23502J9956P8467
1322c43051K38066j31010K05784J68011j60762J32473n5412k92923K98478k33177
1312a73523j4186j41239R8366j75142L87733J13960k16394J44815O1524j14839
1302b8925j99564L18612k83099K41062k4447n0355K61915j95695k42651L04262
1292A01115k59227L57082j86741N2321k25480P4792J95115L8220j24716P7637
$$ plain form
1364 255070 -66964 -127214 -139828 -229498 -288064 135655 -49430 -12114 -131138 158788 -223674
1353 -223674 123425 -47697 -121477 -182212 -214609 -375233 -637826 -185207 -305235 -8096
1343 -8096 236411 146267 21778 64804 85219 -182651 -70482 178086 167778 -249607 -438843
1332 -438843 -552554 -254420 -205715 -409580 -278555 56279 82028 -441474 -421518 -343051
1322 -343051 -104985 -235995 -30211 137800 -22962 109511 54099 -238824 59654 -173523
1312 -173523 -187709 -328948 -230582 -405724 -17991 95969 -120425 24390 85914 -28925
1302 -28925 -228489 90123 -192976 48086 23639 -26716 235199 39504 -203147 101115
1292 101115 -158112 198970 12229 64550 -160930 -86138 108977 147197 22481 100118
1282A00118n8155k8532p3462k01467m3786K566m6160L61371M683J18359j02374
1271C3161q9378m7047p6393L69342k36352l16015J19365J96879j07109K31697
1261G8150m81783n7033M40022J64175O7554k22574J02227q6809k5797J36065k12629
1250i8432j99619P0687Q5864j68526J7815K5253p0159N6099K24156l2166J08246
1239A9218q1964J51030j55393P9404n1123l35852M09039J24260k05897K5015j87943
1228b10206P4126J48799j8039k39472K65656P3135k70018j36517K08334j13500
1218b17702o9886K77434n204j3294j59373n169R6355J16092j85222r5346J79630
1207h1685K28157l78769J21515J75837j90817J84509Q1332l30697Q7318q7941
$$ plain form
1282 100118 41963 13431 -60031 -261498 -305284 -302718 -348878 12493 17176 135535 33161
1271 33161 -56217 -103264 -179657 189685 -46667 -362682 -243317 -46438 -153547 78150
1261 78150 -403633 -460666 -20644 143531 211085 -11489 90738 3929 -21868 114197 -98432
1250 -98432 -298051 -227364 -141500 -310026 -292211 -266958 -337117 -281018 -56862 -89028 19218
1239 19218 -62746 88284 -67109 12295 -38828 -374680 34359 158619 -47278 -22263 -210206
1228 -210206 -136080 12719 -5320 -244792 20864 93999 -176019 -312536 -104202 -217702
1218 -217702 -287588 -10154 -15358 -28652 -188025 -193194 -96839 19253 -165969 -261315 -81685
1207 -81685 146472 -232297 -110782 65055 -125762 58747 140079 -190618 -103300 -191241
1197a91241R3377K55621J37867o7131n1098l24839K84969l77896J51492k33281
1187c22160L54485K6082j67402M56667j10825j9283l43149J70493M189j21298
1177g2201K05735r7622k22689q2237J80177n974r2697L3152J17442o4144j04605
1166b05663K80432o1144k3144J52289m03123j68908N71764l8147q115l46314J11697
1155a38376J98711J53388p6205m0294j55194K0557r3944O6897J56773J50953K497
1144B45763q6946m35k80664k07675L67501j94582o9395L64451J40528m1864J38206
1133C74888l24463l45958J70417M77602N9767k9383k44272k08365O7691K70737
1123B68661k40425j60847r0359J45849K49374k67341j25219M75834j291j89439
$$ plain form
1197 -191241 -97864 157757 295624 228493 177395 -147444 137525 -240371 -88879 -322160
1187 -322160 32325 58407 -108995 347672 236847 217564 -125585 44908 49097 -72201
1177 -72201 133534 35912 -186777 -269014 -88837 -94811 -187508 -154356 -36914 -101058 -205663
1166 -205663 74769 13625 -9519 142770 -260353 -429261 142503 104356 96241 -250073 -138376
1155 -138376 60335 213723 137518 97224 -57970 -37413 -131357 -64460 92313 243266 245763
1144 245763 158817 158382 -122282 -329957 37544 -157038 -226433 138018 278546 236682 374888
1133 374888 50425 -295533 -125116 352486 412253 382870 138598 -69767 -2076 268661
1123 268661 28236 -132611 -222970 -77121 172253 -95088 -220307 255527 254236 64797
1113F4797P7723K59855L1232k92442l17211j78537K32298K4845m0647J10765L35803
1102C08481n3202l65442n0122O7076R9790l0991K17038M9896k89188j54711J87631
1091a3744j55758J47117L8991j22739n4285j1539l5791J11463p8387q7707J34480
1080a27899J20546J64792k88067K03588l129k97964M68323J26113q2706k17159
1070F6438j88092J93061m4383J70842p2156k69439K99006J94727m28387Q52K09736
1059A32205J32863L9843r6049q7977j77932k41697M8310J32153j19256N3100L9019
1048a45418J58118J37290R6122K7778J10696k01971j71668M405J36674K28246
1038C80272q3418j98722p0461k62011N8044K37416k61510p821j7753K94553k39236
$$ plain form
1113 64797 142520 402375 433607 141165 -176046 -354583 -122285 -97440 -138087 -27322 308481
1102 308481 255279 -110163 -160285 -93209 6581 -24410 192628 242524 -46664 -201375 -13744
1091 -13744 -169502 -22385 16606 -106133 -160418 -171957 -207748 -96285 -174672 -262379 -127899
1080 -127899 -7353 157439 -130628 72960 69831 -228133 240190 366303 283597 66438
1070 66438 -121654 71407 27024 197866 125710 -143729 155277 350004 -78383 -77531 132205
1059 132205 265068 304911 208862 120885 -57047 -298744 -250434 -118281 -237537 -184437 -145418
1048 -145418 12700 149990 246112 273890 384586 182615 10947 15352 152026 380272
1038 380272 296854 98132 27671 -234340 -176296 61120 -200390 -208211 -225964 68589 -170647
1027a70647L2174K20604j36508j04242J35170m5544J63066J15531J4185m19359
1017a95570L29796k08128j5077q475J69602k3502k44202L774j46571o653P8761
1006b66245k8074J86662j03334K57493l03004K67981l0033j37583j55366J48964
996a62539K40300m1282j34544k21974j36229J94603m4002K30187n8805Q9435O6850
985B2000j2052J41782l62895J89900m0868k546r3015J99820L6167l99895J28531
974a93071p5695J2096J57151N1915O0086r1156K16091J90343k68209j6219n002
963C8330o9393k69858P5190K57417k39923M5668J13025M5325K04758J62792l15173
952D8158l4553m08424J30982K04770Q2425K24885j71462j12277K53666m27589
$$ plain form
1027 -170647 -138473 82131 -54377 -158619 -23449 -68993 94073 209604 223789 -195570
1017 -195570 134226 -73902 -88979 -97454 72148 48646 -195556 -191782 -338353 -345006 -266245
1006 -266245 -294319 -107657 -210991 46502 -256502 11479 -18554 -156137 -311503 -162539
996 -162539 77761 36479 -98065 -320039 -456268 -261665 -305667 -75480 -134285 -44850 22000
985 22000 9948 151730 -211165 -21265 -62133 -64679 -157694 42126 78293 -321602 -193071
974 -193071 -268766 -256670 -99519 -47604 12482 -78674 137417 327760 59551 43332 38330
963 38330 -31063 -300921 -225731 31686 -208237 -162569 -49544 -4219 200539 363331 48158
952 48158 13605 -394819 -263837 -59067 23358 248243 76781 -35496 218170 -209419
942b09419J94694q5628n913K50652p6158k19153K43694J40157L6706L9388l70752
931f1732K02186k94568j474N31920n30581q3464k5133J77406O7298q5390K2560
920h0972J6869q878k24442J65528J74850J4757N6766j62830K18857K85959l29442
909A27022l51617K50433j20091J05352k39286K85428l35992M2212L50420j62582
899d8701K12283k6277m58132K08700J97738P5652J37284k53417M8362L2008j27856
888b356l60801o2665Q7418P685O1773M48958k91448p157J34485J89733k90637
877h5012L0204J33430k09447J74833l04655n3997k20337M62488N592k10721J94081
866h3541J57277j80696Q1709q5286k9983J00103J33525r2048J4604k4156j37022
$$ plain form
942 -209419 -14725 -100353 -106266 144386 68228 -150925 92769 232926 269632 309020 -61732
931 -61732 140454 -154114 -155588 376332 -154249 -237713 -262846 -85440 -18142 -103532 -80972
920 -80972 -64103 -72981 -297423 -131895 42955 57712 114478 -48352 170505 456464 127022
909 127022 -224595 25838 -94253 11099 -228187 57241 -278751 -236539 113881 -48701
899 -48701 163582 137305 -320827 -112127 85611 161263 298547 45130 93492 125500 -2356
888 -2356 -363157 -425822 -338404 -330719 -268946 180012 -111436 -118593 15892 205625 -85012
877 -85012 -54808 78622 -130825 44008 -260647 -314644 -534981 -72493 -66901 -277622 -83541
866 -83541 73736 -106960 -25251 -110537 -140520 -40417 93108 1060 15664 -8492 -145514
855a45514K35342j08023r1796l4189P6965K28143j79248K54039j95213K8893L05484
844C74883l56776K07524k95217L6519K26547J60649j9848m4329Q8679q2925k61276
833C4430Q1986o6691m0243K22682J43187j95452l19471j6961M63758j31450j64888
822A0887k90389K9483N6343l08022K39104K85016J15885l04004J9557P264M7117
811i1759l922j5560q7618R7797M8104o4824J59952j66763o721K57769j00863J58522
799A84114L3883k03286l9724j58329K02463m9619l01362L78020J33426r8327l08156
788b26897p5921M68381K0251k26002k5k77305K53504j39377m2611K37183m7365
777e6184R0713j77065J81674M5065j19154k80712M73159k80190N7196J30399K24348
$$ plain form
855 -145514 89828 -18195 -109991 -144180 -67215 160928 -18320 235719 40506 69399 374883
844 374883 18107 225631 -69586 -33067 193480 354129 334281 289952 378631 295706 34430
833 34430 116416 49725 9482 232164 375351 179899 -139572 -156533 307225 175775 10887
822 10887 -279502 -250019 -193676 -501698 -262594 22422 138307 -165697 -146140 -138876 -91759
811 -91759 -95681 -111241 -198859 -101062 -52958 -117782 42170 -124593 -131314 126455 25592 184114
799 184114 217997 14711 -25013 -183342 19121 -30498 -331860 46160 179586 81259 -226897
788 -226897 -302818 165563 185814 -40188 -40213 -317518 -64014 -203391 -246002 -8819 -56184
777 -56184 34529 -142536 39138 84203 -34951 -315663 157496 -122694 -65498 64901 289249
766B89249j14974J77943j91768o0419j0166j74995K50631J16448n0891j1802m5828
755A73428l35040j39336M47988J13523k59950K97407M4555l18121J60161l4846
745A49769k99447j54356L74193j12505k15933J00345m578K21275j46395q0282
735a67914K36541J49318k75239k30263L44643o050j51388N0241L63593p8384k8514
724B06584k9493o1262j31353j95036R4472K6127p9428l9885M8288J66898l886
713B026M6725O9123k4633n9841k45508K01354k25661M3743K76983l1965K79779
702C32125r4552j77505j39664J0104J55537K90103j05016P0618j36928k77717
692g2895j82481N2686Q0101K2947J13507m2112J170J97355N4302l25501l9761
$$ plain form
766 289249 174275 352218 160450 100031 89865 -85130 165501 281949 231058 219256 173428
755 173428 -161612 -300948 147040 260563 613 298020 342575 24454 184615 149769
745 149769 -149678 -304034 70159 -42346 -258279 -157934 -162512 58763 -87632 -167914
735 -167914 68627 217945 -57294 -287557 57086 51036 -100352 -50111 313482 235098 206584
724 206584 177091 115829 -15524 -210560 -116088 -89961 -169389 -209274 -160986 5912 2026
713 2026 48751 117874 93241 33400 -212108 -10754 -236415 -192672 84311 52346 332125
702 332125 237573 60068 -79596 -69492 86045 376148 271132 341750 204822 -72895
692 -72895 -255376 -202690 -122589 -99642 13865 -28247 -27077 170278 224580 -100921 -140682
681a40682j33422K00320N3707J41012j50845j65928k17880q2973N42287k07375
671a61779K35562J0794q7315j75235K13906J14991k64721Q0625k80894J83990
661a30076o1593K01384N109j17490m4703P3374p242J19432j68865K99364l97477
650b28783L80392p0682j21248k24628K9889N2655Q9154J11527K20066l25782K66223
639A78783l00850l14063L17188k7893p2231j22442P9296j6560K69041L13605l82485
628g8611l42032K08919j10810q7027L44929J05847J7677K16422k31706L0955J36651
617B11214j83703j3414j86926j3867j00202K28095n9645k41L88003n8188j14564
606I6562j82529R0635m8338j05044K27345J09045j97669p1613K04167k34573L47159
$$ plain form
681 -140682 -274104 -73784 -20077 120935 -29910 -195838 -413718 -496691 45596 -161779
671 -161779 73783 84577 -2738 -177973 35933 150924 -113797 -33172 -314066 -130076
661 -130076 -191669 9715 14824 -102666 -147369 -73995 -81237 38195 -130670 168694 -228783
650 -228783 151609 80927 -40321 -264949 -235060 -182405 -93251 18276 238342 -87440 178783
639 178783 -122067 -436130 -118942 -146835 -219066 -341508 -262212 -278772 -9731 303874 -78611
628 -78611 -420643 -211724 -322534 -409561 -64632 41215 58892 275314 43608 74563 211214
617 211214 27511 14097 -172829 -186696 -286898 -58803 -118448 -118689 269314 211126 96562
606 96562 -85967 4668 -43670 -148714 78631 187676 -9993 -81606 122561 -112012 235147
595B35147j81378m21551O0253K33467J27J31451K06624l37533L2750Q7796q6612
584c9459J57092J50901j61817O845P8841J76699l01268q5485L2313l66773O08577
573B56466K53498n32710j44193O7583N4810K24598J74151j85877O2240k77328
563d6762K8096q0482L47617k01429j37724l3274O5935k76745J53475M39767M7527
552C06001k71216L3797l6017J03063M9093q577k39958R4262N4413j04403q0279
541i9821M23647j09662k10198k19921M96499K35325l60532j51271J60429k36838
531g2343j79748K23192k9138j24494n3165M8490L4688r3669J40114Q5259r1001
520a11815J17598K56969j04603m43992M04181J76041k84433J24395j42636J39688
$$ plain form
595 235147 53769 -367782 -307529 -74062 -73935 57516 264140 -73393 -40643 47153 -39459
584 -39459 117633 268534 106717 113562 192403 369102 67834 -17651 14662 -352111 256466
573 256466 509964 -22746 -166939 -99356 -44546 180052 354203 168326 230566 -46762
563 -46762 -18666 -99148 248469 47040 -90684 -123958 -58023 -334768 -181293 258474 306001
552 306001 34785 68582 32565 135628 184721 176144 -63814 30448 84861 -19542 -99821
541 -99821 323826 214164 3966 -215955 280544 515869 155337 4066 164495 -72343
531 -72343 -252091 -28899 -58037 -182531 -235696 -187206 -152518 -246187 -106073 -20814 -111815
520 -111815 5783 262752 158149 -285843 118338 294379 9946 134341 -8295 131393
510A31393k94552q3794K48901K37170j17133m35775L49790j49740J77830K6613
500I0703l1237J5331j33305K30443k43982K26253J73329j54120k47292P0242P2282
489F8647P1911j5891j68010j75100o8945J36949J83123L0328m3866k14731L0788
478a64797K02419l02813N9730m2498K26332k6014M4327j09279J60954n3462J1555
467F454J43453j83014j57872R3529p2372k0410K0682J40640M4587K91742j01440
456B05979k58415j9384K79103J8977j31535l43922P6915K51654k80190r8546J74317
445a25047L43051P9419j65816J69103j15539l06994j45151J18389Q7699q4072
435a44958n8809n4728J23667J53937k28200K24647m112j03829L02205K22938j98133
$$ plain form
510 131393 -163159 -246953 1948 239118 121985 -313790 36000 -113740 64090 90703
500 90703 59466 74797 -58508 171935 -72047 154206 327535 173415 -73877 -3635 68647
489 68647 140558 124667 -43343 -218443 -287388 -150439 32684 63012 19146 -195585 -164797
478 -164797 37622 -265191 -205461 -247959 -21627 -47641 -3314 -112593 48361 -5101 6454
467 6454 149907 -33107 -190979 -97450 -169822 -190232 -169550 -28910 15677 307419 205979
456 205979 -52436 -71820 207283 226260 94725 -249197 -172282 79372 -200818 -299364 -125047
445 -125047 218004 297423 131607 300710 185171 -121823 -266974 -148585 -60886 -144958
435 -144958 -203767 -258495 -134828 19109 -209091 15556 11444 -92385 209820 432758 234625
424B34625k77497m9835j52991J22052k71445J44461L60885J7817k21285K8149
414f5064j94004k53195M63470j15964J53936J36390k47084K44554j6054O8866
404A75851k63538Q2135L01335j16771j114k55690J54192Q7545K07481q6671k44328
393D0427j09346N9488M13175J18752m77940j13604J92081J26339o1930M581j86564
382E459o7548P1884j06060J69276J1282p1291J21917Q5821k82192L73304j40606
371A71246k27021L30549k04172R8318m535j29073K49761j58741J036l4932K05287
360B97723n6263k31569p6583j36576o66k11466p817K59866K99598n6721l7214
349D2312N3234M9132j44640L852j3102l7712k38785K82707L5682K38719L0566
$$ plain form
424 234625 -42872 -92707 -245698 -123646 -395091 -250630 110255 128072 -93213 -65064
414 -65064 -259068 -512263 -48793 -164757 -10821 125569 -121515 123039 106985 175851
404 175851 -87687 -5552 295783 179012 177898 -77792 76400 163945 371426 284755 40427
393 40427 -68919 -9431 403744 522496 44556 -69048 123033 249372 187442 192023 5459
382 5459 -62089 9795 -96265 73011 84293 13002 134919 220740 -61452 311852 171246
371 171246 -55775 274774 70602 168920 164385 35312 285073 126332 127368 92436 297723
360 297723 241460 9891 -66692 -203268 -203934 -415400 -423217 -163351 136247 79526 42312
349 42312 95546 144678 38 3890 -9212 -46924 -285709 -3002 32680 271399 301965
338C01965l42113K8468L04956k20536J74939J67617j65156j11565Q352j30639
328A6288L02994J19049m34381r4898J88811R7825k03756L29663M0300k24908j3658
317A23329P6050j19804J8746K61109L7170k17395k58650m17975M05404j22116
307b14132J04403n7848o532O6077K21138K18740r1421j52622J38704j65497J08102
296A69112K904P4246k40091N499K60501L639k48769l83489N9732O57129o4012
285B96401k28492K15899n8089j17729j05342J21436K16170l72532P3540N18903
275E60165k11147k28042N8424j58209j29804P9461p1384K47179l4257m17533o9917
264c75064M32028r6443R2496L25005j20112j30653M7671j82141N40168k07987
$$ plain form
338 301965 -40148 -11680 293276 72740 247679 415296 250140 138575 146927 16288
328 16288 319282 438331 3950 -90948 97863 195688 -8068 321595 361895 136987 123329
317 123329 199379 79575 98321 359430 396600 179205 -79445 -497420 -92016 -214132
307 -214132 -109729 -167577 -174109 -108032 113106 331846 240425 87803 226507 61010 169112
296 169112 172016 246262 6171 11670 272171 275810 27041 -356448 -296716 360413 296401
285 296401 67909 283808 225719 107990 2648 124084 340254 -32278 41262 560165
275 560165 349018 120976 179400 21191 -108613 -29152 -100536 146643 112386 -305147 -375064
264 -375064 56964 -39479 53017 378022 257910 127257 174928 -7213 532955 324968
254C24968l07740P9672k37462J10196K12323l64154j19003L37971J60984J39662
244C37417R8742l9617j09915j33025m4268k4666j48721J37670J03030j072j84173
233h598J18546j54805M10815k60685L1113n9049k11904j26527L24511P4903j84316
222d5996Q9062j44028K89872k19628L2775J93305k30465J75994p1764r5750K30612
211B03989K03023l16675Q6641L343q2595j78989K75065j2146j9151O6302o8719
200A60088R0212q1975J14168k17028M70690m23264j9838r4102m09m4836l6997
189h3291O7906q53j8810K41042N3032j70505M0761j14412K7981Q7538k65421M7707
177h7325k24034L05425L05486j37197Q833J31605k46847k24922J68073K51493
$$ plain form
254 324968 17228 96900 -140562 -30366 181957 -182197 -301200 36771 197755 337417
244 337417 436159 396542 286627 153602 109334 84668 -64053 73617 176647 175575 -8598
233 -8598 109948 -44857 365958 105273 136386 77337 -134567 -261094 63417 138320 -45996
222 -45996 43066 -100962 188910 -30718 2057 195362 -35103 140891 69127 -26623 203989
211 203989 407012 90337 176978 180321 97726 -81263 193802 181656 162505 228807 160088
200 160088 250300 168325 282493 65465 536155 112891 93053 -1049 -1458 -46294 -83291
189 -83291 -15385 -16238 -35048 205994 259026 88521 129282 14870 42851 130389 -135032 -87325
177 -87325 -311359 -5934 299552 162355 171188 302793 55946 -168976 -903 250590
167B50590J8514m3544j95156p704O0688K25432j35173j86836M1540J17428r2156
156E3623m3808M9971P4110r0078m0053J5322J886q6179q8267J69009L8332O8851
$$ plain form
167 250590 269104 225560 30404 22700 83388 308820 173647 -13189 28351 145779 53623
156 53623 9815 59786 133896 43818 3765 19087 20973 -65206 -153473 15536 53868 122719
$$ [...]
##END NTUPLES=NMR SPECTRUM
##END=
