##TITLE=1H_CG-1215
 CDCl3
 8 sc, 
 29.10.2024
##JCAMPDX= 6.0         $$ Bruker NMR JCAMP-DX V2.0
##DATA TYPE= NMR SPECTRUM
##DATA CLASS= NTUPLES
##ORIGIN= UXNMR, Bruker Analytische Messtechnik GmbH
##OWNER= root
$$ XWIN-NMR		Version 3.5
$$ Tue Oct 29 14:25:51 2024 Russian Standard Time (UT+4h)  she@DPX200
##.OBSERVE FREQUENCY= 200.1318
##.OBSERVE NUCLEUS= ^1H
##.ACQUISITION MODE= SIMULTANEOUS
##.ACQUISITION SCHEME= undefined
##.AVERAGES= 8
##.DIGITISER RES= 18
##SPECTROMETER/DATA SYSTEM= spect
##.PULSE SEQUENCE= zg30
##.SOLVENT NAME= CDCl3
##.SHIFT REFERENCE= (INTERNAL, CDCl3, 0, 21.0311)
##AUDIT TRAIL= $$ (NUMBER, WHEN, WHO, WHERE, WHAT)
$$ ##TITLE= Audit trail, XWIN-NMR		Version 3.5
$$ ##JCAMPDX= 5.01
$$ ##ORIGIN= Bruker BioSpin GmbH
$$ ##OWNER= she
$$ F:/spectra/data/she/nmr/H-F/1/pdata/1/auditp.txt
$$ ##AUDIT TRAIL=  $$ (NUMBER, WHEN, WHO, WHERE, WHAT)
(   1,<2024-10-29 14:24:35.93 +0400>,<she>,<DPX200>,
      <created by zg, POWCHK disabled, PULCHK disabled
       configuration hash MD5:
       00 E9 B6 7A A2 85 ED C7 34 08 36 98 17 FE 4E 26
       data hash MD5: 16K
       B7 2B 02 6A 3C 9A F2 81 57 C6 B0 24 03 44 9E E3>)
(   2,<2024-10-29 14:24:38.64 +0400>,<she>,<DPX200>,
      <Start of raw data processing
       efp BC_mod = 2 LB = 0.24 FT_mod = 6 PKNL = 1 PHC0 = -26349.71 PHC1 = 14.58743 SI = 16K 
       data hash MD5: 16K
       8B C1 1F 94 CF B7 F0 1F 06 DC D0 16 55 A0 62 05>)
(   3,<2024-10-29 14:24:55.57 +0400>,<she>,<DPX200>,
      <pk PHC0 = -155.4603 PHC1 = -4 
       data hash MD5: 16K
       B9 C7 6A D4 C3 7F 9A 22 6A F8 66 D2 5A E6 29 92>)
(   4,<2024-10-29 14:24:59.70 +0400>,<she>,<DPX200>,
      <abs ABSG = 5 
       data hash MD5: 16K
       03 C1 BD D9 A4 6B 51 62 F4 32 9E 76 3B 74 19 D0>)
$$ ##END=
$$ 
$$ hash MD5
$$ DD AC 2B CD D3 2C 19 45 53 1C C4 CD 05 11 0C F1
##$RELAX= 
##$RELAX= 
##$RELAX= 
##$RELAX= 
##$RELAX= 
##$RELAX= 
$$ Bruker specific parameters
$$ --------------------------
##$DU= <F:/spectra>
##$EXPNO= 1
##$NAME= <H-F>
##$PROCNO= 1
##$TYPE= <nmr>
##$USER= <she>
##$AMP= (0..31)
100 100 100 100 100 100 100 100 100 100 100 100 100 100 100 100 100 100 
100 100 100 100 100 100 100 100 100 100 100 100 100 100 
##$AQSEQ= 0
##$AQ_mod= 1
##$AUNM= <au_zg>
##$AUTOPOS= <>
##$BF1= 200.13
##$BF2= 200.13
##$BF3= 200.13
##$BF4= 200.13
##$BF5= 200.13
##$BF6= 200.13
##$BF7= 200.13
##$BF8= 200.13
##$BYTORDA= 1
##$CFDGTYP= 0
##$CFRGTYP= 5
##$CHEMSTR= <none>
##$CNST= (0..31)
1 1 145 1 1 1 1 1 1 1 1 1 1 1 1 1 1 1 1 1 1 1 1 1 1 1 1 1 1 1 1 1 
##$CPDPRG= <>
##$CPDPRG1= <>
##$CPDPRG2= <>
##$CPDPRG3= <>
##$CPDPRG4= <mlev>
##$CPDPRG5= <mlev>
##$CPDPRG6= <mlev>
##$CPDPRG7= <mlev>
##$CPDPRG8= <mlev>
##$CPDPRGB= <>
##$CPDPRGT= <>
##$D= (0..31)
0 1.2 0 0 0 0 0 0 0 0.06 0 0.03 0 0 0 0 0.0002 0 0 0 0 0 0 0 0 0 0 0 0 
0 0 0 
##$DATE= 1730197475
##$DBL= (0..7)
120 120 120 120 120 120 120 120 
##$DBP= (0..7)
150 150 150 150 150 150 150 150 
##$DBP07= 0
##$DBPNAM0= <>
##$DBPNAM1= <>
##$DBPNAM2= <>
##$DBPNAM3= <>
##$DBPNAM4= <>
##$DBPNAM5= <>
$$ [...]
##$SUBNAM3= <"">
##$SUBNAM4= <"">
##$SUBNAM5= <"">
##$SUBNAM6= <"">
##$SUBNAM7= <"">
##$SUBNAM8= <"">
##$SUBNAM9= <"">
##$SW= 24.0689170037331
##$SWIBOX= (0..15)
0 0 2 0 0 0 0 0 0 0 0 0 0 0 0 0 
##$SW_h= 4816.95568400771
##$TD= 16384
##$TD0= 1
##$TE= 0
##$TE2= 300
##$TE3= 300
##$TEG= 300
##$TL= (0..7)
0 120 120 120 120 120 120 120 
##$TP= (0..7)
150 150 150 150 150 150 150 150 
##$TP07= 0
##$TPNAME0= <>
##$TPNAME1= <>
##$TPNAME2= <>
##$TPNAME3= <>
##$TPNAME4= <>
##$TPNAME5= <>
##$TPNAME6= <>
##$TPNAME7= <>
##$TPOAL= (0..7)
0.5 0.5 0.5 0.5 0.5 0.5 0.5 0.5 
##$TPOFFS= (0..7)
0 0 0 0 0 0 0 0 
##$TUNHIN= 0
##$TUNHOUT= 0
##$TUNXOUT= 0
##$USERA1= <user>
##$USERA2= <user>
##$USERA3= <user>
##$USERA4= <user>
##$USERA5= <user>
##$V9= 5
##$VALIST= <valist>
##$VCLIST= <CCCCCCCCCCCCCCC>
##$VD= 0
##$VDLIST= <DDDDDDDDDDDDDDD>
##$VPLIST= <PPPPPPPPPPPPPPP>
##$VTLIST= <TTTTTTTTTTTTTTT>
##$WBST= 1024
##$WBSW= 4
##$XGAIN= (0..3)
0 0 0 0 
##$XL= 0
##$YL= 0
##$YMAX_a= 429907
##$YMIN_a= -577535
##$ZGOPTNS= <>
##$ZL1= 120
##$ZL2= 120
##$ZL3= 120
##$ZL4= 120
##$ABSF1= 20.99291
##$ABSF2= -3.076221
##$ABSG= 5
##$ABSL= 3
##$ALPHA= 0
##$AQORDER= 0
##$ASSFAC= 0
##$ASSFACI= 0
##$ASSFACX= 0
##$ASSWID= 0
##$AUNMP= <proc_1d>
##$AZFE= 0.1
##$AZFW= 0.1
##$BCFW= 0
##$BC_mod= 2
##$BYTORDP= 0
##$COROFFS= 0
##$CY= -3
##$DATMOD= 1
##$DC= 0
##$DFILT= <>
##$DTYPP= 0
##$F1P= 0
##$F2P= 0
##$FCOR= 1
##$FTSIZE= 16384
##$FT_mod= 6
##$GAMMA= 0
##$GB= 0
##$INTBC= 1
##$INTSCL= 3.70164e-10
##$ISEN= 128
##$LB= 0.24
##$LEV0= 0
##$LPBIN= 0
##$MAXI= 10000
##$MC2= 0
##$MEAN= 0
##$ME_mod= 0
##$MI= 1.114404
##$NCOEF= 0
##$NC_proc= -5
##$NLEV= 6
##$NOISF1= 3.799351
##$NOISF2= 2.8
##$NSP= 0
##$NTH_PI= 0
##$NZP= 0
##$OFFSET= 21.03111
##$PC= 1
##$PHC0= -26505.17
##$PHC1= 10.58743
##$PH_mod= 1
##$PKNL= yes
##$PPARMOD= 0
##$PSCAL= 0
##$PSIGN= 0
##$REVERSE= no
##$SF= 200.129999521679
##$SI= 16384
##$SIGF1= 3
##$SIGF2= 2
##$SINO= 5.538805
##$SIOLD= 16384
##$SREGLST= <1H.CDCl3>
##$SSB= 0
##$STSI= 16384
##$STSR= 0
##$SW_p= 4816.95568400771
##$SYMM= 0
##$S_DEV= 0
##$TDeff= 16384
##$TDoff= 0
##$TI= <>
##$TILT= no
##$TM1= 0
##$TM2= 0
##$TOPLEV= 0
##$USERP1= <user>
##$USERP2= <user>
##$USERP3= <user>
##$USERP4= <user>
##$USERP5= <user>
##$WDW= 1
##$XDIM= 16384
##$YMAX_p= 383085748
##$YMIN_p= -178481
$$ End of Bruker specific parameters
$$ ---------------------------------
##NTUPLES= NMR SPECTRUM
##VAR_NAME=  FREQUENCY,     SPECTRUM/REAL,   SPECTRUM/IMAG
##SYMBOL=    X,             R,               I
##VAR_TYPE=  INDEPENDENT,   DEPENDENT,       DEPENDENT
##VAR_FORM=  AFFN,          ASDF,            ASDF
##VAR_DIM=   16384,         16384,           16384
##UNITS=     HZ,            ARBITRARY UNITS, ARBITRARY UNITS
##FACTOR=    0.29402158847633, 1,            1
##FIRST=     4208.9561870496, 0,             0
##LAST=      -607.99949695811, 0,            0
##MIN=       -607.99949695811, -178481,      0
##MAX=       4208.9561870496, 383085748,     0
$$ Real data points
##PAGE= N=1
##DATA TABLE= (X++(R..R)), XYDATA
$$ [...]
9886 16524 10781 -28512 5665 21640 45606 55317 51975 6878 9392 1814 13403 19124 12093
9873 12093 -37169 -33307 -9280 -17755 -13559 25947 12018 39883 40492 -12449 -16259 -56481 -71114
9860 -71114 -6215 29204 -32832 -22808 9003 38172 24949 4318 15705 9580 -12337 20389
9848 20389 39306 21411 6781 20126 84792 49638 41889 -10534 -28620 4683 4852 -13168
9836 -13168 -14695 35673 68753 28885 27357 54299 24901 1126 -10080 33967 21007 -77371
9824 -77371 -42968 16454 -15544 40491 11144 -21319 -6809 18864 6149 46156 21327 -20736
9812 -20736 -4853 -12511 -8609 5741 31412 16111 40581 32016 -62558 -37596 -10916 -4030 -26339
9799 -26339 26746 24505 -17172 7026 -21397 -2924 -379 -6924 -35560 6105 39577 -10636
9787 -10636 -34231 -7994 9479 -52425 -50540 -32450 -31274 -61669 -56331 -46951 -48990 -60233 -64471
9774 -64471 -14827 -9320 2496 -33944 -33868 -28848 -277 -29434 -42615 -33129 -64162 -64645 536
9761 536 -8999 -8814 7872 11410 7737 -3039 14500 2076 5273 -22317 -5458 -10739 31219 42448
9747 42448 855 4327 20118 38538 45819 27504 10316 -6122 -21477 23877 48150 13523
9735 13523 -15951 6280 41943 63303 5162 22548 -10367 -67583 -45000 -42797 -23955 -19290
9723 -19290 -41567 -12914 -7436 -23722 -19201 -11268 -26202 -44709 16677 9433 32455 7663 -21624
9710 -21624 -41528 -12431 -3208 -13786 20407 4651 40 -19268 -6995 -18181 5530 13297
9698 13297 1808 -50008 735 7281 -20456 -47853 -28074 -24735 -5689 -35328 865 23898
9686 23898 -34465 -32625 24345 -15219 -6292 42449 -20246 10371 55241 80102 42728 43554 24087
9673 24087 10954 6286 -9729 -48635 -25458 -24071 -9927 -16484 -17234 3128 -7078 -109 1420
9660 1420 -185 9302 7098 44502 26065 -45704 -46071 -27081 -18509 -34812 20554 -7416 -23440
9647 -23440 13322 -17769 -31956 -6747 -7380 -426 -5353 2277 24546 8294 17244 2926 3397
9634 3397 -14494 -20800 -30292 -29386 -3610 -34066 -40898 -48037 -33607 -1272 -30030 24188 25425
9621 25425 23028 28936 69842 37593 34477 49180 35883 -69372 -31782 -2266 -31407 -53720
9609 -53720 5288 5872 -32038 -63937 -57996 -37264 -15210 10397 4516 36594 27912 5536 56262
9596 56262 17970 3882 21761 -18802 6967 938 8484 43367 2650 -41288 -9082 12525
9584 12525 6665 -4036 10207 -41430 -16661 -22135 -30613 -20452 18822 30021 26556 23226 -35679
9571 -35679 -28339 10563 7425 22744 -6238 31927 28987 -22399 -29134 15564 -6062 -43481 -45288
9558 -45288 -10670 6493 13738 19474 8477 35186 11147 287 19113 -37561 -55868 -46178
9546 -46178 -4513 -42370 -51779 -62757 -33372 -9346 -64134 -20526 -14345 -31005 4010 -14550
9534 -14550 -16282 23839 4803 -15569 -7155 23822 -20609 31233 1916 2159 16895 32275 53331
9521 53331 -18523 -22838 2291 40366 26734 27208 22972 -784 17548 40177 60588 23544 -22445
9508 -22445 21440 35507 51437 45241 46459 68362 71024 42518 2736 -26748 140 74320
9496 74320 36389 -4428 39918 5489 23489 28536 57 -7086 27790 5253 33514 32486
9484 32486 13291 3631 32265 -46086 -38500 -26902 -17583 30638 43702 22439 -8624 -38287
9472 -38287 -55637 -6782 -3952 33379 6215 -31299 -71358 -52821 11511 10979 -23560 8317
9460 8317 -21258 -24883 2278 -24760 -35242 -57677 3791 -18696 -47120 -24949 -43871 -16919
9448 -16919 6440 -4583 -38508 -56991 -49104 -31454 -54352 -63889 -27662 -12617 5806 -29624
9436 -29624 -33934 -36830 -20268 7288 3678 -11031 -15676 8551 2610 4483 23408 26330 -28592
9423 -28592 -18131 -20248 15126 12211 24973 -19834 -11466 -4833 11105 5634 2715 19445 -47365
9410 -47365 -47242 -1132 15768 49485 -19657 -35821 -2355 30257 2785 -44801 -13888 16762
9398 16762 5443 -55119 -77238 -23520 14892 52576 41795 3123 -11201 10996 449 4585
9386 4585 21872 -17968 3768 12334 7571 -408 9602 -1667 -50861 -2864 29633 8186 -5189
9373 -5189 -26737 -50251 -13454 12899 15695 12175 -877 6420 27881 15610 -4535 -19235 -43491
9360 -43491 -10468 -32239 -35782 -36199 -40180 -40085 4578 -9776 -14718 -10380 -39045 18128 -51603 -64460
9346 -64460 -39370 -17792 -43433 7526 7419 24939 -44920 -26919 -953 24815 45591 1903
9334 1903 -29009 -69990 12252 47844 49507 34512 -11830 -27607 -9222 -24270 -37177 71648
9322 71648 25877 -33654 -31651 6092 27003 17881 29298 36519 73648 91529 69034 -15500
9310 -15500 -31493 -43463 -22579 -21046 8760 6236 -13435 -44218 -467 -5282 7089 -6948
9298 -6948 27596 16855 -35503 -11500 -33849 -63593 -422 29120 23615 -24896 -42531 2342
9286 2342 37653 -8302 9169 24712 53562 49238 10822 19043 -31035 -36734 -18586 16467 7620
9273 7620 -12366 -17236 -52988 -26736 -24370 5896 -18029 4754 24099 -22216 -40546 6400
9261 6400 -13863 17366 30193 11918 24225 48167 3586 10159 -37326 -25635 -31364 -45222
9249 -45222 -12884 -33881 -42813 -16940 -50408 -47886 -33238 -18808 -16914 -16280 -25788 -14651 -11048
9236 -11048 19703 9331 -12010 18088 15704 -7015 -30723 -7944 3231 20577 15725 12286
9224 12286 -6227 27822 10650 -4639 -42226 -30763 -13261 34852 -20375 -43290 -66305 -76663
9212 -76663 -36220 -12207 9830 -2600 -25756 -35995 -26989 -39696 20188 4748 -9847 2351
9200 2351 13407 -3197 -21175 -10053 21285 24293 -1647 -7121 -23518 -3383 -14604 -47117
9188 -47117 -37424 6850 -40057 -71063 -38201 3860 -43115 -51581 -32852 -34022 -7135 9411
9176 9411 -24442 -11421 599 -24279 -19749 4337 -12744 -12732 -31366 -11560 -46250 -69638 -74785
9163 -74785 -17212 -17514 18209 -53920 -56245 -36336 2954 14580 12274 24030 24310 26544 -3298
9150 -3298 -17128 12597 1506 4388 11143 -24799 -22157 -20671 -3678 -23064 -27659 21614 -7533
9137 -7533 23443 14290 -25393 4416 -21857 -31076 1062 -5501 -46934 -6700 -14933 -49846 -45409
9124 -45409 -32569 5077 -4550 -55776 7995 -52429 -21698 -16250 -45325 -38083 -34468 -28021 -62301
9111 -62301 -43918 -5135 38590 17665 -28798 -45317 -21613 8997 -24635 -55801 -40047 -8261
9099 -8261 7403 -10874 -11985 13627 -1253 -8701 -29644 -1023 23128 26165 -3325 -3955 32422
9086 32422 -31905 -3767 -30387 -25865 -16427 7863 -3309 -16748 12451 -11036 -9941 -50251
9074 -50251 -43551 -25511 -41436 -23415 -1449 -16877 7035 -10999 19161 21964 2904 -41340
9062 -41340 -3879 29201 -3036 -69590 -46870 -6276 -53041 -74265 12913 4688 -24466 -36218
9050 -36218 -41316 9215 -64469 -20662 -12360 -1124 50219 19967 -29656 22781 47020 8991
9038 8991 -22618 -21724 -30826 -34500 18056 25927 23721 -20009 -84263 -34210 424 -46628 -47289 -36857
9024 -36857 15993 31768 31332 6067 37544 39117 39555 60591 -1167 -46161 -17191 -13988 -14751
9011 -14751 13347 31101 -11474 50117 48313 31272 -9493 -24646 10002 -11785 22584 20601
8999 20601 14255 42641 54553 42901 13042 24206 25411 18057 -9770 -35596 -26321 -76982 -39410
8986 -39410 -24583 -11359 -19277 -46769 -9057 -16181 -41138 -76816 -27047 -20842 12573 3815 -1680
8973 -1680 -18018 1364 29330 20064 -36782 -68649 -37669 7218 7721 -8218 26611 -14835 33802
8960 33802 -331 -6682 5435 8012 3902 11727 23291 10456 3689 -14091 -36472 -21405 -64958
8947 -64958 -65177 -30360 -43944 -33938 -45878 -29628 -3377 -792 -80305 -65483 -67565 -75840 -11757
8934 -11757 35919 -19474 -24539 -45191 -18011 28107 -8069 -89278 -124294 -100294 -23525 -29489
8922 -29489 -59243 -17314 -28081 26 48361 -28638 -37679 12139 -40863 -34976 -43605 -80840
8910 -80840 -10901 -9454 -51787 -29209 -90715 -23600 -62621 -22495 819 -12444 3718 -38729
8898 -38729 -29124 3962 -42078 -25456 -55692 -25931 -12756 3072 -7958 23461 1121 -3613
8886 -3613 -33185 -49836 20474 52641 10514 -30886 -41670 -9487 -11239 -19575 9056 36055
8874 36055 -14388 -2666 -18097 -45893 -47280 5898 39814 47246 -10641 -20256 -5947 -53573
8862 -53573 -2653 -2131 -3476 -24113 80279 45261 2078 -36573 1203 19935 -21752 -7546
8850 -7546 -15388 20751 1372 28560 7714 -2623 -28826 -12286 1981 7580 4784 13443 35734
8837 35734 -2159 -3089 18526 57604 23925 18202 11524 -12754 -20236 -57068 -41815 -24499 -47602
8824 -47602 -47788 -57542 -17632 -28294 -41758 -10883 -2039 -250 33116 11926 6036 14574 18718
8811 18718 25524 9747 -13712 -37416 -23464 57572 -50098 -45873 -9009 -25781 -22277 -29061
8799 -29061 9295 135 16240 -11754 -35930 -39674 -50294 -36393 -46858 -30941 -75404 -67397
8787 -67397 -16602 2880 8041 -27036 -34631 -39497 -95954 -32047 24599 -2035 -4827 -13234 3630
8774 3630 2340 -47500 -31249 -33558 5102 2815 -14229 -72284 -107357 -45994 -10433 5431 16470
8761 16470 -62464 -46057 -35913 -20629 -34841 -81312 -62394 -67140 -51367 -104689 -67808 -25402
8749 -25402 -27004 -68853 -18488 -597 -35575 -35711 -25013 -21555 -22840 4405 -33598 34029 41519
8736 41519 -23143 -32616 743 10193 29263 -25176 -44579 -39966 -26126 16013 15839 -15923 -27710
8723 -27710 -49691 -19988 17223 21368 31523 15274 -17857 -858 16529 31593 -4106 -64811
8711 -64811 -74872 -64189 -48493 -59598 -14507 -62374 -53167 -35358 -10949 -11925 -13688 -45973 -30401
8698 -30401 -67442 -43730 -43911 -21101 -45284 -40421 -48630 -4859 22810 -14805 -10807 -9808 -19807
8685 -19807 -16612 4678 -45964 -62791 -46350 -76832 -20223 -8224 -34945 -69059 -44417 -30654
8673 -30654 -12103 22422 -10780 -40580 -6924 -18846 -43410 -29898 -21470 -38327 -28089 45742
8661 45742 -37035 -8979 -9509 -9808 -41210 -10573 20842 16447 6115 -5572 -6532 55528 37368
8648 37368 -43108 17739 11007 -27649 13368 -55053 -85524 -99789 -90486 -42245 -45152 -46636 -75626
8635 -75626 -115140 -60607 -4501 5701 -24978 -59860 -43022 -69428 -81216 -47572 -46415 -82894
8623 -82894 -79596 -106107 -103265 -60972 -54601 -58802 -43226 -30066 -21567 12315 -41488 -11502 15614
8610 15614 -13580 -44366 -85700 -79086 -79909 -11394 -18868 -24739 -22760 -23659 -41571 -20468 -36514
8597 -36514 -38277 -64024 -52319 -65915 4766 -23348 -37041 -43820 -19650 -14469 -9938 -20590 -46860
8584 -46860 -56615 -83794 -68345 -50058 -34126 -18166 13786 -33537 -52888 -71986 -119805 -96649
8572 -96649 -47881 -51726 -65229 -34716 -2006 17866 33810 17594 -1039 5065 -19630 -32561
8560 -32561 -28991 -31892 -12916 -57908 -8267 9617 7875 -35044 -22002 -47578 -11890 -29689
8548 -29689 -54938 -17683 -20745 -19355 -31691 -38188 -72200 -110188 -48140 -40501 -82872 -51161 -31240
8535 -31240 10947 18653 -24562 -39523 -53350 -17137 -35145 -19789 -26615 -50259 -28041 -56384
8523 -56384 -16934 -59803 -77201 -21717 19142 29689 -34029 -85167 -86185 -34560 -35991 -20400
8511 -20400 -32654 -81414 -60197 -22820 -14107 -13823 32319 19864 -26246 -36824 -45571 -53386 -75116
8498 -75116 -51359 -29729 -14051 -19449 -49347 -12266 -8925 -9977 -41925 -68682 -49994 -94081
8486 -94081 -73702 -67189 -57970 13208 -17268 -29395 -10886 -28385 -22474 -17337 -24392 -19948 -42689
8473 -42689 -11275 -30313 -34884 -23428 -47299 8918 43259 35987 -24925 -74599 -69496 -24485
8461 -24485 -33597 2719 -10604 9225 -33803 -72498 -39261 6330 27727 4112 -468 -27777
8449 -27777 -18523 -21518 -42389 -60478 -54639 -82088 -74030 -35166 -30811 -32896 -60198 -80496 -49609
8436 -49609 -73581 -32022 -32633 -22731 -14774 -77029 -89352 -74852 -39309 -10022 -5648 1340 -54604
8423 -54604 -55771 -29740 -29080 1429 -4073 4428 -21471 -44444 -31074 -11525 -36743 5148 -45952
8410 -45952 -42653 -71648 -51971 -20609 -34919 -29135 -53539 -5178 -27260 -35970 -65756 -73149 -8556
8397 -8556 9471 -30653 -56227 -33710 -52418 -26141 -35656 -28320 9745 -3013 -23703 -76127
8385 -76127 -49526 -1210 9357 -37330 -63336 5973 -27326 -91977 -100545 -87254 -52248 -51897
8373 -51897 -59154 -35840 -2914 -22824 10039 26634 66102 -4541 -23769 7046 35106 30761
8361 30761 -7782 -24633 -43540 -51663 -17217 -17436 -42670 -22716 -42540 -79338 -28459 -4747
8349 -4747 5294 -70530 -82160 -56342 -75494 -35845 -63074 -57485 -21591 -46012 -63630 -40706
8337 -40706 -5894 -6393 -49649 -46113 20339 -27608 -31118 -35935 -82318 -48960 -66185 -34315 -55000
8324 -55000 -45090 -33500 -40356 -48530 -58993 -53677 -76975 -3090 8931 -70250 -33791 12906 -31117
8311 -31117 -60331 -67754 -57112 -85283 -33366 -30821 -64976 28271 -1655 -20724 -3659 -63602
8299 -63602 -24877 -45359 -1181 -60337 -31050 -56451 -50725 -9820 -17051 -39726 -88357 -33324
8287 -33324 -22585 -29951 -42738 -19100 -20214 -23675 -9305 -41742 -42552 -60206 -5054 33094 -16161
8274 -16161 -7498 -58276 -60597 -76794 -54768 -52270 -46104 -48320 -16962 -31428 -39869 -39316 258
8261 258 -19073 -42257 -49745 -43742 -47303 -79040 -83746 -64997 -56408 -48836 -40543 -55844 -31059 -25830
8247 -25830 -46188 -39754 -29411 -35280 -34486 -17335 8406 18141 -38204 -49402 -10587 -22880 -17994
8234 -17994 16552 -26943 -9992 -42980 -11470 -28317 -29879 -48425 -24600 -76710 -56132 -78093
8222 -78093 -67445 -56496 -66159 -554 -3614 -26150 -19257 38877 -15741 -35028 -13825 -77541
8210 -77541 -61041 -17013 -36752 -17059 -66474 -30485 -34473 -30690 -18943 -6661 -20196 13862
8198 13862 -78534 29015 3769 16449 37823 245889 196220 -178481 -59203 -40529 -56109
8187 -56109 -39545 9315 -23176 -28914 -73755 -23643 -14804 -2769 -1901 -39818 -47946 -3843 569
8174 569 -84669 -85834 -61683 -68303 -35139 -4444 -90439 -77637 -76197 -60925 -63227 -30579 -11263
8161 -11263 -73235 -87346 -31192 -34516 -47834 -91301 -52609 -14293 -114198 -87548 -43862 -28917
8149 -28917 -38517 -25660 -43626 -41021 -59757 -57426 -51998 -56202 -10226 -24731 -14430 -22457 -17976
8136 -17976 -66008 -69882 -33716 -51609 -42143 -35996 -25153 8011 -25690 -18874 -14851 -60015 -54373
8123 -54373 -96507 -51667 -69548 -93103 -59563 -65138 -59932 -35896 -40472 -63273 -33425 -24983 -60418
8110 -60418 -98934 -98196 -55471 -33334 -64202 -73811 -54681 -73853 -84909 -36873 21320 -30345
8098 -30345 -86523 -84915 -89385 -66961 -72944 -85147 -59280 -28099 -32485 -35615 -71842 -104203 -78862
8085 -78862 -113615 -131312 -62043 -45236 -36482 -57416 -56923 -78620 -110872 -100706 -66334 -18487
8073 -18487 -55756 -60478 -54336 -63224 -57000 -69255 -67827 -68468 2518 -28874 -49441 -46473 -55389 -91340
8059 -91340 -37261 -36841 -24892 -52742 -87605 -77576 -39995 -22762 -62990 -9469 -26212 -46829
8047 -46829 -41034 -33690 -25302 -63688 -80258 -61505 -29387 -49956 -40350 -61031 -79699 -108470 -62787
8034 -62787 -45135 -69749 -52079 -80101 -23508 -22025 -54036 -46950 -82139 -59178 -44677 -43487
8022 -43487 -52656 -67640 -62097 -25060 -8558 -23116 -17968 9877 8193 -59819 -6634 -28337 -78275
8009 -78275 -46315 -38956 -60166 -34899 -41079 -31308 4262 13415 8796 -32383 -53664 -53876 -88635
7996 -88635 -68494 -55791 -59470 -46644 -68846 -58866 -81224 -44236 -54355 -14557 -30776 -88569
7984 -88569 -8298 -38712 -41465 -68248 -13962 28107 -592 -14627 2027 26226 8103 -33123
7972 -33123 -45228 -43837 -22380 -41559 6185 46488 9074 -42216 -47058 -20371 -8586 -41087
7960 -41087 -39582 -67848 -124972 -84660 -53879 -87463 -21104 -6780 -1956 -35823 -69162 -67280
7948 -67280 -27497 -29026 -11723 -15088 -34057 -20006 1619 -7606 21870 -17240 -46782 -1951
7936 -1951 -4499 1128 -8798 1884 -10306 14069 -18583 -39657 -68112 -81300 -58300 -59400 -55744
7923 -55744 -18220 -41953 -33285 -8353 -37426 -13496 -14125 -66487 -43209 -9293 3219 1497 -64058
7910 -64058 -38346 -33077 -58191 -33990 -19369 42202 855 3387 16891 46975 62122 67477
7898 67477 10315 -25125 -17605 -52087 -43623 -48323 2416 12431 -38281 -59426 -10654 -19125 -21371
7885 -21371 -4117 -40736 -2576 -4642 -2837 -3293 13494 -15534 10502 29754 2188 41009 -31192
7872 -31192 -25393 -25061 -43485 -3581 23972 9912 -25819 -7515 9572 -21569 -6535 21238
7860 21238 26465 -27554 -36733 5585 22819 -17632 -25507 6559 6219 -46519 -47127 -37684 2343
7847 2343 905 -3319 9615 2797 -3414 -16153 -13071 -10799 8904 15308 -41452 -27016 -16608
7834 -16608 -14414 -224 -38102 -25158 -19046 -34415 -38528 27019 8641 -15741 -7881 5174 -9236
7821 -9236 19849 40901 38917 12453 -34523 -16173 15285 -48717 -52427 -3596 7029 -15215
7809 -15215 -5240 -46451 11025 33888 -23438 -11400 25819 25623 53713 21839 46935 -2207
7797 -2207 -22500 -12640 10231 9091 -7580 -11714 48024 9605 -45431 -19021 37166 4747 -3373
7784 -3373 39063 42929 418 -6608 3823 10631 39687 22680 62257 23069 14886 32844 1964
7771 1964 10001 40365 64934 66342 60437 118025 150088 94820 64529 67674 58294 69225 66017
7758 66017 47929 75902 7320 8414 22225 -7432 -17765 -1814 3153 -38094 5642 -11590
7746 -11590 -18081 -12283 -31731 -6824 29745 37172 -5706 42081 35177 -28433 54528 86265 89568
7733 89568 41924 71289 29926 50631 82488 131968 126976 89321 88853 135999 63124 64311 83011
7720 83011 120021 81441 81464 100167 45373 52724 34274 52514 48668 37502 36455 38316 72945
7707 72945 60601 30483 69489 52055 28877 40606 -6740 12728 16514 19467 -12615 12801
7695 12801 41739 46830 27181 64377 84055 63892 18738 -500 8482 41152 38072 24418
7683 24418 33709 54033 8277 -4468 12964 8048 23641 36439 37160 53904 102137 86443 27151
7670 27151 26321 -6899 30515 78647 97761 118790 88312 79789 93682 113967 75659 63343
7658 63343 113622 127683 45256 55070 72884 61958 71045 134912 105774 120649 129309 79558
7646 79558 64237 65814 7148 1771 919 5833 -19104 40878 44789 34955 66803 102098 86481
7633 86481 59771 45379 65087 68096 132459 68629 40307 122742 70094 80471 44621 18957
7621 18957 73806 117748 82528 66432 119275 88629 77868 74212 57367 107403 108721 109930
7609 109930 113042 89901 80254 63299 96938 117724 134708 168812 183174 189136 202498 206807
7597 206807 171056 221753 203464 207640 228657 333127 321896 311804 336318 336744 363570 388676
7585 388676 396577 418110 476947 511636 519369 543498 628615 677761 809490 886666 1033804 1234436
7573 1234436 1431289 1530291 1579751 1616042 1648627 1737744 1740732 1672466 1605133 1489258 1395548
7562 1395548 1220170 1063068 941366 853179 776711 754059 686265 631388 557558 542019 512641
7551 512641 508241 518584 463756 409289 365844 393231 376941 356261 274624 304206 343105 335882
7539 335882 323935 282869 264814 267285 239749 225232 209584 214558 229536 184041 194473 227934
7527 227934 201230 179992 218466 248338 221116 216843 212089 183993 167510 179993 135041 148487
7515 148487 187868 190269 135160 174543 191658 182248 169713 129275 149548 148653 143931 103888 149587
7502 149587 175636 207215 158295 132847 121499 91772 124958 168209 139700 171939 145757 118063
7490 118063 141508 165905 110926 97476 134380 93718 163654 152518 122940 138474 132047 128133
7478 128133 155234 94541 83033 107809 113094 149476 141256 115934 93456 98912 115178 108820
7466 108820 154101 168884 104591 143507 151028 104463 125273 129338 152095 154634 186069 156366
7454 156366 128974 165839 183770 210663 220483 214557 198120 175821 159665 158279 211275 148773
7442 148773 166041 244220 216037 219878 261228 272277 286616 268713 305756 314526 338285 304481
7430 304481 333183 352351 411835 452031 479443 539238 558631 566816 563833 551717 550412 481359
7418 481359 434517 463581 447334 431916 365161 429305 438408 444000 415289 395768 419059 386120
7406 386120 383203 381693 411534 438779 503309 499616 491067 483180 528201 581830 618850 670371 702022
7393 702022 730048 764899 722028 667853 616143 542680 506325 480014 458417 404022 411566 365902
7381 365902 364219 399596 408091 399865 418255 386569 345530 341861 322943 338096 399771 386538
7369 386538 383518 424487 391029 380835 438870 430025 376037 350146 358417 373490 342235 319849
7357 319849 359316 368302 343083 398227 401993 396392 388813 358639 394391 409813 405579 400181 370871
7344 370871 364368 403998 372931 342060 369923 413518 496870 460825 420228 522272 526462 512494
7332 512494 506429 527383 519443 532787 608054 627731 590727 592191 616137 614748 608862 628095 630188
7319 630188 667980 694573 742765 793962 815119 817174 821827 815829 841031 832555 816920 851195
7307 851195 806740 743364 764467 757368 748526 716468 650945 683027 680065 679187 702502 702212 681378
7294 681378 669996 749246 780179 751235 753318 781536 766187 762778 834971 808661 868999 846859
7282 846859 807212 924249 957229 926452 995116 1033252 1032586 1066092 1163733 1264025 1339684 1426108
7270 1426108 1482098 1611027 1750945 1871870 1924014 1917451 1957139 2061177 2084934 2030327 2040096
7259 2040096 1933844 1871754 1764847 1637633 1546269 1398745 1309192 1306189 1337157 1300619 1282160
7248 1282160 1282508 1274298 1214725 1209684 1226271 1226824 1180795 1192116 1250688 1272786 1260117 1291753 1342560
7235 1342560 1347774 1273738 1284345 1289694 1315150 1326934 1307142 1316913 1363880 1388077 1358571 1284416
7223 1284416 1276920 1298714 1277587 1310593 1236662 1226680 1239223 1259935 1253021 1259348 1270256 1272922
7211 1272922 1273102 1321281 1380824 1365066 1314556 1355297 1328110 1313523 1325629 1346618 1370830 1357954
7199 1357954 1379432 1384461 1373957 1355562 1376260 1385071 1408400 1430471 1486245 1478097 1494222 1610282
7187 1610282 1742500 1768253 1725440 1744354 1828386 1783528 1818076 1819707 1803363 1776483 1742483
7176 1742483 1727688 1657269 1633129 1569745 1530099 1564234 1597459 1555037 1559719 1579211 1569742 1607875
7164 1607875 1639832 1622636 1636238 1709294 1707575 1691667 1701605 1675759 1656333 1652306 1727882 1700037
7152 1700037 1672960 1586453 1558641 1565723 1508114 1448563 1444262 1491461 1456173 1467306 1450765 1491721
7140 1491721 1547022 1525428 1548659 1518553 1480910 1476201 1534710 1527602 1504596 1468888 1486850 1481565
7128 1481565 1473932 1511439 1492641 1498442 1545810 1550709 1611736 1612410 1607250 1638851 1693925 1728153 1860063
7115 1860063 1915750 1953166 2085079 2118068 2148551 2156833 2179294 2162558 2153235 2230567 2286059 2359379
7103 2359379 2390515 2453425 2466872 2452522 2472043 2478993 2503330 2487847 2433974 2402582 2379223 2325681
7091 2325681 2301972 2270447 2216115 2194559 2212495 2226146 2196990 2191787 2216266 2191000 2184475 2229046
7079 2229046 2325203 2379899 2464445 2548512 2679799 2827398 2866157 2874617 2884334 2990801 3059560
7068 3059560 3085328 3049545 3001719 2950348 2886445 2809525 2739417 2670545 2687137 2707110 2690580
7057 2690580 2731876 2719774 2745099 2849128 2915708 3031003 3169619 3334804 3513393 3751158
7047 3751158 4056482 4341363 4822598 5474567 6372791 7768322 9218053 9238663 8526946
7038 8526946 7539781 6274767 5271676 4672869 4244452 3890929 3622878 3475842 3396972
7029 3396972 3342961 3232296 3151141 3134680 3109313 3090680 3110801 3099375 3083173 2993512 2871300
7018 2871300 2879030 2774939 2721169 2642842 2556615 2507811 2470358 2433680 2341299 2293865 2275267
7007 2275267 2289518 2270866 2337838 2351436 2338191 2383330 2405474 2447090 2434560 2479646 2567458
6996 2567458 2594959 2657923 2687205 2668176 2710847 2716339 2715028 2771371 2864613 2943346 2963562 3053646
6984 3053646 3135173 3299524 3404585 3516325 3597633 3642783 3672900 3720983 3744252 3747840 3818545
6973 3818545 3897479 4047267 4097211 4094929 4038603 3870294 3662498 3444487 3219668 3039676
6963 3039676 2915146 2809262 2761649 2726705 2738200 2724460 2682128 2585249 2579095 2572102 2520384
6952 2520384 2576681 2603233 2697166 2719975 2757916 2823114 2855948 2863914 2944780 3070876 3111106
6941 3111106 3079712 3051250 2938239 2761440 2523928 2335928 2184038 2057056 1934888 1824542
6931 1824542 1717969 1658156 1628105 1613977 1569186 1523313 1512887 1537638 1534669 1536447 1544756 1543168
6919 1543168 1577209 1612998 1576457 1566426 1559110 1531961 1554823 1534317 1529477 1516908 1499139 1458949
6907 1458949 1470864 1441453 1409575 1477373 1432943 1442733 1519374 1544425 1562794 1622973 1741229
6896 1741229 1883435 1945844 2038380 2055609 1995503 1872437 1768711 1643894 1584708 1511150 1452138
6885 1452138 1396408 1431841 1438743 1377643 1394859 1397807 1316629 1259276 1239459 1197835 1132182 1069963
6873 1069963 1043649 1037074 1022476 1005910 1050929 1095490 1153495 1150231 1232384 1216243 1148024 1055969
6861 1055969 1044812 1021378 936485 900258 832661 842374 812745 832677 809908 791595 770208 749474
6849 749474 764174 730737 696903 663062 686867 636769 596076 637322 645196 640347 591424 627820
6837 627820 585494 642540 641962 650091 601511 573978 553876 528699 516651 540318 603063 544021
6825 544021 577346 581898 571077 530495 492900 497074 480902 500827 547748 521210 587365 542785
6813 542785 506633 501802 477866 470848 489777 489192 510356 485163 507099 568459 541263 507771
6801 507771 527725 569093 509059 473120 526420 474302 484209 478570 468877 515875 542278 504870
6789 504870 539137 540261 540041 567908 580507 543178 512472 488508 498097 477428 506101 524922
6777 524922 508740 497420 491151 517339 537804 475978 485793 530721 513104 507043 505665 496618 507063
6764 507063 491933 493596 517832 539727 503799 456012 475553 475911 459544 523039 486638 541674
6752 541674 510648 461541 499959 521295 544311 590426 589239 534133 508387 506050 494455 512936
6740 512936 523602 495040 481428 429333 476206 473710 439390 490283 514033 482546 519192 475319
6728 475319 491043 484367 536244 540308 504939 504486 522530 513111 532286 531832 505749 535815 500049
6715 500049 464997 470618 535967 516544 549406 517079 478259 535623 594015 586626 557857 613863
6703 613863 594083 591044 548254 544322 529296 551434 569875 554141 500525 514276 502168 461634
6691 461634 484688 486046 485299 552715 579491 562666 530626 570333 545121 555597 524393 506474
6679 506474 549309 524485 537679 494178 491597 549448 472929 455267 406529 384648 394468 426974
6667 426974 400007 335104 354049 353032 377242 377779 312002 301296 311391 252396 223454 315898
6655 315898 312164 264012 322613 296247 261025 280795 221722 231239 275314 196492 207002 234727
6643 234727 229816 230899 222470 212142 214659 235063 211991 175334 158071 127109 186949 179141 148191
6630 148191 158033 186698 198876 189106 204385 195066 208988 215340 207204 215997 199501 196711 190749
6617 190749 189470 142417 166944 195681 190967 176969 154035 215968 206536 199189 190257 161994 168346
6604 168346 178301 178378 135198 157607 137388 150922 136903 139837 171250 187665 137006 92784 129842
6591 129842 170192 225735 222569 159165 85113 149317 188400 128321 180071 133790 169809 153835
6579 153835 189002 233436 181464 153321 156244 141199 135965 138570 128750 164791 136313 161074
6567 161074 152429 200277 243480 178537 212472 245252 239672 259091 259269 274839 286795 302328
6555 302328 317441 365204 413175 481816 470580 433137 400790 480496 447370 390933 401865 388106
6543 388106 366089 319779 322533 366163 325102 251494 264495 287253 317790 308083 277597 319979
6531 319979 371280 404020 423232 450666 443114 418167 427694 487290 505536 551330 512922 525500
6519 525500 586472 563752 561198 621780 623323 584318 535059 525450 465152 415614 403979 321295
6507 321295 354406 297554 303423 326624 306101 320989 273246 295120 391699 365869 286343 322045
6495 322045 393872 398667 451211 493931 480624 401659 423918 449497 345657 335804 338223 323088
6483 323088 234680 229951 231212 198947 251166 221742 198500 230688 195594 231050 247291 271544
6471 271544 263273 203799 251296 308284 361207 418924 434846 376051 384068 340534 262813 262095
6459 262095 249183 211894 219546 205121 226592 197370 186426 212349 206969 171186 179245 236352
6447 236352 268441 305172 339148 319264 423826 428812 368542 294731 284606 250846 192918 161934
6435 161934 160545 164977 84251 106944 170599 95480 35677 43062 51695 40065 75913 23076
6423 23076 -6858 -5771 26225 21026 29764 33264 51184 25927 -6419 -6684 28997 46784 17832
6410 17832 34533 18578 79970 -2296 -25044 -1889 -4980 15029 11116 3034 7462 5255 28052
6397 28052 12776 20161 8432 1568 178 48016 31877 42190 -20904 -67823 -19841 -26132 -11970
6384 -11970 -22264 -30073 -39424 -79531 -87284 -20365 -56058 -53195 -85052 -75467 -47070 -80557 -77706
6371 -77706 -23506 24787 11616 -1601 -5432 6478 -30740 -62577 -57487 -97355 -85699 -82682
6359 -82682 -85041 -60131 -52414 -17138 -20430 -15145 -23930 -5048 -51391 -80570 -92734 -40422 -29660
6346 -29660 -28937 -21550 -28617 -31230 -28151 776 -69908 -88733 -74170 -70991 -27068 2323 -12579
6333 -12579 -38539 550 -46024 -53673 -31161 -61983 -60380 -42387 -21662 -57503 -30772 -459
6321 -459 -36218 -35084 -33136 23578 -29467 -33681 -56230 -68157 -57341 -3656 44004 66923 13752
6308 13752 67025 -8664 -8751 -39755 -26705 -29584 -50437 -40423 -59074 -55667 -48909 -28809 -33928
6295 -33928 1477 22406 14540 -8265 -750 -53320 -28260 -48652 -63270 -35901 -21670 -55470
6283 -55470 -13645 23674 9003 -59927 -8461 19999 -8739 9212 2629 -20850 27055 21085
6271 21085 -19416 -30496 -24213 -24618 -59564 -16143 -60863 -82694 -63231 -53778 -43480 -94941 -121730
6258 -121730 -76793 -29615 -41132 -24275 -54880 -60861 -92932 -84963 -102194 -113220 -78441 -13303
6246 -13303 -6678 -58222 -25144 -20111 -95442 -79343 -52784 -84058 -28279 -8536 -18939 -36644
6234 -36644 -3099 -7203 -41801 -57520 -67766 -59361 -97809 -95673 -97802 -78681 -78905 -50424 -67581
6221 -67581 -52705 -1370 35356 23149 2556 -47257 -30245 -11254 24419 -10380 -27828 -45840
6209 -45840 -77140 -57755 -58631 -67338 -57691 -68131 -59834 -76335 -60251 -36948 -27586 -69400 -79559
6196 -79559 -24587 -26942 -40983 -17746 -64761 -53244 -57423 -30524 -13141 -52322 -57360 -63952 -39628
6183 -39628 -51623 -51537 -46844 -59522 -36065 -45089 22212 32751 -1229 -73692 -93544 -62246 -57610
6170 -57610 -28308 -17519 2585 -18265 -32166 -19816 -8636 -58289 -100972 -71848 -8425 -48967
6158 -48967 -29669 -14652 -56661 -4110 -34425 -49847 -22118 -10238 6257 -21680 -44678 -36171
6146 -36171 -7655 10956 -1426 -810 -6581 -2155 -4113 35985 19283 32424 40403 -4277 -27895
6133 -27895 -98152 -45551 27652 2415 -24463 29064 11348 6244 19478 7498 14806 51743
6121 51743 -26682 -26644 -32579 -30392 -59512 -42188 -15595 46076 50024 77961 67090 43435 60681
6108 60681 57229 70129 68899 -5860 22878 79467 87713 95375 30242 9852 8026 -19050 28637
6095 28637 14541 32655 46545 44330 74872 78867 43188 54144 102507 64544 2259 -6079
6083 -6079 37207 56177 51943 52504 -25510 34777 13748 39185 66404 84488 46121 39007 75331
6070 75331 38173 64707 30368 -14356 24402 45606 66824 46522 15448 81296 82018 35979
6058 35979 39716 63756 116457 99748 73257 80687 100228 92951 104090 59864 58951 51866 17609
6045 17609 67022 89803 104482 17509 -4870 25624 14532 16104 42230 38040 71082 64907
6033 64907 53218 91501 52779 50568 100692 -8674 47461 119089 45220 32148 22838 43736
6021 43736 117667 81903 97471 121478 93240 71745 88090 72717 96364 125235 94048 66491
6009 66491 102881 63211 49604 73152 89118 100054 108256 93889 89822 53659 82274 93162
5997 93162 134015 108762 92146 126035 158649 165987 171398 173037 124133 95040 136138 186233
5985 186233 135928 153449 154045 174267 158386 105258 101817 89827 138066 95160 143632 138548
5973 138548 134251 162259 98282 88001 78887 74877 83785 48126 106572 128913 99600 109675
5961 109675 120412 123084 112766 158470 78357 40890 112183 126343 107273 73244 60960 80288
5949 80288 77235 93191 71512 69643 101647 129048 122840 148601 117243 97325 114950 128680
5937 128680 121296 111537 166243 142439 110870 131156 151296 74181 138620 156361 164117 125962
5925 125962 118292 114050 118983 142723 102605 121885 179225 164121 190461 220176 169851 174893
5913 174893 196213 206634 187326 190592 240399 216482 221116 220785 241134 282034 291033 324650 354062
5900 354062 377547 373713 402213 415857 423604 423488 387920 349430 359969 405924 364423 368496 415953
5887 415953 407533 363395 414650 526991 479552 497876 449861 492218 449779 421535 385659 396240
5875 396240 388971 408809 363311 320873 317761 309450 270121 259659 291776 315012 300896 343638
5863 343638 334659 304988 312328 308843 298055 312098 307882 321083 325501 354773 405773 386991 364011
5850 364011 379707 363103 369016 398524 453510 485513 498431 583693 635664 715888 731142 729558
5838 729558 646508 648276 650155 598195 532328 510486 497905 475630 509632 498233 463003 442476
5826 442476 448542 487198 483555 469224 436292 413420 434484 468729 427989 395805 392521 369362
5814 369362 329502 286863 301523 278582 252880 292633 250071 269510 261791 229620 254261 231816
5802 231816 251623 269911 277967 247539 182205 202098 202338 195842 206903 240131 238488 220562 223132
5789 223132 193777 210271 206225 194468 159217 235553 273898 255411 236404 236812 279257 269190
5777 269190 242981 209851 193029 226204 201991 204171 186560 231313 237007 175847 197336 184115
5765 184115 244816 244927 217246 228345 204803 132859 169610 196787 175146 201812 211390 156245
5753 156245 138277 175492 217725 190986 194023 193080 234515 165350 118398 147211 65793 135546
5741 135546 156661 132643 154560 129796 98538 122305 45070 79781 92791 152276 171499 136620
5729 136620 119419 122017 118213 166448 130252 121834 108664 122608 140330 119613 77374 16825
5717 16825 93936 134936 132375 45800 81971 111651 100017 88455 137396 123219 137278 133835
5705 133835 88761 44956 79964 115942 113351 128473 100462 102712 105180 92468 63729 53288
5693 53288 29618 91462 111865 29615 59616 79449 123591 120977 70478 97672 55624 43137
5681 43137 75299 65314 126629 67875 130474 118381 95930 101550 75453 71193 83426 86160 82628
5668 82628 53742 66369 115793 128078 110836 116495 104111 82466 74207 59613 87147 97856
5656 97856 89717 98652 65885 97939 97161 61950 131018 137540 145469 157303 137641 132293 105111
5643 105111 143298 111592 122553 109503 102510 89121 130668 119961 97678 114037 83671 98601
5631 98601 89000 132671 105827 82000 93254 111229 63569 75719 65713 99474 154500 119912
5619 119912 102221 100657 90856 36424 94974 184314 130415 161539 196944 176797 196606 246784
5607 246784 166561 184127 195191 203505 223796 231418 170165 236888 221815 195783 256081 245522
5595 245522 244598 271741 309402 281473 235218 153611 199011 181217 233279 204803 151032 194500
5583 194500 134931 128195 122872 103467 83987 119875 134651 158307 152286 58909 58260 143182 167947
5570 167947 151575 150732 153104 178606 180375 207571 184669 173380 131515 180183 175981 140980 166500
5557 166500 158016 213553 230749 219940 136687 142848 99577 134520 124273 105475 109230 131500
5545 131500 186998 124043 116112 117316 111772 102527 80055 71062 98967 86150 51253 72064 67422
5532 67422 72971 65629 61679 63568 69949 64189 87298 116086 71656 47603 111940 122777 124617
5519 124617 95950 97156 106442 60385 117460 135987 117333 113019 95183 160509 119712 103500
5507 103500 197107 200228 194364 185835 178832 216430 203230 201195 152657 155425 142948 185531 195722
5494 195722 201194 202461 141633 162969 180415 190987 160935 167057 201286 196877 167596 189286
5482 189286 188084 170511 131023 168427 175580 140332 160831 175057 179233 162287 181531 147465
5470 147465 125616 192173 231626 216668 224121 205087 204164 256046 211248 237471 212686 204410
5458 204410 188616 179776 212254 187842 147229 192183 238304 250572 190865 188698 285670 269737
5446 269737 266027 259034 204326 259190 219817 169487 187351 174874 164841 175923 177622 193993
5434 193993 175339 179145 175558 168918 207470 183184 218282 191282 201477 166055 159064 212092
5422 212092 182490 139785 118109 189454 241581 205196 213744 161859 157084 159104 170433 164432
5410 164432 150235 167056 140617 159665 115279 137786 144970 137222 142583 119884 122044 133147
5398 133147 177016 152437 173359 173812 229663 194725 170846 216505 233088 276606 207309 191797
5386 191797 181192 234098 220098 205975 190245 228238 230766 275253 240722 267344 219433 255610
5374 255610 258056 255956 238229 205591 236844 194412 231050 238724 256987 254180 246926 233314 195415
5361 195415 282941 306794 341026 327203 323249 380114 367443 449348 419094 375147 374931 429026
5349 429026 447392 494288 500055 504782 568275 573346 607914 646223 643460 678217 744811 789586
5337 789586 863533 840199 876710 891788 957827 1015467 1088245 1190090 1241456 1348395 1493066
5326 1493066 1653635 1769971 1936770 2144093 2435797 2724254 3054974 3488566 4010329 4473656
5316 4473656 4821956 4936569 4798757 4583082 4227365 3820680 3455237 3102232 2848397 2591788
5306 2591788 2400954 2256563 2143173 2062017 1936753 1881172 1842609 1825725 1800136 1778190 1735637
5295 1735637 1669001 1616229 1562865 1495242 1454015 1451323 1434548 1383335 1398978 1390801 1400876 1394513
5283 1394513 1373436 1322502 1288477 1224250 1199475 1180757 1126803 1115452 1116045 1054796 1019287 1006615
5271 1006615 993069 1076936 1037738 1071807 1055237 1036919 1052582 1083718 1045268 1072176 1144723
5260 1144723 1139400 1151217 1188649 1223179 1258391 1304884 1337327 1358460 1474414 1464425 1544573 1620634
5248 1620634 1724034 1839755 1992540 2091544 2269918 2438327 2669624 2935481 3246364 3497361
5238 3497361 3746282 3837686 3827801 3621188 3376891 3138631 2825063 2591491 2382040 2255527
5228 2255527 2114116 1921070 1799680 1729091 1688245 1598811 1595470 1553094 1533309 1514488 1468695
5217 1468695 1427274 1428424 1392641 1403195 1398382 1405046 1443991 1438001 1457849 1457590 1469017 1413320 1450227
5204 1450227 1490846 1530186 1570715 1543485 1542886 1555175 1528270 1576103 1577941 1587809 1573100 1605747
5192 1605747 1606015 1575999 1615837 1591372 1557207 1523307 1489439 1491405 1440329 1434326 1394087 1342230
5180 1342230 1353383 1327123 1297317 1322893 1378271 1367610 1358220 1375295 1318961 1349243 1424970 1412600
5168 1412600 1405222 1410718 1434520 1496761 1457975 1469707 1497195 1547070 1569908 1586519 1637588 1648012
5156 1648012 1677133 1689109 1622535 1690089 1723475 1696981 1731891 1729423 1701673 1829829 1858439
5145 1858439 1825645 1885310 1897474 1926526 1962054 1997592 2034478 2073134 2144984 2151068 2169424 2204317
5133 2204317 2257972 2266345 2364252 2410797 2524381 2570958 2669863 2736074 2777293 2853530 2915027
5122 2915027 3002929 3147900 3232950 3345797 3438132 3665700 3879917 4032472 4055999 4116932
5112 4116932 4217228 4361725 4490742 4607757 4787907 5022518 5274767 5566583 5767639 6032089
5102 6032089 6214142 6541313 6745275 7015114 7216988 7498495 7811459 8137620 8469715 8863774
5092 8863774 9264204 9720542 10194038 10704616 11290423 11958629 12685479 13407644 14116689 14852512
5082 14852512 15597627 16360005 17179816 18112899 19202170 20470522 21904448 23498606 25414885
5073 25414885 27644671 30198475 32586278 35043875 37646944 40594969 44167698 48549810
5065 48549810 54260665 61914268 71545337 81159707 85849106 86625570 85843458 84987548 83723586
5056 83723586 82351625 83144189 86556263 90987475 92964679 94525036 96783737 100914558
5048 100914558 105708870 108784335 108576713 105881348 102753834 100412852 98761495 98348663
5040 98348663 97518749 94234206 90773364 87713970 85955468 84940944 86389894 91058860
5032 91058860 95634195 94474128 89230626 82092266 74796609 66366674 57566216 50519496
5024 50519496 44934273 40404499 36757329 33708390 31108153 28938099 27075236 25500440
5016 25500440 24000894 22642682 21398749 20292249 19276619 18389106 17570607 16912552 16217681
5007 16217681 15488524 14785315 14124519 13482969 12906235 12463886 12040296 11564392 11182417
4998 11182417 10746055 10388973 9950154 9568431 9256822 8991949 8651653 8427336 8238477
4989 8238477 8001116 7793476 7604981 7442733 7359770 7282273 7109222 6969655 6740453 6598946
4979 6598946 6394328 6195552 6068104 5939577 5794797 5725152 5561389 5456361 5373395 5252724
4969 5252724 5200803 5234903 5208349 5120556 5013332 4885768 4743544 4566821 4478121 4369777
4959 4369777 4225182 4078883 3967783 3866437 3781358 3690780 3653224 3567695 3477998 3477387 3429915
4948 3429915 3368420 3414543 3418292 3397291 3355140 3322876 3342313 3359687 3325123 3302701 3282415 3259232
4936 3259232 3254803 3279061 3254200 3267427 3292288 3345850 3327343 3339219 3409256 3490110 3470277 3492592
4924 3492592 3494104 3494574 3422942 3463956 3461464 3488342 3440061 3428125 3358410 3365186 3303403 3220277
4912 3220277 3167828 3139468 3137220 3133469 3151277 3118640 3116530 3076359 3057722 3119797 3060941 3061779
4900 3061779 3022113 2968075 2934824 2980205 2987970 3013685 2958966 3006280 3111195 3114865 3169394 3177906
4888 3177906 3240004 3305736 3270251 3266028 3207952 3136366 3021149 2959153 2958285 2924437 2949345 2986217
4876 2986217 3014931 2979219 2932580 2926112 2939693 2876120 2807652 2766688 2773312 2804467 2740118 2719936
4864 2719936 2622042 2600364 2577580 2508290 2478474 2463723 2474380 2509089 2541109 2603704 2627397
4853 2627397 2766312 2792088 2755931 2724589 2738627 2747461 2712866 2661898 2694877 2690283 2700895 2636928
4841 2636928 2625561 2572243 2512984 2418899 2408652 2395489 2363614 2385117 2358610 2378956 2427317
4830 2427317 2413082 2437663 2476694 2498971 2465342 2451857 2450425 2449712 2441830 2478178 2482404 2423661
4818 2423661 2435613 2433666 2423177 2495568 2502078 2494882 2548417 2584629 2640098 2654149 2684761 2703058
4806 2703058 2767908 2859951 2893667 2865003 2931122 2907739 2930882 2887736 2935805 2975219 3020745
4795 3020745 3020151 3075469 3163786 3234915 3272621 3291244 3310835 3329565 3392333 3417266 3393271 3519361
4783 3519361 3632336 3756645 3844088 3963145 4010998 4044388 4041546 4084005 4063203 4071963 4029307
4772 4029307 4024554 4001507 4009749 3990149 3986758 3972779 4012522 4042789 4141578 4120800 4094392 4095114
4760 4095114 4124049 4095535 4122843 4098542 4046935 3938164 3918666 3908309 3971763 4044366 4078736
4749 4078736 4099918 4127533 4049117 4045098 3978465 3956890 3849349 3825227 3830565 3875633 3880540 3926254
4737 3926254 3999134 3989310 3943849 3932383 3939723 3996979 4039556 4154432 4277856 4374832 4444137
4726 4444137 4483733 4502090 4554391 4604437 4692168 4744631 4819845 4871490 4942060 4995245 5152054
4715 5152054 5216141 5308614 5442850 5607835 5769102 5936969 6067216 6274964 6574985 6779841
4705 6779841 7036877 7272014 7539050 7750435 7985094 8283523 8541485 8842554 9182272 9493778
4695 9493778 9809027 10261586 10738897 11259338 11823565 12409840 13064717 13730802 14486213 15320572
4685 15320572 16183334 17007719 17852149 18651778 19577986 20590946 21633252 22832638 24148742
4676 24148742 25656594 27504641 29476074 31715549 34341436 37365554 40790314 44905643
4668 44905643 49834636 55929144 63780496 73886181 85963925 96015715 99431713 99035970
4660 99035970 97005687 94969404 92245530 90830871 92641971 96318691 97780426 97954258
4652 97954258 98471092 100646130 104560748 109849514 115127807 116757747 115190694 112863300
4644 112863300 110882446 109265293 107083555 102663465 97775282 93109177 89893783 87215620
4636 87215620 86311541 88344761 92832357 95457146 92918364 87519235 81156948 74646224
4628 74646224 67116103 59856692 53919406 49218604 45368018 41952537 38741839 35879795
4620 35879795 33304574 31069968 29070430 27342169 25867439 24571885 23419643 22390077
4612 22390077 21413673 20467211 19586576 18758303 17994424 17329373 16704197 16142394 15662227
4603 15662227 15270438 14907665 14614147 14363718 14222334 14116553 14029004 13971215 13898433 13735165
4593 13735165 13599557 13397768 13334255 13289272 13280200 13332992 13556599 13780330 13834402 13753320 13619351
4582 13619351 13419903 13320080 13217996 13212936 13299360 13482648 13771732 14266812 14821010 15071419
4572 15071419 15246307 15490598 15638189 15352316 14906760 14367822 13902167 13327118 12845571
4563 12845571 12499923 12371818 12325199 12430042 12559301 12736832 12868420 12954122 13033091 13278290
4553 13278290 13580061 13530675 13327384 13170183 12830390 12217408 11549309 10884283 10254984 9732400
4543 9732400 9213583 8760526 8512033 8382343 8200490 8138384 8194041 8052863 7937906 7930175
4533 7930175 7873700 7712981 7412731 7149826 6914121 6710354 6421412 6288926 6156958 6101037
4523 6101037 5928117 5758695 5596675 5466891 5394484 5308449 5139815 5134127 5103683 5048594 5028078
4512 5028078 5063051 4998690 4984920 4878606 4796503 4678198 4579946 4515647 4494180 4487009 4563664
4501 4563664 4439248 4463136 4504461 4429989 4386982 4333351 4211540 4113383 3998272 3862066 3778060
4490 3778060 3703956 3542140 3424091 3333954 3276174 3130077 3055038 3025349 2962869 2872798 2881999
4479 2881999 2764656 2752761 2759046 2773694 2756390 2779995 2774900 2787959 2758714 2774445 2796774 2821478
4467 2821478 2787887 2838726 2837843 2874126 2801422 2762591 2745666 2731826 2677883 2637262 2587939 2503399
4455 2503399 2512420 2517417 2519205 2504987 2492197 2491606 2520308 2537432 2590689 2652352 2643085 2649939 2612135
4442 2612135 2607069 2576810 2503030 2515925 2480768 2401425 2361489 2411245 2367111 2326837 2346330 2305131
4430 2305131 2278555 2328295 2408936 2469062 2519688 2559853 2618766 2711818 2731011 2747515 2821081
4419 2821081 2877670 2962721 3015711 3073586 3147563 3133024 3218219 3167552 3208052 3224665 3200902
4408 3200902 3240595 3302992 3334475 3439541 3500038 3548910 3602922 3723070 3810347 3950649 4057973
4397 4057973 4417234 4668513 5069954 5276383 5376901 5307170 5235518 5124949 4907692 4813038
4387 4813038 4780275 4643475 4591987 4510710 4379369 4211472 4127586 3997295 3958998 3890150 3928089
4376 3928089 3913687 3963636 4070936 4196538 4275742 4509496 4605432 4820824 5014253 5140989
4366 5140989 5196482 5139199 5014000 4858278 4626042 4476847 4232675 4157802 4018019 3963113
4356 3963113 3860934 3833033 3822011 3857471 3893269 4010425 4093955 4268775 4404931 4603233
4346 4603233 4707037 4801135 4873381 4894271 4873109 4940858 4949405 4976805 5099644 5293764 5516377
4335 5516377 5903783 6351134 6925779 7463326 7880902 7967009 7955710 7780401 7617534 7287363
4325 7287363 6946990 6701458 6616022 6531265 6537353 6597939 6746092 6930583 7213953 7601847
4315 7601847 7990076 8478071 9068190 9866663 10938262 12253192 14001718 15798779 16871095
4306 16871095 17050020 16652417 15970617 15002887 13714586 12496827 11494709 10683653 10060300
4297 10060300 9498072 9195029 9034258 9023953 9173883 9320955 9589364 9981579 10484295 11180026
4287 11180026 12138237 13555184 15290592 17222433 18553330 18856232 18362423 17575628 16416960
4278 16416960 14988925 13519031 12327062 11257671 10423956 9690775 9200963 8778419 8512875
4269 8512875 8291784 8221703 8122159 8100352 8046290 8163724 8333310 8691144 9075551 9694902
4259 9694902 10108967 10319215 10236428 10100751 9755310 9506512 9150893 8861689 8544506 8448582
4249 8448582 8253346 8232588 7993337 7881225 7663776 7568980 7313913 7182863 6983184 6928414
4239 6928414 6789600 6863976 6816316 6917645 6916614 7057315 7029517 7194267 7294472 7482613
4229 7482613 7574669 7904198 8122769 8460091 8689717 9085969 9302685 9606925 9559082 9677646
4219 9677646 9619998 9738411 9708038 9847423 9853412 10052892 10097685 10359429 10430746 10690332 10785036
4208 10785036 11207715 11545998 12193758 12742740 13642342 14573289 15690775 16459182 17355222
4199 17355222 18085337 19121756 19930515 20885075 21636711 22502537 23330651 24242687 25101055
4190 25101055 26235416 27297806 28686877 30075155 31899095 33812395 36135790 38470763
4182 38470763 41094068 43810446 47003499 50219144 53672222 57361374 61927620 67141440
4174 67141440 72981968 78963017 85960236 94401098 104953019 113524772 120397202 127889852
4166 127889852 136686470 147843476 161912008 182032015 210912637 252710879 312254897
4159 312254897 375691411 383085748 362090817 329579971 298110465 252764416 205968543
4152 205968543 174577947 150048223 132090630 116669874 104822134 94196443 85663345
4145 85663345 77713295 71907526 66068510 61092581 56507756 53050776 49564029 46846965
4137 46846965 44065637 41890553 39577254 37802736 35826076 34137594 32159221 30792183
4129 30792183 29222351 28070547 26805440 25920641 24798548 24162493 23344961 22994844 22560331
4120 22560331 22679338 22320807 22031708 21445059 21182725 20525274 19968620 19386622 19241524
4111 19241524 18851351 18830910 18670754 18620624 18143841 17735172 16983123 16434775 15643279 15134460
4101 15134460 14454268 13953771 13353065 12960158 12394833 12020190 11537414 11348479 11118657
4092 11118657 11009963 10805855 10717367 10510490 10331080 10074370 9924354 9607977 9451846 9185920
4082 9185920 9092203 8962884 8961547 8929742 9029879 9145316 9389242 9686236 10216110 10908575
4072 10908575 11391096 11148054 10745375 10102685 9587787 8823506 8225513 7705126 7336843
4063 7336843 6966034 6749451 6518859 6467774 6350873 6350095 6336429 6385375 6448973 6552922 6590445
4052 6590445 6536731 6406390 6255653 6116658 5929137 5743931 5594120 5543628 5473476 5454854
4042 5454854 5439190 5392498 5512579 5682845 5903799 6079630 6134735 6146506 6147999 6064857 6036972
4031 6036972 6044868 6085843 6098352 6145790 6202605 6227440 6290218 6310720 6355440 6468963 6599916
4020 6599916 6755082 6892003 7026577 7214852 7474150 7819135 8140693 8426247 8693948 9092002
4010 9092002 9437887 9974636 10349225 10671507 10951464 11418434 11970101 12734969 13785449
4001 13785449 14813329 15875049 17228402 18930092 21389947 24703645 29579014 34852076
3993 34852076 36664720 36512780 34944251 32415533 28772448 24471533 21262626 18302026
3985 18302026 16097888 14284075 12964132 11863616 10969265 10103698 9479424 8813174 8317537
3976 8317537 7836625 7440000 7046759 6769055 6497254 6352342 6156093 6110737 5951887 6009962
3966 6009962 6009709 6121934 6150218 6322537 6287234 6113212 5811554 5588277 5261129 4950792
3956 4950792 4650002 4454795 4341884 4229543 4063648 3947400 3819820 3747093 3588492 3535236
3946 3535236 3392378 3355509 3312249 3244014 3182461 3231027 3128702 3065817 3026789 3058039 3024617
3935 3024617 3074908 3038980 3026119 3049657 3052788 3013623 3041650 3078551 3139443 3126026 3236045
3924 3236045 3328978 3579975 3873615 4200397 4228982 4213002 4092087 3932262 3733222 3590517
3914 3590517 3433378 3306382 3339110 3318700 3383923 3511532 3751578 4080400 4435659 4801481
3904 4801481 4772974 4660913 4416536 4156713 3878731 3543215 3203913 2916816 2640209 2438689
3894 2438689 2346232 2271074 2208673 2153226 2042255 1981758 1860345 1844942 1838874 1755164 1755879 1741070
3882 1741070 1681308 1570317 1582293 1548247 1574018 1581365 1593743 1553921 1555653 1617673 1583161 1589420
3870 1589420 1636369 1584214 1635802 1652823 1778299 1806761 1855475 1902850 1984135 2024981 2148018
3859 2148018 2209457 2358891 2432599 2523743 2524955 2558073 2477771 2425911 2432620 2465826 2443103 2497112
3847 2497112 2499627 2565441 2523784 2636264 2655175 2709349 2780343 2890625 2964758 3099041 3219261
3836 3219261 3393057 3566376 3768998 3941343 4234815 4551029 4952464 5388869 5975347 6738274
3826 6738274 7691796 8476429 8798214 8657274 8396131 8044166 7519229 6993858 6616527 6405555
3816 6405555 6402286 6398200 6602410 6923777 7390344 7829305 8033883 7875533 7528863 7033340
3806 7033340 6473021 5870846 5337717 4866246 4513648 4187983 4044560 3838025 3686765 3591190
3796 3591190 3543321 3455347 3468705 3494418 3531652 3521227 3440437 3341073 3205735 3042291 2932870
3785 2932870 2705575 2544415 2404170 2282765 2211442 2112513 2076014 1997983 1884984 1863288
3775 1863288 1762936 1738240 1694588 1649746 1653223 1629946 1583343 1581437 1582826 1568570 1563583 1520800
3763 1520800 1573747 1573613 1544388 1544180 1524302 1561744 1584244 1529668 1502017 1481800 1469063 1390905
3751 1390905 1388512 1371876 1350471 1320603 1323653 1318793 1274769 1278424 1289588 1251576 1337964 1291980
3739 1291980 1282559 1268798 1217242 1266999 1247600 1175506 1200115 1192884 1195420 1173326 1143491 1116940
3727 1116940 1111872 1048703 1034936 1025480 976908 952450 1009149 959553 965335 952720 923811 927935
3715 927935 965519 890743 950295 960006 990733 952378 985385 976398 991231 974403 976643 961128
3703 961128 935068 899608 893964 898415 946568 909460 904721 870022 874776 901110 851029 827570
3691 827570 872061 882158 917925 879152 859438 880512 898174 897298 892887 846517 866404 846616
3679 846616 880326 876889 910389 856011 883856 944472 976898 953402 895464 911974 896743 890681
3667 890681 876925 809426 827540 799974 835299 817184 811316 826066 880253 835010 818313 871340
3655 871340 846080 849141 896919 890610 912047 926129 894221 953133 961025 926128 963506 893597
3643 893597 940251 1002192 1010829 1009128 993117 949493 1011396 1016266 998031 1024841 1037472 961798
3631 961798 987869 1044454 1038044 1073680 1107245 1069688 1079895 1120470 1107999 1115439 1104440 1119388
3619 1119388 1128470 1125425 1102267 1127846 1142534 1155197 1127747 1192066 1230582 1241277 1280381 1341987
3607 1341987 1358522 1298679 1286790 1328282 1284522 1274314 1199531 1172704 1173392 1143141 1158046 1154220
3595 1154220 1161498 1176165 1187492 1205752 1164667 1141808 1157114 1179594 1122620 1124159 1100799 1146749
3583 1146749 1096605 1126439 1120857 1108688 1153943 1201244 1203850 1242432 1158516 1211670 1166557 1149086
3571 1149086 1190234 1198831 1222362 1247380 1242598 1254586 1238642 1302011 1323293 1344264 1323257 1367595
3559 1367595 1331041 1356012 1367105 1331182 1295791 1361332 1331210 1343697 1307934 1306389 1293812 1325353
3547 1325353 1335478 1340687 1339546 1312881 1319159 1321512 1290621 1317737 1350056 1316669 1313282 1352370
3535 1352370 1369363 1423630 1468488 1504718 1450405 1492752 1466381 1493907 1455824 1440267 1471690
3524 1471690 1518969 1514935 1538741 1524131 1580481 1584294 1646276 1669312 1675801 1670681 1690157 1680189
3512 1680189 1690198 1784132 1797498 1785394 1776878 1807560 1793806 1837031 1808714 1917799 1973501
3501 1973501 1946156 1957440 1963037 1966106 2058109 2044641 2036886 2043178 2128570 2158838 2181444 2212411
3489 2212411 2323488 2380445 2418313 2515364 2604370 2659017 2700558 2717908 2720076 2698302 2714709
3478 2714709 2648967 2548826 2521261 2552831 2543581 2530714 2495591 2488899 2426516 2464674 2461218 2466711
3466 2466711 2440993 2428113 2436788 2464144 2456074 2510181 2545517 2514529 2464189 2558784 2553030 2512559
3454 2512559 2510096 2507342 2478639 2467562 2438681 2435289 2394254 2398953 2437336 2451166 2414681 2452441
3442 2452441 2412075 2420176 2400309 2364468 2312102 2346469 2368463 2341567 2330922 2367223 2369814 2305599
3430 2305599 2322808 2395510 2338063 2357440 2374308 2371436 2300549 2302292 2347172 2342428 2348073 2368019
3418 2368019 2348608 2338720 2326822 2302358 2344662 2369404 2335729 2312430 2357110 2395586 2369098 2367499
3406 2367499 2376901 2339791 2341299 2357390 2390830 2406543 2415347 2420930 2421553 2445540 2418126 2437165 2478794
3393 2478794 2442999 2463044 2471116 2465053 2485735 2474838 2453333 2429973 2490142 2478722 2452048 2482861
3381 2482861 2515524 2548516 2461261 2509244 2524480 2522334 2540959 2538197 2544979 2515610 2536050 2553243
3369 2553243 2551158 2565263 2572079 2570481 2583749 2576121 2554769 2566340 2580589 2637369 2563364 2584165
3357 2584165 2620591 2651388 2703092 2705468 2714764 2709526 2734493 2772946 2768500 2776255 2789082 2810788
3345 2810788 2802056 2777580 2796107 2813822 2857055 2904525 2957712 2929742 2973632 2969379 2957394 2976751
3333 2976751 2981168 2990231 3029263 3127266 3192101 3145954 3085798 3109588 3060867 3058486 3070546 3058635
3321 3058635 3041319 3038527 3015066 3071152 3081635 3117003 3087840 3122303 3081574 3122883 3103641 3073965
3309 3073965 3094436 3103384 3172441 3177676 3196111 3221651 3137426 3173753 3191750 3219820 3240308 3230048
3297 3230048 3252791 3253524 3308393 3364925 3314993 3384837 3430825 3441111 3488855 3493807 3509880 3532339
3285 3532339 3540145 3618516 3660326 3660889 3714833 3749873 3768362 3827515 3864729 3908918 3985131 4026303
3273 4026303 4047396 4120626 4136930 4185699 4235510 4302924 4358290 4381964 4359615 4410583 4479342
3262 4479342 4545220 4553386 4611937 4733430 4834538 4911682 4976760 5004953 5049668 5116141 5157149
3251 5157149 5203443 5328817 5400083 5360178 5363230 5451112 5501746 5573164 5684225 5649469 5732039
3240 5732039 5788796 5818008 5868151 5898498 5917841 6002075 6055693 6096124 6142074 6139727 6157871 6162372
3228 6162372 6184875 6211387 6236798 6273237 6247810 6262311 6286087 6273299 6400271 6432070 6385787
3217 6385787 6444928 6467491 6499272 6503020 6567005 6624063 6685867 6715244 6801010 6839351 6848877 6863667
3205 6863667 6883697 6887165 6941651 6977539 6980211 7018950 7014387 7018603 7063347 7099836 7147931 7212786
3193 7212786 7270697 7270425 7309210 7277887 7324483 7337246 7345961 7359068 7441003 7454110 7449601 7437043
3181 7437043 7374741 7369507 7366998 7350352 7325129 7374129 7373275 7413869 7450714 7498587 7557873 7621762
3169 7621762 7649705 7667961 7737096 7728903 7733353 7734012 7767663 7811911 7921016 8032853 8089207 8130744
3157 8130744 8114852 8091026 8138515 8141113 8161595 8127413 8148080 8205213 8238541 8281950 8353549 8482485
3145 8482485 8517200 8590467 8677183 8795565 8832195 8841736 8853745 8808358 8849470 8857196 8891683 8834423
3133 8834423 8823181 8876409 8934934 9001001 9023748 9010620 9011849 9033521 9071734 9108210 9168206 9270503
3121 9270503 9317253 9316916 9370495 9359916 9401494 9380844 9413679 9393796 9379845 9424274 9382325 9412151
3109 9412151 9429541 9465922 9489487 9557531 9657847 9632503 9573171 9549132 9489354 9497751 9477397
3098 9477397 9459652 9513143 9451208 9461141 9484213 9524961 9554278 9551887 9548977 9531699 9601695 9642865
3086 9642865 9649053 9677540 9690637 9751759 9841007 9847980 9839051 9874491 9927428 9968844 9993421 10006995
3074 10006995 9996136 9952359 9964275 9979100 10024856 10081805 10125917 10160337 10222044 10256510 10373310
3063 10373310 10430695 10529892 10610454 10725302 10904114 11076159 11102433 11158922 11189948 11291674
3053 11291674 11284710 11250971 11338437 11393173 11483492 11594032 11706814 11801090 11915150 12053819 12170494
3042 12170494 12289194 12393032 12484285 12665676 12855400 13031963 13285465 13632834 13867754 13953074
3032 13953074 14092366 14148989 14216398 14252375 14297451 14417794 14606472 14768746 14911747 15071910
3022 15071910 15233095 15438425 15660083 15840187 15974364 16132992 16289872 16431996 16607012
3013 16607012 16820181 17062069 17330280 17612389 17756381 17911763 18088280 18318330 18547530
3004 18547530 18764077 18981674 19319245 19594302 19924169 20317554 20689572 21005643 21253915
2995 21253915 21525268 21827360 22089646 22359287 22679777 23057631 23424643 23764311 24120662
2986 24120662 24541472 24952639 25377976 25838382 26334832 26923680 27466379 28078555 28682047
2977 28682047 29330766 29969836 30827127 31592389 32320068 33082236 33931689 34819380 35711321
2968 35711321 36635389 37618723 38575951 39587788 40669524 41740138 42795570 43917542 45082613
2959 45082613 46273354 47547303 48845622 50125878 51469038 52931247 54513510 56075473
2951 56075473 57760909 59430460 61250916 63231307 65277770 67440500 69728542 72125123
2943 72125123 74509659 77017366 79693938 82518639 85615105 89131720 92953668 97337814
2935 97337814 102156815 107568726 113509800 120071700 127273633 135103833 143579360 152566924
2927 152566924 161946143 171311661 179920249 186910851 191496170 192918757 191259819 187079488
2919 187079488 181239075 174738499 168531032 162551036 156302777 150045295 144158045 138261097
2911 138261097 132286231 126590338 121544849 117005715 112957093 109567782 106545556 103966544
2903 103966544 101798287 99936486 98274069 96932002 95780860 94806484 94089618 93676468
2895 93676468 93739599 94418505 95975949 97852369 97793495 96014396 93178023 89605025 85140582
2886 85140582 80161830 75787582 71832333 68440492 65529918 63075186 60999598 59202927
2878 59202927 57635782 56307741 55172032 54155481 53261166 52628843 52099750 51845343 51994817
2869 51994817 52537798 53362952 53638548 52851888 51627631 50124741 48250157 46053496 43993780
2860 43993780 42207010 40673195 39298542 38122522 37000731 36037171 35206882 34405913 33701040
2851 33701040 33061099 32457158 31987634 31432563 30866759 30313462 29783385 29309719 28858576
2842 28858576 28364664 27891864 27477786 27076090 26648896 26242425 25833511 25444707 25087558
2833 25087558 24715130 24372871 24080896 23817429 23591771 23381593 23091674 22884775 22675414
2824 22675414 22398431 22218078 22029085 21833301 21597278 21385221 21182929 20982325 20840144
2815 20840144 20670334 20478450 20312117 20141158 19984066 19891316 19738168 19635008 19518408 19422137
2805 19422137 19294456 19174056 19036422 18989192 18931666 18832944 18655903 18503115 18386826 18243993
2795 18243993 18119668 17964723 17834438 17670885 17464499 17284655 17148098 17034390 16840876
2786 16840876 16656852 16519682 16435434 16321742 16251381 16096167 15946055 15855353 15764250 15707572
2776 15707572 15596826 15414849 15285702 15142439 15013022 14852468 14672857 14523928 14392042
2767 14392042 14221396 14064141 13958912 13844964 13743895 13654286 13635575 13548180 13435838 13407414
2757 13407414 13414803 13411987 13407268 13415795 13477875 13471425 13506852 13550693 13592065 13587881 13600174 13687011
2745 13687011 13743477 13861461 13948391 14003841 14200059 14382731 14567355 14761952 15062572 15342022
2735 15342022 15713005 16112457 16398828 16687748 16847449 16990650 17061953 17203366 17389709 17640515
2725 17640515 17874638 18139693 18292947 18417516 18518846 18561523 18657659 18803935 18988130 19277182
2715 19277182 19617971 19976959 20318865 20823862 21384647 22053142 22864918 23584005 24107080
2706 24107080 24529336 24825361 25197017 25620325 26112298 26774595 27507685 28090231 28625132
2697 28625132 29179220 29814616 30510241 31317353 32273801 33276586 34337545 35435352 36554300
2688 36554300 37599261 38527557 39426627 40248636 40962114 41673275 42385757 43120682 43869723
2679 43869723 44743363 45730566 47014402 48533371 50243073 52106615 54242240 56444734
2671 56444734 58827644 61461510 64022848 66356679 68123542 68997160 68921283 68005679 66493533
2662 66493533 64779445 63197435 61943960 61126183 60754824 60942603 61478191 62333424 63535962
2653 63535962 64956929 66511068 68235602 69940566 71547074 72966340 73870462 74136259
2645 74136259 73710233 72719162 71082920 68840349 66280341 63682607 61289898 59185607
2637 59185607 57383108 55958054 54894719 54208083 53828756 53501132 53351336 53141793 52753715
2628 52753715 52132412 51238509 50038868 48500418 46589625 44422504 42189455 40016122
2620 40016122 37894922 35941472 34246348 32589844 31088265 29729580 28549629 27453842
2612 27453842 26452299 25548748 24748022 24025188 23333050 22624947 21884661 21165201 20484921
2603 20484921 19770547 19031647 18317149 17681757 17062280 16428329 15924550 15466146 14936158
2594 14936158 14447902 13952515 13525701 13114046 12679677 12345208 12060383 11715183 11419210
2585 11419210 11217138 10998480 10774946 10553701 10355707 10187191 10012927 9751657 9568919
2576 9568919 9246360 8979404 8774739 8536895 8313642 8068083 7810722 7635070 7436906 7254215
2566 7254215 7049448 6915248 6753087 6632467 6481706 6417103 6278606 6122298 6023704 5891681
2556 5891681 5749959 5615257 5509591 5348030 5212504 5043419 4907468 4789851 4614220 4486389
2546 4486389 4387346 4350966 4223834 4102785 4007435 3951961 3895341 3759839 3679127 3645305 3593832
2535 3593832 3494972 3446665 3342565 3265777 3216455 3134890 3094324 3051314 2964068 2936307 2908732
2524 2908732 2849147 2814027 2731821 2708400 2664564 2666913 2598187 2533044 2539197 2537987 2496742 2466297
2512 2466297 2456556 2441179 2420457 2436583 2413140 2359196 2326838 2248836 2239861 2207213 2181351 2159632
2500 2159632 2130450 2090433 2096019 2056957 2032816 2042327 2019516 1965830 1959927 1937547 1919914 1905148
2488 1905148 1871582 1849243 1886369 1893286 1873140 1889442 1849248 1757782 1772489 1785546 1830904 1785489
2476 1785489 1810268 1756669 1732426 1743413 1692516 1688085 1662223 1647437 1631294 1586496 1609571 1584617
2464 1584617 1595843 1630272 1647230 1630616 1615690 1603510 1598833 1591262 1624183 1614761 1615402 1569117
2452 1569117 1615563 1578677 1595171 1585116 1515709 1433488 1417251 1450724 1460043 1458628 1438198 1417913
2440 1417913 1461988 1388318 1384429 1400089 1405832 1445321 1392437 1388086 1423614 1391950 1327743 1286928
2428 1286928 1234444 1231164 1235003 1248029 1259137 1220117 1243294 1225695 1214919 1177924 1177615 1106339
2416 1106339 1083534 1138002 1084092 1054462 1035181 1036021 1035386 1050443 1031738 1018382 965332 1001295
2404 1001295 950643 928688 882835 844144 822516 833458 865466 863910 820389 835650 885595 828825
2392 828825 778076 801693 762020 753033 716280 708293 722040 691535 682955 686590 707196 679076
2380 679076 707152 728713 707890 719707 726413 681328 616205 638745 643643 639594 587606 633715
2368 633715 640969 587385 587693 571794 563589 593358 589968 542055 559131 508314 492498 530416 498215
2355 498215 513247 478478 492071 501674 545828 500481 517884 500954 481645 458108 477726 484012
2343 484012 454371 460443 496796 442128 387688 396392 390777 420298 468310 406539 391732 410420
2331 410420 420695 401905 374341 386585 358232 373144 403985 356776 373509 361752 359725 336413
2319 336413 351966 341656 313421 293554 314113 303527 297788 242824 237534 238485 219803 168483
2307 168483 191846 242018 265297 284995 222901 187019 170450 159192 206686 212786 241503 229539
2295 229539 209980 166825 179890 214565 167893 217602 210218 181097 130037 98191 103430 125786
2283 125786 118317 179525 126264 112342 114484 140234 168075 166069 150037 96545 102660 126464
2271 126464 85811 99895 146698 138858 105458 98367 52865 90512 89795 98633 119391 83513 59296
2258 59296 83735 60082 36896 54468 43789 29870 69127 62150 12454 22867 51124 15865
2246 15865 15423 31701 33248 42143 44685 38090 83738 39066 41005 18861 -8809 17799 14916
2233 14916 -7254 64487 27804 19129 8191 21433 2114 -20867 -2708 55373 80729 38478
2221 38478 38519 19853 -2957 7900 30162 20167 7232 8246 -4908 21642 -15848 -10487 42965
2208 42965 11997 3375 -35405 1671 32053 13516 9622 -27327 -10910 -4865 38080 22964
2196 22964 35255 8124 -6148 43147 -22310 -65825 -71715 -34777 -5532 17241 -12098 -19646
2184 -19646 18063 30546 -20760 525 51550 1726 11214 74286 52649 -423 -1816 18297
2172 18297 24427 25256 10711 -15989 34977 44087 10218 -30879 7588 -10781 -512 3760 16264
2159 16264 1168 5931 -7939 38571 -16651 -19052 26921 9761 -32599 -7725 21171 -1382
2147 -1382 32662 4708 9151 -3078 336 33003 21853 32844 -7872 -45005 2514 48216
2135 48216 73996 4184 -47792 -16881 74622 33849 42273 27741 64948 70686 92388 92717 87447
2122 87447 66728 111292 145928 110215 47579 44705 52954 134711 172528 206140 140922 114562
2110 114562 166618 191743 172665 160177 201079 242164 224694 235755 277523 286664 254527 265227
2098 265227 321060 348035 370326 442331 418132 492966 534383 568682 592778 664139 722035 715212
2086 715212 773846 852464 928995 978460 1070697 1172206 1303359 1500292 1672675 1818766 1948234
2075 1948234 2230456 2536426 2950162 3433342 4158445 5233989 6718880 7167922 6655590
2066 6655590 6043819 5404945 4448977 3570940 3068530 2595185 2309742 2004854 1830421 1662951
2056 1662951 1515913 1376888 1218174 1099088 1020448 920774 803572 777538 709664 622237
2046 622237 619014 550286 525842 446753 492517 420861 368502 344673 356880 273217 287167 290626
2034 290626 306803 285070 240586 251206 257614 208385 177666 181897 183461 180652 214333 174718
2022 174718 151460 121649 180767 168163 173789 142538 119498 105331 56881 76494 56894 69068
2010 69068 59134 48168 112258 73697 52403 76275 86753 41521 51313 66274 109125 52736
1998 52736 13120 73438 21509 -512 -11808 -10822 -54390 -52031 -4785 40462 7621 4042 5732
1985 5732 25378 60548 27928 22812 42336 49729 35803 2358 12026 12742 9758 -3773 -28741
1972 -28741 -32890 17952 27626 21936 18603 5156 -20311 -68607 -56742 -25971 -19641 -42702 -34292
1959 -34292 -43884 -51916 -19712 4810 24477 13870 -28477 -13779 -3262 -37201 -54621 -56940
1947 -56940 -77574 -63395 -66081 -69419 -72211 -58054 1487 -25753 -37411 -60875 -83360 -83858 -43441
1934 -43441 -66108 -75321 -61954 -72974 -28413 -24604 -43768 -54464 -24854 -71641 -54612 -81097
1922 -81097 -94161 -89968 -69608 -20357 -60885 -92786 -57098 -42793 -65204 -63781 -23197 -10618
1910 -10618 -53423 -50740 -54177 -18426 -67134 -48506 -25260 -3262 -26640 -46400 -73344 -67390
1898 -67390 -47742 -53812 -34710 -29321 -26390 21839 -76 -57555 -89364 -89201 -126404 -102551 -118639
1885 -118639 -72381 -2971 -32147 7314 -11308 14566 -17297 -30344 -6634 -27067 -41969 -70406
1873 -70406 -33946 -23223 -3965 -37221 -56688 -42953 -59502 -70146 -38015 -64645 -57500 -55919
1861 -55919 -81751 -85819 -95071 -35769 -40699 -75134 -61696 -51116 -49601 -53537 -88770 -106057 -89063
1848 -89063 -29631 -21780 -64004 -13116 33441 -33735 -27108 -44262 -21718 -61653 -60246 -4230
1836 -4230 -37873 -94275 -35639 -5407 -37361 -73598 -40802 -65991 -63326 649 -18270 -50947
1824 -50947 -78237 -97604 -101967 -104763 -85442 -97544 -103551 -75702 -102020 -69838 -43830 -49387 -82464
1811 -82464 -52584 -33195 -76567 -46499 -62964 -99837 -105150 -68318 -34439 -83150 -63977 -65494
1799 -65494 -30396 -63913 -36061 -19408 -71277 -20645 -5297 -48329 -74956 -70496 -58392 -44546
1787 -44546 -45932 -79116 -77758 -41788 -36001 -32564 -32401 -50567 -64048 -26574 -50252 -12475 -9579
1774 -9579 29087 -10260 -52578 -28885 -37605 -25995 -56667 -38520 -46930 -10137 -13514 -17702 -38052
1761 -38052 -45592 -41287 -32025 -62781 -74679 -30826 -6218 -9112 -20563 -66702 -31494 9503 -63627
1748 -63627 -28138 -9624 6761 30972 -8567 15231 -50327 -53102 -48738 -35773 -58749 -103867
1736 -103867 -39936 -21346 -33190 -34452 -77563 -107921 -74982 -12436 -53449 -76345 -59730 -58230
1724 -58230 -45372 -29178 -76929 -18740 -8127 16414 -12127 -79152 -48201 -17702 6290 -58722
1712 -58722 -83571 -83905 -90491 -64561 -29967 -18896 -59272 -17159 -31600 -63905 -40086 -44352 -33705
1699 -33705 -37497 -21723 -25106 25112 -169 -41901 -66607 -61224 -62910 -13950 -21842 -29067 -17503
1686 -17503 -40621 -37299 -14398 -50592 -68261 -79627 -68002 -68402 -56249 -65342 -55735 -58103 -53902
1673 -53902 -32251 -74951 -61523 -48004 -41353 -62455 -54221 -11287 2299 -57271 -45585 -55833
1661 -55833 -54675 -12942 -38500 -33488 -32695 9758 8342 -16012 -90583 -94305 -63729 2199 -60928
1648 -60928 -19467 -63485 -98440 -68812 -60971 -71237 -80849 -42244 -56938 -57985 -5667 -11800 -57147
1635 -57147 -48797 -43582 -33988 -3527 -37777 -94686 -83210 -65870 -66946 -25486 -50410 -87345 -80918
1622 -80918 -58973 -70636 -59225 -60849 -118059 -23481 -28154 -47011 -55088 -30861 -19505 -19894 -7069
1609 -7069 -5001 30858 8746 -22374 -4740 -37137 -54685 -50970 -71056 -58993 -8530 -6120 -57237
1596 -57237 -49062 -35173 -28792 -38551 -38060 41637 17759 -35395 -23158 -66746 -68849 -19320 4467
1583 4467 -48531 -73452 -40061 -74638 -67737 -24894 -26690 -20723 -12419 -49764 -16769 -11828 -42798
1570 -42798 -23213 -46178 -61783 -80813 -78154 -41434 -41228 -54500 -60909 -14938 -17021 -55088 -43907
1557 -43907 -22795 -13981 -53493 -51802 -51406 -82731 -39424 -69034 -67830 -96716 -30314 -65147 -58106
1544 -58106 -58680 -59854 -69821 -84330 -51926 -39257 -44087 -56581 -8658 -2087 -17918 -28135 -40729
1531 -40729 -64051 -42654 -30880 -69216 -62589 -48420 -41204 -38573 -11202 -63190 -69473 886 -57596
1518 -57596 -60776 1616 -2116 -19905 -12643 -26497 -1521 -11887 -16458 -60598 -36576 -23713 -40723
1505 -40723 -20709 -50492 -93669 -112771 -67786 -28017 -48126 -25414 -622 -54184 -51568 -18396
1493 -18396 -61370 -68222 -55829 4594 -21532 -56153 -48517 -41291 -56180 -44552 -65939 -73341 20730
1480 20730 13464 -55177 -73829 -17389 -65279 -52639 -71631 -56224 -20920 -4399 -77590 -58360
1468 -58360 -4022 11397 47498 -25223 -97230 -72218 -33687 -65895 -47562 -38067 -76337 -83809
1456 -83809 -36276 13326 -16410 -85516 -65520 -43109 -21095 -22646 -55264 -48617 -92776 -82834
1444 -82834 -84468 -79191 -67710 -43425 -27938 -2777 -7699 26633 28835 24935 53611 -2589 -48286
1431 -48286 -41326 -77360 -55284 -41855 -17462 -9250 -13756 -4090 -3313 -8544 -16613 -28525 -81441
1418 -81441 -31786 -60404 -1493 9188 19170 -10692 -19563 -54888 -43171 -6304 -5054 -23343
1406 -23343 -54799 -75160 -74496 -95423 -54141 -40689 -69329 -82824 -36454 2355 -67255 -66856 -77739
1393 -77739 -47037 -41405 28902 34766 -17204 10792 -10233 6817 -27096 -4399 28752 40967
1381 40967 -20502 -52335 -82696 -24595 832 -47879 -13202 -17084 -9881 -25950 241 -3857
1369 -3857 -16825 -31344 -71926 -47243 -64216 -39135 -68172 -43533 -59295 -33866 -42722 9109
1357 9109 63358 13480 -42325 -22922 -12097 -20375 5359 -12577 -70196 -58764 -22725 -17791
1345 -17791 -35752 -33429 -53805 -78338 -90726 -73323 -43450 -25511 -17822 10350 35481 18890
1333 18890 -23928 -12279 -55122 -87289 -49917 -48323 -76216 -72857 -30351 -78206 -14126 -47718
1321 -47718 -48359 -45348 -83979 -75470 -46137 -48874 -8676 -1148 -8438 -36070 -12856 -26765 -14763
1308 -14763 23100 -31185 -36236 -64871 -37843 -44648 -41927 -31763 -9899 34723 -5389 -27401
1296 -27401 -15745 -30629 -713 -13524 -39877 -27799 -23357 -22745 16933 -18530 -31387 -20640
1284 -20640 -21278 308 -32653 -18137 -18788 -6999 -16858 -58717 -74410 -19598 -26681 -18014 -37926
1271 -37926 -6984 -25528 -20729 -82228 -42784 -64977 -33260 -3229 -23689 -22020 41759 -14531
1259 -14531 -58484 -30830 -37297 -36639 -35547 -14483 4917 -92 -28246 -25080 -436 9605 16316
1246 16316 -24263 -32699 -60792 -22738 -32601 -68593 -56766 -25251 1781 -54718 -36837 7291
1234 7291 -13789 -34758 -10759 -32649 -86570 -7247 -19251 -50262 -24611 -51901 -52700 -66407
1222 -66407 -31868 3975 -24691 -24566 -13197 2682 -46771 -9103 -32935 -53913 -2461 -25655
1210 -25655 -11984 -30168 -11096 12080 -23052 -32408 -27844 -6247 10619 -5018 -22264 -28535
1198 -28535 -36738 -1599 22938 -11595 3665 -25760 -45442 -26703 -31210 -8653 -32137 -46534
1186 -46534 -435 -1193 -2488 -33783 -22202 -71568 -42769 -48780 -7336 2062 10714 35403 27449
1173 27449 -1385 54855 20159 3614 30025 25345 4477 -55244 -37275 -2272 -54109 -40263
1161 -40263 -20369 42613 38633 46894 -8102 -8377 -21346 -15074 -40088 -47650 -49212 -37911 -45717
1148 -45717 -58394 -15916 -29064 -48570 -44754 -9990 -8034 -15621 46774 35097 -37531 -49912
1136 -49912 -38926 -51001 -36062 -22358 -36006 3338 -12545 -27577 17126 -61575 -53144 -70394
1124 -70394 -89990 -34290 -30644 23882 47985 9762 -21094 -6287 -7566 9915 -381 -25205
1112 -25205 38994 33020 -3189 -42754 6470 16360 -51162 -19388 -8759 44767 -2445 -17542
1100 -17542 -8739 23171 -27030 -19770 12215 -39286 -19328 -19082 14206 26868 22063 15366 29942
1087 29942 17594 -211 24684 16515 -84072 -47847 -1482 -38934 3627 74201 69275 20732
1075 20732 -14928 -57863 -16377 1933 40927 42216 -11946 -22491 -1272 -24679 -6904 28366
1063 28366 7063 17437 -21098 -10735 13151 18532 -21020 15693 7418 -52775 -13865 -37588
1051 -37588 -37366 -13036 -42885 -21887 -22586 -65648 -37523 -9496 55287 -25394 6635 33237 -13231
1038 -13231 18594 47343 21139 32954 13625 19994 8030 -7778 -9587 -42701 -115359 7102
1026 7102 -29231 -26985 -17080 -8299 -24840 -33578 -22587 5272 -28911 2668 -1467 11566 6546
1013 6546 -10655 32606 25523 -16713 -23446 5685 -40440 -5467 27046 9294 -48378 -39171 -14784
1000 -14784 34069 36136 -2648 11495 22590 3908 -30881 27120 19374 32892 23106 -29322
988 -29322 -18374 23836 12518 8362 20039 -69177 -44308 -56569 -89458 1069 9015 -21708
976 -21708 -63791 -54933 -20749 -10557 -14770 -33172 -42612 -84709 -7579 8294 2435 -38232 -8623
963 -8623 -3102 -5801 31357 -1752 -33431 2940 14043 60822 -14139 3942 6110 -18285 -21968
950 -21968 -65205 -31682 21617 -26429 -46919 -42520 -21576 151 -5659 5164 24738 15353 -3168
937 -3168 -24241 10895 49266 27030 -28429 -12346 -12548 -30353 -35922 -22383 28628 14900 -4640
924 -4640 -7752 18241 10131 -41499 -16916 -32548 -15085 10629 -4521 -7463 -5277 -13131 -18101
911 -18101 51051 70044 5778 26 22079 -27042 -14632 -9677 -33958 -13085 25909 41182
899 41182 49526 -6566 33547 59715 23819 -9781 -46508 -6548 6342 -15974 -17971 -302
887 -302 15928 -26111 -10882 6806 -41254 -11299 15579 33357 1853 -8643 8593 40040
875 40040 46947 23145 1818 23404 8154 -7525 10516 3017 -1589 51781 48344 61511 18520
862 18520 14860 29452 -9555 52308 80049 82254 46555 10487 -22560 29039 57686 57507 20448
849 20448 30295 30399 68691 29537 -37177 -37701 -40890 -48816 -34709 34561 17362 25922 27362 1685
835 1685 35646 7197 -4240 31949 -16861 28253 3526 4281 -8018 11861 -16933 -1064 47726
822 47726 48436 851 23712 37912 18298 -8383 -21118 -33199 38104 72459 56028 30739
810 30739 21805 12778 25383 31902 -26170 5796 -14377 -22251 -17079 -19269 5808 44175 28163
797 28163 16216 1662 22721 44796 61426 -3809 19531 43591 81426 52458 65938 35081
785 35081 23941 33098 34823 18260 1467 8690 18526 37860 35061 40565 53784 -8887 -13458
772 -13458 7671 12089 16170 6472 292 7977 25221 -8730 -15436 16213 28345 9830 3631
759 3631 36816 34464 13554 23231 18750 -11411 11559 -631 20499 9579 17244 25582 34082
746 34082 24148 9123 40240 29866 80213 62110 13040 -13889 -7155 35768 19792 9257
734 9257 51352 37588 32010 3348 -12426 47357 24711 25948 35990 8125 48923 8713 -12310
721 -12310 -4444 15374 -6524 -2841 43995 -2549 59538 40419 -31560 -27640 50637 42636 36762
708 36762 -14016 371 7100 -817 -16952 -2767 25799 -5801 -25234 -18293 53691 66380 47575
695 47575 33816 -5421 23347 5143 -4565 4940 -22401 -243 -3544 31744 -6167 25715 219
682 219 19245 17786 19465 28246 29641 34392 32175 40744 46019 -21282 -1324 32766 56034 42813
668 42813 47138 43190 -4215 18446 -32549 7371 27516 1364 -17562 -25918 25529 86831 60866
655 60866 26402 27871 41875 74825 8509 19550 5868 -6879 11238 22344 3576 -1053
643 -1053 5000 7888 40819 40036 52291 -12344 -19267 -39389 215 17137 27170 38514 16591
630 16591 -8244 28992 30319 6497 16609 -669 47803 24723 34119 28130 3551 1960 44288
617 44288 -161 40767 59751 62541 11472 52142 64037 703 10992 44085 25237 48458
605 48458 36502 16034 20644 72560 40766 21932 70034 52418 39492 50151 30186 24304
593 24304 40334 43309 63165 64841 82522 32892 80305 70916 33712 50702 42331 13817 17435
580 17435 59131 31716 -21575 3372 85032 22740 13888 36065 9277 33057 -21378 59444
568 59444 46841 34993 2101 25320 42650 42936 47789 52530 28426 16481 28851 13430 -2061
555 -2061 53555 55433 38048 62670 47426 103700 79386 16975 -33654 12459 65273 104775
543 104775 61321 2365 -10271 6112 24249 51524 60670 50663 73387 91959 85290 -4436
531 -4436 -37429 11278 38561 92835 74972 10831 43302 69949 30170 -27912 12310 51059
519 51059 65736 12728 -21790 23212 57933 43092 41825 30367 34719 55137 43449 35264 -48594
506 -48594 -5466 14192 36223 6528 75665 93258 38624 60928 78737 50486 89831 68975
494 68975 39452 37055 67027 93448 8448 80814 46459 43195 65933 57627 21505 14868 -9038
481 -9038 67824 62798 32628 9725 35871 56260 80869 115022 59192 62946 58651 49626 72959
468 72959 18123 13650 26798 37400 63971 58419 52990 59976 53611 3213 2598 -10000 -6382 15276
454 15276 81501 70339 -1182 75346 30500 67670 58147 63821 72403 56090 19285 12238 50506
441 50506 53689 57139 78462 48007 57935 49974 78139 81445 30934 74593 71040 80090 60356
428 60356 39787 4369 65001 72322 69372 59510 119765 132780 76517 68056 58681 61302 66883
415 66883 62138 66118 92475 61949 2092 -14319 10162 46773 -2727 44607 77823 43133
403 43133 47719 29931 27670 35215 60045 77345 79973 54476 75179 53279 60738 54424 69508
390 69508 50624 22771 38354 78116 104877 37940 56633 90934 79780 47068 42238 17718
378 17718 39722 32672 39545 -3576 23733 -1697 26620 35315 86078 67326 56841 60837 98165
365 98165 113171 63675 55225 52811 86970 58118 70957 6765 28007 26250 44789 52415 55512
352 55512 104848 29250 26278 24849 11206 -6371 13286 83750 37627 49906 33857 44215
340 44215 51647 35261 20823 17199 55976 29089 57419 56295 44083 59911 27499 60452 79620
327 79620 71093 56991 23990 48552 68718 96659 36744 46518 72177 62255 20281 70890 125232
314 125232 97030 65916 87738 3510 11275 56575 57751 54584 56623 60648 78889 24581 54503
301 54503 71712 19818 45464 45965 29762 11063 44685 21378 -18892 28012 47014 64945
289 64945 104855 81695 42196 37379 35821 6423 -11088 -10864 53882 59239 73946 31032 28101
276 28101 33490 28160 55863 1786 22927 61186 30278 42671 15405 69286 69335 31771 67198
263 67198 94649 54128 111003 81024 60076 50832 42577 73509 75611 56326 36923 50280 68453
250 68453 59840 49058 -10549 20626 58950 13444 38268 48287 98847 66181 3381 4722
238 4722 51683 50260 55402 53952 61183 87499 81274 123339 104402 63286 -1739 12745 28000
225 28000 55223 43327 80035 58325 51979 50589 96854 54730 50660 64069 39192 77983 44884
212 44884 47096 53392 89431 76682 81354 102273 60364 25647 20689 46469 35678 59495 -2242
199 -2242 46202 102961 60286 113426 101678 84207 55511 7691 32403 115297 72899 73054 59986
186 59986 67486 32670 50339 71526 42679 18876 27537 48505 28174 54972 71700 57329
174 57329 21115 -35470 1319 44838 37365 38112 48610 30775 -1897 -4619 17132 37816 50129
161 50129 37696 1727 16840 24062 33908 29920 9109 -24199 -12543 39142 89664 8697 59759
148 59759 45320 34322 62023 83046 84185 84369 68704 67466 56218 57386 57885 74977 57559
135 57559 32058 60960 67844 34668 12460 35088 26711 13751 8252 15633 17180 8677 -12286
122 -12286 16484 35223 34062 35508 103497 81719 79782 63016 55975 38369 63169 61812 92842
109 92842 78331 74117 34682 91614 95666 65098 84208 106931 48958 91879 81836 73401 88844
96 88844 57693 96148 85711 68451 66680 36098 37105 51010 49442 59137 52467 63390 70374
83 70374 73566 89345 77429 65134 105823 101155 29620 32277 -5100 -8552 1203 -6997 25372
70 25372 48987 52422 53365 45567 40800 29180 40072 43574 65558 51787 60385 39633 82967 106804
56 106804 63030 30715 46687 23655 38910 27381 33803 46862 38085 57587 39155 29890 9581
43 9581 36144 -4050 34656 22692 71396 49378 29063 44744 60902 40031 39039 63744 48173
30 48173 47400 45453 54823 56329 58776 66372 61051 60070 56910 33747 61275 78604 16484 47348
16 47348 48196 47589 52770 75669 58212 55373 72870 63143 42998 36785 23372 29745 66373 69859
2 69859 54145 67851
0 67851
$$ Imaginary data points
##PAGE= N=2
##DATA TABLE= (X++(I..I)), XYDATA
16383 -1451423 -1461099 -1452271 -1408314 -1395304 -1370012 -1362599 -1341620 -1344388 -1306422 -1276594 -1272813 -1227408
16371 -1227408 -1204556 -1171363 -1152542 -1137600 -1117820 -1118598 -1089292 -1097439 -1079908 -1071334 -1092461 -1031432
16359 -1031432 -1015324 -976797 -989922 -985911 -936326 -942019 -912441 -892160 -867978 -869319 -857421 -867056
16347 -867056 -860471 -852447 -826121 -834348 -817588 -778529 -750449 -741598 -696533 -695548 -697324 -678797 -650182
16334 -650182 -623261 -617508 -601600 -608417 -585579 -578137 -547417 -550768 -516491 -490294 -481255 -455437
16322 -455437 -488007 -449013 -451297 -415509 -421119 -398358 -372614 -403309 -361134 -325707 -328652 -291713
16310 -291713 -295088 -306354 -281359 -232632 -243543 -241629 -212203 -195244 -184129 -132249 -138027 -107896
16298 -107896 -73625 -126806 -72665 -45743 -63183 -38969 -32964 -14018 14648 5503 17996 32818
16286 32818 52595 75207 73319 72501 109959 120235 109896 108064 123490 142808 173283 202373
16274 202373 191622 217830 227277 221257 256133 299889 259773 280215 295894 248023 228620 265877
16262 265877 314043 321672 335077 337991 336382 366635 355413 407589 389433 418073 419086 426302
16250 426302 436976 463970 513708 472084 482757 492616 533571 553535 530232 519318 512468 574236
16238 574236 568954 573930 546281 576524 660026 642159 619348 599656 629533 649362 676147 660985
16226 660985 671876 659676 712634 733008 695917 725489 768732 739557 728219 727389 774138 723832
16214 723832 737715 751128 754129 782466 828506 832857 804075 813261 805534 821541 828054 836463 872291
16201 872291 876959 917712 885269 861251 908072 921070 939508 883914 910841 930772 931021 940842
16189 940842 938438 922321 917869 936914 942801 945682 973747 956214 971475 995534 985251 990014
16177 990014 976178 983278 975351 991077 1010402 1022103 1029918 1052818 1044994 1046588 1045397 982374 1038071
16164 1038071 1005910 1057684 1119280 1104186 1102804 1067398 1110803 1099321 1105965 1078175 1103312 1098872
16152 1098872 1097714 1109848 1101118 1097212 1082936 1099296 1124982 1103459 1128651 1188756 1205102 1166117
16140 1166117 1155169 1188431 1167282 1168698 1172419 1124514 1122560 1119847 1126517 1162055 1155957 1159804 1177210
16127 1177210 1125731 1139885 1145225 1168901 1162887 1166743 1161572 1177912 1203026 1199853 1198464 1213185
16115 1213185 1199978 1241777 1202488 1162961 1201240 1256670 1246013 1216814 1240379 1202618 1211457
16104 1211457 1188033 1196271 1174186 1198854 1207085 1222099 1196712 1240830 1244580 1272615 1228837 1202475
16092 1202475 1252138 1270745 1294373 1285746 1250595 1268935 1269368 1277308 1301831 1275942 1249501 1237452
16080 1237452 1229662 1302049 1287634 1236000 1237115 1272156 1277457 1266656 1308454 1276155 1253564 1268633
16068 1268633 1299784 1293765 1271884 1283483 1248258 1219437 1297619 1303422 1297898 1296023 1284489 1278935
16056 1278935 1302875 1253587 1236848 1257084 1288394 1273425 1229921 1262653 1256467 1321638 1343819
16045 1343819 1310154 1271487 1276757 1255046 1269736 1267655 1297306 1331907 1280336 1297788 1328553 1313865
16033 1313865 1276615 1287339 1255911 1310060 1275122 1289967 1275330 1338782 1299873 1283890 1308151
16022 1308151 1312088 1325710 1330919 1313952 1313803 1321280 1272945 1296471 1283739 1300118 1350039 1316747
16010 1316747 1277413 1319150 1315636 1340847 1331462 1374291 1367652 1334408 1318425 1297306 1259056 1314410
15998 1314410 1306312 1259326 1274609 1287371 1276979 1273127 1322207 1318119 1268263 1297102 1305315 1324764
15986 1324764 1280681 1308949 1296654 1305720 1278844 1319775 1356613 1367880 1358044 1339626 1319807 1297879
15974 1297879 1313063 1300229 1360145 1365341 1360796 1327764 1322393 1320270 1323041 1351830 1350266 1339189
15962 1339189 1318974 1283966 1314764 1303071 1296161 1298431 1282540 1291817 1309076 1302144 1291761 1303007
15950 1303007 1295102 1279874 1241144 1289985 1324456 1343765 1305467 1280211 1298252 1340435 1313575
15939 1313575 1278852 1246468 1228512 1258102 1279200 1248804 1289685 1302115 1298995 1292575 1264864 1308085
15927 1308085 1306068 1325988 1310124 1267038 1230797 1287058 1251011 1240638 1263818 1291682 1263136
15916 1263136 1295722 1306423 1256995 1307999 1333484 1320431 1352015 1357893 1349201 1270710 1292161 1304588
15904 1304588 1311719 1274506 1360598 1391687 1375309 1344258 1309012 1307214 1291051 1354563 1267144 1339047
15892 1339047 1346744 1330055 1330278 1302977 1258918 1299029 1324112 1308877 1358996 1272846 1257417 1332964
15880 1332964 1319153 1296832 1259330 1269632 1285239 1261392 1323260 1310526 1287703 1284280 1311767
15869 1311767 1383954 1367196 1346935 1294032 1291684 1312031 1270076 1267017 1281087 1328692 1311214 1327012
15857 1327012 1304996 1325012 1301644 1304501 1282303 1268053 1307577 1300465 1278843 1312289 1302052 1285305
15845 1285305 1349661 1364784 1313334 1307191 1304913 1281548 1272800 1295453 1319506 1329058 1313984 1282176
15833 1282176 1313663 1335345 1320913 1274010 1280155 1346672 1318485 1307030 1274864 1329454 1329746 1296620
15821 1296620 1298482 1308094 1324754 1350194 1355732 1299792 1304266 1256995 1324166 1259105 1252397 1264152
15809 1264152 1263936 1271832 1311009 1296523 1334946 1353684 1337436 1338217 1312954 1338886 1360758 1277819
15797 1277819 1278271 1341083 1335001 1321235 1327682 1359556 1329815 1320927 1313075 1326867 1354811 1345223 1299945
15784 1299945 1295348 1305722 1330326 1310170 1273154 1305551 1261944 1248438 1330724 1331262 1307615 1310327
15772 1310327 1319473 1256547 1267467 1281514 1311502 1328153 1325022 1335731 1311040 1289676 1339177 1374375
15760 1374375 1353490 1345765 1363480 1382244 1306784 1357702 1358132 1342646 1327708 1364955 1400719 1335677
15748 1335677 1261436 1287746 1329530 1331872 1301925 1299412 1310546 1368616 1332559 1320945 1314497 1349068
15736 1349068 1386334 1322316 1316671 1324060 1341427 1346255 1346513 1340136 1302863 1358494 1347264 1303203
15724 1303203 1332203 1342697 1364950 1367353 1348512 1328860 1360269 1396343 1346290 1286767 1318660
15713 1318660 1331807 1351225 1364698 1356569 1392953 1398936 1384461 1370167 1315734 1327205 1313159 1327435
15701 1327435 1370005 1356984 1328086 1335441 1321812 1342681 1381692 1379285 1335510 1323721 1321257 1375936
15689 1375936 1354869 1355004 1307810 1371402 1383944 1330652 1268221 1308307 1315407 1277054 1333369 1358756
15677 1358756 1377683 1400361 1333282 1337276 1348560 1344087 1374644 1324368 1382574 1395686 1397792 1393756
15665 1393756 1345411 1311842 1338253 1329605 1318558 1370062 1361559 1312237 1348650 1367374 1369163 1314463
15653 1314463 1322151 1324404 1344211 1365365 1363008 1350119 1347143 1340535 1313810 1301773 1356151 1334170
15641 1334170 1352603 1365287 1381475 1353772 1379251 1377757 1326809 1338382 1292983 1306066 1349169
15630 1349169 1390064 1407000 1342402 1335387 1347380 1330256 1303413 1287631 1320497 1339009 1332013 1348448
15618 1348448 1336496 1319235 1319887 1285899 1339272 1334569 1322615 1320634 1344609 1390182 1375162 1376330
15606 1376330 1376347 1366500 1363163 1322005 1329960 1299754 1312106 1298902 1388417 1394978 1356892 1417215 1388217
15593 1388217 1355157 1365162 1372300 1403557 1397605 1344195 1335167 1334681 1323829 1337081 1311868 1317748
15581 1317748 1294854 1382319 1387639 1349399 1384698 1340377 1327007 1363982 1331391 1330277 1369811 1336498
15569 1336498 1367576 1364389 1364271 1386544 1390933 1399864 1407722 1409007 1381696 1346965 1352121 1333052 1310993
15556 1310993 1362522 1441204 1342388 1346276 1380916 1353534 1383448 1372431 1318115 1329347 1356654
15545 1356654 1311251 1325248 1347007 1379384 1384526 1345743 1322610 1336515 1371784 1298255 1314631
15534 1314631 1339606 1327357 1328225 1377117 1349534 1344646 1351609 1349752 1329023 1326814 1324915 1345943 1297033
15521 1297033 1341346 1404146 1363117 1342770 1313072 1351508 1351106 1371435 1344301 1330082 1349694 1367563
15509 1367563 1337122 1401777 1397103 1398956 1370054 1313895 1302408 1369490 1326633 1316870 1345961 1308792
15497 1308792 1341350 1330919 1318598 1351962 1368818 1384656 1430549 1369428 1353574 1426728 1391337
15486 1391337 1361157 1330371 1342951 1368975 1308152 1323167 1334986 1341581 1400073 1375040 1381332 1371495
15474 1371495 1369714 1367368 1384988 1390201 1360049 1404390 1424448 1388105 1378815 1367848 1354682 1361766
15462 1361766 1386817 1392511 1415438 1440225 1363615 1373132 1371815 1349603 1332670 1366751 1388718 1385634
15450 1385634 1392370 1363991 1361659 1339240 1306429 1304438 1273095 1351105 1369659 1373020 1356999 1364591
15438 1364591 1418543 1396143 1389726 1365780 1332792 1360632 1281623 1301190 1363180 1395404 1396497 1316817
15426 1316817 1358434 1389271 1390464 1404774 1351246 1339303 1381376 1352609 1387103 1332533 1329908 1391094
15414 1391094 1407072 1400469 1377497 1380552 1386199 1366129 1342576 1380624 1358430 1386483 1346384 1391569
15402 1391569 1396499 1356157 1362388 1394776 1399586 1350619 1316416 1314550 1356559 1379803 1423629 1367985
15390 1367985 1351140 1401334 1415984 1403306 1406266 1367133 1386654 1392396 1373505 1356484 1337056 1364360
15378 1364360 1384318 1438827 1394420 1340143 1350737 1367692 1393410 1388931 1387525 1366089 1423283 1382111
15366 1382111 1331639 1373270 1342087 1402746 1403645 1356632 1396930 1376292 1315751 1330304 1341626 1346391
15354 1346391 1321166 1340063 1390734 1406412 1385952 1357852 1360656 1382073 1350218 1337666 1388669
15343 1388669 1359745 1374904 1376686 1405765 1354314 1368986 1396043 1368202 1371048 1392647 1378130 1349726
15331 1349726 1359037 1367522 1376488 1384783 1348473 1378152 1377042 1367117 1356165 1347845 1388557 1344260 1341849
15318 1341849 1350313 1357378 1403108 1401596 1377232 1404611 1348830 1386266 1334784 1324021 1363280 1364308
15306 1364308 1428120 1375210 1371365 1386768 1370899 1376545 1352708 1356602 1351957 1358910 1373265 1418670
15294 1418670 1418074 1426833 1385088 1352044 1368736 1385799 1380930 1372531 1392544 1398688 1406529 1379105 1402114
15281 1402114 1425331 1436623 1397605 1384089 1367014 1415437 1417564 1385591 1392193 1402081 1348417 1319482
15269 1319482 1357981 1351671 1350422 1348715 1346777 1394057 1388373 1380875 1382443 1361668 1346730 1377103 1340725
15256 1340725 1343530 1418191 1441184 1437116 1409960 1384729 1394811 1371168 1368867 1361130 1386348 1397571
15244 1397571 1373725 1416875 1411833 1368056 1397672 1456668 1426825 1371971 1387410 1415218 1388543
15233 1388543 1397876 1450610 1378321 1353990 1365010 1372237 1375164 1363177 1393513 1372631 1396118 1405898
15221 1405898 1372421 1381609 1402932 1376148 1385654 1389791 1325026 1396870 1422495 1366160 1389845 1404453
15209 1404453 1438965 1424104 1407938 1353218 1338251 1420243 1395285 1397912 1419378 1416567 1409647 1364959
15197 1364959 1393685 1399591 1389020 1392727 1357668 1352695 1385701 1393147 1405533 1377177 1405758 1414876
15185 1414876 1401403 1403397 1436720 1414425 1417056 1418465 1394234 1402760 1418057 1424102 1430515 1439823 1462198
15172 1462198 1416196 1377337 1349994 1400648 1405366 1397858 1413505 1374087 1384354 1402439 1430387 1379263
15160 1379263 1372594 1367149 1368939 1410700 1423237 1400966 1358415 1420683 1456455 1431671 1387968 1354098
15148 1354098 1359965 1413459 1395474 1372461 1380134 1397645 1417551 1410594 1387698 1413124 1389656 1389124
15136 1389124 1402004 1358279 1343285 1359283 1373364 1366952 1398677 1430361 1373681 1373362 1380664 1371662
15124 1371662 1408457 1384652 1410705 1441323 1404315 1334636 1376875 1411341 1370192 1416696 1405757
15113 1405757 1386552 1400750 1374636 1355631 1404952 1409375 1372935 1403061 1390970 1407887 1425066
15102 1425066 1416534 1388553 1391726 1447132 1381355 1402813 1423856 1415823 1421979 1431324 1418725 1425972
15090 1425972 1442425 1398720 1427639 1444825 1463304 1486979 1478866 1410931 1435425 1410242 1409408 1367045
15078 1367045 1404472 1411060 1402716 1455272 1430578 1407915 1435928 1356657 1405503 1453247 1417749 1438046
15066 1438046 1420824 1394645 1395025 1415911 1409174 1417164 1440274 1427487 1407265 1394416 1406904 1392317
15054 1392317 1404097 1438638 1416541 1456750 1422401 1369412 1379704 1406042 1469884 1455786 1434970
15043 1434970 1411780 1401621 1373359 1426269 1381830 1390532 1425770 1424874 1455430 1434661 1457773 1421699
15031 1421699 1431551 1462800 1443072 1386887 1410076 1401720 1423097 1423244 1428250 1385310 1412962 1424562
15019 1424562 1441659 1390442 1364671 1363236 1393959 1409604 1401786 1417886 1424003 1404955 1423346 1402732
15007 1402732 1398260 1459231 1442237 1441592 1414201 1403815 1410454 1450034 1414303 1399715 1322208 1377288
14995 1377288 1466956 1498383 1450239 1437724 1438079 1458938 1431662 1402779 1411628 1399969 1397153 1421636
14983 1421636 1450397 1457629 1421802 1421516 1441181 1460629 1426124 1454357 1478108 1420479 1417681 1442601
14971 1442601 1450534 1417864 1415050 1431544 1465322 1494351 1463314 1428370 1434345 1432596 1434892 1385102
14959 1385102 1371672 1420121 1449218 1480194 1448837 1437429 1450498 1435211 1455257 1449475 1405007
14948 1405007 1442813 1435364 1453028 1519395 1467589 1484137 1428836 1432013 1412726 1462947 1483434 1474598
14936 1474598 1465956 1444680 1474515 1475719 1458885 1433917 1441229 1433771 1410362 1439406 1467557 1497718
$$ [...]
##END NTUPLES=NMR SPECTRUM
##END=
