##TITLE=1H_CG-1215-2
 CDCl3
 8 sc, 
 29.10.2024
##JCAMPDX= 6.0         $$ Bruker NMR JCAMP-DX V2.0
##DATA TYPE= NMR SPECTRUM
##DATA CLASS= NTUPLES
##ORIGIN= UXNMR, Bruker Analytische Messtechnik GmbH
##OWNER= root
$$ XWIN-NMR		Version 3.5
$$ Tue Oct 29 14:33:24 2024 Russian Standard Time (UT+4h)  she@DPX200
##.OBSERVE FREQUENCY= 200.1318
##.OBSERVE NUCLEUS= ^1H
##.ACQUISITION MODE= SIMULTANEOUS
##.ACQUISITION SCHEME= undefined
##.AVERAGES= 8
##.DIGITISER RES= 18
##SPECTROMETER/DATA SYSTEM= spect
##.PULSE SEQUENCE= zg30
##.SOLVENT NAME= CDCl3
##.SHIFT REFERENCE= (INTERNAL, CDCl3, 0, 21.012)
##AUDIT TRAIL= $$ (NUMBER, WHEN, WHO, WHERE, WHAT)
$$ ##TITLE= Audit trail, XWIN-NMR		Version 3.5
$$ ##JCAMPDX= 5.01
$$ ##ORIGIN= Bruker BioSpin GmbH
$$ ##OWNER= she
$$ F:/spectra/data/she/nmr/H-F/1/pdata/1/auditp.txt
$$ ##AUDIT TRAIL=  $$ (NUMBER, WHEN, WHO, WHERE, WHAT)
(   1,<2024-10-29 14:30:27.03 +0400>,<she>,<DPX200>,
      <created by zg, POWCHK disabled, PULCHK disabled
       configuration hash MD5:
       00 E9 B6 7A A2 85 ED C7 34 08 36 98 17 FE 4E 26
       data hash MD5: 16K
       31 4C 84 70 9F 2E FF B1 37 EC A1 DC 2B F2 B7 5A>)
(   2,<2024-10-29 14:30:29.37 +0400>,<she>,<DPX200>,
      <Start of raw data processing
       efp BC_mod = 2 LB = 0.24 FT_mod = 6 PKNL = 1 PHC0 = -26505.17 PHC1 = 10.58743 SI = 16K 
       data hash MD5: 16K
       4E 57 C6 DC 49 7A 36 D7 4B 45 34 03 F5 CF F9 19>)
(   3,<2024-10-29 14:30:53.90 +0400>,<she>,<DPX200>,
      <pk PHC0 = 1.264155 PHC1 = -0.6000001 
       data hash MD5: 16K
       5B 75 21 7F 83 3A 82 52 98 6C ED D9 CB F4 EC 52>)
(   4,<2024-10-29 14:30:58.23 +0400>,<she>,<DPX200>,
      <abs ABSG = 5 
       data hash MD5: 16K
       34 6C B0 51 A7 71 B9 7A 16 70 56 45 18 EA 12 8F>)
$$ ##END=
$$ 
$$ hash MD5
$$ E5 45 64 AF 30 9D 46 A0 B6 88 A3 99 3F 2E EF 92
##$RELAX= 
##$RELAX= 
##$RELAX= 
##$RELAX= 
##$RELAX= 
##$RELAX= 
$$ Bruker specific parameters
$$ --------------------------
##$DU= <F:/spectra>
##$EXPNO= 1
##$NAME= <H-F>
##$PROCNO= 1
##$TYPE= <nmr>
##$USER= <she>
##$AMP= (0..31)
100 100 100 100 100 100 100 100 100 100 100 100 100 100 100 100 100 100 
100 100 100 100 100 100 100 100 100 100 100 100 100 100 
##$AQSEQ= 0
##$AQ_mod= 1
##$AUNM= <au_zg>
##$AUTOPOS= <>
##$BF1= 200.13
##$BF2= 200.13
##$BF3= 200.13
##$BF4= 200.13
##$BF5= 200.13
##$BF6= 200.13
##$BF7= 200.13
##$BF8= 200.13
##$BYTORDA= 1
##$CFDGTYP= 0
##$CFRGTYP= 5
##$CHEMSTR= <none>
##$CNST= (0..31)
1 1 145 1 1 1 1 1 1 1 1 1 1 1 1 1 1 1 1 1 1 1 1 1 1 1 1 1 1 1 1 1 
##$CPDPRG= <>
##$CPDPRG1= <>
##$CPDPRG2= <>
##$CPDPRG3= <>
##$CPDPRG4= <mlev>
##$CPDPRG5= <mlev>
##$CPDPRG6= <mlev>
##$CPDPRG7= <mlev>
##$CPDPRG8= <mlev>
##$CPDPRGB= <>
##$CPDPRGT= <>
##$D= (0..31)
0 1.2 0 0 0 0 0 0 0 0.06 0 0.03 0 0 0 0 0.0002 0 0 0 0 0 0 0 0 0 0 0 0 
0 0 0 
##$DATE= 1730197826
##$DBL= (0..7)
120 120 120 120 120 120 120 120 
##$DBP= (0..7)
150 150 150 150 150 150 150 150 
##$DBP07= 0
##$DBPNAM0= <>
##$DBPNAM1= <>
##$DBPNAM2= <>
##$DBPNAM3= <>
##$DBPNAM4= <>
$$ [...]
##$SUBNAM3= <"">
##$SUBNAM4= <"">
##$SUBNAM5= <"">
##$SUBNAM6= <"">
##$SUBNAM7= <"">
##$SUBNAM8= <"">
##$SUBNAM9= <"">
##$SW= 24.0689170037331
##$SWIBOX= (0..15)
0 0 2 0 0 0 0 0 0 0 0 0 0 0 0 0 
##$SW_h= 4816.95568400771
##$TD= 16384
##$TD0= 1
##$TE= 0
##$TE2= 300
##$TE3= 300
##$TEG= 300
##$TL= (0..7)
0 120 120 120 120 120 120 120 
##$TP= (0..7)
150 150 150 150 150 150 150 150 
##$TP07= 0
##$TPNAME0= <>
##$TPNAME1= <>
##$TPNAME2= <>
##$TPNAME3= <>
##$TPNAME4= <>
##$TPNAME5= <>
##$TPNAME6= <>
##$TPNAME7= <>
##$TPOAL= (0..7)
0.5 0.5 0.5 0.5 0.5 0.5 0.5 0.5 
##$TPOFFS= (0..7)
0 0 0 0 0 0 0 0 
##$TUNHIN= 0
##$TUNHOUT= 0
##$TUNXOUT= 0
##$USERA1= <user>
##$USERA2= <user>
##$USERA3= <user>
##$USERA4= <user>
##$USERA5= <user>
##$V9= 5
##$VALIST= <valist>
##$VCLIST= <CCCCCCCCCCCCCCC>
##$VD= 0
##$VDLIST= <DDDDDDDDDDDDDDD>
##$VPLIST= <PPPPPPPPPPPPPPP>
##$VTLIST= <TTTTTTTTTTTTTTT>
##$WBST= 1024
##$WBSW= 4
##$XGAIN= (0..3)
0 0 0 0 
##$XL= 0
##$YL= 0
##$YMAX_a= 406264
##$YMIN_a= -695387
##$ZGOPTNS= <>
##$ZL1= 120
##$ZL2= 120
##$ZL3= 120
##$ZL4= 120
##$ABSF1= 21.03111
##$ABSF2= -3.038023
##$ABSG= 5
##$ABSL= 3
##$ALPHA= 0
##$AQORDER= 0
##$ASSFAC= 0
##$ASSFACI= 0
##$ASSFACX= 0
##$ASSWID= 0
##$AUNMP= <proc_1d>
##$AZFE= 0.1
##$AZFW= 0.1
##$BCFW= 0
##$BC_mod= 2
##$BYTORDP= 0
##$COROFFS= 0
##$CY= -3
##$DATMOD= 1
##$DC= 0
##$DFILT= <>
##$DTYPP= 0
##$F1P= 0
##$F2P= 0
##$FCOR= 1
##$FTSIZE= 16384
##$FT_mod= 6
##$GAMMA= 0
##$GB= 0
##$INTBC= 1
##$INTSCL= 3.70164e-10
##$ISEN= 128
##$LB= 0.24
##$LEV0= 0
##$LPBIN= 0
##$MAXI= 10000
##$MC2= 0
##$MEAN= 0
##$ME_mod= 0
##$MI= 1.114404
##$NCOEF= 0
##$NC_proc= -6
##$NLEV= 6
##$NOISF1= 3.799351
##$NOISF2= 2.8
##$NSP= 0
##$NTH_PI= 0
##$NZP= 0
##$OFFSET= 21.01201
##$PC= 1
##$PHC0= -26503.91
##$PHC1= 9.98743
##$PH_mod= 1
##$PKNL= yes
##$PPARMOD= 0
##$PSCAL= 0
##$PSIGN= 0
##$REVERSE= no
##$SF= 200.130003343763
##$SI= 16384
##$SIGF1= 3
##$SIGF2= 2
##$SINO= 5.538805
##$SIOLD= 16384
##$SREGLST= <1H.CDCl3>
##$SSB= 0
##$STSI= 16384
##$STSR= 0
##$SW_p= 4816.95568400771
##$SYMM= 0
##$S_DEV= 0
##$TDeff= 16384
##$TDoff= 0
##$TI= <>
##$TILT= no
##$TM1= 0
##$TM2= 0
##$TOPLEV= 0
##$USERP1= <user>
##$USERP2= <user>
##$USERP3= <user>
##$USERP4= <user>
##$USERP5= <user>
##$WDW= 1
##$XDIM= 16384
##$YMAX_p= 434405378
##$YMIN_p= -954230
$$ End of Bruker specific parameters
$$ ---------------------------------
##NTUPLES= NMR SPECTRUM
##VAR_NAME=  FREQUENCY,     SPECTRUM/REAL,   SPECTRUM/IMAG
##SYMBOL=    X,             R,               I
##VAR_TYPE=  INDEPENDENT,   DEPENDENT,       DEPENDENT
##VAR_FORM=  AFFN,          ASDF,            ASDF
##VAR_DIM=   16384,         16384,           16384
##UNITS=     HZ,            ARBITRARY UNITS, ARBITRARY UNITS
##FACTOR=    0.29402158847633, 1,            1
##FIRST=     4205.13374650201, 0,            0
##LAST=      -611.821937505698, 0,           0
##MIN=       -611.821937505698, -954230,     0
##MAX=       4205.13374650201, 434405378,    0
$$ Real data points
##PAGE= N=1
##DATA TABLE= (X++(R..R)), XYDATA
$$ [...]
6972D0182943K39662L55994O33618R23779J195090J500124K009803K499745L016089
$$ 40182943 40422605 40778599 41412217 42335996 43531086 45031210 47041013 49540758 52556847
6963E2556847L985106M988806N753149O800428Q138260O332419L922783N472514
$$ 52556847 56541953 61530759 67283908 74084336 82222596 88555015 92477798 97950312
6955I7950312P084524Q204795P485665J970716j283108R14903J288703J630444
$$ 97950312 105034836 113239631 120725296 122696012 121412904 122327807 123616510 125246954
6947A25246954J751954O23450K663050M979922J439460l65525L49585j422334
$$ 125246954 126998908 127622358 130285408 135265330 136704790 136339265 136688850 135266516
6939A35266516k98413j596390k692581l633988o970706q422836p567729p901929
$$ 135266516 134968103 133371713 130679132 127045144 120074438 111651602 104083873 96181944
6931I6181944p654929o061661m599976l782933l316074l089634k708550k485004
$$ 96181944 88527015 82465354 77865378 74082445 70766371 67676737 64968187 62483183
6923F2483183k330322k009840j911499j792966j396544j227208q84172p42450
$$ 62483183 60152861 58143021 56231522 54438556 53042012 51814804 50930632 50188182
6915E0188182q1454l34002p01980n63744q08253r65055p98771j315030j163090
$$ 50188182 50106728 49772726 49070746 48507002 47698749 46733694 45934923 44619893 43456803
6906D3456803j667708k206596k232151j972010k067999j765712j524582j310404
$$ 43456803 41789095 39582499 37350348 35378338 33310339 31544627 30020045 28709641
6898B8709641j268828j250819j031223j010270j022753o27512p91058o60212o94524
$$ 28709641 27440813 26189994 25158771 24148501 23125748 22498236 21707178 21046966 20352442
6889B0352442p94530o88842n29012o76682n52900n86381m67730m11429n28138
$$ 20352442 19557912 18869070 18340058 17663376 17110476 16524095 16056365 15644936 15116798
6880A5116798m03507l45098m25373k36818j78802k26294k87141j37430r7655j02136
$$ 15116798 14713291 14368193 13942820 13706002 13527200 13300906 13013765 12876335 12778680 12676544
6870A2676544j32788q8032j02139j3615R0031K36163L2939L2823j85744J0876
$$ 12676544 12543756 12455724 12353585 12339970 12430001 12666164 12699103 12731926 12546182 12557058
6860A2557058J9045j10822p8509k94673k11999k23077k91949k87215l00431k37232
$$ 12557058 12576103 12465281 12386772 12092099 11880100 11657023 11365074 11077859 10777428 10540196
6850A0540196j36786k55195k60373k09601j42853k08039j53497r3404K2490k8135
$$ 10540196 10403410 10148215 9887842 9678241 9535388 9327349 9173852 9080448 9102938 9074803
6840I074803j90074j03529n3748Q3832L0301m6860p2131j87225r5968l5480j40383
$$ 9074803 8884729 8781200 8727452 8811284 8841585 8794725 8722594 8535369 8439401 8403921 8263538
6829H263538j13087k48458k01927j69233k74202l26548l35046k87560k30084k30317
$$ 8263538 8150451 7901993 7700066 7530833 7256631 6930083 6595037 6307477 6077393 5847076
6819E847076j73997k26696j00065m9567k44461r5065j32184k6621j37066m6276
$$ 5847076 5673079 5446383 5346318 5296751 5052290 4957225 4825041 4798420 4661354 4615078
6809D615078l2549l7158j04545J6120j00973k0647o8292J28085k20365j67289
$$ 4615078 4582529 4545371 4440826 4456946 4355973 4335326 4267034 4395119 4174754 4007465
6799D007465K9728j58075p6459j54833j67427n0426Q880p8769j22481K3408j79920
$$ 4007465 4037193 3879118 3802659 3647826 3480399 3429973 3438853 3360084 3237603 3261011 3081091
6788C081091j09278r9515j20491k825m0876j44221p2896j4594n4220n2351K1895
$$ 3081091 2971813 2872298 2751807 2748982 2708106 2563885 2490989 2476395 2422175 2369824 2391719
6777B391719j6755N7476O539r762j34590q0561p3357R036k8295J0693j52142L3429
$$ 2391719 2374964 2432440 2438979 2429217 2294627 2214066 2140709 2149745 2121450 2132143 1980001 2013430
6765B013430j59515O105K8252p4213j82202R5065L3033j192q4989j2881L5006
$$ 2013430 1853915 1860020 1888272 1814059 1631857 1726922 1759955 1758763 1673774 1660893 1695899
6754A695899m0617n5817P7455l6805j10188l2006j22703O0624O9274N6100m0600
$$ 1695899 1655282 1599465 1676920 1640115 1529927 1497921 1375218 1435842 1505116 1561216 1520616
6743A520616l7870K8494p1604P7992j6759j44823J09810m2845L3289j6282o9634
$$ 1520616 1482746 1511240 1439636 1517628 1500869 1356046 1465856 1423011 1456300 1440018 1370384
6732A370384J07870k259l6273p9461O316J0246L7123p546k0891q48n3894m1178
$$ 1370384 1478254 1475995 1439722 1360261 1366577 1376823 1413946 1406400 1385509 1384661 1330767 1289589
6720A289589J2187R385Q4577L3382q1784m2906j7145k6053K2686j6501O4628J18277
$$ 1289589 1301776 1311161 1395738 1429120 1347336 1304430 1287285 1261232 1283918 1267417 1332045 1450322
6708A450322p6670m9098p812N6811O3167Q9793j16811J06584P0842n025N2664
$$ 1450322 1373652 1324554 1316742 1373553 1436720 1526513 1409702 1516286 1587128 1582103 1634767
6697A634767N7531o0471N4198O7337m2850q7591O2013J20461K071m5321l7736
$$ 1634767 1692298 1631827 1686025 1753362 1710512 1622921 1684934 1805395 1807466 1762145 1724409
6686A724409j5932O2550J08862P1490J08693J01797j08834o9121k2848j28824
$$ 1724409 1708477 1771027 1879889 1951379 2060072 2161869 2053035 1983914 1961066 1832242
6676A832242j7742n6178J5200P5177r4608l9991J3413O1976l8452j1806O717j7999
$$ 1832242 1814500 1758322 1773522 1848699 1754091 1714100 1727513 1789489 1751037 1739231 1745948 1727949
6664A727949L1513N753q2664o5381K4277l4481p5481J5924l1575k1762m7798k7461
$$ 1727949 1759462 1765215 1682551 1617170 1641447 1606966 1531485 1547409 1515834 1494072 1446274 1418813
6652A418813l3232l7746r1430m593M3639O2870p1736J7059k5940R635J5119n7063
$$ 1418813 1385581 1347835 1256405 1251812 1295451 1358321 1286585 1303644 1277704 1287339 1302458 1245395
6640A245395J0224k184q6707Q3040n3258l3035J7995J833P0674k8258m7595m7569
$$ 1245395 1255619 1253435 1166728 1249768 1196510 1163475 1181470 1183303 1253977 1225719 1178124 1130555
6628A130555l8143r786m9293J57623l8491o0203N418j2757K3499K0159l6232N810
$$ 1130555 1092412 1082626 1033333 1190956 1152465 1092262 1097680 1084923 1108422 1128581 1092349 1098159
6616A098159n4550l624P8152J00585p9219M0975M403j25545K4951l8843J8232
$$ 1098159 1043609 1039985 1118137 1218722 1139503 1180478 1184881 1059336 1084287 1045444 1063676
6605A063676L4643M2411j06185N1999L9961j81723M024j1859j01496j634r953
$$ 1063676 1098319 1140730 1034545 1086544 1126505 944782 948806 936947 835451 833817 823864
6594H23864O9796j6412m5407m5475L3156K1371k3789J293k1928o5886L8169O7105
$$ 823864 893660 877248 831841 786366 819522 840893 817104 818397 796469 730583 768752 835857
6582H35857j7330k4684O2097o367j5955n3987L4926P1836l9942J4395j09919L9416
$$ 835857 818527 793843 855940 849573 833618 779631 814557 886393 846451 860846 750927 790343
6570G90343K4614N1455N5382l2946K4774r4655m6307M1604K257Q597q3842q3794
$$ 790343 814957 866412 921794 888848 913622 818967 772660 814264 816521 825118 741276 657482
6558F57482K9962o0840p089Q2145j7607k6094J3332K1275N8522R8276l8848L5845
$$ 657482 687444 626604 619515 701660 684053 657959 671291 692566 751088 849364 810516 846361
6546H46361q369j25182O725K6069l8795j5112j5083n986o7682j19255O2854j05483
$$ 846361 837992 712810 719535 745604 706809 691697 676614 670628 602946 483691 546545 441062
6534D41062j137O4397M1416n5290K8426o1569K1488n3844L1005J4898l2635p847
$$ 441062 439925 504322 545738 490448 518874 457305 478793 424949 455954 470852 438217 430370
6522D30370k0951J26696M6169Q6392k3629o9779J34402q1071L4178l829J3600
$$ 430370 409419 536115 582284 668676 645047 575268 709670 628599 662777 658948 672548
6511F72548Q4518N89J3391J2196j64800k9856P6082r6713j3067p4936N371O8644
$$ 672548 757066 757655 771046 783242 618442 588586 664668 567955 554888 479952 485323 553967
6499E53967m299r6553o6940R226K5614Q1391j47701L338M9262k0743O8408j4121
$$ 553967 549668 453115 386175 395401 421015 502406 354705 358043 407305 386562 454970 440849
6487D40849L9826r2890l2719J13236N9712j01678q0477J24877l5878m0462O786
$$ 440849 480675 387785 355066 468302 528014 426336 345859 470736 434858 394396 401182
6476D01182j1605O6399J9308o4035O6688m5299m5091l9010k05532J16463R5978
$$ 401182 389577 455976 475284 411249 477937 432638 387547 348537 143005 259468 355446
6465C55446J6758m5367N604J8252n2153j8n1583p774J2081l2872L6525p545M7612
$$ 355446 372204 326837 332441 350693 298540 298522 246939 239165 251246 218374 254899 247354 294966
6452B94966k0773N6649l9546k1809Q4065k7937P8749j39863R3142K824j3354m5436
$$ 294966 274193 330842 291296 269487 353552 325615 404364 264501 357643 360467 347113 301677
6440C01677k2666j3951o2860J22099n0982j41111K533J4020j2741R5417l4963
$$ 301677 279011 265060 202200 324299 273317 132206 134739 148759 136018 231435 196472
6429A96472p0105R8145J8598r3734q595J06852l8831q5421q3722o1423K04760
$$ 196472 126367 224512 243110 149376 140781 247633 208802 123381 39659 -21764 182996
6418A82996K13r265M7340k7917l9425J9161o8345N5977k3552k6719K8670Q562
$$ 182996 183209 173944 221284 193367 153942 173103 104758 160735 137183 110464 139134 147696
6406A47696J7196n3697O686K1932o498M9672j377j11213k2463L5824P711P260
$$ 147696 164892 111195 117881 139813 133315 182987 181610 70397 47934 83758 91469 98729
6394I8729N2999o7722n1401J06193j06653l4560P6352q831J31235N1527j06494
$$ 98729 151728 84006 32605 138798 32145 -2415 73937 65106 196341 247868 141374
6383A41374k0699j7615r0710K4855M4324o9410l6292J10568L3691j38120J1580
$$ 141374 120675 103060 12350 37205 81529 12119 -24173 86395 120086 -18034 -6454
6372f454L5365K0578P7306q9297Q0994p1761k2093J4995p945O1742P709p9444
$$ -6454 28911 49489 126795 37498 118492 46731 24638 39633 31688 93430 101139 21695
6360B1695l3448N8143K2909n304K3881n9737K064m4634j3672k8493o8481O4743
$$ 21695 -11753 46390 69299 63995 87876 28139 30203 -14431 -28103 -56596 -125077 -60334
6348f0334Q8853L1067j3557P9329j03610j47796N3657J33335p7379L2640j2080
$$ -60334 28519 59586 46029 125358 21748 -126048 -72391 60944 -16435 16205 4125
6337D125R1910n2194j1602M5256n3803j03332J19876R5240p0567j874r6653j6679
$$ 4125 96035 43841 32239 77495 23692 -79640 40236 135476 64909 63035 -33618 -50297
6325e0297L1477L8715J7700l4033k2347j6398M3788n5494J39576j53587Q5177
$$ -50297 -18820 19895 37595 3562 -18785 -35183 8605 -46889 92687 -60900 24277
6314B4277j0734j15147n3745J47592o2063L7545M5519J0741p6515n0159N1919
$$ 24277 13543 -101604 -155349 -7757 -69820 -32275 13244 23985 -52530 -102689 -50770
6303e0770K3257L4444O3118l1143j07529P8881N4268J2619j28064K834J13070
$$ -50770 -27513 6931 70049 38906 -68623 10258 64526 77145 -50919 -48085 64985
6292F4985M2817j22484R426P4555p2398j02546Q5279J0855k0787P2553j8385o1585
$$ 64985 107802 -14682 -5256 69299 -3099 -105645 -20366 -9511 -30298 42255 23870 -37715
6280c7715L575p0628J700M6548J8064J8490k8152n5208N6009P2640K6467q1115
$$ -37715 -34140 -104768 -103068 -56520 -38456 -19966 -48118 -103326 -47317 25323 51790 -29325
6268b9325N6981j24885O1789R5499K083j12883j9063J6947Q4765n5844O7207o3712
$$ -29325 27656 -97229 -35440 60059 62142 -50741 -69804 -52857 31908 -23936 43271 -20441
6256b0441J7298n2328j5403O7077P269r5146J23410K0655j5384N845j14228N025
$$ -20441 -3143 -55471 -70874 -3797 3472 -91674 31736 52391 37007 42852 -71376 -66351
6244f6351P7115Q9594M173q2437l0164q7699K0802N2302J0619O3724m7064n8423
$$ -66351 10764 100358 104531 22094 -8070 -95769 -74967 -22665 -12046 51678 4614 -53809
6232e3809L8074L7252M1789l6638m9514J0260q0052K2380O8093n6629K4245P2873
$$ -53809 -15735 21517 63306 26668 -22846 -12586 -92638 -70258 -2165 -58794 -34549 38324
6220C8324o5212K4372M0426j09899J787M6157k0599R2157k6482J7455k6756o3826
$$ 38324 -26888 -2516 37910 -71989 -70202 -24045 -44644 47513 21031 38486 11730 -52096
6208e2096K9100J23155q9736O7204J084j05258P2610r7088P0945J0964L8223o4079
$$ -52096 -22996 100159 10423 77627 78711 -26547 46063 -51025 19920 30884 69107 5028
6196E028J7927N4009j61314P2551J5700P9881l9910k7352P7753k2768q3177M0340
$$ 5028 22955 76964 -84350 -11799 3901 83782 43872 16520 94273 71505 -11672 28668
6184B8668k2511K9250J0047j1906K3391M308o4294K4994N0503o8708n3061J03005
$$ 28668 6157 35407 45454 33548 56939 61247 -3047 21947 72450 3742 -49319 53686
6172E3686O8989j39147Q8649q1058m5332J05833k0689N8526N0436j80566k7993
$$ 53686 122675 -16472 72177 -8881 -54213 51620 30931 89457 139893 -40673 -68666
6161f8666J320N6163L2916p2549o3147k3537L8171J03639N7885n0980k5641o6155
$$ -68666 -67346 -11183 21733 -50816 -113963 -137500 -99329 4310 62195 11215 -14426 -80581
6149h0581P1375M992J212o2548n2060k9886O3017N2782N1635j18722j9913J10858
$$ -80581 -9206 -4214 -3002 -65550 -117610 -147496 -84479 -31697 19938 -98784 -118697 -7839
6137g839Q604m4296j9593K1891J50075l1224J3634l8728O2240l0266m8789n183
$$ -7839 765 -43531 -63124 -41233 108842 77618 91252 52524 114764 84498 35709 30526
6125C0526n9121O8034J02108o3015j748l6088m7779K5672J00241l0776O9892Q8360
$$ 30526 -28595 39439 141547 78532 76784 40696 -7083 18589 118830 88054 157946 246306
6113B46306j20182K5483m8635m0864K6064O9221k8129O9063k3840L2436J137n2681
$$ 246306 126124 151607 102972 62108 88172 157393 129264 198327 174487 206923 208060 155379
6101A55379J41824J592o5133j04867L1407R9055p2026j05616N7834M1077m6340
$$ 155379 297203 298795 233662 128795 160202 259257 187231 81615 139449 180526 134186
6090A34186l6592l8830L7862l6906j3306Q595M0392L6113R7881m4959O583p6951
$$ 134186 97594 58764 96626 59720 46414 55009 95401 131514 229395 184436 191019 114068
6078A14068n247m9684P5039j828q2687k8715L8303l4O9815J8285J1214k4824K4847
$$ 114068 108821 59137 134176 132348 49661 20946 59249 59215 129030 147315 158529 133705 158552
6065A58552m766N2299P9327q7492l4064l1178p8965P8308M0390j42282R6310K9289
$$ 158552 153786 206085 285412 197920 163856 132678 53713 132021 172411 30129 126439 155728
6053A55728o8613j5672K1832o5186M0751J41425r4420K6982J13572j28782q9686
$$ 155728 87115 71443 93275 28089 68840 210265 115845 142827 256399 127617 37931
6042C7931K2260N6543m363j6638Q336k1775j9244N4158n6542O292N1548l9611
$$ 37931 60191 116734 112371 95733 104069 82294 63050 117208 60666 66958 118506 78895
6030G8895N3104q892r4437j4112L8573K7933J1002L2619m4325L6548n0978p0060
$$ 78895 131999 123107 28670 14558 53131 81064 92066 124685 80360 116908 65930 -4130
6018d130L0668J3785n556K9006j07824j2259O895M7450N1939N227m676P8127l1542
$$ -4130 26538 40323 34767 63773 -44051 -56310 -49415 -1965 49974 55201 50525 128652 97110
6005I7110J6609n4421j9410O4056r2731K9768l6462Q0013N3959J247p1142O9194
$$ 97110 113719 59298 39888 103944 11213 40981 4519 84532 138491 139738 68596 137790
5993A37790l0282j21761R5984O5497J9182K8514j07197l3564N9788k7487L9409
$$ 137790 107508 -14253 81731 147228 166410 194924 87727 54163 113951 86464 125873
5982A25873K0205l6469j7848K7655k9685M3480K4783N1610M5170k8673k8970K066
$$ 125873 146078 109609 91761 119416 89731 133211 157994 209604 254774 226101 197131 199197
5970A99197k6502l625r5480M6379N5517J553p7990l3869J8424O3812k9669K0770
$$ 199197 172695 169070 73590 119969 175486 177039 99049 65180 83604 147416 117747 138517
5958A38517J1080P1954M9564K2606J1732k6157L1192q337K9568O8657O0238j42198
$$ 138517 149597 221551 271115 293721 305453 279296 310488 302151 331719 400376 460614 318416
5946C18416J0261L8961k363l9046N4685n3615l2286j45997R7651L9660l5005m9287
$$ 318416 328677 367638 365275 326229 380914 327299 295013 149016 246667 286327 251322 202035
5934B02035J7996K4842K6725O132m9670O879P0902M1167j01434K720P908J3471
$$ 202035 220031 244873 271598 277730 228060 234939 305841 347008 245574 248294 256202 269673
5922B69673P0505n6921O8547q3523K2977K4339L0245O7718J7849k2684p4520N1714
$$ 269673 340178 283257 351804 268281 291258 315597 345842 413560 431409 408725 334205 385919
5910C85919J6081M0591L1908m2852L3276P8599l6185o7776l6224O3176o6482Q651
$$ 385919 402000 442591 474499 431647 464923 543522 507337 439561 403337 466513 400031 408682
5898D08682P362L6674J4608q302p76K0847K05236M3788M1872M475J2548J28969
$$ 408682 416044 452718 467326 459024 458248 479095 684331 728119 769991 774466 787014 915983
5886I15983P1180j8297L6455N3308l7731l49o1976j64338o7236K4298l0581m395
$$ 915983 987163 968866 1005321 1058629 1020898 1020549 958573 794235 726999 751297 720716 716321
5874G16321m8196J9017q9393J5669K4489j48331N3244j4465O0862o7044j0463
$$ 716321 668125 687142 597749 613418 637907 489576 542820 528355 589217 522173 511710
5863E11710P6612l078k7211j0127m831j54149L2773J23644o2336M777J1285K2099
$$ 511710 588322 585244 558033 547906 543075 388926 421699 545343 483007 487784 499069 521168
5851E21168R2998J00383R1575R7113k5602k4943K6980J01221K5171j07812l4091
$$ 521168 614166 714549 806124 903237 877635 852692 879672 980893 1006064 898252 864161
5840H64161n6047o516j6252P0597l2617j67603k2204K441j5976J1685p1808J7725
$$ 864161 808114 801598 785346 855943 823326 655723 633519 635960 619984 631669 559861 577586
5828E77586L4594J00530j52753P513k0929m0587k7484Q4335q2814R451P6440k1161
$$ 577586 612180 712710 559957 567470 546541 505954 478470 562805 479991 489442 565882 544721
5816E44721N9605m7832q4246o4969o0388O0128Q2234q6723M2301K1500r7774N8932
$$ 544721 604326 556494 472248 407279 346891 407019 489253 402530 444831 466331 368557 427489
5804D27489O6956p8188K4036m356l1431R8332n521P0655L3571j0678K5087M8391
$$ 427489 494445 416257 440293 435937 404506 502838 497317 567972 601543 590865 615952 664343
5792F64343L2031j31564j5885j006n9325J82594n2926J8687j0761j29236R5498
$$ 664343 696374 564810 548925 547919 488594 671188 618262 636949 626188 496952 592450
5781E92450j04602O001M7470O0836m5410j07794N3282j9470j2966O6432N1617
$$ 592450 487848 493849 541319 602155 556745 448951 502233 482763 469797 536229 587846
5770E87846L7206m663n9624q4501M3161R0682j2962R7908N7823P5405p6540n8932
$$ 587846 625052 620389 560765 476264 519425 610107 597145 695053 752876 828281 751741 692809
5758F92809J02557J6716L5670R0738o3322J31190J33651K3016j57721l1404J24203
$$ 692809 795366 812082 847752 938490 875168 1006358 1140009 1163025 1005304 973900 1098103
5747A098103l0160k7119Q7444J7757r9634j16760J0909R4269j0656p2663J7017
$$ 1098103 1067943 1040824 1128268 1146025 1046391 929631 940540 1034809 1024153 951490 968507
5736I68507o1696L547n664o2596P2003N4003K1611j39727L8463M8880k2611K3854
$$ 968507 906811 910358 904694 842098 914101 968104 989715 849988 888451 937331 914720 938574
5724I38574M310k1036j3306o7680J12704N6135o381j09676J14113o5419M4778
$$ 938574 942884 921848 908542 840862 953566 1009701 1003320 893644 1007757 942338 987116
5713I87116Q6768O3639m5938q5550J349P1516j00836Q2578N1345J70878p602J9902
$$ 987116 1073884 1137523 1091585 1006035 1007384 1078900 978064 1060642 1111987 1282865 1275263 1295165
5701A295165L9352M9611K1357L4687o8971J20116N5481L8327K10955l9767O8466
$$ 1295165 1334517 1384128 1405485 1440172 1371201 1491317 1546798 1585125 1796080 1756313 1824779
5690A824779j1897k212k5389o612k9818k0545k4595J7977Q945k7360j44546k2028
$$ 1824779 1812882 1810670 1785281 1778669 1748851 1728306 1703711 1721688 1730633 1703273 1558727 1536699
5678A536699P7495j9117n0680J8186j56192r661Q4826O9562L8983j62597j4289
$$ 1536699 1614194 1595077 1544397 1562583 1406391 1396730 1481556 1551118 1590101 1427504 1413215
5667A413215j4692J05202O6834K6551N5365P9340J92584J19314J55633K4028l5229
$$ 1413215 1398523 1503725 1570559 1597110 1652475 1731815 1924399 2043713 2199346 2223374 2188145
5656B188145M6322O58m8627K8992j9855j2960j24636j08990k13843K9142l1666
$$ 2188145 2234467 2235125 2186498 2215490 2195635 2182675 2058039 1949049 1735206 1764348 1732682
5645A732682j16234J2145k25985j50041j04756o6978j7112Q1000L3298j75631
$$ 1732682 1616448 1628593 1402608 1252567 1147811 1080833 1063721 1144721 1178019 1002388
5635A002388r1534j50122K1203j14559J7171j8311k8107P8952k2146J2591o6410
$$ 1002388 910854 760732 781935 667376 684547 666236 638129 717081 694935 707526 641116
5624F41116j14205J2864k3125m5675M7309J343j5128N2287L4739r598j27417j07813
$$ 641116 526911 539775 516650 470975 518284 519627 504499 556786 591525 581927 454510 346697
5612C46697m1494J13046L6935M7164R251M4902p5978l1730R2588r5854K1439K0983
$$ 346697 305203 418249 455184 502348 511599 556501 480523 448793 541381 445527 466966 487949
5600D87949m5162J2580m786j28794P7510N6967m6549l563p880p8696p4819l0434
$$ 487949 442787 455367 450581 321787 399297 456264 409715 406152 398272 319576 244757 214323
5588B14323J68877o7782K5883l289p828J24345p8854J05029L2511m8153o1501
$$ 214323 383200 315418 341301 338012 330184 454529 375675 480704 513215 465062 403561
5577D03561o5775J28996J879Q5026q1653j59386j2333L1890m5622o3050m886m8046
$$ 403561 337786 466782 468661 553687 472034 312648 300315 332205 286583 223533 218647 170601
5565A70601P0573l353O2209n6743k404O9239j09626r307k8890K6399K216J4187
$$ 170601 241174 237821 300030 243287 240883 310122 200496 191189 162299 188698 190914 205101
5553B05101K3184m2659L6074k2471J5409o7759L4735N265n1411p3031O2241m2490
$$ 205101 228285 185626 221700 199229 214638 146879 181614 186879 135468 62437 124678 82188
5541H2188q578p974N8817o9633K8328l639J7841N5331L6708N3091j16767J14269
$$ 82188 73610 65636 124453 54820 83148 79509 97350 152681 189389 242480 125713 239982
5529B39982k4305k9324o0035k7207Q6088k1884r2154L3892k4714Q168P2555m5244
$$ 239982 215677 186353 126318 99111 185199 163315 71161 105053 80339 88507 161062 115818
5517A15818Q909K1717p9067J48579l9420l5997K0091M0036o5295m724k254P8924
$$ 115818 124727 146444 67377 215956 176536 140539 160630 200666 135371 130647 128393 207317
5505B07317k5859p9931K7281o2362O8829j1153j5582P3824j35929L1635K2198
$$ 207317 181458 101527 128808 66446 135275 124122 108540 182364 46435 78070 100268
5494A00268P5392O8879j51583J3468K983J2176o109l9831k6911Q4310m1144L4236
$$ 100268 175660 244539 92956 106424 109407 121583 115474 75643 48732 133042 91898 126134
5482A26134m3809l9380O0085K7249l4780P5962n349N2957L928j02867k6417M251
$$ 126134 82325 42945 103030 130279 95499 171461 166112 219069 222997 120130 93713 97964
5470I7964R7J31615L9465q6445r5553L5580J3084N1721K2674l8535m371J6338
$$ 97964 98061 229676 269141 182696 87143 122723 135807 187528 210202 171667 167296 183634
5458A83634L471R903L1537K4093m259l5997n007N7241J927J0955J45966K4053
$$ 183634 187105 197008 228545 252638 248379 212382 207375 264616 266543 277498 423464 447517
5446D47517m0089M8351P0298j39478M6732M4082p4725K8105p1786R999J1327q3300
$$ 447517 407428 455779 526077 386599 433331 477413 402688 430793 359007 369006 380333 297033
5434B97033J20230j5873M0260L5566k1823j14408K672K5885j338k7936P7601M5287
$$ 297033 417263 401390 441650 477216 455393 340985 343657 369542 368204 340268 417869 463156
5422D63156j6581m2966o7669k2752K6119o1200K2239Q8710K769j05240K294J1787
$$ 463156 446575 403609 335940 313188 339307 278107 300346 389056 391825 286585 288879 300666
5410C00666J5010R1675l3862K3491J06220M2868l6504j8442J0403P7548Q981n5264
$$ 300666 315676 407351 373489 396980 503200 546068 509564 491122 501525 579073 588054 532790
5398E32790L8481j3767p2968j355j7481O5029R082m5352J81295k0487O534q1103
$$ 532790 571271 557504 484536 483181 465700 530729 539811 494459 675754 655267 661801 580698
5386E80698J4639p9762l7488O1367L6539K647n958O91j06829j572O645k3672l4134
$$ 580698 595337 515575 478087 539454 575993 578640 572682 573373 466544 464972 471617 447945 413811
5373D13811j14396k3198J01846P2291l2732q666j55201l2407N8442k1342K3848
$$ 413811 299415 276217 378063 450354 417622 408956 253755 221348 279790 258448 282296
5362B82296K5154o0141K933j8365N7290K0015o7525J46005l8626N1822r1142N2112
$$ 282296 307450 247309 250242 231877 289167 309182 241657 387662 349036 400858 309716 361828
5350C61828l722M6081o6209M1496j07359l2259R7506K1694r3965m8699R2758J22847
$$ 361828 358106 404187 337978 379474 272115 239856 337362 359056 265091 216392 309150 431997
5338D31997p1177j885o1497j1613N2693r3341l5059n73J05833m6718P4483M216
$$ 431997 360820 358935 297438 285825 338518 245177 210118 209545 315378 268660 343143 347359
5326C47359r0629L6647m5833K002L4456P6718j1886q517n4199L0008m7633J09844
$$ 347359 256730 293377 247544 249546 284002 360720 348834 340317 286118 316126 268493 378337
5314C78337k4619r047J1999K7290q7850J7157O0262r3421M7225p665N9339o2730
$$ 378337 353718 344671 356670 383960 296110 313267 373529 280108 327333 319668 379007 316277
5302C16277P7403L2144m0002J817k2900L5551J1204K9824K0426J06146K7648j15536
$$ 316277 393680 425824 385822 387639 364739 400290 411494 441318 461744 567890 595538 480002
5290D80002j8987J1023L101m8356K89Q4714l9455r5368L5017Q0604J6712N9108
$$ 480002 461015 472038 475139 426783 427072 511786 472331 376963 411980 492584 509296 568404
5278E68404N371J073j2859K6331m972o2003K2874J18047j7366j1013L7369n7717
$$ 568404 573775 574848 561989 588320 583348 521345 544219 662266 644900 633887 671256 613539
5266F13539M5092p920O84M2307l1690P9221J9349J9037M2807j44039J43591K5799
$$ 613539 658631 650711 651395 693702 662012 741233 760582 779619 822426 678387 821978 847777
5254H47777J5315j29620M4904L6945j04195J96277P7420j04641j1065J9409j2421
$$ 847777 863092 733472 778376 815321 711126 907403 984823 880182 869117 888526 876105
5243H76105l7895L9957p9819J11019M1469K2769N105j9895j3422J1235J63803
$$ 876105 838210 878167 798348 909367 950836 973605 978710 958815 945393 956628 1120431
5232A120431o9093L6326k4113R6965p2293n4196N9200P8504O7689r452O3637n289
$$ 1120431 1051338 1087664 1063551 1160516 1088223 1034027 1093227 1171731 1239420 1229968 1293605 1288316
5220A288316O2816j6550m5313n4337J27799J339k1819P880R8120j7926M1523J6913
$$ 1288316 1351132 1334582 1289269 1234932 1362731 1364070 1342251 1350131 1448251 1430325 1471848 1488761
5208A488761m2335j4861J79738p8384Q5915R9651n1495L0747J5225n3427J18279
$$ 1488761 1446426 1431565 1611303 1532919 1618834 1718485 1666990 1697737 1712962 1659535 1777814
5197A777814Q7473M2738P7584q272K1789O5828J02695R9722N6699K5316O5055
$$ 1777814 1865287 1908025 1985609 1977337 1999126 2064954 2167649 2267371 2324070 2349386 2414441
5186B414441L3627L9486L8564J9390M1235P7492O6937j0326k0321L0525l9263
$$ 2414441 2448068 2487554 2526118 2545508 2586743 2664235 2731172 2720846 2700525 2731050 2691787
5175B691787J07774J53229N8196l581N7805O8465L4678J8170Q1519J29340J9455
$$ 2691787 2799561 2952790 3010986 3007405 3065210 3133675 3168353 3186523 3268042 3397382 3416837
5164C416837o8257J53944L5866J24291J06742O1299J13039J16681J35807Q1856
$$ 3416837 3348580 3502524 3538390 3662681 3769423 3830722 3943761 4060442 4196249 4278105
5154D278105R5660J64199Q0664Q0848L2881L9750J07018m917p1150j2173m6821
$$ 4278105 4373765 4537964 4618628 4699476 4732357 4772107 4879125 4874208 4803058 4790885 4744064
5143D744064J294q6738K1442K2690r2039j23447p2250j5664L4145j12611r6021
$$ 4744064 4745358 4658620 4680062 4702752 4610713 4487266 4415016 4399352 4433497 4320886 4224865
5132D224865j355m1023K3987O7877K2389n6502l1434O803O1726k8301J8294K9655
$$ 4224865 4223510 4182487 4206474 4274351 4296740 4240238 4208804 4215607 4277333 4249032 4267326 4296981
5120D296981k501k5873M9537r715Q8477J37232J14522N9164O5720J42976J10672
$$ 4296981 4294480 4268607 4318144 4308429 4396906 4534138 4648660 4707824 4773544 4916520 5027192
5109E027192K73788J19768O2072J44229J55661J11770J55739J28208J34352N3458
$$ 5027192 5300980 5420748 5482820 5627049 5782710 5894480 6050219 6178427 6312779 6366237
5099F366237M0437Q5323k1841q0076l4465j914j36476j27263j09828n3599j75675
$$ 6366237 6406674 6491997 6470156 6390080 6355615 6353701 6217225 6089962 5980134 5926535 5750860
5088E750860j50300o2213k45121j05138k78k2719j44134n8655j12215L9401j01077
$$ 5750860 5600560 5538347 5293226 5188088 5187810 5165091 5020957 4962302 4850087 4889488 4788411
5077D788411R3348O348j13250N2844p0682P7746n0230p224J02061J12244J31337
$$ 4788411 4881759 4888107 4774857 4827701 4757019 4834765 4784535 4777311 4879372 4991616 5122953
5066E122953l9273k1040J00731J1238N5254J08285r7604Q5859J38130Q9362O0895
$$ 5122953 5083680 5062640 5163371 5174609 5229863 5338148 5240544 5326403 5464533 5553895 5614790
5055E614790J06362J63034N2652J96101J07892J27162L7554K2911J62139K8100
$$ 5614790 5721152 5884186 5936838 6132939 6240831 6367993 6405547 6428458 6590597 6618697
5045F618697Q3621K4933Q6944R3727M0210j2424K14953R2980J11781K02817k4405
$$ 6618697 6702318 6727251 6814195 6907922 6948132 6935708 7150661 7243641 7355422 7558239 7533834
5034G533834J00035O3603O6150K41228J22136J54135J31847j5707J48626J70489
$$ 7533834 7633869 7697472 7763622 8004850 8126986 8281121 8412968 8397261 8545887 8716376
5024H716376N8014J34938J81760J11733O9186K23901K37886J36480J91253K90427
$$ 8716376 8774390 8909328 9091088 9202821 9272007 9495908 9733794 9870274 10061527 10351954
5014A0351954K39830L27052L67062J70585K49475L73641K15834J94829J53232
$$ 10351954 10591784 10918836 11285898 11456483 11705958 12079599 12295433 12490262 12643494
5005A2643494j4130O6668Q677M954o2348M8573j7467k2354j54529o328k3347l3420
$$ 12643494 12629364 12696032 12704709 12709663 12647315 12695888 12678421 12656067 12501538 12495210 12471863 12438443
4993A2438443l5699P9917o6591L7459P2923J64435J20278J30168P7139J29005
$$ 12438443 12402744 12482661 12416070 12453529 12526452 12690887 12811165 12941333 13018472 13147477
4983A3147477J81404P1340J03206K34919K21475K99988K60378M13690K96327K99530
$$ 13147477 13328881 13400221 13503427 13738346 13959821 14259809 14520187 14933877 15230204 15529734
4973A5529734M26477M61388M80133N78166N01503N66983O73650O77217O44701
$$ 15529734 15956211 16417599 16897732 17475898 17977401 18544384 19218034 19895251 20539952
4964B0539952Q65354Q50717Q52809Q21661J052163R77576J018958J146519J097826
$$ 20539952 21405306 22256023 23108832 23930493 24982656 25960232 26979190 28125709 29223535
4955B9223535J238302J247857J266948J337614J625587J449940J713700J734980
$$ 29223535 30461837 31709694 32976642 34314256 35939843 37389783 39103483 40838463
4947D0838463J983369K177310K564639K912776L238613M039587M797441N632138
$$ 40838463 42821832 44999142 47563781 50476557 53715170 57754757 62552198 68184336
4939F8184336O002230O417030O369951M514803L762640M155633N127404O268409
$$ 68184336 74186566 80603596 86973547 91488350 95250990 99406623 104534027 110802436
4931A10802436O438958N731991M986301M944439M371460M241771M699651N852127
$$ 110802436 117241394 122973385 127959686 132904125 137275585 141517356 146217007 152069134
4923A52069134P082354O941102M843870K828216L109345M227684M946355M129436
$$ 152069134 159151488 166092590 170936460 173764676 176874021 181101705 186048060 190177496
4915A90177496J436587p88780q41437R2672J137876J730384J865060J520870J403506
$$ 190177496 191614083 190825303 189983866 190076538 191214414 192944798 194809858 196330728 197734234
4906A97734234J077795J008748J544295K189918K063898Q67805j482385l539389
$$ 197734234 198812029 199820777 201365072 203554990 205618888 206486693 205004308 201464919
4898B01464919l632960l107861l925654n938796p296628p682063p513747o958711
$$ 201464919 197831959 194724098 190798444 184859648 177563020 169880957 162367210 155408499
4890A55408499o578960o124018n307802m156016l158681k316887k117870k261511
$$ 155408499 148829539 142705521 137397719 133241703 130083022 127766135 125648265 123386754
4882A23386754k649837k674637k550028k329168k453916k980038l846923m276218
$$ 123386754 120736917 118062280 115512252 113183084 110729168 107749130 103902207 99625989
4874I9625989m553126m717175m955989n035448m924978m580995m194408l866405
$$ 99625989 95072863 90355688 85399699 80364251 75439273 70858278 66663870 62797465
4866F2797465l484535l193359k872723k614644k384767k035237j943594j853875
$$ 62797465 59312930 56119571 53246848 50632204 48247437 46212200 44268606 42414731
4858D2414731j641997j578016j586217j461608j293185j209852j181824j079981
$$ 42414731 40772734 39194718 37608501 36146893 34853708 33643856 32462032 31382051
4850C1382051j052556r46169r06578r35902q46825q51438o49254n80017p79510
$$ 31382051 30329495 29383326 28476748 27540846 26694021 25842583 25193329 24613312 23833802
4841B3833802p15967o45082o81182n54570n05765m80217n96946l85281m52036
$$ 23833802 23117835 22472753 21791571 21237001 20731236 20251019 19654073 19268792 18816756
4832A8816756k86367l32115m40614m00861k83322l95230j79686k46502k32897
$$ 18816756 18530389 18198274 17757660 17356799 17073477 16678247 16498561 16252059 16019162
4823A6019162j74912l15916j47003j73889n1010j52478j76205j05886m2566q9820
$$ 16019162 15844250 15528334 15381331 15207442 15156432 15003954 14827749 14721863 14679297 14589477
4813A4589477q8146j34590q7979j5718p4683k42719m9882j62918j52751o4646
$$ 14589477 14501331 14366741 14278762 14263044 14188361 13945642 13895760 13732842 13580091 13515445
4803A3515445j56054K3279R8342L3388O0474O9453L1032J68443j1686q4873j09982
$$ 13515445 13359391 13382670 13481012 13514400 13574874 13644327 13675359 13843802 13832116 13747243 13637261
4792A3637261J8785j23648n3394J1218p6574j92460k71773k27483k45567k11793
$$ 13637261 13656046 13532398 13479004 13490222 13413648 13221188 12949415 12721932 12476365 12264572
4782A2264572j67045j60365p7499j94657J3186j4432j83752j62696o5547j12174
$$ 12264572 12097527 11937162 11859663 11665006 11678192 11663760 11480008 11317312 11251765 11139591
4772A1139591r9137k83952j25917j31789j87382j12883j66913j38166k16690j73956
$$ 11139591 11040454 10756502 10630585 10498796 10311414 10198531 10031618 9893452 9676762 9502806
4762I502806j74276j88966j64932j34027q3968j07160j20660L1335o7569j1378
$$ 9502806 9328530 9139564 8974632 8840605 8756637 8649477 8528817 8560152 8492583 8481205
4752H481205l0697p6119P6185p3187r8843P264J64230P0963J6703n0895J57984
$$ 8481205 8450508 8374389 8450574 8377387 8278544 8285808 8450038 8521001 8537704 8486809 8644793
4741H644793N1266J02245J02905J32026J08599O8067J12963J77460N3995l931
$$ 8644793 8696059 8798304 8901209 9033235 9141834 9209901 9322864 9500324 9554319 9550388
4731I550388K6318J16430J04629L3614n2574L5776M8569N0418J26010n1135J12961
$$ 9550388 9576706 9693136 9797765 9831379 9778805 9814581 9863150 9913568 10039578 9988443 10101404
4720A0101404l9J16614J117K5743j6846P6058J52974J27238K0691K3133J21695
$$ 10101404 10101365 10217979 10219096 10244839 10227993 10304051 10457025 10584263 10604954 10628087 10749782
4709A0749782P4758J53394K8332J00943J975J20183J77019R8158Q1419J55201
$$ 10749782 10824540 10977934 11006266 11107209 11109184 11229367 11406386 11504544 11585963 11741164
4699A1741164K16018J10933J63511J63938J41854J44371K21690K00629K46435
$$ 11741164 11957182 12068115 12231626 12395564 12537418 12681789 12903479 13104108 13350543
4690A3350543J90558K36872K50577K05029K58117J86223J95637L42298L33742
$$ 13350543 13541101 13777973 14028550 14233579 14491696 14677919 14873556 15215854 15549596
4681A5549596L38584K17239L84291L31648L09127L25598L03759K76797L46957
$$ 15549596 15888180 16105419 16489710 16821358 17130485 17456083 17759842 18036639 18383596
4672A8383596L63176M52580L59565L26957K64379K64748K72173L09257L13207
$$ 18383596 18746772 19199352 19558917 19885874 20150253 20415001 20687174 20996431 21309638
4663B1309638L17127L49483K87699K47278L65175L55664L16284K30617L06928
$$ 21309638 21626765 21976248 22263947 22511225 22876400 23232064 23548348 23778965 24085893
4654B4085893K64343L74671L61168K18330L16652L71047L07105L01369M08766
$$ 24085893 24350236 24724907 25086075 25304405 25621057 25992104 26299209 26600578 27009344
4645B7009344M65172L48245L71372N03426O27678M49061M85403N51173O13258
$$ 27009344 27474516 27822761 28194133 28697559 29325237 29774298 30259701 30810874 31424132
4636C1424132O12286P03688O57809P65075Q90299Q08225R81605J002242J055116
$$ 31424132 32036418 32740106 33397915 34162990 35053289 35861514 36843119 37845361 38900477
4627C8900477J101120J233265J313021J484256J390116J639516J628305J889695
$$ 38900477 40001597 41234862 42547883 44032139 45422255 47061771 48690076 50579771
4619E0579771J792834J991811K194860K350657K637494L075383L552247L948692
$$ 50579771 52372605 54364416 56559276 58909933 61547427 64622810 68175057 72123749
4611G2123749M428999M855971N039007M903316M171093L288713L007704K973657
$$ 72123749 76552748 81408719 86447726 91351042 95522135 98810848 101818552 104792209
4603A04792209K957569K381668J603406O33210K74448K48791L94451N22147J168607
$$ 104792209 107749778 110131446 111734852 112368062 112642510 112891301 113285752 113807899 114976506
4594A14976506K286486L627474M975544N480015N304114M069661K235132J444888
$$ 114976506 117262992 120890466 125866010 131346025 136650139 140719800 142954932 144399820
4586A44399820J740722J715281J087978o71587k759280l927473m364501m875939
$$ 144399820 146140542 147855823 148943801 148272214 145512934 141585461 137220960 132345021
4578A32345021n331418n266829m442213l402426k293538j429382q53372p58514
$$ 132345021 127013603 121746774 117304561 113902135 111608597 110179215 109325843 108567329
4570A08567329j183177j478505j509482j310055j369378j610013k220971k841096
$$ 108567329 107384152 105905647 104396165 103086110 101716732 100106719 97885748 95044652
4562I5044652l223334l238495l386899l515098l376798l125061k617759k230701
$$ 95044652 91821318 88582823 85195924 81680826 78304028 75178967 72561208 70330507
4554G0330507j977009j648308j307948j223914q97238o82273p24107l50517k18512
$$ 70330507 68353498 66705190 65397242 64173328 63276090 62593817 61869710 61519193 61300681
4545F1300681j73691j52584j1951R4680L88588N38870O25181P78810J089720J134634
$$ 61300681 61126990 60974406 60962455 61057135 61445723 61984593 62609774 63388584 64478304 65612938
4535F5612938R18915R78141J073751J338612J597837J685501J881818K240148
$$ 65612938 66531853 67509994 68583745 69922357 71520194 73205695 75087513 77327661
4527G7327661K449546K444258K713502L073208L665067M175038M744622N476118
$$ 77327661 79777207 82221465 84934967 88008175 91673242 95848280 100592902 106069020
4519A06069020O406503P412259Q386961R238632J0134453J0793668J1114445J1070890
$$ 106069020 112475523 119887782 128274743 137513375 147647828 158441496 169555941 180626831
4511A80626831J0122872Q766375P085798N501676L781036J912830j65427k539848
$$ 180626831 190749703 199516078 206601876 212103552 215884588 217797418 217631991 215092143
4503B15092143m447684n961047p088490p289060p126930o619584n820238m492654
$$ 215092143 210644459 204683412 197594922 190305862 183178932 176559348 170739110 166246456
4495A66246456l131905j840379n39277J51441q39313j640124r06212N00214J924984
$$ 166246456 163114551 161274172 160734895 160886336 160047023 158406899 157500687 158000901 159925885
4486A59925885K608932J908648Q39800m2296p45665o40062k68468L93878J517764
$$ 159925885 162534817 164443465 165283265 165240969 164495304 163855242 163586774 163980652 165498416
4477A65498416J605373l69488j967478j502416k73072K79485j3551k024403m023007
$$ 165498416 167103789 166734301 164766823 163264407 162991335 163270820 163257269 161232866 157209859
4468A57209859l795165k682558j581977j443376j978095k627622k540106l208709
$$ 157209859 153414694 150732136 149150159 147706783 145728688 143101066 140560960 137352251
4460A37352251m300604m788571m077919l273195k929365l757118n157303n509004
$$ 137352251 133051647 128263076 124185157 120911962 117982597 114225479 109068176 103559172
4452A03559172m958170m956491n617368n584426m949163m433176l861788l382152
$$ 103559172 98601002 93644511 88027143 82442717 77493554 73060378 69198590 65816438
4444F5816438l016631k681231k305270k071170j962473j743268j699473j610161
$$ 65816438 62799807 60118576 57813306 55742136 53779663 52036395 50336922 48726761
4436D8726761j617561j546075j476752j458678j406436j529590j335893j232912
$$ 48726761 47109200 45563125 44086373 42627695 41221259 39691669 38355776 37122864
4428C7122864j262711j178305j015722j017842r63254r25821q07724q31149p29226
$$ 37122864 35860153 34681848 33666126 32648284 31685030 30759209 29951485 29120336 28391110
4419B8391110p10962o96711o67114n89569n84889o57740o11756o51845n62755
$$ 28391110 27680148 26983437 26316323 25726754 25141865 24484125 23872369 23220524 22657769
4410B2657769o98596n84201o28490n74030m50202m98165m65555m11855m56871
$$ 22657769 21959173 21374972 20746482 20172452 19722250 19224085 18758530 18346675 17889804
4401A7889804m07865m07723m14171n00779l28954l49203l95693j64765k99587
$$ 17889804 17481939 17074216 16660045 16159266 15830312 15481109 15085416 14920651 14621064
4392A4621064l93156k06233l49096k44504l16687k65407k23047j88546j83932
$$ 14621064 14227908 14021675 13672579 13428075 13111388 12845981 12622934 12434388 12250456
4383A2250456k71280k88350k04350j69429K1835j91918j83748j26437p6282k48966
$$ 12250456 11979176 11690826 11486476 11317047 11338882 11146964 10963216 10836779 10760497 10511531
4373A0511531j81742k3927k27970k21959j19230j17602j22548j16622j73108j08209
$$ 10511531 10329789 10305862 10077892 9855933 9736703 9619101 9496553 9379931 9206823 9098614
4363I098614j21275r2772j14728j18114p9732j75158J33858j56184j3507L2200
$$ 9098614 8977339 8884567 8769839 8651725 8571993 8396835 8530693 8374509 8361002 8393202
4353H393202j82243n9015o9027p3983L2211r7315l8629k7834J9771j93306J90940
$$ 8393202 8210959 8151944 8082917 8008934 8041145 7943830 7905201 7877367 7897138 7703832 7894772
4342G894772N1496k1509k4994m595N8057J87196J23984j79202k14054j22583k1553
$$ 7894772 7946268 7924759 7899765 7895170 7953227 8140423 8264407 8085205 7871151 7748568 7727015
4331G727015j9441M897k8347L4308J9637j17399j62199l5957q4253p9886j71952
$$ 7727015 7707574 7712471 7684124 7718432 7738069 7620670 7458471 7422514 7338261 7258375 7086423
4320G086423o3831k29034j44987j59485j22927j28324o1152j8416k11568l5581
$$ 7086423 7022592 6793558 6648571 6489086 6366159 6237835 6176683 6158267 5946699 5911118
4310E911118M7280J0074r5068r6732M7523j03477q3579l7588M2044J5984j9553
$$ 5911118 5958398 5968472 5873404 5776672 5824195 5720718 5637139 5599551 5641595 5657579 5638026
4299E638026k483j8761k0720n4313J44077N4382m4400R5126J8063k1138M264k8779
$$ 5638026 5635543 5616782 5596062 5541749 5685826 5740208 5695808 5790934 5808997 5787859 5792123 5763344
4287E763344N4829J55123K8692K6211L9877M3914K5423J02446r455K6842j07M0853
$$ 5763344 5818173 5973296 6001988 6028199 6068076 6111990 6137413 6239859 6230404 6257246 6257139 6297992
4275F297992J1700m6218L1658J4932o7095J6685L7537m0481n3644K4035n9279
$$ 6297992 6309692 6263474 6295132 6310064 6242969 6259654 6297191 6256710 6203066 6227101 6167822
4264F167822L2834j57208N379K9481R125K5264j44690O5397l542r3348J17500
$$ 6167822 6200656 6043448 6048827 6078308 6087433 6112697 5968007 6033404 6029862 5936514 6054014
4253F054014J00714P8165l7134J5088Q5480l9336J00117Q3227l240R1905J38108
$$ 6054014 6154728 6232893 6195759 6210847 6296327 6256991 6357108 6440335 6437095 6529000 6667108
4242F667108J03297j8944P5065Q9017N1576o8083Q119J14370J22438M6452k6997
$$ 6667108 6770405 6751461 6826526 6915543 6967119 6899036 6907155 7021525 7143963 7190415 7163418
4231G163418M4790l5665J03067J08204L8922K40671P3691J34400J82061J41292
$$ 7163418 7208208 7172543 7275610 7383814 7422736 7663407 7737098 7871498 8053559 8194851
4221H194851K70192K65672L05747J90959P3642M5844j6191J81954R9395n9477
$$ 8194851 8465043 8730715 9036462 9227421 9301063 9346907 9330716 9512670 9612065 9552588
4211I552588j11112l2736j68790l5046j66434j62930j67746j53265K9039O5033
$$ 9552588 9441476 9408740 9239950 9204904 9038470 8875540 8707794 8554529 8583568 8648601
4201H648601k26891o4985K833q3459j80328q7555J4453j7982j12005j02185j3380
$$ 8648601 8421710 8356725 8359558 8276099 8095771 8008216 8022669 8004687 7892682 7790497 7777117
4190G777117n0994j94907k3646K0333P8418j09425j2407J28050K6945R2470r3614
$$ 7777117 7726123 7531216 7507570 7527903 7606321 7496896 7484489 7612539 7639484 7731954 7638340
4179G638340J4101N0228J53480N4511M7119L9684L1323K41593k5118K06972R5550
$$ 7638340 7652441 7702669 7856149 7910660 7957779 7997463 8028786 8270379 8245261 8452233 8547783
4168H547783J19924K13033J50325J51803J26167J37607J67975K93550K43217K54788
$$ 8547783 8667707 8880740 9031065 9182868 9309035 9446642 9614617 9908167 10151384 10406172
4158A0406172K75983K97546K23342K71828K96129L67673K23482L78640L20742
$$ 10406172 10682155 10979701 11203043 11474871 11771000 12138673 12362155 12740795 13061537
4149A3061537L20048L18717K97564L03876L65667M73731L23788L41257M33154
$$ 13061537 13381585 13700302 13997866 14301742 14667409 15141140 15464928 15806185 16239339
4140A6239339K90346K45152O05446M51986N45278O52063N44113P96301P94156
$$ 16239339 16529685 16774837 17380283 17832269 18377547 19029610 19573723 20370024 21164180
4131B1164180Q95905Q04428J009241J009012J057210J083351J095748R73255R51486
$$ 21164180 22060085 22864513 23873754 24882766 25939976 27023327 28119075 29092330 30043816
4122C0043816Q00942O11323N15455K57710M6521L6848k87091k94074n18290m67854
$$ 30043816 30844758 31456081 31971536 32229246 32275767 32312615 32025524 31731450 31213160 30745306
4112C0745306o48711p30361p88910q08797q19575o88947p40618o05395o91534
$$ 30745306 30096595 29366234 28577324 27768527 26948952 26260005 25519387 24913992 24222458
4103B4222458m88877m09433n46203l30896k16794j86690p5283k13997o2616j05224
$$ 24222458 23733581 23324148 22777945 22447049 22230255 22043565 21968282 21754285 21691669 21586445
4093B1586445R7133M8963K4721J28665J70517Q0041K16289J94769K81412K40922
$$ 21586445 21683578 21732541 21757262 21885927 22056444 22136485 22352774 22547543 22828955 23069877
4083B3069877K33051J45712K32790K91573K72815K36078M68304K39647M47917
$$ 23069877 23302928 23448640 23681430 23973003 24245818 24481896 24950200 25189847 25637764
4074B5637764K87345N41567M74527N97703N62536O68563P07226Q06315P48751
$$ 25637764 25925109 26466676 26941203 27538906 28101442 28770005 29477231 30283546 31032297
4065C1032297R23475Q67861R79584R64916J128890J053233J212214J228713J388852
$$ 31032297 31955772 32823633 33803217 34768133 35897023 36950256 38162470 39391183 40780035
4056D0780035J334062J471152J523450J593126J787820J719344J766373J983693
$$ 40780035 42114097 43585249 45108699 46701825 48489645 50208989 51975362 53959055
4048E3959055K008193J993278K003760K229827K255495K272394K354715K450872
$$ 53959055 55967248 57960526 59964286 62194113 64449608 66722002 69076717 71527589
4040G1527589K571004K618652K666432K811257K983942L084639L410844L866842
$$ 71527589 74098593 76717245 79383677 82194934 85178876 88263515 91674359 95541201
4032I5541201M259224M513234M865177N153390N594489N791452O083375O359618
$$ 95541201 99800425 104313659 109178836 114332226 119926715 125718167 131801542 138161160
4024A38161160O405438O477210O618340O848908P286061P182320P062608O823701
$$ 138161160 144566598 151043808 157662148 164511056 171797117 178979437 186042045 192865746
4016A92865746P108931P326981P647783P692263P914979P931470Q195222P934791
$$ 192865746 199974677 207301658 214949441 222641704 230556683 238488153 246683375 254618166
4008B54618166P823394P190669O986349N897501M979727L969742K156404n65369
$$ 254618166 262441560 269632229 276618578 282516079 287495806 291465548 293621952 293056583
4000B93056583j023784j579419j285844k065018k552932l727974k190136j589937
$$ 293056583 292032799 290453380 289167536 287102518 284549586 280821612 278631476 277041539
3992B77041539p75659O8345L613427O397012J2946567J8233121K2711206K5362425
$$ 277041539 276265880 276334225 279947652 286344664 299291231 317524352 340235558 365597983
3984C65597983L9556893J4856322j6659334l898200P134325J4783137J3034252
$$ 365597983 405154876 420011198 403351864 399453664 406587989 421371126 434405378
3977D34405378j9129214l6024658k0699180j7991493l6100523m0070334k8800724
$$ 434405378 415276164 379251506 358552326 340560833 304460310 264389976 235589252
3970B35589252k3333054j7879571j5794906j2669138j2169655j0164901q936284
$$ 235589252 212256198 194376627 178581721 165912583 153742928 143578027 134641743
3963A34641743p078089p094260o144208n819361m899430m745776l937950m060310
$$ 134641743 127563654 120469394 114325186 108505825 103606395 98860619 94922669 90862359
3955I0862359l585640l537388l139980l193691k671259k873778k429659k357833
$$ 90862359 87276719 83739331 80599351 77405660 74734401 71860623 69430964 67073131
3947F7073131j830691j994122j626936j713997j330397j372338j059273j121883
$$ 67073131 65242440 63248318 61621382 59907385 58576988 57204650 56145377 55023494
3939E5023494p11141r26375o65071o85847n11973m94504l44922l92830k87895
$$ 55023494 54312353 53385978 52720907 52035060 51523087 51028583 50683661 50290831 50002936
3930E0002936k01756j01511k32569j57078k31815P61k65548k31039m07035m94275
$$ 50002936 49801180 49699669 49467100 49310022 49078207 49078968 48813420 48582381 48175346 47681071
3920D7681071k57453m24161m65765l99391l23483l88140l40762j65578p11J27170
$$ 47681071 47423618 46999457 46533692 46134301 45810818 45422678 45081916 44916338 44915627 45042797
3910D5042797L44609O52968R60003J580945K014833K450992L075126L673963M029825
$$ 45042797 45387406 46040374 47000377 48581322 50596155 53047147 56122273 59796236 63826061
3901F3826061K172912L79492N42910P89497M65831j246418l207576l878569m343340
$$ 63826061 65998973 66378465 66921375 67710872 68176703 66930285 63722709 59844140 55500800
3892E5500800m985054m537644l681573l125899k563014k111793j647996j496023
$$ 55500800 50515746 45978102 42296529 39170630 36607616 34495823 32847827 31351804
3884C1351804j317147j251051j212545r22435q69501p77415o41708n82710n03100
$$ 31351804 30034657 28783606 27571061 26648626 25779125 25001710 24360002 23777292 23274192
3875B3274192n82463m62424l61235m40130k58038l21198l03018j09209k06242
$$ 23274192 22691729 22229305 21868070 21427940 21169902 20848704 20545686 20436477 20230235
3866B0230235j57782j96846J91205N6539O8417J44443J66085L19873M34982N55909
$$ 20230235 20072453 19875607 20066812 20123351 20191768 20336211 20502296 20822169 21257151 21813060
3856B1813060M38826K40132J72014K70701N00856M50436J62248J65086L95106
$$ 21813060 22251886 22492018 22664032 22934733 23435589 23886025 24048273 24213359 24608465
3847B4608465K80173K84590M06987N72209P83995Q99830Q19305J085474Q87034
$$ 24608465 24888638 25173228 25580215 26152424 26936419 27836249 28655554 29741028 30628062
3838C0628062J050697R31109J178468J105723J337189J339831J551227J488834
$$ 30628062 31678759 32609868 33788336 34894059 36231248 37571079 39122306 40611140
3830D0611140J716836J705987J887087K094609K137611K364058K611211K517983
$$ 40611140 42327976 44033963 45921050 48015659 50153270 52517328 55128539 57646522
3822E7646522K759998K867645L013467L322568L380299L684507L996578M653283
$$ 57646522 60406520 63274165 66287632 69610200 72990499 76675006 80671584 85324867
3814H5324867N167876N649653O638329P612096R081743J0763952J3042176J5705227
$$ 85324867 90492743 96142396 102780725 110392821 119474564 130238516 143280692 158985919
3806A58985919J8990322K2270831K5291689K6865480K5818371J9141891J2033513
$$ 158985919 177976241 200247072 225538761 252404241 278222612 297364503 309398016
3799C09398016Q784647O277062J49517q732826j5076611j8753206k2226039k3158555
$$ 309398016 318182663 324459725 324609242 315876416 300799805 282046599 259820560 236662005
3791B36662005k1516087j8576644j5740782j3376666j1520517j0159614q945471
$$ 236662005 215145918 196569274 180828492 167451826 155931309 145771695 136826224
3784A36826224p992656p379679o918726o593352o205859n963969n575466n293200
$$ 136826224 128833568 121453889 114535163 107941811 101735952 95771983 90196517 84903317
3776H4903317m846712m521460m136401l959205l550908l276675l077801k875000
$$ 84903317 80056605 75535145 71398744 67439539 63888631 60611956 57534155 54659155
3768E4659155k677563k316471k149270k009779j821322j687364j504992j356352
$$ 54659155 51981592 49665121 47515851 45506072 43684750 41997386 40492394 39136042
3760C9136042j323563j238437j130361j062898r97464r95089q57752q88000q78475
$$ 39136042 37812479 36574042 35443681 34380783 33383319 32388230 31530478 30642478 29764003
3751B9764003o46312p64654n95277o66002l77654m00771n45644n97972n50739
$$ 29764003 29117691 28353037 27757760 27091758 26714104 26313333 25767689 25169717 24618978
3742B4618978m13061l84823n68172o54938n63117n51768n11233o12382n56419
$$ 24618978 24205917 23821094 23252922 22597984 22034867 21483099 20971866 20359484 19803065
3733A9803065l67044m73248l80315k87842k65905l29512k07019l25494k15391
$$ 19803065 19436021 18962773 18582458 18294616 18028711 17699199 17492180 17166686 16951295
3724A6951295l88573k05007k43518k49469k27349k77848j50740j61097k24053
$$ 16951295 16562722 16357715 16114197 15864728 15637379 15359531 15208791 15047694 14823641
3715A4823641j13644k04780Q390k97032j41816j48697k61725k47910k25211j30592
$$ 14823641 14709997 14505217 14513607 14216575 14074759 13926062 13664337 13416427 13191216 13060624
3705A3060624k65493k62180k19522k20344k14757k09053k65533k20719j09222
$$ 13060624 12795131 12532951 12313429 12093085 11878328 11669275 11403742 11183023 11073801
3696A1073801l43521k73930j39629k80927j79729j79980k77054k87752l42558
$$ 11073801 10730280 10456350 10316721 10035794 9856065 9676085 9399031 9111279 8768721
3687H768721j48772k48030k02783l31329k35151k06240j41963j29019j52261j00667
$$ 8768721 8619949 8371919 8169136 7837807 7602656 7396416 7254453 7125434 6973173 6872506
3677F872506N9454n4050o9464j63417K469r3479j35480j90651q4741j05415n0898
$$ 6872506 6931960 6877910 6808446 6645029 6647498 6554019 6418539 6227888 6143147 6037732 5986834
3666E986834j99656N423j99900o5279j70810J66r1933j31211j7766n493j10015
$$ 5986834 5787178 5792601 5592701 5527422 5356612 5356778 5264845 5133634 5115868 5110375 5000360
3655E000360n5899o1958O0729k7236p3899Q951n643j1864L5410J81383j2975L8715
$$ 5000360 4944461 4882503 4943232 4915996 4842097 4851048 4845405 4833541 4868951 5050334 5037359 5076074
3643E076074J27979q8964J27271L01865K00899K79772L03924O63613O21250Q72530
$$ 5076074 5204053 5115089 5242360 5544225 5745124 6024896 6328820 6992433 7613683 8486213
3633H486213J140206L67330j09216L64941K78023j4891o65285l91639p93166r23357
$$ 8486213 9626419 9993749 9884533 10249474 10527497 10512606 9847321 9455682 8662516 7739159
3623G739159o59190n41741l30292k29475k54519k03468j42066r2179j49508J3673
$$ 7739159 7079969 6538228 6207936 5978461 5723942 5520474 5378408 5286229 5136721 5150394
3613E150394p9958j83318j16841p5948q6956J08962j50184k07174j19806l7870
$$ 5150394 5070436 4887118 4770277 4694329 4607373 4716335 4566151 4358977 4239171 4201301
3603D201301j31127j14472q629j39748p7737P1993P456o9407n2272Q9939L2208
$$ 4201301 4070174 3955702 3947073 3807325 3729588 3801581 3809037 3739630 3687358 3777297 3809505
3592C809505j081m8354O4994j2152j18359K8580M5557J38748j12696n5060N8844
$$ 3809505 3808424 3760070 3825064 3812912 3694553 3723133 3768690 3907438 3794742 3739682 3798526
3581C798526M5112N4004N0918L8767J14808J00509J67903P7156J82669J46681
$$ 3798526 3843638 3897642 3948560 3987327 4102135 4202644 4370547 4447703 4630372 4777053
3571D777053J7979L1642M3009n3148j32798o7871j83439l2817j63666K8789k13480
$$ 4777053 4795032 4826674 4869683 4816535 4683737 4615866 4432427 4399610 4235944 4264733 4051253
3560D051253l3982k7037p0339j01491m119j35616k6384l0558K4672j00103Q4259
$$ 4051253 4017271 3990234 3919895 3818404 3814285 3678669 3652285 3621727 3646399 3546296 3630555
3549C630555P984K2253n0090L5835M607p1506M7330Q7542J8895j88601j5132n1795
$$ 3630555 3638539 3660792 3610702 3646537 3651144 3579638 3626968 3714510 3733405 3544804 3529672 3477877
3537C477877L2508Q414K5356k6511k6427k4168P1194o1981k0856P2213n105j58138
$$ 3477877 3510385 3518799 3544155 3517644 3491217 3467049 3538243 3476262 3455406 3527619 3522514 3364376
3525C364376n1434j15138P7689R2755l2242N8189j52162J1302m9727j9685j12536
$$ 3364376 3312942 3197804 3275493 3368248 3336006 3394195 3242033 3253335 3203608 3183923 3071387
3514C071387J2666n1071l8152j6460K561k5532n7605n6305j72973j0626j5351
$$ 3071387 3084053 3032982 2994830 2978370 2980931 2955399 2897794 2841489 2668516 2657890 2642539
3503B642539q9345k4135P0041J546q9822K3068k1857o7737K5753l7824M7924j10870
$$ 2642539 2553194 2529059 2599100 2600646 2510824 2533892 2512035 2444298 2470051 2432227 2480151 2369281
3491B369281j22451N9352q540O2691J21197J63976J5023J432j08112k370Q712
$$ 2369281 2246830 2306182 2297642 2360333 2481530 2645506 2660529 2661961 2553849 2551479 2560191
3480B560191l8625o6017j06080l9749j21967M7181j02050j4837m1496l6398n8725
$$ 2560191 2521566 2455549 2349469 2309720 2187753 2234934 2132884 2118047 2076551 2040153 1981428
3469A981428j17096p842M3746q0282j1025p485m3887n6062q9479j15725L8628
$$ 1981428 1864332 1856490 1900236 1819954 1808929 1801444 1757557 1701495 1612016 1496291 1534919
3458A534919k4169J33184m5609L2695N6022j22626k1205m1355j01271L387K3324
$$ 1534919 1510750 1643934 1598325 1631020 1687042 1564416 1543211 1501856 1400585 1403972 1427296
3447A427296Q1232L577m6564M66R081q4357R8062L088j8854o7720n5566L5771
$$ 1427296 1508528 1512105 1465541 1466007 1475088 1390731 1488793 1491881 1473027 1405307 1349741 1385512
3435A385512j8556o6520n0029O578M5082M634P6734p7757r4078Q9860J1820o6787
$$ 1385512 1366956 1300436 1250407 1256985 1302067 1306701 1383435 1305678 1211600 1301460 1313280 1246493
3423A246493k7424N0964P3308j58560J18614k0143q5456N2624m5626Q537J3991
$$ 1246493 1219069 1270033 1343341 1184781 1303395 1283252 1197796 1250420 1204794 1213331 1227322
3412A227322p2074k0513N9174k2632O1269L9004q5247J2217k8545K1443r044m1337
$$ 1227322 1155248 1134735 1193909 1171277 1232546 1271550 1186303 1198520 1169975 1191418 1182374 1141037
3400A141037o5987K2799J09150l3482k9011j22187m5945Q1754J5526j0777j22669
$$ 1141037 1075050 1097849 1206999 1173517 1144506 1022319 976374 1058128 1073654 1062877 940208
3389I40208j39892N0791J00625n8162J03321L8160L897M997q2903n9413l640L4282
$$ 940208 800316 851107 951732 893570 996891 1035051 1038948 1043945 961042 901629 897989 932271
3377I32271R6031j12663n5165J11383j4640K8970o9489K3684J8293j0874l0742
$$ 932271 1028302 915639 860474 971857 957217 986187 916698 940382 958675 947801 917059
3366I17059j38597N5446O9354n651k9580k4042O1679m6058l649o5133J6167n995
$$ 917059 778462 833908 903262 897611 868031 843989 905668 859610 855961 790828 806995 801000
3354H01000n564O9147n6038L3187k7051j60997L5482L1857J3350m7578P2175k4391
$$ 801000 795436 864583 808545 841732 814681 653684 689166 721023 734373 686795 758970 734579
3342G34579L192k6883Q5182p8770j04985J3018k2253P0687o1184n8315K0547O7086
$$ 734579 737771 710888 796070 717300 612315 625333 603080 673767 612583 554268 574815 641901
3330F41901M3018J5147J1360p316P317j6133o2986J09872l2609j47402p507L4038
$$ 641901 684919 700066 711426 704110 711427 695294 632308 742180 709571 562169 554662 588700
3318E88700P501n1979M6541P3778o224j26246O0643o6111j24321J18975L3672
$$ 588700 596201 544222 590763 664541 658317 532071 592714 526603 402282 521257 554929
3307E54929O0269n7804k4315k6455J2401N6537p7975L2856m6748k7971o9627N9736
$$ 554929 615198 557394 533079 506624 519025 575562 497587 530443 483695 455724 386097 445833
3295D45833o183j6079o7666l6327L4330l3485O8149N4467r8866J4725j8586J52923
$$ 445833 439650 423571 355905 319578 353908 320423 388572 443039 344173 358898 340312 493235
3283D93235r8358k4168K0333k8088L0887L9342l8752K8984p5425L1583p8394N6370
$$ 493235 394877 370709 391042 362954 393841 433183 394431 423415 347990 379573 301179 357549
3271C57549J253k7989o0432O3626l7954r1771R6495L8929l498l6962K9910N29
$$ 357549 358802 330813 270381 334007 296053 204282 300777 339706 336208 299246 329156 329685
3259C29685P9196j28267k2291Q5877L0156n071q6148O2591m3193M450m294O5610
$$ 329685 408881 280614 258323 344200 374356 369285 283137 345728 302535 306985 302691 368301
3247C68301o6782O1038n7085L6737J6364K6128l5072l540R4204L058j15747r8055
$$ 368301 301519 362557 305472 342209 358573 384701 349629 346089 440293 443351 327604 229549
3235B29549J20590o0260k095m5125q4720J5846J29363l5620M2580n9262L4961
$$ 229549 350139 289879 287784 242659 157939 173785 303148 267528 310108 250846 285807
3224B85807n6245k7813Q020n0708O2101Q6956k6077n2353l2774J34944K2583K2314
$$ 285807 229562 201749 209769 159061 221162 308118 282041 229688 196914 331858 354441 376755
3212C76755k1623j00090q5594O9544j5995K0396N0769j998q2751P7930q527l746
$$ 376755 355132 255042 169448 238992 222997 243393 294162 292164 209413 287343 278816 275070
3200B75070M69O7378m9755Q5843j32999l9502O1798N3380O8775r7873K4621M6536
$$ 275070 275539 342917 293162 379005 246006 206504 268302 321682 390457 292584 317205 363741
3188C63741m0846r7956N7975J07445q5168P0844J18124j9330r7650M0098l6176
$$ 363741 322895 224939 282914 390359 305191 376035 494159 474829 377179 417277 381101
3177C81101N3447n3367R818J403Q7308r5739k9902p7129J34390o6794J3908J6114
$$ 381101 434548 381181 390999 392402 479710 383971 354069 276940 411330 344536 358444 374558
3165C74558L9613j3556K1845P5859n6783m3951Q6104J11050n0729l5283j2552
$$ 374558 414171 400615 422460 498319 441536 397585 483689 594739 544010 508727 496175
3154D96175L233K738q3560J01165J314L0201P1250L3250l500o0652m889P0185
$$ 496175 499408 502146 418586 519751 521065 551266 622516 655766 652266 591614 586725 656910
3142F56910R3772q5699R8734o1294K242q1650M598n907M6043K3953L139n8777
$$ 656910 750682 664983 763717 702423 704665 623015 627613 621706 667749 691702 694841 636064
3130F36064K0183j05406R0585j2152N8184L9169j7615j0248N5496O6943o0846
$$ 636064 656247 550841 641426 629274 687458 726627 709012 698764 754260 821203 760357
3119G60357J9666K0614n9921J08608j3547j4070o0192n1485o5673J46369m6695
$$ 760357 780023 800637 740716 849324 835777 821707 761515 710030 644357 790726 744031
3108G44031o3189L2234L4146K7934q2526j2634O9263q9859n5227J12237R4855
$$ 744031 680842 713076 747222 775156 692630 679996 749259 659400 604173 716410 811265
3097H11265L4329q1357o2458j0202J7016j147L6973K50m4676J9446l4478j6573
$$ 811265 845594 764237 701779 691577 708593 707446 744419 744669 699993 719439 684961 668388
3085F68388j39997J22436m8112J5773l2855k3616n0493O877l4488J0231r781J5820
$$ 668388 528391 650827 602715 618488 585633 562017 511524 518401 483913 494144 484363 500183
3073E00183J09600j7410l8447n8943p9648O5781k623l9846j1904J5331L9145k2333
$$ 500183 609783 592373 553926 494983 415335 481116 478493 438647 426743 442074 481219 458886
3061D58886L169n7904L8837m9591k0706P2318m6874j8532j3122N447K8306l7418
$$ 458886 462055 404151 442988 393397 372691 445009 398135 379603 366481 371928 400234 362816
3049C62816J01951m326r189K4725n4577J8189J9902R263q6746j06736J15496k9028
$$ 362816 464767 460441 451252 475977 421400 439589 459491 468754 382008 275272 390768 361740
3037C61740O3774n3244J18412O2084j1640n7853m420J27316j4683l6774q429o6392
$$ 361740 425514 372270 490682 552766 541126 483273 478853 606169 591486 554712 546283 479891
3025D79891M6609q0568N2329j0515L8710O6196l3848P0490m2726K0493k9692O896
$$ 479891 526500 445932 498261 487746 526456 592652 558804 629294 586568 607061 577369 584265
3013E84265J05798n864p6558O7707J7176m3611N0970n4588L9152Q3786J02811
$$ 584265 690063 684199 607641 675348 692524 648913 699883 645295 684447 768233 871044
3002H71044k8821n3320P077O7377m3119M5564O6070N4409J00466j2558p985j1040
$$ 871044 842223 788903 795980 863357 820238 865802 931872 986281 1086747 1074189 1066204 1055164
2990A055164M637N8703O1551n9579O2926K9457j7655J87369L0309o2292k2121
$$ 1055164 1059801 1118504 1180055 1120476 1183402 1212859 1195204 1382573 1412882 1350590 1328469
2979A328469O5088R1131J08576P5406N3907J5650l1183J28129J3508M5756k069
$$ 1328469 1393557 1484688 1593264 1668670 1722577 1738227 1707044 1835173 1848681 1894437 1892368
2968A892368J79494K31671K9367k3142J44489N4158J23687Q8589J15489J04605
$$ 1892368 2071862 2303533 2332900 2309758 2454247 2508405 2632092 2720681 2836170 2940775
2958B940775J17603J91496Q6085J88225M9255J56246Q7813J43203K07413K12079
$$ 2940775 3058378 3249874 3335959 3524184 3573439 3729685 3817498 3960701 4168114 4380193
2948D380193N6689J63227L48456L22543J85119L13866L29793M17957M18600M25038
$$ 4380193 4436882 4600109 4948565 5271108 5456227 5770093 6099886 6517843 6936443 7361481
2938G361481M96338O38257O13135M41388N46226N81556M97392L68860L81717K39067
$$ 7361481 7857819 8496076 9109211 9550599 10096825 10678381 11175773 11544633 11926350 12165417
2928A2165417O7627q1297m9741K162k3587j98164k29189J7532j42861j56450q1235
$$ 12165417 12233044 12151747 12102006 12104168 12080581 11882417 11653228 11670760 11527899 11371449 11290214
2917A1290214k05767j85608l12218l89854n49679m63178o56328m93192n25208
$$ 11290214 11084447 10898839 10586621 10196767 9647088 9183910 8527582 8034390 7509182
2908G509182n87106n70765l84872m52381k49907k54878k64981k64476j73800j80226
$$ 7509182 6922076 6351311 5966439 5514058 5264151 5009273 4744292 4479816 4306016 4125790
2898D125790j71008j03095k21425n3302j14427J7334q611J3903M2396J58003P1238
$$ 4125790 3954782 3851687 3630262 3576960 3462533 3479867 3471256 3485159 3527555 3685558 3756796
2887C756796K85871M33421J02420k79523j08041l0374Q2478J20436J86359P8152
$$ 3756796 4042667 4476088 4578508 4298985 4190944 4160570 4243048 4363484 4549843 4627995
2877D627995k92566j59708l8995j29865j66376k61810l5236n623m7913n2238J03716
$$ 4627995 4335429 4175721 4136726 4006861 3840485 3578675 3543439 3537816 3489903 3437665 3541381
2866C541381L33241K31010M84684M40245N49074n8041l91156k7629R4630J63630
$$ 3541381 3874622 4105632 4590316 5030561 5579635 5521594 5130438 5102809 5197439 5361069
2856E361069K33979L61820j75977m54899l16688j92802m6285l82161n79523l91252
$$ 5361069 5595048 5956868 5780891 5325992 5009304 4816502 4770217 4388056 3808533 3417281
2846C417281l01371k15382k9459n6470L6898P190Q9599L47463J43488j54231k43302
$$ 3417281 3115910 2900528 2871069 2814599 2851497 2858687 2948286 3295749 3439237 3285006 3041704
2835C041704n0747k3887P4157K05807J09202k12026l74648j60178l3385o2339
$$ 3041704 2990957 2967070 3041227 3247034 3356236 3144210 2769562 2609384 2575999 2513660
2825B513660j75232l23630j73157j82428k42541q7019k9544j76733o324r3097
$$ 2513660 2338428 2014798 1841641 1659213 1416672 1329653 1300109 1123376 1117052 1023955
2815A023955m1041l4371k0278J0001r1310k9101j2682M9045J9866L1072n8115
$$ 1023955 982914 948543 928265 938266 846956 817855 805173 854218 874084 905156 847041
2804H47041j04914j05829Q1554p7636n879k3736l3996J26313j42745j9512R236
$$ 847041 742127 636298 717852 640216 634337 610601 576605 702918 560173 540661 549897
2793E49897Q9545r0939l4229l7315p3746k0054j2067K1517q497N8164o053l0067
$$ 549897 639442 548503 514274 476959 403213 383159 371092 392609 384112 442276 436223 406156
2781D06156K7492q0862p8749L6916o0557J01412L2343K2405j26000N258O5172
$$ 406156 433648 352786 274037 310953 250396 351808 384151 406556 280556 285814 350986
2770C50986o555J16007K7982j02949j59588Q3065N1492j3398r9202m7548J17504
$$ 350986 344431 460438 488420 385471 225883 308948 360440 347042 247840 200292 317796
2759C17796Q494l1693k4469R7314n5117j28297N0255P5280k9909L3714L7530n738
$$ 317796 326290 294597 270128 367442 312325 184028 234283 309563 279654 313368 350898 345160
2747C45160n8165N8972m8868J4406K0403m5162O3945l3677K8116M7747q0932J9693
$$ 345160 286995 345967 297099 311505 331908 286746 350691 317014 345130 392877 311945 331638
2735C31638o9205J28826q380j35899O8309J4259P122o9562Q7943o9612j2423P5099
$$ 331638 262433 391259 382879 246980 315289 329548 336670 267108 355051 285439 273016 348115
2723C48115J3481O6623o8092l2849J60007k7484p6895Q1399L2388j88617J19723
$$ 348115 361596 428219 360127 327278 487285 459801 382906 464305 496693 308076 427799
2712D27799Q3180M0205K2393M31R916R5409m1351j3702J88645l5621J16298k2751
$$ 427799 510979 551184 573577 574008 583924 679333 637982 624280 812925 777304 893602 870851
2700H70851R7899K2495J04429N7321o0349m0783N6493M2151r6774P5377m6015
$$ 870851 968750 991245 1095674 1152995 1092646 1051863 1108356 1150507 1053733 1129110 1083095
2689A083095J4167m4k8591J79437l7533l5063J40155O50Q3317R2449O0656J03329
$$ 1083095 1097262 1097218 1068627 1248064 1210531 1175468 1315623 1316273 1399590 1492039 1552695 1656024
2677A656024J41581k6056j80197R115J600j55669L1742j53816j9528r9198r3596
$$ 1656024 1797605 1771549 1591352 1600467 1602067 1446398 1478140 1324324 1304796 1205598 1112002
2666A112002L5314k5164K1300j112o5372k8712O4254j72509M7974R8005q0143
$$ 1112002 1147316 1122152 1143452 1142340 1076968 1048256 1112510 940001 987975 1085980 1005837
2655A005837L9296n4557k181O5939K8996j00060q2649J1454k6593q977j15065
$$ 1005837 1045133 990576 988395 1054334 1083330 983270 900621 912075 885482 876505 761440
2644G61440m210r4171j6672K2653K1779j81744K0049K3246l9541j64389P9459
$$ 761440 757230 663059 646387 669040 690819 509075 529124 552370 512829 348440 427899
2633D27899L0943l0330k1269q1782j00314M3958O0688N0839l6595j25819Q688
$$ 427899 458842 428512 407243 325461 225147 269105 329793 380632 344037 218218 226906
2622B26906K8395J49204N9600r1180j02113r7570j23584K1516O2041j2207O0690
$$ 226906 255301 404505 464105 372925 270812 173242 49658 71174 133215 121008 181698
2611A81698N0748p4132J8991R3445j6538j67692L3637K3082L4320r2667n5537
$$ 181698 232446 158314 177305 270750 254212 86520 120157 143239 177559 84892 29355
2600B9355k2233L9179K3205n175k4978M3279l3507N5807N2026j6244k5286r1544
$$ 29355 7122 46301 69506 64331 39353 82632 49125 104932 156958 140714 115428 23884
2588B3884q0644N7661j0946K334O3266o1309L0904N6370o2828j09666K21875M080
$$ 23884 -56760 901 -10045 -7711 55555 -5754 25150 81520 18692 -90974 130901 134981
2576A34981p6053k6051l2580O4801J2594l5416l2015K1089m997N3642o8027J3316
$$ 134981 58928 32877 297 65098 77692 42276 10261 31350 26353 79995 11968 25284
2564B5284o2274Q5775k9134L0078N6765j00446q2692N8614K214k5265o8394J07879
$$ 25284 -36990 48785 19651 49729 106494 6048 -76644 -18030 -15816 -41081 -109475 -1596
2552a596L9980r5245n4250K0119J19459M6144n2194q5984J4191j7558l3547O6653
$$ -1596 38384 -56861 -111111 -90992 28467 74611 22417 -63567 -49376 -66934 -100481 -33828
2540c3828q0627j03280L4273L1797O9654j241p0439Q5613J0981j4678J57315o1661
$$ -33828 -114455 -217735 -183462 -151665 -82011 -83252 -153691 -68078 -57097 -71775 85540 23879
2528B3879j08386J2303Q9234n2001j9100K5362J0282n0497N9945L8698j33173
$$ 23879 -84507 -72204 17030 -34971 -54071 -28709 -18427 -68924 -8979 29719 -103454
2517a03454l0497Q7570L0960r8437l6473J33230k3150l3634j0848K8011M1551
$$ -103454 -133951 -46381 -15421 -113858 -150331 -17101 -40251 -73885 -84733 -56722 -15171
2506a5171o9169R0772n5201p2746P2380p2690l015L6724j12288J1590J35014J84
$$ -15171 -84340 6432 -48769 -121515 -49135 -121825 -124840 -88116 -200404 -188814 -53800 -53616
2494e3616k7759M1956L0812k5955l6357M8484N1096l3104o0775J3493J00341n2041
$$ -53616 -81375 -39419 -8607 -34562 -70919 -22435 28661 -4443 -65218 -51725 48616 -3425
2482c425p9190m4834L0432q926N3581L602l1597R2070p2255n3068l5362J07523
$$ -3425 -82615 -127449 -97017 -105943 -52362 -48760 -80357 11713 -60542 -113610 -148972 -41449
2470d1449o1560q2317l3987N5050O0662J6852Q6988L422R682k7772j1422n7931
$$ -41449 -103009 -185326 -219313 -164263 -103601 -86749 239 3661 13343 -14429 -25851 -83782
2458h3782M0370J166N715j7045l710N1384p9077p7268J10456l0684j4200L6790
$$ -83782 -43412 -42246 -36531 -53576 -57286 -5902 -84979 -162247 -51791 -82475 -96675 -59885
2446e9885q3952O6979R93K2177j1735l0791J16880l6234o7191j5475n4335m6063
$$ -59885 -143837 -76858 -75865 -53688 -65423 -96214 20666 -15568 -82759 -98234 -152569 -198632
2434a98632J06040j7661j5334k1586j4395L0211N1523o4513J35889q4598j3969
$$ -198632 -92592 -110253 -125587 -147173 -161568 -131357 -79834 -144347 -8458 -93056 -107025
2423a07025k0331N7429N4742j18071l7856L1391l4511M0222P5126K5983j11138
$$ -107025 -127356 -69927 -15185 -133256 -171112 -139721 -174232 -134010 -58884 -32901 -144039
2412a44039R11O0121K1075K6533k9479j2845L0419r1797Q9251m5186K4684O1553
$$ -144039 -143128 -83007 -61932 -35399 -64878 -77723 -47304 -139101 -49850 -95036 -70352 -8799
2400h799o6792J0940m1605O0099J6614J26440q0580o1764m6772j053J4270K7804
$$ -8799 -75591 -64651 -106256 -46157 -29543 96897 16317 -45447 -92219 -93272 -79002 -51198
2388e1198k0786j5454O6104q8997J0599J83072m2957r3498N287j5082r4288R0563
$$ -51198 -71984 -87438 -21334 -110331 -99732 83340 40383 -53115 -47828 -62910 -157198 -66635
2376f6635l1045L3424m883n7442K4751m8239O7J9690J4261K9531O8857o8855L7245
$$ -66635 -97680 -64256 -69139 -126581 -101830 -150069 -150002 -130312 -116051 -86520 -17663 -86518 -49273
2363d9273P0686n1074K9195l9053Q182O4283n2864p0387n0349K9260N7108Q250
$$ -49273 21413 -29661 -466 -39519 -31337 32946 -19918 -90305 -140654 -111394 -54286 -46036
2351d6036j26677o9196k7337Q0235J15001j41570J24370N2340J1170j06178O1007
$$ -46036 -172713 -241909 -269246 -189011 -74010 -215580 -91210 -38870 -27700 -133878 -72871
2340g2871o2559L6675O4298n5385m5270J6428k0976J2340O413Q7947n5540o4195
$$ -72871 -135430 -98755 -34457 -89842 -135112 -118684 -139660 -127320 -120907 -32960 -88500 -152695
2328a52695m5155M4370n163l5479Q7340L3211j11482Q0847R0080R56j46243K3442
$$ -152695 -197850 -153480 -158643 -194122 -106782 -73571 -185053 -104206 -14126 -13170 -159413 -135971
2316a35971J36674q256k9028j13596J01583K8405N2208q7441j21004n280J30741
$$ -135971 703 -7553 -36581 -150177 -48594 -20189 32019 -55422 -176426 -181706 -50965
2305e0965m46l8657j869N4423Q8632j02407k0033j23352R5646p0875j7909P2759
$$ -50965 -51411 -90068 -91937 -37514 51118 -51289 -71322 -194674 -99028 -169903 -187812 -115053
2293a15053o378J30007J9294L3141q3077n9372q8119R1591R212J14665l1284k2745
$$ -115053 -121431 8576 27870 61011 -22066 -81438 -169557 -77966 -68754 45911 14627 -8118
2281h118O6551m5828k7948l9175j8704k0374j2687L9422J3128J9095N3527N2943
$$ -8118 58433 12605 -15343 -54518 -73222 -93596 -106283 -66861 -53733 -34638 18889 71832
2269G1832j03161j1575j9865J26970L8320n2995j8757o5378n9334N672k1714J6491
$$ 71832 -31329 -42904 -62769 64201 102521 49526 30769 -34609 -93943 -88271 -109985 -93494
2257i3494o6349k3860P3908k6393O1762N231m799M2739m0264o6959K8100N6514
$$ -93494 -159843 -183703 -109795 -136188 -74426 -69195 -73994 -31255 -71519 -138478 -110378 -53864
2245e3864n9736L1810J2475l0532M2166k4631M2838m6032P3950l4717R041O2676
$$ -53864 -113600 -81790 -69315 -99847 -57681 -82312 -39474 -85506 -11556 -46273 -37232 25444
2233B5444p8828K0891P6368n0784J9865j143N3850j21610j8017M2252r3743L6090
$$ 25444 -53384 -32493 43875 -6909 12956 11813 65663 -55947 -73964 -31712 -125455 -89365
2221h9365Q5677j4692m6969o4191K295k3059j9092J09337k4091K2549J6752J3341
$$ -89365 -3688 -18380 -65349 -129540 -127245 -150304 -169396 -60059 -84150 -61601 -44849 -31508
2209c1508M9958M3407O658q0198n0681M9599q820J3595l7146j2479J33975p3635
$$ -31508 18450 61857 68515 -11683 -62364 -12765 -21585 -7990 -45136 -57615 76360 2725
2197B725m7113J1156L6802N5961j43347L8547l4082N0732L4872K2490j2950P4027
$$ 2725 -44388 -33232 3570 59531 -83816 -45269 -79351 -28619 6253 28743 15793 89820
2185H9820o3627p1807Q8027j35347L1754J0193j39659J09019L8086o758R522j4802
$$ 89820 26193 -45614 42413 -92934 -61180 -50987 -190646 -81627 -43541 -50299 -40777 -55579
2173e5579J0360N0072P8056j08069R7252J0993p5116j9146p3434O7226o0452R4260
$$ -55579 -45219 4853 82909 -25160 72092 83085 7969 -11177 -84611 -17385 -77837 16423
2161A6423j16014J40206l4880L9272k8113n7291L0185M0643M8192o5887m4751
$$ 16423 -99591 40615 5735 45007 16894 -40397 -10212 30431 78623 12736 -32015
2150c2015N9203o1174J38288l2905o2623R5456R19k4504k2359r0010P7207K7762
$$ -32015 27188 -33986 104302 71397 8774 104230 105149 80645 58286 -31724 45483 73245
2138G3245O3559J4134K1604O6805p6180N5629M0148K5706j00135J34558R3037
$$ 73245 136804 150938 172542 239347 163167 218796 258944 284650 184515 319073 412110
2127D12110N2658j16264l6451l8548J66305L1628l6147L2582P7400R2080j0759
$$ 412110 464768 348504 312053 273505 439810 471438 435291 467873 545273 637353 626594
2116F26594j3802J16202N4248Q6873O9657M9942r3576M4508J62031J34869M1014
$$ 626594 612792 728994 783242 870115 939772 989714 896138 940646 1102677 1237546 1278560
2105A278560J48426Q9842K8847J02594P3144N5212J74407K15064J00802J00753
$$ 1278560 1426986 1516828 1545675 1648269 1721413 1776625 1951032 2166096 2266898 2367651
2095B367651K83074K08101K69205K74622L75861L41117L83846N93705P86012J144290
$$ 2367651 2650725 2858826 3128031 3402653 3778514 4119631 4503477 5097182 5883194 7027484
2085G027484J660076J675825K826578J600319l81335N55520o61092j451916j701512
$$ 7027484 8687560 10363385 13189963 14790282 14408947 14964467 14303375 12851459 11149947
2076A1149947k355356j552018r31788p91264n96712n03742n60545l65227m22090
$$ 11149947 8794591 7242573 6310785 5519521 4922809 4419067 3858522 3493295 3071205
2067C071205k91676k58816l09134j77996j52887j23861r2394r5051k39276r835
$$ 3071205 2779529 2520713 2211579 2033583 1880696 1756835 1664441 1569390 1330114 1320279
2057A320279n2089j08030K954j67505q2739m6068M3036j09376m7002j11556p1250
$$ 1320279 1268190 1160160 1163114 995609 912870 866802 909838 800462 753460 641904 570654
2046E70654K4395O4113q4105q5102K1020P2587j2569r6349P6414k0180j18777
$$ 570654 595049 659162 575057 489955 510975 583562 570993 474644 551058 530878 412101
2035D12101l904P3775j38084j3842j0442L5997J2682m3575m2887N4895l0557o5433
$$ 412101 408197 481972 343888 330046 319604 355601 368283 324708 281821 336716 306159 240726
2023B40726O6115j23353k1884M9740m1280J53101m3083j4832j4658j00744K5779
$$ 240726 306841 183488 161604 211344 170064 323165 280082 265250 250592 149848 175627
2012A75627j3055J4093r0109O8665N7264l0218M9167l3789j16751j7141J08845
$$ 175627 162572 176665 86556 155221 212485 182267 231434 197645 80894 63753 172598
2001A72598l6761K6285K0017k7697r9639M1101j4078j35943P8864J5683k2930
$$ 172598 135837 162122 182139 154442 54803 95904 81826 -54117 24747 40430 17500
1990A7500P7955M255M4720j04721k0834J3322K9618p1446L0290p10l445j9923
$$ 17500 95455 99710 144430 39709 18875 32197 61815 -9631 20659 19949 16504 -3419
1978c419J3406L476j0324m866L4868n1471l747p926n2102P336O5748O6727m5018
$$ -3419 9987 13463 3139 -1727 33141 -18330 -22077 -30003 -82105 -74769 -9021 57706 12688
1965A2688L1104L9596p5878j5667p979j44399J35609J0445l331J5726k8281n1364
$$ 12688 43792 83388 7510 -8157 -16136 -160535 -24926 -14481 -17812 -2086 -30367 -81731
1953h1731j2200L3504J11455q5823j7663J766K5647L1246K4217k9483q5659N9335
$$ -81731 -93931 -60427 51028 -34795 -52458 -50692 -25045 6201 30418 935 -84724 -25389
1941b5389M8109j04620Q5260L4531r7886J30490m567k6457K505j05676m7661Q0590
$$ -25389 22720 -81900 3360 37891 -59995 70495 65928 39471 41976 -63700 -111361 -30771
1929c0771m0513J64164n5058k9311n9669J6543r7153J27253l8384j2886m233K2415
$$ -30771 -71284 92880 37822 8511 -51158 -34615 -131768 -4515 -42899 -55785 -60018 -37603
1917c7603P2047m3951l9364k7498J19488o9956n3744r123L2111k797J2493N5464
$$ -37603 34444 -9507 -48871 -76369 43119 -26837 -80581 -89704 -57593 -60390 -47897 7567
1905G567n4096K3808k1200L4839j3503l6070k2809j6474j5843N4527J15709p8583
$$ 7567 -46529 -22721 -43921 -9082 -22585 -58655 -81464 -97938 -113781 -59254 56455 -22128
1893b2128r0892k8534J32023j2023N8383k4971j2521p4957O249N8564k8117n3097
$$ -22128 -113020 -141554 -9531 -21554 36829 11858 -663 -75620 -69371 -10807 -38924 -92021
1881i2021L190M1129M3866P2862o3370N6580N7041m0777k5940j56548K9558J31336
$$ -92021 -88831 -47702 -3836 69026 5656 62236 119277 78500 52560 -103988 -74430 56906
1869E6906q5471o2555P7108R9334j15952m8609N0295p367M2881k7260m4595J3854
$$ 56906 -28565 -91120 -14012 85322 -30630 -79239 -28944 -36311 6570 -20690 -65285 -51431
1857e1431n5892N4191L8408j18115l5339M6142M0462N0468K9248n7695l324k50
$$ -51431 -107323 -53132 -14724 -132839 -168178 -122036 -81574 -31106 -1858 -59553 -62877 -63127
1845f3127l7729L7205q2316P6065J23714o1646J5675q32J0217j04173Q4430j9746
$$ -63127 -100856 -63651 -145967 -69902 53812 -7834 7841 7009 17226 -86947 -2517 -22263
1833b2263p575O085q730k2391m7476n6523J35799J7802J1364J2607l6568R137
$$ -22263 -29838 -23753 -32483 -54874 -102350 -158873 -23074 -5272 6092 18699 -17869 -8732
1821h732L9875l5561m0393L6091m343o3433N5213J1144r1150N9528j13005O412
$$ -8732 31143 -4418 -44811 -8720 -13063 -76496 -21283 -10139 -101289 -41761 -154766 -148354
1809a48354J11281n4809M4485o394o4479M1255Q177m7910N0043l5238N2709m7057
$$ -148354 -37073 -91882 -47397 -53791 -118270 -77015 -68838 -116748 -66705 -101943 -49234 -96291
1797i6291q54Q5613M5107j28502Q601n468o9P8065m7194m7662Q9345R766L995
$$ -96291 -97145 -11532 33575 -94927 -86326 -91794 -91863 -13798 -60992 -108654 -19309 -9543 -5548
1784e548k155l7441K2529p6360J13836P294o5231m0493j332P8975r7533Q2030
$$ -5548 -7703 -45144 -22615 -98975 14861 22155 -43076 -83569 -84901 -5926 -103459 -21429
1772b1429L8556m8519K3818o2033R9935J8968r5219j4209p4654N2652m670J6527
$$ -21429 17127 -31392 -7574 -69607 30328 49296 -45923 -60132 -134786 -82134 -86804 -70277
1760g0277n6232m5237J84242l0172J5891o1674J05154n7311o1265l7670N0401
$$ -70277 -126509 -171746 12496 -17676 -1785 -63459 41695 -15616 -76881 -114551 -64150
1749f4150J22900p9226p4446R7152o7590j5810q006K1002K2065L5466m8544p3149
$$ -64150 58750 -20476 -94922 2230 -65360 -81170 -89176 -68174 -46109 -10643 -59187 -132336
1737a32336Q4269P1499M5117n8482k0292q6043M6197m49K1684n7556k1505J06680
$$ -132336 -48067 23432 68549 10067 -10225 -96268 -50071 -50520 -28836 -86392 -107897 -1217
1725a217k4079n7853k5512P0454r598q9950M9416L2277m9492J08052P234j57r0994
$$ -1217 -25296 -83149 -108661 -38207 -47805 -137755 -88339 -56062 -105554 2498 9732 9575 -81419
1712h1419k4997P9153j4175l6922o088p169O026N6919O7385o0962l6055k2578
$$ -81419 -106416 -27263 -41438 -78360 -84448 -91617 -85591 -28672 38713 -22249 -58304 -80882
1700h0882p7831O7653Q1374j32089J1851l7990P3429r887p7625J4086J14806R8315
$$ -80882 -158713 -91060 -9686 -141775 -129924 -167914 -94485 -104372 -181997 -167911 -53105 45210
1688D5210n616p4431q9522R6803j9910R9362m2891o9408j0911j7210K8954N1984
$$ 45210 39594 -34837 -124359 -27556 -47466 51896 9005 -60403 -71314 -88524 -59570 -7586
1676g586q2146p577K9669l9356P6172j8762n5303k1126N5320Q85Q6452j79773
$$ -7586 -89732 -97309 -67640 -106996 -30824 -49586 -104889 -126015 -70695 -69810 16642 -163131
1664a63131P4285j8112L1941M9784j9765l9377R759L6280R151J2006p8222j2818
$$ -163131 -88846 -106958 -75017 -25233 -44998 -84375 -74616 -38336 -29185 -17179 -95401 -108219
1652a08219J4133l6895M9571j4579N8783K202r401M5893K8983o0731k12097J15787
$$ -108219 -94086 -130981 -81410 -95989 -37206 -35004 -44405 1488 30471 -30260 -242357 -126570
1640a26570J0454M6982l739O0802p9625P518q2345J24380j1620m6708Q3003K2074
$$ -126570 -116116 -69134 -72873 -12071 -91696 -84178 -166523 -42143 -53763 -100471 -17468 4606
1628D606k2333M712n9441o5307m062l184l0241J9801R8056o6309J6324K5205j1603
$$ 4606 -17727 -13015 -72456 -137763 -141825 -145009 -175250 -155449 -57393 -123702 -107378 -82173 -93776
1615i3776k3358J79500j1847o0228o9921k6820o31q9004L6792M8287J2234J9286
$$ -93776 -117134 62366 50519 -9709 -79630 -106450 -107081 -196085 -159293 -111006 -98772 -79486
1603g9486O399M8195p9566J8348r801J3499N8603p9147m5859O3110Q0275m0627
$$ -79486 -73087 -24892 -104458 -86110 -95911 -82412 -23809 -102956 -148815 -85705 -5430 -46057
1591d6057N5214K8981o3180J8564J18670l7035o7906n5522l9090P79O5448o4039
$$ -46057 9157 38138 -25042 -6478 112192 75157 7251 -48271 -87361 -86582 -21134 -85173
1579h5173M0071j003m2226K0570j157J06948k497K0326o0069L4227m5767m881
$$ -85173 -45102 -46105 -88331 -67761 -68918 38030 35533 55859 -4210 30017 -15750 -20631
1567b0631l1207k6374M8452m0644N0880m4966J6878n2869O7292k0274K1820k8844
$$ -20631 -51838 -78212 -29760 -70404 -19524 -64490 -47612 -100481 -33189 -53463 -31643 -60487
1555f0487P7298J945J5905o9770j08288l00M0182q3010N6405J23928q3184q6338
$$ -60487 16811 18756 34661 -35109 -143397 -143697 -103515 -186525 -130120 -6192 -89376 -175714
1543a75714J8662J29243P5599m8716Q531l4194j03466L4985J06056r1068K46k4973
$$ -175714 -157052 -27809 47790 -926 7605 -26589 -130055 -95070 10986 -80082 -79836 -104809
1531a04809j9973P9227P4610k1938k8090j0866J9341J5838k7033N928k720J72147
$$ -104809 -124782 -45555 29055 7117 -20973 -31839 -12498 3340 -23693 -17765 -20485 151662
1519A51662r4896j02614M182k029K12J9362n1386n2910m6320L6667J08449r1158
$$ 151662 56766 -45848 -41666 -43695 -43483 -24121 -75507 -128417 -174737 -138070 -29621 -120779
1507a20779L7506J13117Q5526k20800M0519R6325K9751K6599n4452p2359n365
$$ -120779 -83273 29844 115370 -105430 -64911 31414 61165 87764 33312 -39047 -44412
1496d4412n6174J6933K7673Q5668j5779Q56R637n8345M5621q3686L8906j270M8800
$$ -44412 -100586 -83653 -55980 29688 13909 14765 24402 -33943 11678 -72008 -33102 -34372 14428
1483A4428j06512K1019L2459O6072L802n7704j19478P9214j03510O8506j5881
$$ 14428 -92084 -71065 -38606 27466 31268 -26436 -145914 -66700 -170210 -101704 -117585
1472a17585O0570o1848J21925o8014n4687L3038L0738O8620l9941N401J6480m3450
$$ -117585 -57015 -118863 3062 -64952 -119639 -86601 -55863 12757 -27184 -21783 -5303 -48753
1460d8753J16357J5375o5328p1062p3976J29627o8825j0795l2744N3880O5360
$$ -48753 67604 82979 17651 -53411 -127387 2240 -66585 -77380 -110124 -56244 9116
1449I116Q5190q3469j20583N8390J6712p3798J9821J09358m5585l7071K7361l7958
$$ 9116 94306 10837 -109746 -51356 -34644 -108442 -88621 20737 -24848 -61919 -34558 -72516
1437g2516Q198j6017l5306J1171L6825P2698M206j3335j33760l4157N6150M2533
$$ -72516 -64318 -80335 -115641 -104470 -67645 5053 9259 -4076 -137836 -171993 -115843 -73310
1425g3310l103J00150j634j21371k1445l55R6464Q7318p1157M6066m3261q3828
$$ -73310 -76413 23737 22103 -99268 -120713 -121068 -24604 62714 -8443 37623 -5638 -89466
1413h9466Q8602l6999M3786q3013n8902J07589l9342r3606P9541p2233L0986l0385
$$ -89466 -864 -37863 5923 -77090 -135992 -28403 -67745 -161351 -81810 -154043 -123057 -153442
1401a53442O3316P739J7453J9219J9147J4276k2058p5588O5252k4241L3253O696
$$ -153442 -90126 -82387 -64934 -45715 -26568 -12292 -34350 -109938 -44686 -68927 -35674 -28978
1389b8978J5456K6369j14413P2873j3248K7913o556N962J12244q5829R721m1236
$$ -28978 -13522 12847 -101566 -28693 -41941 -14028 -20584 -14622 97622 11793 21514 -19722
1377a9722m7335M3072q2047j9880Q1266J25272r6011k3084J01665l3348o0307
$$ -19722 -67057 -23985 -106032 -125912 -44646 80626 -15385 -38469 63196 29848 -30459
1366c0459j3587j5053l3042N7260O955J4670K9119l7286J33690q2904l162o3011
$$ -30459 -44046 -59099 -92141 -34881 -27926 -13256 15863 -21423 112267 29363 26201 -36810
1354c6810K806O782k1494R552J211L1602M7134k9023p3720L2291L7927J7511n2624
$$ -36810 -34004 -27222 -48716 -39164 -37953 -6351 40783 11760 -61960 -29669 8258 25769 -26855
1341b6855q8121J04995r371J5312l8191l2010P0239n4392p3597K6868O0607M9256
$$ -26855 -114976 -9981 -19352 -4040 -42231 -74241 -4002 -58394 -131991 -105123 -44516 4740
1329D740M2049p7361P4704o589j22265K3842o601L4119J7214j04809P23P6116
$$ 4740 46789 -30572 44132 37543 -84722 -60880 -67481 -33362 -16148 -120957 -120234 -44118
1317d4118m4476L642M5272N3062J2787r8065N4347Q647R462n8390m6515Q1132
$$ -44118 -88594 -84952 -39680 13382 26169 -71896 -17549 -8902 560 -57830 -104345 -23213
1305b3213K2368N128P9321r0522L295K7775o3230j9924Q7590l7457J3124n9909
$$ -23213 -845 4283 83604 -6918 -3623 24152 -39078 -59002 28588 -8869 4255 -55654
1293e5654o5708J35109r1523j08027J08102O4133M4751k5273k5658q7769j5446
$$ -55654 -121362 13747 -77776 -185803 -77701 -13568 31183 5910 -19748 -107517 -122963
1282a22963K8353O2485j5805p7318P0724P8751m3723j4952N2831l9456m0803J5464
$$ -122963 -94610 -32125 -47930 -125248 -54524 24227 -19496 -34448 18383 -21073 -61876 -46412
1270d6412k7329L4360K3636j0701m5171M2144k4132j8781n235L3741K3153J10335
$$ -46412 -73741 -39381 -15745 -26446 -71617 -29473 -53605 -72386 -77621 -43880 -20727 89608
1258H9608j4787j42849M4747j5319l485L0108p0177M5329O6223l5127j8876l0455
$$ 89608 74821 -68028 -23281 -38600 -42085 -11977 -82154 -36825 29398 -5729 -24605 -55060
1246e5060K096J1271L2969k6522m5999J710M4911L6377L207n9010o6584k0438
$$ -55060 -52964 -41693 -8724 -35246 -81245 -79535 -34624 1753 4960 -54050 -120634 -141072
1234a41072J25018J660o1856K613q926J1309q7508R3277R7342p9941J4254O1064
$$ -141072 -16054 -14394 -76250 -73637 -82563 -71254 -158762 -65485 31857 -48084 -33830 27234
1222B7234N585j1637n7837K9670K5136n2082J36479j12541J04239n5847r798K0951
$$ 27234 32819 21182 -36655 -6985 18151 -33931 102548 -9993 94246 38399 28601 49552
1210D9552o9007p7808m0430R5156R284M596L0408K24L781R533r3612M3621O3431
$$ 49552 -19455 -97263 -137693 -42537 -33253 -28657 1751 1975 5756 15289 -78323 -34702 28729
1197B8729l6380n2466J20293Q494L2606o1621n2099n4376L7209k381n535Q271
$$ 28729 -7651 -60117 60176 68670 101276 39655 -12444 -66820 -29611 -31992 -37527 -29256
1185b9256K928L9259Q1149R770q6026L376j30929j9532P9411M8712m9814k4299
$$ -29256 -26328 12931 94080 103850 17824 21200 -109729 -129261 -49850 -1138 -50952 -75251
1173g5251P03K7258J6474P1884k8424J6330m5220j01878K8442L3299P2166j9400
$$ -75251 -74548 -47290 -30816 41068 12644 28974 -16246 -118124 -89682 -56383 15783 -3617
1161c617J4380O5840k3677n2091r5202k5040L4570M4545q5120L4860L2152N4519
$$ -3617 10763 76603 52926 835 -94367 -119407 -84837 -40292 -125412 -90552 -58400 -3881
1149c881r920j1974n2623J9296R3460m7237J00758j58283K2450Q3745l2787j3645
$$ -3881 -13801 -25775 -78398 -59102 34358 -12879 87879 -70404 -47954 35791 3004 -10641
1137a0641M5639m766m0881j1215p36p6482K3932J41809P8784p4187m8374L0503
$$ -10641 34998 30232 -10649 -21864 -22600 -99082 -75150 66659 145443 71256 22882 53385
1125E3385j17662O5231r0908J21244j6439j1712o804M8613r8046L3409M3988K3450
$$ 53385 -64277 954 -89954 31290 14851 3139 -3665 44948 -53098 -19689 24299 47749
1113D7749r5114n6704k052q627Q9485o3120J1449Q8481O643m8293O588n367k2232
$$ 47749 -47365 -104069 -106121 -114748 -25263 -88383 -76934 11547 18190 -30103 -23515 -28882 -51114
1100e1114P241j7372j668J4361J39790J503r6009K2450j2970R5198p1221m1475
$$ -51114 -43873 -61245 -62913 -48552 91238 92741 -3268 19182 6212 101410 30189 -11286
1088a1286j0573k9270P8780R2642k3183j12639j21556O7453L2247K6388O4713
$$ -11286 -21859 -51129 27651 120293 97110 -15529 -137085 -69632 -37385 -10997 53716
1077E3716q0231J18907J8708j31773o297k9067l4185l0200O3281l0671N7946k8946
$$ 53716 -26515 92392 111100 -20673 -26970 -56037 -90222 -120422 -57141 -87812 -29866 -58812
1065e8812K5684p6622Q3134M0069J9799l5428m7981Q6496k2463m1523L4293j3367
$$ -58812 -33128 -109750 -26616 13453 33252 -2176 -50157 36339 13876 -27647 6646 -6721
1053f721o3632K1021k3357Q0468n7270M3418l5357K115O6892j24707M3420J700
$$ -6721 -70353 -49332 -72689 7779 -49491 -6073 -41430 -39315 27577 -97130 -53710 -52010
1041e2010Q3525K0668j38784P310r5785N6728J32643j7287P8780o3100n3296m6558
$$ -52010 31515 52183 -86601 -79291 -175076 -118348 14295 -2992 75788 12688 -40608 -87166
1029h7166M4188K3392L234J65j2615l7604Q6322k974O4887J8944o3034m2081j283
$$ -87166 -42978 -19586 -16352 -16187 -28802 -66406 19916 16942 81829 100773 37739 -4342 -5625
1016e625N6732l795K8705m3064Q825O6309k5258o078l6909L3542L3483k1839j3130
$$ -5625 51107 47312 76017 32953 41778 108087 82829 76751 39842 73384 106867 85028 71898
1003G1898j2778j47173m081Q1440O8352K4113j31033M4398m3207n0194Q1971J6895
$$ 71898 59120 -88053 -92134 -10694 57658 81771 -49262 -4864 -48071 -98265 -16294 601
991F01M2582j09241Q7461K9661l1471l3875M4663o1891P8294O235K8352j5702
$$ 601 43183 -66058 21403 51064 19593 -14282 30381 -31510 46784 53019 81371 65669
979F5669K9659n4772j19487N9209N6866J4722m3180L0114k4516n6823k9111J16413
$$ 65669 95328 40556 -78931 -19722 37144 51866 8686 38800 14284 -42539 -71650 44763
967D4763p8197R4363J6426m3354q6521J2106l2179J1010j11876J02638R6259k1227
$$ 44763 -33434 60929 77355 34001 -52520 -40414 -72593 -61583 -173459 -70821 25438 4211
955D211J6342m0582R6480J05200j09753q444L1054p0848O53o4416K6407L7754
$$ 4211 20553 -20029 76451 181651 71898 63454 94508 23660 24313 -40103 -13696 24058
943B4058P7105l7482L0307q6305K3782o3381n1313J40314O0803o0928r2394J2183
$$ 24058 101163 63681 93988 7683 31465 -31916 -83229 57085 117888 56960 -35434 -23251
931b3251n4108N3516k0688O0643j8408k3185K4936M4873O6816r957l9957m3734
$$ -23251 -77359 -23843 -44531 16112 -2296 -25481 -545 44328 111144 101187 61230 17496
919A7496k1525j05736j6879J92261m2538p1180N9279O0165p2108L3279q9160J2207
$$ 17496 -4029 -109765 -126644 65617 23079 -48101 11178 71343 -765 32514 -56646 -44439
907d4439n2895N0475K3035o2363o1073J13981n4696P3703L1712J77P1L266L3869
$$ -44439 -97334 -46859 -23824 -86187 -147260 -33279 -87975 -14272 17440 17617 17688 20954 54823
894E4823k3885l1230L6728m5453p1288J92648l2625k4059J02979j76285J6756
$$ 54823 30938 -292 36436 -9017 -80305 112343 79718 55659 158638 -17647 -891
883h91p7682k6193P7903k6127R7791k9256j0842l7152J9947k1571N7295j3913
$$ -891 -78573 -104766 -26863 -52990 44801 15545 4703 -32449 -12502 -34073 23222 9309
871I309L598L3025M777p349j2966M2015p0268J6984R8448k9832p5433m1873P4691
$$ 9309 12907 45932 50709 43360 30394 72409 2141 19125 117573 87741 12308 -29565 45126
858D5126q430j0506j01626Q9910j5369K6863m1841J23238o7155m9690K3518j0331
$$ 45126 36696 26190 -75436 14474 -895 25968 -15873 107365 40210 -9480 14038 3707
846C707Q318q833k3667L306J24082n1063N0533K0899K6472j8387K26r6205l0347
$$ 3707 12025 3192 -20475 -17169 106913 55850 106383 127282 153754 135367 135593 39388 9041
833I041O4649J7160l898p9227l9353m7823N6706k3673K5255L8295j6494j2573
$$ 9041 73690 90850 86952 7725 -31628 -79451 -22745 -46418 -21163 17132 638 -11935
821a1935O6635o892n1880J62376o3202n0641q4161J24518q2214k6125Q2784j4365
$$ -11935 54700 47808 -4072 158304 95102 44461 -39700 84818 2604 -23521 59263 44898
809D4898K4039o172n9788M7407L8854r0454O3103l8344j8801N1060l3958o388
$$ 44898 68937 62765 2977 50384 89238 -1216 61887 23543 4742 55802 21844 15456
797A5456j6470l7944p7441J00132J8115j4529Q4792n0856J1754o8660M1741o6021
$$ 15456 -1014 -38958 -116399 -16267 1848 -12681 72111 21255 33009 -35651 6090 -59931
785e9931N5000P6456j8978K2614j8746J6344j6111L321K4851J9511j5686l9068
$$ -59931 -4931 71525 52547 75161 56415 72759 56648 59969 84820 104331 88645 49577
773D9577O042r67J4689o457N82j12696J01801N6879K9636k3872k7249j17589R3082
$$ 49577 55619 54652 69341 62884 63466 -49230 52571 109450 139086 115214 87965 -29624 63458
760F3458p9366L2294k4028L8858r4331Q0563J16251k1356n4138K6569l0698K9607
$$ 63458 -15908 16386 -7642 31216 -63115 17448 133699 112343 58205 84774 54076 83683
748H3683m4576j26227J22225l2613J25455m6243p9246m2654J16389p5997k1320
$$ 83683 39107 -87120 35105 2492 127947 81704 2458 -40196 76193 196 -21124
$$ [...]
##END NTUPLES=NMR SPECTRUM
##END=
