##TITLE=1H_CG-1215-1
 CDCl3
 8 sc, 
 29.10.2024
##JCAMPDX= 6.0         $$ Bruker NMR JCAMP-DX V2.0
##DATA TYPE= NMR SPECTRUM
##DATA CLASS= NTUPLES
##ORIGIN= UXNMR, Bruker Analytische Messtechnik GmbH
##OWNER= root
$$ XWIN-NMR		Version 3.5
$$ Tue Oct 29 14:39:22 2024 Russian Standard Time (UT+4h)  she@DPX200
##.OBSERVE FREQUENCY= 200.1318
##.OBSERVE NUCLEUS= ^1H
##.ACQUISITION MODE= SIMULTANEOUS
##.ACQUISITION SCHEME= undefined
##.AVERAGES= 8
##.DIGITISER RES= 18
##SPECTROMETER/DATA SYSTEM= spect
##.PULSE SEQUENCE= zg30
##.SOLVENT NAME= CDCl3
##.SHIFT REFERENCE= (INTERNAL, CDCl3, 0, 21.0208)
##AUDIT TRAIL= $$ (NUMBER, WHEN, WHO, WHERE, WHAT)
$$ ##TITLE= Audit trail, XWIN-NMR		Version 3.5
$$ ##JCAMPDX= 5.01
$$ ##ORIGIN= Bruker BioSpin GmbH
$$ ##OWNER= she
$$ F:/spectra/data/she/nmr/H-F/1/pdata/1/auditp.txt
$$ ##AUDIT TRAIL=  $$ (NUMBER, WHEN, WHO, WHERE, WHAT)
(   1,<2024-10-29 14:38:16.56 +0400>,<she>,<DPX200>,
      <created by zg, POWCHK disabled, PULCHK disabled
       configuration hash MD5:
       00 E9 B6 7A A2 85 ED C7 34 08 36 98 17 FE 4E 26
       data hash MD5: 16K
       7D 68 36 ED 1B EF E7 90 E1 8C A0 AC C2 E4 A9 6C>)
(   2,<2024-10-29 14:38:18.79 +0400>,<she>,<DPX200>,
      <Start of raw data processing
       efp BC_mod = 2 LB = 0.24 FT_mod = 6 PKNL = 1 PHC0 = -26504.95 PHC1 = 9.98743 SI = 16K 
       data hash MD5: 16K
       8D 3D 78 60 B0 BB 32 64 E2 A4 39 BA B9 46 A1 86>)
(   3,<2024-10-29 14:38:32.95 +0400>,<she>,<DPX200>,
      <pk PHC0 = -0.5901226 PHC1 = 0 
       data hash MD5: 16K
       C6 F6 66 B0 3C D7 36 7A C5 C4 30 29 A0 CC 41 E0>)
(   4,<2024-10-29 14:38:36.23 +0400>,<she>,<DPX200>,
      <abs ABSG = 5 
       data hash MD5: 16K
       34 0E FE 7C C9 2E 2B 02 13 A1 76 6D 1A 24 7A 01>)
$$ ##END=
$$ 
$$ hash MD5
$$ 04 47 15 E5 0E 67 88 5F D9 A2 26 92 75 A7 61 E0
##$RELAX= 
##$RELAX= 
##$RELAX= 
##$RELAX= 
##$RELAX= 
##$RELAX= 
$$ Bruker specific parameters
$$ --------------------------
##$DU= <F:/spectra>
##$EXPNO= 1
##$NAME= <H-F>
##$PROCNO= 1
##$TYPE= <nmr>
##$USER= <she>
##$AMP= (0..31)
100 100 100 100 100 100 100 100 100 100 100 100 100 100 100 100 100 100 
100 100 100 100 100 100 100 100 100 100 100 100 100 100 
##$AQSEQ= 0
##$AQ_mod= 1
##$AUNM= <au_zg>
##$AUTOPOS= <>
##$BF1= 200.13
##$BF2= 200.13
##$BF3= 200.13
##$BF4= 200.13
##$BF5= 200.13
##$BF6= 200.13
##$BF7= 200.13
##$BF8= 200.13
##$BYTORDA= 1
##$CFDGTYP= 0
##$CFRGTYP= 5
##$CHEMSTR= <none>
##$CNST= (0..31)
1 1 145 1 1 1 1 1 1 1 1 1 1 1 1 1 1 1 1 1 1 1 1 1 1 1 1 1 1 1 1 1 
##$CPDPRG= <>
##$CPDPRG1= <>
##$CPDPRG2= <>
##$CPDPRG3= <>
##$CPDPRG4= <mlev>
##$CPDPRG5= <mlev>
##$CPDPRG6= <mlev>
##$CPDPRG7= <mlev>
##$CPDPRG8= <mlev>
##$CPDPRGB= <>
##$CPDPRGT= <>
##$D= (0..31)
0 1.2 0 0 0 0 0 0 0 0.06 0 0.03 0 0 0 0 0.0002 0 0 0 0 0 0 0 0 0 0 0 0 
0 0 0 
##$DATE= 1730198295
##$DBL= (0..7)
120 120 120 120 120 120 120 120 
##$DBP= (0..7)
150 150 150 150 150 150 150 150 
##$DBP07= 0
##$DBPNAM0= <>
##$DBPNAM1= <>
##$DBPNAM2= <>
##$DBPNAM3= <>
##$DBPNAM4= <>
$$ [...]
##$SUBNAM3= <"">
##$SUBNAM4= <"">
##$SUBNAM5= <"">
##$SUBNAM6= <"">
##$SUBNAM7= <"">
##$SUBNAM8= <"">
##$SUBNAM9= <"">
##$SW= 24.0689170037331
##$SWIBOX= (0..15)
0 0 2 0 0 0 0 0 0 0 0 0 0 0 0 0 
##$SW_h= 4816.95568400771
##$TD= 16384
##$TD0= 1
##$TE= 0
##$TE2= 300
##$TE3= 300
##$TEG= 300
##$TL= (0..7)
0 120 120 120 120 120 120 120 
##$TP= (0..7)
150 150 150 150 150 150 150 150 
##$TP07= 0
##$TPNAME0= <>
##$TPNAME1= <>
##$TPNAME2= <>
##$TPNAME3= <>
##$TPNAME4= <>
##$TPNAME5= <>
##$TPNAME6= <>
##$TPNAME7= <>
##$TPOAL= (0..7)
0.5 0.5 0.5 0.5 0.5 0.5 0.5 0.5 
##$TPOFFS= (0..7)
0 0 0 0 0 0 0 0 
##$TUNHIN= 0
##$TUNHOUT= 0
##$TUNXOUT= 0
##$USERA1= <user>
##$USERA2= <user>
##$USERA3= <user>
##$USERA4= <user>
##$USERA5= <user>
##$V9= 5
##$VALIST= <valist>
##$VCLIST= <CCCCCCCCCCCCCCC>
##$VD= 0
##$VDLIST= <DDDDDDDDDDDDDDD>
##$VPLIST= <PPPPPPPPPPPPPPP>
##$VTLIST= <TTTTTTTTTTTTTTT>
##$WBST= 1024
##$WBSW= 4
##$XGAIN= (0..3)
0 0 0 0 
##$XL= 0
##$YL= 0
##$YMAX_a= 148039
##$YMIN_a= -242862
##$ZGOPTNS= <>
##$ZL1= 120
##$ZL2= 120
##$ZL3= 120
##$ZL4= 120
##$ABSF1= 21.01201
##$ABSF2= -3.057123
##$ABSG= 5
##$ABSL= 3
##$ALPHA= 0
##$AQORDER= 0
##$ASSFAC= 0
##$ASSFACI= 0
##$ASSFACX= 0
##$ASSWID= 0
##$AUNMP= <proc_1d>
##$AZFE= 0.1
##$AZFW= 0.1
##$BCFW= 0
##$BC_mod= 2
##$BYTORDP= 0
##$COROFFS= 0
##$CY= -3
##$DATMOD= 1
##$DC= 0
##$DFILT= <>
##$DTYPP= 0
##$F1P= 0
##$F2P= 0
##$FCOR= 1
##$FTSIZE= 16384
##$FT_mod= 6
##$GAMMA= 0
##$GB= 0
##$INTBC= 1
##$INTSCL= 3.70164e-10
##$ISEN= 128
##$LB= 0.24
##$LEV0= 0
##$LPBIN= 0
##$MAXI= 10000
##$MC2= 0
##$MEAN= 0
##$ME_mod= 0
##$MI= 1.114404
##$NCOEF= 0
##$NC_proc= -7
##$NLEV= 6
##$NOISF1= 3.799351
##$NOISF2= 2.8
##$NSP= 0
##$NTH_PI= 0
##$NZP= 0
##$OFFSET= 21.02083
##$PC= 1
##$PHC0= -26505.54
##$PHC1= 9.98743
##$PH_mod= 1
##$PKNL= yes
##$PPARMOD= 0
##$PSCAL= 0
##$PSIGN= 0
##$REVERSE= no
##$SF= 200.130001579384
##$SI= 16384
##$SIGF1= 3
##$SIGF2= 2
##$SINO= 5.538805
##$SIOLD= 16384
##$SREGLST= <1H.CDCl3>
##$SSB= 0
##$STSI= 16384
##$STSR= 0
##$SW_p= 4816.95568400771
##$SYMM= 0
##$S_DEV= 0
##$TDeff= 16384
##$TDoff= 0
##$TI= <>
##$TILT= no
##$TM1= 0
##$TM2= 0
##$TOPLEV= 0
##$USERP1= <user>
##$USERP2= <user>
##$USERP3= <user>
##$USERP4= <user>
##$USERP5= <user>
##$WDW= 1
##$XDIM= 16384
##$YMAX_p= 328138285
##$YMIN_p= -1530474
$$ End of Bruker specific parameters
$$ ---------------------------------
##NTUPLES= NMR SPECTRUM
##VAR_NAME=  FREQUENCY,     SPECTRUM/REAL,   SPECTRUM/IMAG
##SYMBOL=    X,             R,               I
##VAR_TYPE=  INDEPENDENT,   DEPENDENT,       DEPENDENT
##VAR_FORM=  AFFN,          ASDF,            ASDF
##VAR_DIM=   16384,         16384,           16384
##UNITS=     HZ,            ARBITRARY UNITS, ARBITRARY UNITS
##FACTOR=    0.29402158847633, 1,            1
##FIRST=     4206.89877200383, 0,            0
##LAST=      -610.056912003884, 0,           0
##MIN=       -610.056912003884, -1530474,    0
##MAX=       4206.89877200383, 328138285,    0
$$ Real data points
##PAGE= N=1
##DATA TABLE= (X++(R..R)), XYDATA
$$ [...]
$$ plain form
7064 11161453 11158565 11316961 11423205 11683238 11888314 12288568 12432410 12649423 12957083 13452363
7054 13452363 13975617 14610972 15124278 15865620 16680521 17730374 19045650 20750377 22514088
7045 22514088 25184763 28360506 33204267 39310313 47871103 53058335 51579467 47217775
7037 47217775 39401646 33207274 28768138 25573810 23173509 21424378 20038735 18986140
7029 18986140 18133325 17595597 17030962 16628964 16266595 15858038 15544225 15405392 15270297
7020 15270297 15299016 15291448 15281268 15159998 15267800 15387895 15631361 15891324 16099016 16464841
7010 16464841 16635628 16764146 16751389 16629755 16492063 16324613 16123319 15998627 15819277 15575638
7000 15575638 15464074 15388479 15489611 15589418 15772340 15996267 16263730 16471859 16820625 17253972
$$ packed form
7064A1161453k888J58396J06244K60033K05076M00254J43842K17013L07660M95280
7054A3452363N23254O35355N13306P41342Q14901J049853J315276J704727J763711
7045B2514088K670675L175743M843761O106046Q560790N187232j478868m361692
7037D7217775p816129o194372m439136l194328k400301j749131j385643j052595
7029A8986140q52815n37728n64635m01998l62369m08557l13813j38833j35095
7020A5270297K8719p568j0180j21270J07802J20095K43466K59963K07692L65825
7010A6464841J70787J28518j2757j21634j37692j67450k01294j24692j79350k43639
7000A5575638j11564p5595J01132R9807J82922K23927K67463K08129L48766M33347
$$ plain form
6990 17253972 17704693 18001190 18320745 18368142 18512908 18777818 19108960 19495133 19651467 19863843
6980 19863843 19960213 20167153 20385488 20718091 21130473 21581429 22204598 22970219 23809086 24797727
6970 24797727 25856934 26902959 28165451 29804634 31383874 33083791 35156254 37502630
6962 37502630 40393410 44011123 47423076 50301494 52679111 55173809 58423066 62463492
6954 62463492 65981818 68283275 69665223 69618071 68329518 65498994 60966523 55227436
6946 55227436 49462967 44107151 39892972 36691422 34255984 32282197 30544577 28990893
6938 28990893 27647287 26434480 25262400 24250866 23354126 22698541 22210258 21987873 21908911
6929 21908911 22088977 22255363 22312617 22441024 22493305 22527552 22485614 22404696 21984183 21393500
$$ packed form
6990A7253972M50721K96497L19555M7397J44766K64910L31142L86173J56334K12376
6980A9863843R6370K06940K18335L32603M12382M50956O23169P65621Q38867R88641
6970B4797727J059207J046025J262492J639183J579240J699917K072463K346376
6962C7502630K890780L617713L411953K878418K377617K494698L249257M040426
6954F2463492L518326K301457J381948m7152j288553k830524m532471n739087
6946E5227436n764469n355816m214179l201550k435438j973787j737620j553684
6938B8990893j343606j212807j172080j011534q96740o55585m88283k22385p8962
6929B1908911J80066J66386N7254J28407N2281L4247m1938q0918m20513n90683
$$ plain form
6919 21393500 20712592 19837174 18940195 17836688 17156359 16780426 16293103 15868351 15494278
6910 15494278 15222232 15025925 14794405 14635704 14542421 14515406 14512034 14729942 15035699 15532526
6900 15532526 16095349 16824832 17216399 17276115 17223560 17119505 17204040 17366797 17454635 17167516
6890 17167516 16605617 15830060 15012782 14559263 14191455 13840170 13419632 13126387 12946107
6881 12946107 12736704 12405811 12214916 12161590 12063762 12076329 12247869 12655553 13096339 13633458
6871 13633458 14434754 15418044 16093622 16286671 16081761 15277919 14337013 13442525 12710706
6862 12710706 12137382 11654657 11235422 11038546 10774356 10630009 10638901 10532453 10401332 10307749
6852 10307749 10189312 10080620 9967615 9926205 9991835 10022402 10268528 10438932 10547163 10925584
$$ packed form
6919B1393500o80908q75418q96979j103507o80329l75933m87323m24752l74073
6910A5494278k72046j96307k31520j58701r3283k7015l372K17908L05757M96827
6900A5532526N62823P29483L91567N9716n2555j04055Q4535J62757Q7838k87119
6890A7167516n61899p75557q17278m53519l67808l51285m20538k93245j80280
6881A2946107k09403l30893j90895n3326r7828J2567J71540M07684M40786N37119
6871A3633458Q01296R83290O75578J93049k04910q03842r40906q94488p31819
6862A2710706n73324m82725m19235j96876k64190j44347Q892j06448j31121r3583
6852A0307749j18437j08692j13005m1410O5630L0567K46126J70404J08231L78421
$$ plain form
6842 10925584 11398047 12217858 13137350 14030846 14917873 15281665 15505553 15657320 15601923 15362860
6832 15362860 14764990 13908961 13106884 12152247 11212647 10230938 9414459 8809571 8084499
6823 8084499 7664689 7325341 7009623 6664735 6334858 6165246 6077713 6007129 5713830 5752386
6813 5752386 5627717 5391096 5272725 5132313 5077921 4900923 4846465 4691276 4464383 4313154
6803 4313154 4266009 4252760 4208817 4086071 3972084 4032651 3897911 3780207 3768994 3778866 3616711
6792 3616711 3621117 3593543 3611310 3699981 3713915 3748419 3706560 3664166 3688923 3808975 3802042 3842194
6780 3842194 3946983 3796956 3705236 3671247 3675181 3641706 3631038 3555994 3493479 3395763 3381635
6769 3381635 3365153 3262303 3182152 3154921 3192652 3240732 3126164 3075302 3101782 3220084 3268371
$$ packed form
6842A0925584M72463Q19811R19492Q93496Q87027L63792K23888J51767n5397k39063
6832A5362860n97870q56029q02077r54637r39600r81709q16479o04888p25072
6823H084499m19810l39348l15718l44888l29877j69612q7533p0584k93299L8556
6813E752386j24669k36621j18371j40412n4392j76998n4458j55189k26893j51229
6803D313154m7145j3249m3943j22746j13987O0567j34740j17704j1213R872j62155
6792C616711M406k7574J7767Q8671J3934L4504m1859m2394K4757J20052o933M0152
6780C842194J04789j50027r1720l3989L934l3475j0668p5044o2515r7716j4128
6769C381635j6482j02850q0151k7231L7731M8080j14568n0862K6480J18302M8287
$$ plain form
6758 3268371 3293314 3217795 3268932 3190831 3228249 3282539 3203492 3125087 3177674 3188967 3171338
6747 3171338 3258244 3284255 3448940 3433659 3569081 3698621 3780830 3909257 4166564 4323585
6737 4323585 4627739 4939205 5029513 4931308 4736670 4460848 4241463 4029687 3910316 3758348
6727 3758348 3680723 3480526 3542944 3473235 3523588 3425824 3346544 3448674 3534873 3490903 3580629
6716 3580629 3662627 3691670 3838154 3927471 3910536 3913959 4013003 4061346 4094325 4215955 4326064
6705 4326064 4527574 4754502 5046905 5557599 5936636 6270185 6596858 6841977 6888313 6844437
6695 6844437 6622777 6293222 5771004 5385314 5099137 4852863 4807829 4650697 4564209 4525138
6685 4525138 4471226 4455039 4589882 4717675 4904117 5112955 5219601 5479221 5807271 6169078
$$ packed form
6758C268371K4943p5519N1137p8101L7418N4290p9047p8405N2587J1293j7629
6747C171338Q6906K6011J64685j5281J35422J29540Q2209J28427K57307J57021
6737D323585L04154L11466R0308r8205j94638k75822k19385k11776j19371j51968
6727C758348p7625k00197O2418o9709N0353r7764p9280J02130Q6199m3970Q9726
6716C580629Q1998K9043J46484Q9317j6935L423R9044M8343L2979J21630J10109
6705D326064K01510K26928K92403N10694L79037L33549L26673K45119M6336m3876
6695F844437k21660l29555n22218l85690k86177k46274m5034j57132q6488l9071
6685D525138n3912j6187J34843J27793J86442K08838J06646K59620L28050L61807
$$ plain form
6675 6169078 6357727 6346507 6207184 6061727 5896496 5879180 5687828 5387160 5071313 4756806
6665 4756806 4456048 4237804 3991970 3638250 3562384 3465914 3422166 3325933 3216320 3196278
6655 3196278 3121870 3135003 3164046 3135939 3091749 3102394 3017188 3145615 3236438 3204712 3181370
6644 3181370 3269290 3404564 3482132 3516089 3782489 3972781 4286677 4568375 4753657 4743944
6634 4743944 4617940 4405677 4047759 3738639 3411351 3157989 3039484 2963464 2819898 2716065
6624 2716065 2617432 2461980 2484075 2370294 2286210 2295451 2359115 2424811 2420878 2490374 2410977
6613 2410977 2417386 2294662 2176638 2175928 2085287 2104456 2030366 1959388 2006629 2006901 2046528 1977680
6601 1977680 1985358 2000888 2038142 2134786 2074358 2116858 2072343 2121544 2300711 2406997 2533878
$$ packed form
6675F169078J88649j1220j39323j45457j65231j7316j91352l00668l15847l14507
6665D756806l00758k18244k45834l53720p5866r6470m3748r6233j09613k0042
6655C196278p4408J3133K9043k8107m4190J0645q5206J28427R0823l1726k3342
6644C181370Q7920J35274P7568L3957K66400J90292L13896K81698J85282r713
6634D743944j26004k12263l57918l09120l27288k53362j18505p6020j43566j03833
6624B716065r8633j55452K2095j13781q4084R241O3664O5696l933O9496p9397
6613B410977O409j22724j18024p10r0641J9169p4090p0978M7241K72L9627o8848
6601A977680P678J5530L7254R6644o0428M2500m4515M9201J79167J06286J26881
$$ plain form
6590 2533878 2602523 2719044 2680994 2569043 2662531 2643121 2513159 2403417 2316606 2257235 2101785
6579 2101785 2017237 1906600 1876364 1762304 1701991 1664918 1736944 1656005 1561899 1520219 1551906
6568 1551906 1460480 1414428 1435543 1534240 1520536 1329564 1320744 1414967 1429892 1457530 1573590
6557 1573590 1589421 1671448 1576251 1562288 1628806 1685353 1673658 1671291 1628952 1552452 1516961 1556219
6545 1556219 1542453 1525685 1400349 1193451 1262634 1222768 1156420 1175217 1208430 1100370 1052616
6534 1052616 1092285 1043146 953280 888481 861562 895435 876849 765953 867020 934861 851710
6523 851710 805040 761886 751915 804548 724245 780775 773201 852033 814289 729120 770836 736428
6511 736428 701955 668252 686241 694699 792756 766915 784691 800194 803009 754751 694603 559737
$$ packed form
6590B533878O8645J16521l8050j11951R3488j9410j29962j09742q6811n9371j55450
6579B101785q4548j10637l0236j14060o0313l7073P2026q0939r4106m1680L1687
6568A551906r1426m6052K1115R8697j3704j90972q820R4223J4925K7638J16060
6557A573590J5831Q2027r5197j3963O6518N6547j1695k367m2339p6500l5491L9258
6545A556219j3766j6768j25336k06898O9183l9866o6348J8797L3213j08060m7754
6534A052616L9669m9139q9866o4799k6919L3873j8586j10896J01067O7841q3151
6523H51710m6670m3154r971N2633q0303N6530p574P8832l7744q5169M1716l4408
6511G36428l4473l3703J7989Q458R8057k5841J7776J5503K815m8258o0148j34866
$$ plain form
6499 559737 565061 606822 624208 598995 519086 488133 447752 391058 524893 459869 513136 547066
6487 547066 494724 468746 488118 473866 553157 592320 670770 689330 555943 623001 596502
6476 596502 631653 600506 543471 434740 528225 531566 513220 458658 467974 385592 441706 452577
6464 452577 362362 448507 407327 333337 375531 317544 286452 313401 323234 396758 429804 360321
6452 360321 332588 339720 337350 349047 402744 444387 342290 303373 254594 271808 344050 327155
6440 327155 295674 194604 261774 303315 363115 303077 323095 402416 365605 308727 299009 358785
6428 358785 369234 446313 260030 254793 290910 267437 309550 313542 335681 345293 320501 227271
6416 227271 221977 168243 164197 303572 286931 321757 309035 274496 335627 310413 203262 194483
$$ packed form
6499E59737N324M1761J7386k5213p9909l0953m0381n6694J33835o5024N3267L3930
6487E47066n2342k5978J9372j4252P9291L9163P8450J8560j33387O7058k6499
6476E96502L5151l1147n7035j08731R3485L341j8346n4562R316q2382N6114J0871
6464D52577r0215Q6145m1180p3990M2194n7987l1092K6949R833P3524L3046o9483
6452C60321k7733P132k370J1697N3697M1643j02097l8917m8779J7214P2242j6895
6440C27155l1481j01070O7170M1541N9800o0038K0018P9321l6811n6878r718N9776
6428C58785J0449P7079j86283n237L6117k3473M2113L992K2139R612k4792r3230
6416B27271n294n3734m046J39375j6641L4826j2722l4539O1131k5214j07151q779
$$ plain form
6404 194483 209026 258185 312702 289996 184033 219355 195592 276618 271444 146443 214402
6393 214402 233332 271502 262870 301457 171851 269210 295986 315548 219354 232672 251010 222119
6381 222119 157409 174666 142787 194415 262387 208011 197511 238848 186086 174318 175849 91132
6369 91132 172764 134910 149416 188209 183252 142428 79186 194635 242373 250155 214601 147537
6357 147537 291869 211201 112985 151089 205679 146124 215253 158256 160398 124379 44102 70567
6345 70567 104365 30268 108897 186083 197963 188757 100593 104282 108418 105307 74372 174178 150894
6332 150894 130339 128854 139579 214055 97577 64453 145956 253133 112952 64458 213015
6321 213015 253044 150670 166457 162418 167736 160697 89689 51113 92555 40994 152767 136638
$$ packed form
6404A94483J4543M9159N4517k2706j05963L5322k3763Q1026n174j25001O7959
6393B14402J8930L8170q632L8587j29606R7359K6776J9562r6194J3318J8338k8891
6381B22119o4710J7257l1879N1628O7972n4376j0500M1337n2762j1768J531q4717
6369I1132Q1632l7854J4506L8793m957m0824o3242J15449M7738P782l5554o7064
6357A47537J44332q0668r8216L8104N4590n9555O9129n6997K142l6019q0277K6465
6345G0567L3798p4097P8629P7186J1880r206q8164L689M136l111l0935R9806k3284
6332A50894k0555j485J0725P4476j16478l3124Q1503J07177j40181m8494J48557
6321B13015M0029j02374J5787m039N318p039p1008l8576M1442n1561J11773j6129
$$ plain form
6309 136638 76727 37652 20769 -19260 20758 97871 159875 102610 128871 104652 76800 -803
6297 -803 -18610 76441 -29521 131335 80810 45217 77701 61487 76313 132768 128390 -12137
6285 -12137 43068 84918 29407 59600 97624 80093 -11332 64533 -15189 50795 16068 12821
6273 12821 27988 88936 99357 45288 64282 148035 47981 117523 102230 56464 1307 -4299
6261 -4299 12785 59766 70991 118760 139057 -41385 -15360 50084 153072 123051 30309 -13953
6249 -13953 -78610 94081 94968 38179 7578 17689 35772 77109 75347 61037 148415 213488
6237 213488 215858 108310 76081 109342 114484 129353 63390 44558 93638 67757 91735 4471
6225 4471 45132 178214 176463 170666 147035 120444 170056 99900 84909 123870 149351 125174
$$ packed form
6309A36638n9911l9075j6883m0029M0018P7113O2004n7265K6261k4219k7852p7603
6297h03j7807R5051j05962J60856n0525l5593L2484j6214J4826N6455m378j40527
6285a2137N5205M1850n5511L0193L8024j7531r1425P5865p9722O5984l4727l247
6273A2821J5167O0948J0421n4069J8994Q3753j00054O9542j5293m5766n5157n606
6261d299J7084M6981J1225M7769K0297j80442K6025O5444J02988l0021r2742m4262
6249a3953o4657J72691Q87n6789l0601J0111J8083M1337j762j4310Q7378O5073
6237B13488K370j07548l2229L3261N142J4869o5963j8832M9080k5881K3978q7264
6225D471M0661J33082j751n797k3631k6591M9612p0156j4991L8961K5481k4177
$$ plain form
6213 125174 173092 154632 121161 154713 48225 112105 163690 78232 175384 146844 208225
6202 208225 158647 148760 105073 147841 227929 240574 119009 90141 127160 52012 109663 91618
6190 91618 150576 162831 236038 182822 168052 235702 96640 105039 150115 91200 129142 232060
6178 232060 216960 119243 111083 196393 109583 48931 67855 156566 168068 187011 150458 171026
6166 171026 257796 156624 138544 143687 130754 274073 359939 285833 257924 239433 236675 272398
6154 272398 330518 218808 214236 290003 136040 198079 223845 240145 295838 390163 389571 308319
6142 308319 260365 306813 289401 359980 367533 350052 227099 221059 281398 322952 201129 179225
6130 179225 295607 366473 336380 235249 255554 264681 251682 228013 330679 271463 238018
$$ packed form
6213A25174M7918j8460l3471L3552j06488O3880N1585q5458R7152k8540O1381
6202B08225m9578r887m3687M2768Q0088J2645j21565k8868L7019p5148N7651j8045
6190I1618N8958J2255P3207n3216j4770O7650j39062Q399M5076n8915L7942J02918
6178B32060j5100r7717q160Q5310q6810o0652J8924Q8711J1502J8943l6553K0568
6166A71026Q6770j01172j8080N143j2933J43319Q5866p4106k7909j8491k758L5723
6154B72398N8120j11710m572P5767j53963O2039K5766J6300N5693R4325n92q1252
6142C08319m7954M6448j7412P0579P553j7481j22953o040O0339M1554j21823k1904
6130A79225J16382P0866l0093j01131K0305R127j2999k3669J02666n9216l3445
$$ plain form
6119 238018 298952 295142 339186 350924 277263 334482 340036 394370 398499 364836 303412 384468
6107 384468 513429 518957 481196 586560 604437 737721 614522 624629 657644 583906 635563
6096 635563 596645 617205 569142 534835 554831 478474 498903 544145 422343 332296 428807
6085 428807 416547 531857 669475 582701 502560 508033 447629 437923 448263 491634 498798 475950
6073 475950 439036 518674 563413 593810 548797 479112 534824 600344 550251 564730 632586 606468
6061 606468 616126 651261 651379 618289 655914 668883 612837 651995 654449 659244 757038 713984 779177
6048 779177 840884 818302 776367 812728 934584 980667 899943 825216 874014 868036 968981
6037 968981 1049650 1104585 1097724 1105195 1122923 1039085 1002930 1052259 1135754 1233206 1232246 1277071
$$ packed form
6119B38018O0934l810M4044J1738p3661N7219N554N4334M129l3663o1424Q1056
6107C84468J28961N528l7761J05364J7877J33284j23199J0107L3015p3738N1657
6096F35563l8918K0560m8063l4307J9996p6357K0429M5242j21802r0047R6511
6085D28807j2260J15310J37618q6774q0141N473o0404r706J0340M3371P164k2848
6073D75950l6914P9638M4739L0397m5013o9685N5712O5520n0093J4479O7856k6118
6061F06468R658L5135J18l3090L7625J2969n6046L9158K454M795R7794m3054O5193
6048G79177O1707k2582m1935L6361J21856M6083q0724p4727M8798n978J00945
6037I68981Q0669N4935o861P471J7728q3838l6155M9329Q3495R7452r60M4825
$$ plain form
6025 1277071 1344207 1396986 1456267 1471481 1668221 1690181 1759645 1890598 2017571 2012249 2038229
6014 2038229 1944555 1945467 2016516 1965836 1911624 1823823 1727031 1653765 1789202 1717497 1543025
6003 1543025 1637211 1703664 1711601 1704792 1630331 1672671 1674172 1616815 1643298 1697094 1875324 1871268
5991 1871268 1996455 2002011 2104686 2219794 2257449 2388056 2492778 2481211 2587591 2786493
5981 2786493 2840050 2862225 2793953 2825237 2884051 2936101 3001326 3010727 3017458 3025938 2997275 3003285
5969 3003285 3030033 2989759 2973130 3007455 3118128 3250166 3401873 3650717 3946526 4210747
5959 4210747 4587976 5186596 5631890 6094451 6366547 6388777 6512987 6495407 6245408 5919409
5949 5919409 5523973 5014110 4789431 4409100 4116759 3870471 3591957 3492506 3403494 3215112
$$ packed form
6025A277071O7136N2779N9281J5214J96740K1960O9464J30953J26973n322K5980
6014B038229r3674R12P1049n0680n4212q7801r6792p3266J35437p1705j74472
6003A543025R4186O6453P937o809p4461M2340J501n7357K6483N3796J78230m056
5991A871268J25187N556J02675J15108L7655J30607J04722j1567J06380J98902
5981B786493N3557K2175o8272L1284N8814N2050O5225R401O731Q480k8663O010
5969C003285K6748m0274j6629L4325J10673J32038J51707K48844K95809K64221
5959D210747L77229N98620M45294M62561K72096K2230J24210j7580k49999l25999
5949E919409l95436n09863k24679l80331k92341k46288k78514r9451q9012j88382
$$ plain form
5939 3215112 3069092 3005343 3046465 3027502 2883188 3008692 3042342 3094473 3073467 2932302 3110699
5928 3110699 3212399 3228823 3174534 3299272 3372623 3517335 3703535 3985906 4288451 4653321
5918 4653321 5165467 5487224 5707077 5768833 5817009 5791240 5786267 5538876 5083674 4659395
5908 4659395 4242027 3824759 3715228 3347567 3165000 3059559 2890655 2894493 2816409 2625562
5898 2625562 2671761 2580602 2538602 2532693 2471566 2511273 2599884 2578728 2511554 2586719 2671751 2726746
5886 2726746 2615608 2653430 2671447 2671308 2681689 2637788 2788098 2793754 2757812 2824310 2939044
5875 2939044 3007954 3050550 3171511 3266369 3298979 3340671 3455542 3487329 3451867 3421323 3312187
5864 3312187 3362028 3387735 3266759 3125590 3040694 2990699 2866003 3010109 2941130 2958030 3059097
$$ packed form
5939C215112j46020o3749M1122j8963j44314J25504L3650N2131k1006j41165J78397
5928C110699J01700J6424n4289J24738P3351J44712J86200K82371L02545L64870
5918D653321N12146L21757K19853O1756M8176k5769m973k47391m55202m24279
5908D659395m17368m17268j09531l67661j82567j05441j68904L838p8084j90847
5898B625562M6199r1159m2000n909o1127L9707Q8611k1156o7174P5165Q5032N4995
5886B726746j11138L7822J8017j39J0381m3901J50310N656l5942O6498J14734
5875B939044O8910M2596J20961R4858L2610M1692J14871L1787l5462l0544j09136
5864C312187M9841K5707j20976j41169q4896m9995j24696J44106o8979J6900J01067
$$ plain form
5853 3059097 3020844 3044621 3038482 3105526 3097031 3185201 3279105 3344628 3290137 3388297 3528519 3662719
5841 3662719 3797451 3927493 3958279 4197504 4461490 4688326 4938513 5323646 5825367 6370547
5831 6370547 6777870 6896786 6971770 7031111 7027490 6902570 6543640 6068660 5679781 5222639
5821 5222639 4844877 4597114 4452873 4328622 4310378 4284015 4371675 4302341 4281232 4371996 4304692
5810 4304692 4326484 4298081 4275228 4205951 4177380 4276013 4118507 3967294 3973471 3823035 3642490
5799 3642490 3718302 3704409 3715715 3632578 3564459 3655851 3756453 3777522 3790473 3896242 3915350
5788 3915350 3892163 3990989 4002619 3982070 4009188 4088331 4076269 4094366 4199096 4354546 4374732
5777 4374732 4513432 4758912 5040882 5398650 5692491 6184946 6622395 6760186 6855774 6919578
$$ packed form
5853C059097l8253K3777o139O7044q495Q8170R3904O5523n4491R8160J40222J34200
5841C662719J34732J30042L0786K39225K63986K26836K50187L85133N01721N45180
5831F370547M07323J18916P4984N9341l621j24920l58930m74980l88879m57142
5821E222639l77762k47763j44241j24251j8244k6363Q7660o9334k1109R0764o7304
5810D304692K1792k8403k2853o9277k8571R8633j57506j51213O177j50436j80545
5799C642490P5812j3893J1306q3137o8119R1392J00602K1069J2951J05769J9108
5788C915350k3187R8826J1630k0549K7118P9143j2062J8097J04730J55450K0186
5777D374732J38700K45480K81970L57768K93841M92455M37449J37791R5588O3804
$$ plain form
5767 6919578 6898022 6824789 6539614 6235086 5854903 5429578 5239899 4930167 4712230 4610800
5757 4610800 4628517 4609807 4576005 4588844 4514006 4585429 4687322 4920122 5009001 5186769 5159329
5746 5159329 5192915 5414883 5367399 5292266 5318462 5321910 5187592 5214178 5156689 5119024 5020664
5735 5020664 5128632 5163720 5249166 5280943 5294086 5337231 5328654 5500106 5496050 5504527 5542225 5543561
5723 5543561 5763779 5855840 5945604 5983462 6043217 6160867 6206896 6333384 6387522 6518121 6671961
5712 6671961 6763237 6952967 7246958 7659383 8074021 8421494 8936456 9443480 10165739 10939603
5702 10939603 11854544 12875360 14137186 15496770 16872620 18295888 19162938 19556300 19179540
5693 19179540 18203600 16815250 15227760 13745190 12520758 11523594 10593765 9844073 9043920
$$ packed form
5767F919578k1556p3233k85175l04528l80183m25325j89679l09732k17937j01430
5757D610800J7717j8710l3802J2839p4838P1423J01893K32800Q8879J77768k7440
5746E159329L3586K21968m7484p5133K6196L448j34318K6586n7489l7665r8360
5735E020664J07968L5088Q5446L1777J3143M3145q577J71452m056Q477L7698J336
5723E543561K20218R2061Q9764L7858N9755J17650M6029J26488N4138J30599J53840
5712F671961R1276J89730K93991M12425M14638L47473N14962N07024P22259P73864
5702A0939603R14941J020816J261826J359584J375850J423268Q67050L93362l76760
5693A9179540r75940j388350j587490j482570j224432r97164r29829p49692q00153
$$ plain form
5684 9043920 8607232 8034773 7545147 7133084 6933220 6581301 6220148 6025382 5873213 5685300
5674 5685300 5453692 5304350 5144326 4983720 4818992 4681144 4521836 4457142 4310118 4085071
5664 4085071 3874889 3769404 3598077 3365561 3313676 3106281 2959410 2890882 2843684 2681420
5654 2681420 2526208 2549309 2459601 2344114 2232602 2202084 2138941 2084479 2081807 1967491 1986379
5643 1986379 1853173 1830511 1774521 1735035 1785374 1757758 1682786 1667698 1636167 1666746 1705365
5632 1705365 1656336 1609052 1519753 1654619 1460786 1435890 1472233 1380664 1333439 1395290 1403525
5621 1403525 1408369 1347690 1378406 1447932 1436232 1360655 1347482 1295694 1283554 1262438 1431310
5610 1431310 1396355 1371543 1313844 1246256 1220502 1207785 1255260 1173525 1299487 1215859 1166468
$$ packed form
5684I043920m36688n72459m89626m12063j99864l51919l61153j94766j52169j87913
5674E685300k31608j49342j60024j60606j64728j37848j59308o4694j47024k25047
5664D085071k10182j05485j71327k32516n1885k07395j46871o8528m7198j62264
5654B681420j55212K3101q9708j15487j11512l0518o3143n4462k672j14316J8888
5643A986379j33206k2662n5990l9486N0339k7616p4972j5088l1531L0579L8619
5632A705365m9029m7284q9299J34866j93833k4896L6343r1569m7225O1851Q235
5621A403525M844o0679L0716O9526j1700p5577j3173n1788j2140k1116J68872
5610A431310l4955k4812n7699o7588k5754j2717M7475q1735J25962q3628m9391
$$ plain form
5599 1166468 1204550 1254271 1240746 1198861 1125644 1075873 1129595 1163379 1188865 1117580 1163322
5588 1163322 1229049 1161426 1248837 1334972 1174445 1241688 1146822 1161646 1185199 1234751 1267439
5577 1267439 1143212 1134106 1092483 1068873 1023923 1061923 997524 982494 1003338 956240 877608
5566 877608 931239 863354 849097 768833 796194 822280 857414 804050 826162 796812 760424 804002
5554 804002 750901 665873 761887 803311 780830 664260 709630 770370 766932 809234 811909 850735
5542 850735 760946 792789 705760 694869 754657 832104 750418 551000 644366 663493 669124 740951
5530 740951 698119 736398 624283 623779 713207 756363 697647 709291 654510 703068 770379 806760
5518 806760 729078 645395 659825 744765 710488 767114 822152 716536 661527 677887 682177 635617
$$ packed form
5599A166468L8082M9721j3525m1885p3217m9771N3722L3784K5486p1285M5742
5588A163322O5727o7623Q7411Q6135j60527O7243r4866J4824K3553M9552L2688
5577A267439j24227r106m1623k3610m4950L8000o4399j5030K0844m7098p8632
5566H77608N3631o7885j4257q0264K7361K6086L5134n3364K2112k9350l6388M3578
5554H04002n3101q5028R6014M1424k2481j16570M5370O0740l438M2302K675L8826
5542H50735q9789L1843q7029j0891N9788P7447q1686j99418R3366J9127N631P1827
5530G40951m2832L8279j12115n04Q9428M3156n8716J1644n4781M8558O7311L6381
5518H06760p7682q3683J4430Q4940l4277N6626N5038j05616n5009J6360M290m6560
$$ plain form
5506 635617 667795 787387 842030 831847 716170 730269 801815 845602 909792 974371 768195
5495 768195 810395 942529 971901 994932 1065442 1005066 976040 1010522 1045316 1023578 956347
5484 956347 1074776 979374 1048918 1010642 1092517 1115334 1009720 1053098 1211428 1262638 1233749
5473 1233749 1267667 1286003 1212905 1231472 1208207 1223550 1193798 1195093 1251290 1206555 1151562 1269261
5461 1269261 1306399 1320793 1353629 1406262 1430530 1473850 1415125 1468335 1514383 1554681 1526635
5450 1526635 1523696 1570381 1662313 1753148 1790035 1748419 1844801 2056011 1968423 2053349 2176095
5439 2176095 2276696 2358886 2456803 2562458 2587411 2516970 2607342 2667546 2686667 2741699 2766380
5428 2766380 2789577 2741094 2773779 2762220 2559524 2557893 2484877 2426475 2368007 2355346 2384283
$$ packed form
5506F35617L2178J19592N4643j0183j15677J4099P1546M3787O4190O4579k06176
5495G68195M2200J32134K9372K3031P0510o0376k9026L4482L4794k1738o7231
5484I56347J18429r5402O9544l8276Q1875K2817j05614M3378J58330N1210k8889
5473A233749L3918J8336p3098J8567k3265J5343k9752J295N6197m4735n4993J17699
5461A269261L7138J4394L2836N2633K4268M3320n8725N3210M6048M0298k8046
5450A526635k939M6685R1932R0835L6887m1616R6382K11210q7588Q4926J22746
5439B176095J00601Q2190R7917J05655K4953p0441R0372O0204J9121N5032K4681
5428B766380K3197m8483L2685j1559k02696j631p3016n8402n8468j2661K8937
$$ plain form
5417 2384283 2247935 2273239 2182247 2134393 1984690 2002298 2007137 2004999 1926792 1999697 2037132
5406 2037132 1932234 1988897 1986075 1942475 2029279 1998941 1995224 1914738 1993327 2029704 2076124 2176165
5394 2176165 2256391 2364842 2420518 2516353 2498873 2544604 2619244 2705130 2873610 3021886 3141329
5383 3141329 3254351 3385587 3472691 3542008 3622033 3624268 3689338 3552291 3450115 3453092 3391496
5372 3391496 3170301 3148836 3085035 2887549 2779325 2779048 2598756 2378764 2335083 2379805 2261843
5361 2261843 2240494 2121451 2022604 2106203 1977544 1976077 1946101 1887078 1853739 1825227 1819012
5350 1819012 1752548 1801087 1843199 1900075 1743367 1677775 1760700 1756686 1741544 1734791 1729179 1677888
5338 1677888 1732971 1734078 1748021 1862602 1865446 1938290 1837408 1718236 1658007 1760279 1714589
$$ packed form
5417B384283j36348K5304r0992m7854j49703J7608M839k138p8207P2905L7435
5406B037132j04898N6663k822m3600Q6804l0338l717q0486P8589L6377M6420J00041
5394B176165Q0226J08451N5676R5835j7480M5731P4640Q5886J68480J48276J19443
5383C141329J13022J31236Q7104O9317Q0025K235O5070j37047j02176K977o1596
5372C391496k21195k1465o3801j97486j08224k77j80292k19992m3681M4722j17962
5361B261843k1349j19043r8847Q3599j28659j467k9976n9023l3339k8512o215
5350A819012o6464M8539M2112N6876j56708o5592Q2925m014j5142o753n612n1291
5338A677888N5083J107J3943J14581K844P2844j00882j19172o0229J02272m5690
$$ plain form
5327 1714589 1694619 1665302 1682344 1711891 1779520 1767130 1741841 1758955 1778975 1761044 1858378
5316 1858378 1849639 1804096 1797617 1899427 1930180 1936763 1944749 2105136 2210236 2163174 2209914 2237521
5304 2237521 2302335 2280419 2416199 2395128 2451240 2496788 2483312 2678304 2737452 2810044 3006099
5293 3006099 3175740 3313117 3561214 3768762 4053677 4216105 4176287 4130395 4070675 4036474
5283 4036474 3769704 3569987 3479301 3422924 3277480 3279502 3234247 3083460 3147386 3185913 3043246
5272 3043246 2937162 2922960 2940188 2818739 2770898 2699578 2700706 2848052 2842465 2738517 2737246
5261 2737246 2816420 2770467 2868411 2903362 2897465 2874139 2908267 3007208 2940457 3010678 2988620 3002163
5249 3002163 3066989 3203204 3234124 3277986 3433250 3433757 3454383 3621671 3802935 4014321 4019027
$$ packed form
5327A714589j9970k9317J7042K9547O7629j2390k5289J7114K0020j7931R7334
5316A858378q739m5543o479J01810L0753O583P986J60387J05100m7062M6740K7607
5304B237521O4814k1916J35780k1071N6112M5548j3476J94992N9148P2592J96055
5293C006099J69641J37377K48097K07548K84915J62428l9818m5892n9720l4201
5283D036474k66770j99717r0686n6377j45444K022m5255j50787O3926L8527j42667
5272C043246j06084j4202J7228j21449m7841p1320J128J47346n587j03948j271
5261B737246P9174m5953R7944L4951n897k3326L4128R8941o6751P0221k2058J3543
5249C002163O4826J36215L0920M3862J55264N07K0626J67288J81264K11386M706
$$ plain form
5238 4019027 4234740 4474449 4746091 4875035 5179527 5452373 5674597 5861317 5974121 5940020
5228 5940020 5810931 5583664 5585061 5559438 5539540 5529942 5567415 5630591 5616354 5679973 5577691
5217 5577691 5525609 5582629 5548949 5541769 5466638 5353718 5200223 5224066 5173372 5042106 4981724
5206 4981724 4886063 4748100 4712218 4733011 4772805 4765720 4727407 4731248 4713161 4635207 4647016 4738006
5194 4738006 4869691 4863030 4929694 5076253 5063092 5096366 5145129 5197188 5210708 5303928 5309834
5183 5309834 5495984 5527565 5533326 5348388 5332352 5461937 5446461 5527844 5564737 5602590 5604104
5172 5604104 5542699 5576783 5564832 5522510 5517510 5542207 5515280 5360904 5279267 5225734 5212622
5161 5212622 5114374 5046612 5024333 4920648 4821600 4728824 4804144 4695249 4733859 4634814 4637751
$$ packed form
5238D019027K15713K39709K71642J28944L04492K72846K22224J86720J12804l4101
5228E940020j29089k27267J397k5623j9898r598L7473O3176j4237O3619j02282
5217E577691n2082N7020l3680p180p5131j12920j53495K3843n0694j31266o0382
5206D981724r5661j37963l5882K0793L9794p085l8313L841j8087p7954J1809R0990
5194D738006J31685o661O6664J46559j3161L3274M8763N2059J3520R3220N906
5183E309834J86150L1581N761j84938j6036J29585j5476Q1383L6893L7853J514
5172E604104o1405L4084j1951m2322n000K4697k6927j54376q1637n3533j3112
5161E212622r8248o7762k2279j03685r9048r2776P5320j08895L8610r9045K937
$$ plain form
5150 4637751 4688262 4647715 4687389 4777927 4862950 4822455 4862632 5043994 5073441 5175914 5162196
5139 5162196 5233960 5301832 5510680 5569072 5502509 5507592 5542936 5582783 5596457 5560187 5510661
5128 5510661 5540862 5559718 5488225 5574320 5576568 5544909 5557651 5556977 5546173 5543951 5682717 5804260
5116 5804260 5879031 5906309 5955681 5981179 5985818 6097403 6189428 6287961 6356685 6514134 6648774
5105 6648774 6748578 6904405 7010936 7087600 7327550 7526898 7755708 7900746 8266165 8632249
5095 8632249 8839207 9121868 9466391 9589313 9889592 10406839 10645204 10964286 11395125 11809757
5085 11809757 12273645 12736991 13279120 13851421 14371497 14991201 15575527 16123057 16769912
5076 16769912 17473653 18254524 19041337 19774185 20684110 21665279 22769903 23919364 25069177
$$ packed form
5150D637751N0511m0547L9674R0538Q5023m0495M0177J81362K9447J02473j3718
5139E162196P1764O7872K08848N8392o6563N083L5344L9847J3674l6270m9526
5128E510661L0201J8856p1493Q6095K248l1659J2742o74j0804k222J38766J21543
5116E804260P4771K7278M9372K5498M639J11585R2025R8533O8724J57449J34640
5105F648774R9804J55827J06531P6664K39950J99348K28810J45038L65419L66084
5095H632249K06958K82661L44523J22922L00279N17247K38365L19082M30839M14632
5085A1809757M63888M63346N42129N72301N20076O19704N84326N47530O46855
5076A6769912P03741P80871P86813P32848R09925R81169J104624J149461J149813
$$ plain form
5067 25069177 26256030 27480187 28879348 30424917 31935203 33873443 36030879 38407720
5059 38407720 41185083 44492150 48371451 53293656 59191328 66391321 73313176 76847404
5051 76847404 76998202 74763089 71822102 70174615 70185993 72217295 75746082 79712575 82144942
5042 82144942 83645657 84819415 87020240 90556681 93597813 93861222 91552166 87981385
5034 87981385 84678750 83109557 83572969 83782298 82297228 79887207 77028673 75484341
5026 75484341 75923823 78633658 82795473 85965390 85344879 80961880 73985351 66551515
5018 66551515 60314243 55251110 51253560 48212982 45807663 43899496 42449411 40879006
5010 40879006 39436443 38011729 36665031 35608512 34581623 33815375 33246155 32730933 32275061
$$ packed form
5067B5069177J186853J224157J399161J545569J510286J938240K157436K376841
5059C8407720K777363L307067L879301M922205N897672P199993O921855L534228
5051G6847404J50798k235113k940987j647487J1378K031302L528787L966493K432367
5042H2144942J500715J173758K200825L536441L041132K63409k309056l570781
5034H7981385l302635j569193M63412K09329j485070k410021k858534j544332
5026G5484341M39482K709835M161815L169917o20511m382999o976529p433836
5018F6551515o237272n063133l997550l040578k405319j908167j450085j570405
5010D0879006j442563j424714j346698j056519j026889p66248n69220n15222m55872
$$ plain form
5001 32275061 31728297 31184788 30829766 30590826 30502339 30509695 30502279 30515965 30462498 30200662 29720740
4990 29720740 29079602 28296085 27398527 26599073 25869471 25288783 24904347 24479619 24287443
4981 24287443 24186221 24010058 24074407 24145937 24287006 24547660 24814733 24968417 24977679 25032094
4971 25032094 24897311 24766103 24737469 24703036 24764481 24849725 25099319 25518434 25964773 26486532
4961 26486532 27066883 27787492 28630187 29537203 30714689 32084671 33555973 35295784 37377873
4952 37377873 39660241 42003453 43809256 44944726 45551669 45777657 46378121 47320159 48888535
4943 48888535 50872806 53347478 55747025 57561785 58926642 60133324 61492494 62924773
4935 62924773 64224636 65223314 65910586 66165338 66521851 66724938 66642475 66106847 65476484
$$ packed form
5001C2275061n46764n43509l55022k38940q8487P356p416J3686n3467k61836m79922
4990B9720740o41138p83517q97558p99454p29602n80688l84436m24728j92176
4981B4287443j01222j76163O4349P1530J41069K60654K67073J53684R262N4415
4971B5032094j34783j31208k8634l4433O1445Q5244K49594M19115M46339N21759
4961B6486532N80351P20609Q42695R07016J177486J369982J471302J739811K082089
4952C7377873K282368K343212J805803J135470O06943K25988O00464R42038J568376
4943D8888535J984271K474672K399547J814760J364857J206682J359170J432279
4935F2924773J299863R98678O87272K54752L56513K03087q2463n35628o30363
$$ plain form
4926 65476484 64758743 64132558 63853572 63994350 64657499 65483260 66115467 66152353 65419318 64355153
4916 64355153 63393190 62920685 62358711 61667039 60308687 58355067 55700854 52724734 49638633
4907 49638633 46654336 44041208 41938673 40108715 38635095 37519453 36731009 36163234
4899 36163234 35773638 35576647 35528765 35435766 35039215 34207297 32970222 31373670 29465629
4890 29465629 27844087 26273607 24773221 23509914 22523527 21614494 20597289 19902835 19345619
4881 19345619 18674968 18148086 17522073 17077993 16747244 16319502 15885893 15522865 15179731
4872 15179731 14819627 14529595 14271292 14038632 13778637 13606753 13445688 13248609 13053211
4863 13053211 13028194 12952689 12831647 12808297 12675641 12673190 12527692 12508652 12399676 12360526 12345491
$$ packed form
4926F5476484p17741o26185k78986J40778O63149Q25761O32207L6886p33035j064165
4916F4355153r61963m72505n61974o91672j358352j953620k654213k976120l086101
4907D9638633k984297k613128k102535j829958j473620j115642p88444n67775
4899C6163234l89596j96991m7882r2999l96551q31918j237075j596552j908041
4890B9465629j621542j570480j500386j263307r86387r09033j017205o94454n57216
4881A9345619o70651n26882o26013m44080l30749m27742m33609l63028l43134
4872A5179731l60104k90032k58303k32660k59995j71884j61065j97079j95398
4863A3053211k5017p5505j21042k3350j32656k451j45498j9040j08976l9150j5035
$$ plain form
4852 12345491 12356825 12448749 12447052 12398106 12511481 12514159 12502708 12544788 12580073 12703585 12797211
4841 12797211 12846838 13147983 13232007 13296263 13518289 13675430 13719908 13875272 14038581 14134399
4831 14134399 14271871 14343716 14485054 14537589 14533001 14562267 14561876 14572142 14642862 14689773 14792133
4820 14792133 14818762 14850994 14850802 14913344 14968728 14911636 14962739 15020496 14918830 14892252 14934422
4809 14934422 15015148 14978579 15066227 15096970 15092602 15103391 15175859 15152923 15089639 15045997 15004343
4798 15004343 14980309 14902687 14837526 14695451 14606390 14461712 14378835 14346348 14194627 14174425 14154324
4787 14154324 13971812 13973213 13902496 13908035 13730252 13666124 13694572 13650047 13547000 13568417 13459371
4776 13459371 13469464 13395444 13324209 13355291 13180473 13010018 12918428 12961268 12890501 12841152 12960499
$$ packed form
4852A2345491J1334R1924j697m8946J13375K678j1451M2080L5285J23512R3626
4841A2797211M9627L01145Q4024O4256K22026J57141M4478J55364J63309R5818
4831A4134399J37472P1845J41338N2535m588K9266l91J0266P0720M6911J02360
4820A4792133K6629L2232j92O2542N5384n7092N1103N7757j01666k6578M2170
4809A4934422Q0726l6569Q7648L0743m368J0789P2468k2936o3284m3642m1654
4798A5004343k4034p7622o5161j42075q9061j44678q2877l2487j51721k0202k0101
4787A4154324j82512J401p0717N539j77783o4128K8448m4525j03047K1417j09046
4776A3459371J0093p4020p1235L1082j74818j70455r1590M2840p0767m9349J19347
$$ plain form
4765 12960499 12944002 12867935 12861255 12769934 12738051 12679255 12774929 12830884 12788264 12852805 12938757
4754 12938757 12953211 12972174 13055224 13132821 13193878 13295511 13283085 13311878 13324951 13416940 13456581
4743 13456581 13650196 13730678 13934383 14040871 14257597 14361716 14426188 14558461 14644535 14598687
4733 14598687 14772862 14888280 14917608 14954565 14970482 15125788 15231944 15386772 15361574 15438097
4723 15438097 15548136 15654831 15761100 15905517 16035683 16154523 16410907 16626610 16815789
4714 16815789 16956082 17110345 17244220 17388519 17555569 17520497 17759804 17991323 18303439 18424407
4704 18424407 18545790 18787316 18943454 19217364 19516626 19804440 20083693 20368414 20572184
4695 20572184 20800728 21148667 21365241 21728946 21923570 22269720 22669619 22932695 23276221
$$ packed form
4765A2960499j6497p6067o680r1321l1883n8796R5674N5955m2620O4541Q5952
4754A2938757J4454J8963Q3050P7597O1057J01633j2426K8793J3073R1989L9641
4743A3456581J93615Q0482K03705J06488K16726J04119O4472J32273Q6074m5848
4733A4598687J74175J15418K9328L6957J5917J55306J06156J54828k5198P6523
4723A5438097J10039J06695J06269J44417J30166J18840K56384K15703J89179
4714A6815789J40293J54263J33875J44299J67050l5072K39307K31519L12116J20968
4704A8424407J21383K41526J56138K73910K99262K87814K79253K84721K03770
4695B0572184K28544L47939K16574L63705J94624L46150L99899K63076L43526
$$ plain form
4686 23276221 23823265 24328723 24844644 25483586 26087569 26622855 27333466 27921790 28669876
4677 28669876 29441758 30253565 31226935 32214680 33161529 34250528 35186376 36105231 37222190
4668 37222190 38527219 39943587 41362709 42933561 44658766 46396881 48347070 50480143
4660 50480143 52836670 55498786 58555951 62034314 66089474 71182906 77633956 85317928
4652 85317928 93785568 99857553 101700707 100452601 97246174 94853466 94335453 95894097
4644 95894097 99284382 102876995 104603119 105079182 104964721 105642838 108164485 111957952 114981492
4635 114981492 115452886 113415431 110456041 108218028 107579228 107423904 106112072 104137330
4627 104137330 101983946 100889896 101577923 103814798 107352475 111410888 113143305 111150210
$$ packed form
4686B3276221N47044N05458N15921O38942O03983N35286P10611N88324P48086
4677B8669876P71882Q11807R73370R87745R46849J088999R35848R18855J116959
4668C7222190J305029J416368J419122J570852J725205J738115J950189K133073
4660E0480143K356527K662116L057165L478363M055160N093432O451050P683972
4652H5317928Q467640O071985J843154j248106l206427k392708n18013J558644
4644I5894097L390285L592613J726124M76063j14461O78117K521647L793467L023540
4635A14981492M71394k037455k959390k238013o38800j55324j311832j974742
4627A04137330k153384j094050O88027K236875L537677M058413J732417j993095
$$ plain form
4619 111150210 106353714 99790034 93148040 87204764 82344873 78322917 75002382 72397628
4611 72397628 70400665 68603317 67379723 66512226 66073146 66097104 66510431 67046674 68084096
4602 68084096 69142675 69976370 70034967 68905100 66875770 64363986 61618783 58875847 56438761
4593 56438761 54353703 52655104 51242288 50281971 49660584 49242457 48995300 48831824 48670022
4584 48670022 48528248 48182338 47577254 46646729 45236154 43549406 41631480 39871160 38486657
4575 38486657 37303160 36228212 35281988 34574490 33947093 33445013 32994042 32623127 32230398
4566 32230398 31982654 31726393 31564845 31486581 31523402 31519280 31656256 31838079 32116657 32434451
4556 32434451 32491048 32389944 32360736 32569104 32741055 33001347 33377692 33862414 34479901 35278412
$$ packed form
4619A11150210m796496o563680o641994n943276m859891m021956l320535k604754
4611G2397628j996963j797348j223594q67497m39080K3958M13327N36243J037422
4602F8084096J058579Q33695N8597j129867k029330k511784k745203k742936k437086
4593E6438761k085058j698599j412816r60317o21387m18127k47157j63476j61802
4584D8670022j41774l45910o05084r30525j410575j686748j917926j760320j384503
4575C8486657j183497j074948r46224p07498o27397n02080m50971l70915l92729
4566C2230398k47744k56261j61548p8264L6821m122J36976J81823K78578L17794
4556C2434451N6597j01104k9208K08368J71951K60292L76345M84722O17487P98511
$$ plain form
4546 35278412 36071917 37031960 38021059 38938721 39960371 40955871 42117321 43332282 44277578
4537 44277578 45213991 45863980 46178310 46169771 46032091 45879023 45737168 45516354 45424794 45660550
4527 45660550 45930637 46520942 47311124 48374673 49669349 51233822 52978166 55105612 57567636
4518 57567636 60350535 63164942 66073756 68842559 71385072 73995790 76525645 79024658
4510 79024658 81431934 83227005 84438403 84851638 84170330 82519775 80023021 77605062
4502 77605062 75457698 73649122 72357180 71313866 70552195 69836012 69087447 68384129 67848174
4493 67848174 67745990 67947862 68285991 68339244 68022500 67729487 67755091 67815130 67229273 66040468
4483 66040468 64453713 63061949 62306244 62131357 62220523 62208299 61686878 60108958 57696129
$$ packed form
4546C5278412P93505R60043R89099R17662J021650R95500J161450J214961R45296
4537D4277578R36413O49989L14330q539j37680j53068j41855k20814r1560K35756
4527D5660550K70087N90305P90182J063549J294676J564473J744344K127446K462024
4518E7567636K782899K814407K908814K768803K542513K610718K529855K499013
4510G9024658K407276J795071J211398M13235o81308j650555k496754k417959
4502G7605062k147364j808576j291942j043314p61671p16183p48565p03318n35955
4493F7848174j02184K01872L38129N3253l16744k93013K5604O0039n85857j188805
4483F6040468j586755j391764p55705j74887Q9166j2224n21421j577920k412829
$$ plain form
4474 57696129 54854520 51836513 48912883 46188999 43653663 41110999 38997095 36989738
4466 36989738 35135472 33394042 31888802 30365338 29022259 27839823 26670746 25544766
4458 25544766 24620913 23868326 23183874 22495196 21915035 21483740 20965325 20428287 19887020
4449 19887020 19427538 18968026 18580212 18188196 17759122 17552766 17383339 17036639 16732861
4440 16732861 16642879 16445668 16168736 15945600 15814859 15666307 15379086 15250264 15152689 14934576
4430 14934576 14687695 14486805 14297963 14217458 14223663 13932047 13680372 13606187 13247943 12819068
4420 12819068 12723885 12573789 12352406 12273888 12127745 11944462 11821802 11585000 11516580 11424010
4410 11424010 11311058 11299160 11133250 11090525 10913431 10834642 10759577 10720341 10745264 10648646 10508754
$$ packed form
4474E7696129k841609l018007k923630k723884k535336k542664k113904k007357
4466C6989738j854266j741430j505240j523464j343079j182436j169077j125980
4458B5544766r23853p52587o84452o88678n80161m31295n18415n37038n41267
4449A9887020m59482m59512l87814l92016m29074k06356j69427l46700l03778
4440A6732861q9982j97211k76932k23136j30741j48552k87221j28822r7575k18113
4430A4934576k46881k00890j88842q0505O205k91616k51675p4185l58244m28875
4420A2819068r5183j50096k21383p8518j46143j83283j22660k36802o8420r2570
4410A1424010j12952j1898j65910m2725j77094p8789p5065l9236K4923r6618j39892
$$ plain form
4399 10508754 10433133 10456471 10498588 10471224 10380612 10550924 10681026 10830171 10953170 11041121
4389 11041121 11376269 11505203 11342438 11309755 11081641 10916697 10700898 10567436 10557695 10529752
4379 10529752 10566221 10694601 10779847 10802221 10838312 10905220 11008196 10928366 10992404 11045882 11336312
4368 11336312 11442102 11603414 11856827 12108362 12358845 12711616 13005944 13390063 13699859
4359 13699859 14189022 14658661 15155608 15538009 15908260 16359413 16748287 17176637 17584620
4350 17584620 17848572 18225138 18588702 18833948 18812747 18644770 18318003 18032400 17561927 17033681
4340 17033681 16534030 16179610 15844869 15547113 15339207 15131053 14936915 14690667 14495765
4331 14495765 14400833 14161566 13930173 13799490 13711431 13645496 13663654 13630239 13635669 13710300 13697764
$$ packed form
4399A0508754p5621K3338M2117k7364r0612J70312J30102J49145J22999Q7951
4389A1041121L35148J28934j62765l2683k28114j64944k15799j33462r741k7943
4379A0529752L6469J28380Q5246K2374L6091O6908J02976p9830O4038N3478K90430
4368A1336312J05790J61312K53413K51535K50483L52771K94328L84119L09796
4359A3699859M89163M69639M96947L82401L70251M51153L88874M28350M07983
4350A7584620K63952L76566L63564K45246k1201j67977l26767k85603m70473n28246
4340A7033681m99651l54420l34741k97756k07906k08154j94138k46248j94902
4331A4495765r4932k39267k31393j30683q8059o5935J8158l3415N430P4631j2536
$$ plain form
4320 13697764 13639088 13800344 13878038 13969874 14074441 14198600 14194651 14245047 14388036 14414074 14643283
4309 14643283 14735345 14823520 14942529 14927602 14866476 14679574 14519935 14411290 14135034 13784030
4299 13784030 13620503 13553135 13434123 13309752 13069452 12928314 12953061 12885129 12799754 12779760
4289 12779760 12697136 12644061 12699502 12716879 12860871 12850838 12975280 13086980 13103705 13197778 13218074
4278 13218074 13055599 12818461 12545287 12301162 11981641 11629654 11538563 11441136 11298561 11189487
4268 11189487 11153779 11043719 10913253 10656596 10566338 10460983 10323785 10278257 10144718 10096924
4258 10096924 10107069 10110682 10171998 10174399 10236696 10346347 10549871 10486330 10489478 10502831 10584063
4247 10584063 10672578 10750828 10788454 10642682 10581069 10400635 10303005 10225204 10007601 10023799 9962936
$$ packed form
4320A3697764n8676J61256P7694R1836J04567J24159l949N0396J42989K6038K29209
4309A4643283R2062Q8175J19009j4927o1126j86902j59639j08645k76256l51004
4299A3784030j63527o7368j19012j24371k40300j41138K4747o7932q5375j9994
4289A2779760q2624n3075N5441J7377J43992j0033J24442J11700J6725R4073K0296
4278A3218074j62475k37138k73174k44125l19521l51987r1091r7427j42575j09074
4268A1189487l5708j10060j30466k56657r0258j05355j37198m5528j33539m7794
4258A0096924J0145L613O1316K401O2297J09651K03524o3541L148J3353Q1232
4247A0584063Q8515P8250L7626j45772o1613j80434r7630p7801k17603J6198o0863
$$ plain form
4236 9962936 10067950 10063310 10038138 10169333 10401579 10444929 10596892 10850090 11063276 11170765
4226 11170765 11341773 11385385 11533903 11594518 11807080 11773329 11841767 11740420 11945518 12063735
4216 12063735 12287553 12417866 12542624 12672189 13060591 13320893 13620466 13900665 14288369
4207 14288369 14735636 15227345 15627971 16258645 16801090 17485675 18257252 19161081 19918798
4198 19918798 20551307 20991648 21601818 22300471 23111240 23944923 24829015 25615655 26714044
4189 26714044 27652249 28570247 29631283 30989647 32098696 33474261 34801008 36280998
4181 36280998 37541409 39109923 40641073 42442511 44192343 46353437 48633058 51172169
4173 51172169 53577268 56282181 59203178 62644777 66421337 70729224 75168594 80076180
$$ packed form
4236I962936J05014m640k5172J31195K32246M3350J51963K53198K13186J07489
4226A1170765J71008M3612J48518O0615K12562l3751O8438j01347K05098J18217
4216A2063735K23818J30313J24758J29565L88402K60302K99573K80199L87704
4207A4288369M47267M91709M00626O30674N42445O84585P71577R03829P57717
4198A9918798O32509M40341O10170O98653Q10769Q33683Q84092P86640J098389
4189B6714044R38205R17998J061036J358364J109049J375565J326747J479990
4181C6280998J260411J568514J531150J801438J749832K161094K279621K539111
4173E1172169K405099K704913K920997L441599L776560M307887M439370M907586
$$ plain form
4165 80076180 85247610 90779764 96836184 103986054 112401630 122853361 135074092 149963417
4157 149963417 169086442 195341881 230961895 277740692 322032608 328138285 309836255
4150 309836255 268545822 222127332 186363796 159295576 139257724 123680270 111898911
4143 111898911 102038022 94210135 87552237 81663411 76016546 71367639 67174572 64099469
4135 64099469 61778101 59970221 58064628 55942748 53238609 50605855 48044784 45667583
4127 45667583 43430966 41785043 40426808 39322614 38187315 37387577 36639774 36202152 35782448
4118 35782448 35621662 35281357 35047063 34977712 35081095 35224876 35420984 35714937 36231368 36722828
4108 36722828 37614405 38711927 40029826 41412714 43321890 45617516 48678306 52645137
$$ packed form
4165H0076180N171430N532154O056420P149870Q415576J0451731J2220731J4889325
4157A49963417J9123025K6255439L5620014M6778797M4291916O105677j8302030
4150C09836255m1290433m6418490l5763536k7068220k0037852j5577454j1781359
4143A11898911r860889p827887o657898n888826n646865m648907m193067l075103
4135F4099469k321368j807880j905593k121880k704139k632754k561071k377201
4127D5667583k236617j645923j358235j104194j135299p99738p47803m37622m19704
4118C5782448j60786l40305k34294o9351J03383J43781J96108K93953N16431M91460
4108C6722828Q91577J097522J317899J382888J909176K295626L060790L966831
$$ plain form
4100 52645137 58217541 64604853 70237188 71905436 69025947 63071735 55985678 49758982
4092 49758982 44930919 41218274 38346424 35936342 33870636 32185916 31000518 29780386
4084 29780386 28634200 27755222 26906662 26233993 25965515 25786129 25733729 25615750 25595224 25476749
4074 25476749 25437533 25528405 25812585 26130482 26395590 26442566 26279900 25870836 25698022 25572856
4064 25572856 25657203 25750171 25963436 26138415 26311054 26502772 26845570 27120686 27538824 27920639
4054 27920639 28367548 28927544 29750020 30398313 31092962 31754397 32626329 33629832 34575812
4045 34575812 35613207 36833587 38116540 39428821 40937484 42695250 44596554 46788787
4037 46788787 49297237 52375198 55624841 58951685 61022350 61966410 61860972 61285767 61031400
$$ packed form
4100E2645137N572404O387312N632335J668248k879489n954212p086057o226696
4092D9758982m828063l712645k871850k410082k065706j684720j185398j220132
4084B9780386j146186q78978q48560o72669k68478j79386n2400j17979k0526j18475
4074B5476749l9216R0872K84180L17897K65108M6976j62666m09064j72814j25166
4064B5572856Q4347R2968K13265J74979J72639J91718L42798K75116M18138L81815
4054B7920639M46909N59996Q22476O48293O94649O61435Q71932J003503R45980
4045C4575812J037395J220380J282953J312281J508663J757766J901304K192233
4037D6788787K508450L077961L249643L326844K070665R44060j05438n75205k54367
$$ plain form
4028 61031400 61136861 61380265 61737553 62408924 63213380 64209696 65427293 66861344 68568201
4019 68568201 70612135 72808321 75193451 78145985 81318750 84128374 85838791 86678170
4011 86678170 86647709 86243679 85967945 85961637 86080807 86343754 86639616 86945574 87702020 89265455
4001 89265455 91642591 95421921 100234392 106360806 114618997 126151087 141295135 159815067
3993 159815067 172432209 171047738 159634250 140742132 122107989 107449540 96360284
3986 96360284 87884617 81148609 75802762 71618536 68299546 65905883 63699429 62067240
3978 62067240 60873630 59755194 58751601 58017560 57175597 56175162 54941063 53321279
3970 53321279 51567824 50076365 48504163 47281348 46466878 45835490 45100363 44222941 43169299
$$ packed form
4028F1031400J05461K43404L57288O71371Q04456R96316J217597J434051J706857
4019F8568201K043934K196186K385130K952534L172765K809624J710417Q39379
4011H6678170l0461m04030k75734o308J19170K62947K95862L05958P56446J563435
4001H9265455K377136L779330M812471O126414Q258191J1532090J5144048J8519932
3993A59815067J2617142j384471j1413488j8892118j8634143j4658449j1089256
3986I6360284q475667o736008n345847m184226l318990k393663k206454j632189
3978F2067240j193610j118436j003593p34041q41963j000435j234099j619784
3970E3321279j753455j491459j572202j222815q14470o31388p35127q77422j053642
$$ plain form
3961 43169299 42035372 40987561 40072751 39597914 39101243 38803050 38715050 38677414 38502980
3952 38502980 38116408 37791109 37309491 36691866 36029978 35382263 34741658 34069685 33463591
3943 33463591 32879256 32315728 31927716 31455272 31219130 30985939 31011297 31162992 31200224 31443976
3933 31443976 31817960 32081501 32298357 32518899 32719017 32871265 32922739 33057343 33131783 33295388
3923 33295388 33348292 33486178 33754087 34094021 34439634 34775864 35317682 35778588 36298151 36646614
3913 36646614 36729992 36734405 36678331 36565331 36460509 36402500 36349830 36325164 36264047 36377258 36528635
3902 36528635 36626648 36953902 37423470 38021125 38802618 39798334 41008272 42604831 44574850
3893 44574850 47066026 50249800 54375858 59786991 66592468 74141657 80490599 81726318
$$ packed form
3961D3169299j133927j047811r14810m74837m96671k98193q8000l7636j74434
3952C8502980l86572l25299m81618o17625o61888o47715o40605o71973o06094
3943C3463591n84335n63528l88012m72444k36142k33191K5358J51695L7232K43752
3933C1443976L73984K63541K16856K20542K00118J52248N1474J34604P4440J63605
3923C3295388N2904J37886K67909L39934L45613L36230N41818M60906N19563L48463
3913C6646614Q3378M413n6074j13000j04822n8009n2670k4666o1117J13211J51377
3902C6528635R8013L27254M69568N97655P81493R95716J209938J596559J970019
3893D4574850K491176L183774M126058N411133O805477P549189O348942J235719
$$ plain form
3885 81726318 78021095 70462064 61605301 53926823 47625171 42710097 38840739 35641150
3877 35641150 33062112 30777466 28874844 27316862 25892997 24580997 23447600 22421473
3869 22421473 21574050 20875638 20300951 19836711 19287013 18882623 18387599 18082911 17842255
3860 17842255 17604727 17318880 17147313 16954678 16898290 16714371 16708604 16887562 17022033 17014086
3850 17014086 17068215 17039247 17149448 17188826 17177313 17140593 17270817 17463673 17583425 17822527
3840 17822527 18066714 18283141 18653507 19024392 19434386 19917471 20389542 20807390 21446526
3831 21446526 22082381 22744265 23408975 24200371 25048493 25994860 26855859 27918010 29125541
3822 29125541 30518305 32052784 33666754 35625814 37822707 39856292 41919662 44155771
$$ packed form
3885H1726318l705223p559031q856763p678478o301652m915074l869358l199589
3877C5641150k579038k284646j902622j557982j423865j312000j133397j026127
3869B2421473q47423o98412n74687m64240n49698m04390m95024l04688k40656
3860A7842255k37528k85847j71567j92635n6388j83919n767J78958J34471p947
3850A7014086N4129k8968J10201L9378j1513l6720J30224J92856J19752K39102
3840A7822527K44187K16427L70366L70885M09994M83085M72071M17848O39136
3831B1446526O35855O61884O64710P91396Q48122R46367Q60999J062151J207531
3822B9125541J392764J534479J613970J959060K196893K033585K063370K236109
$$ plain form
3814 44155771 46679000 49736000 53440776 57794217 62819056 68610966 75513285 83121419
3806 83121419 90613952 96767351 101233099 104476182 107240187 109215711 108657109 104695597
3798 104695597 98069973 90191346 82908246 76954651 72569127 69634650 67660148 66808277
3790 66808277 66576565 66930529 67208503 66733381 65025628 62045206 58363196 54467560 50715679
3781 50715679 47142153 44072143 41228763 38643739 36280553 34134617 32305477 30586218
3773 30586218 28947460 27617321 26546543 25465780 24411991 23672517 23031700 22488457 22021388
3764 22021388 21553582 21109356 20793641 20569209 20127576 19631389 19243006 18692124 18251241
3755 18251241 17838339 17389020 17022206 16657707 16342459 16028029 15755799 15365350 15099635
$$ packed form
3814D4155771K523229L057000L704776M353441N024839N791910O902319P608134
3806H3121419P492533O153399M465748L243083K764005J975524n58602l961512
3798A04695597o625624p878627p283100n953595m385524k934477j974502q51871
3790F6808277k31712L53964K77974m75122j707753k980422l682010l895636l751881
3781E0715679l573526l070010k843380k585024k363186k145936j829140j719259
3773C0586218j638758j330139j070778j080763j053789p39474o40817n43243m67069
3764B2021388m67806m44226l15715k24432m41633m96187l88383n50882m40883
3755A8251241m12902m49319l66814l64499l15248l14430k72230l90449k65715
$$ plain form
3746 15099635 14658929 14125902 13649450 13148067 12791255 12529570 12125724 11786195 11577328
3737 11577328 11387909 11006005 10901626 10831504 10700000 10537941 10486758 10581927 10696234 10755785
3727 10755785 10897088 10889482 10761861 10655768 10481864 10307821 10072611 9835579 9640581 9383688
3717 9383688 9169058 8960287 8769457 8599425 8539046 8359294 8158355 7982879 7876441 7776960
3707 7776960 7481340 7470108 7386037 7354121 7324105 7212232 7105283 7092015 7176198 7144821 7187161
3696 7187161 7200942 7398359 7526141 7544418 7631325 7750660 7842447 7968667 7933359 7963811 8007332
3685 8007332 8087939 8309948 8686464 9038715 9470889 10169045 10999676 11949487 13007841 13951695
3675 13951695 14406673 14251393 13477146 12319880 11166470 10138569 9325223 8593681 8013553
$$ packed form
3746A5099635m40706n33027m76452n01383l56812k61685m03846l39529k08867
3737A1577328j89419l81904j04379p0122j31504j62059n1183R5169J14307N9551
3727A0755785J41303p606j27621j06093j73904j74043k35210k37032j94998k56893
3717I383688k14630k08771j90830j70032o0379j79752k00939j75476j06438r9481
3707G776960k95620j1232q4071l1916l0016j11873j06949j3268Q4183l1377M2340
3696G187161J3781J97417J27782J8277Q6907J19335R1787J26220l5308L0452M3521
3685H007332Q0607K22009L76516L52251M32174O98156Q30631R49811J058354R43854
3675A3951695M54978j55280p74247j157266j153410j027901q13346p31542n80128
$$ plain form
3666 8013553 7611797 7315133 7096667 6817131 6598947 6269679 5956730 5878840 5548887 5488116
3656 5488116 5328206 5128712 4924282 4728782 4587006 4527878 4445250 4314978 4109415 4038901
3646 4038901 4031506 3922239 3875538 3753456 3723434 3699357 3773577 3719278 3786234 3718239 3852633
3635 3852633 4001793 4039361 4222817 4517106 4649579 4752402 4680009 4569470 4442907 4298002
3625 4298002 4348434 4331503 4392789 4414807 4315112 4211458 3997764 3948510 3823674 3679193 3538857
3614 3538857 3415478 3361721 3367287 3337100 3357958 3441820 3268706 3202766 3086086 3017296 3042122
3603 3042122 2980467 2947872 2909563 2887268 2972299 2966809 2939448 2851898 2814059 2807585 2823236 2903876
3591 2903876 2848468 2825707 2884352 2976695 2976454 2978909 3033302 2898615 2805778 2894779 2888765 2863757
$$ packed form
3666H013553m01756k96664k18466k79536k18184l29268l12949p7890l29953o0771
3656E488116j59910j99494k04430j95500j41776n9128q2628j30272k05563p0514
3646D038901p395j09267m6701j22082l0022k4077P4220n4299O6956o7995J34394
3635C852633J49160L7568J83456K94289J32473J02823p2393j10539j26563j44905
3625D298002N0432j6931O1286K2018r9695j03654k13694m9254j24836j44481j40336
3614C538857j23379n3757N566l0187K0858Q3862j73114o5940j16680o8790K4826
3603C042122o1655l2595l8309k2295Q5031n490k7361q7550l7839o474J5651Q0640
3591B903876n5408k2761N8645R2343k41K455N4393j34687r2837Q9001o014k5008
$$ plain form
3579 2863757 2952240 2928263 2989763 2917523 2919615 3019281 3024665 3035403 3020513 2994898 3018061 2988492
3567 2988492 2881887 2866849 2854525 2868140 2931601 2923434 2938574 2985481 2995327 3126209 3099337
3556 3099337 3035832 2993152 3071678 3174043 3293250 3411098 3325754 3439689 3512498 3435131 3534234
3545 3534234 3478600 3447225 3472468 3533688 3601356 3705274 3775265 3767573 3762343 3840714 3838085 3915729
3533 3915729 4025016 4152619 4322735 4353881 4335495 4383321 4146648 4077979 3945880 3743815
3523 3743815 3665915 3659839 3487753 3405224 3318515 3236671 3290729 3225877 3037215 3058648 3084675
3512 3084675 3063277 3112427 3031309 3033091 3046673 3045367 3000569 2975054 3047978 3061737 3049331 2929049
3500 2929049 2978865 3010210 2977713 3018977 2762156 2709805 2674378 2528242 2503653 2395106 2337181
$$ packed form
3579B863757Q8483k3977O1500p2240K092R9666N384J0738j4890k5615K3163k9569
3567B988492j06605j5038j2324J3615O3461q167J5140M6907R846J30882k6872
3556C099337o3505m2680P8526J02365J19207J17848q5344J13935P2809p7367R9103
3545C534234n5634l1375K5243O1220O7668J03918O9991p692n230P8371k629P7644
3533C915729J09287J27603J70116L1146j8386M7826k36673o8669j32099k02065
3523C743815p7900o076j72086q2529q6709q1844N4058o4852j88662K1433K6027
3512C084675k1398M9150q1118J782J3582j306m4798k5515P2924J3759j2406j20282
3500B929049M9816L1345l2497M1264k56821n2351l5427j46136k4589j08547n7925
$$ plain form
3489 2337181 2224842 2180254 2250338 2222407 2217391 2225544 2173971 2052760 2077946 2091051 2062189
3478 2062189 2059430 1962704 1911302 1892446 1997321 1990042 1931918 1901361 1871444 1839765 1791980 1714360
3466 1714360 1577650 1582338 1578518 1568990 1518562 1595546 1557187 1454074 1509949 1506599 1450214 1473563
3454 1473563 1252502 1277262 1299246 1281894 1272973 1268530 1153721 1064649 1040336 1092310 1034594
3443 1034594 978619 937135 1009694 994311 926901 1062707 1019102 976809 1011403 1046059 1019451
3432 1019451 924769 948969 752892 739498 852188 839193 796394 906270 901709 866574 882750
3421 882750 853460 887314 862081 834641 803026 774054 759281 883533 867232 763690 776507
3410 776507 697533 745154 712242 731070 700897 777653 784241 820267 966444 894921 959744 902974
$$ packed form
3489B337181j12339m4588P0084k7931n016Q153n1573j21211K5186J3105k8862
3478B062189k759r6726n1402j8856J04875p279n8124l0557k9917l1679m7785p7620
3466A714360j36710M688l820r528n0428P6984l8359j03113N5875l350n6385K3349
3454A473563k21061K4760K1984j7352q921m443j14809q9072k4313N1974n7716
3443A034594n5975m1484P2559j5383o7410J35806m3605m2293L4594L4656k6608
3432A019451r4682K4200j96077j3394J12690j2995m2799J09876m561l5135J6176
3421H82750k9290L3854k5233k7440l1615k8972j4773J24252j6301j03542J2817
3410G76507p8974M7621l2912J8828l0173P6756O588L6026J46177p1523O4823n6770
$$ plain form
3398 902974 794606 830639 807153 899705 930103 799753 685618 762708 839707 769031 718534
3387 718534 597647 595929 645873 699127 578849 656011 556859 585677 634505 648186 616315
3376 616315 612536 598686 615269 596069 549355 589106 519259 511254 509164 584257 564979 546985
3364 546985 579949 590515 554748 594181 614093 452529 531253 632983 597898 580846 581429 572751
3352 572751 540477 576660 677136 651111 675554 608264 651283 649317 582261 589338 577439 574433
3340 574433 621874 692063 720509 705984 767033 771220 782851 733657 745330 755998 656646 699544
3328 699544 725265 632860 683007 686369 613667 699317 563766 621549 522662 491970 590640 463548
3316 463548 458595 475445 472828 533038 463626 443920 426065 436079 425775 539868 529123 562122
$$ packed form
3398I02974j08368L6033k3486R2552L0398j30350j14135P7090P6999p0676n0497
3387G18534j20887j718M9944N3254j20278P7162r9152K8818M8828J3681l1871
3376F16315l779j3850J6583j9200m6714L9751o9847q005k090P5093j9278j7994
3364E46985L2964J0566l5767L9433J9912j61564P8724J01730l5085j7052N83q678
3352E72751l2274L6183J00476k6025K4443o7290M3019j966o7056P077j1899l006
3340E74433M7441P0189K8446j4525O1049M187J1631m9194J1673J0668r9352M2898
3328F99544K5721r2405N0147L362p2702Q5650j35551N7783r8887l0692R8670j27092
3316D63548m953J6850k617O0210o9412j9706j7855J0014j0304J14093j0745L2999
$$ plain form
3304 562122 414203 374590 315310 274722 345156 297803 348003 280408 302464 354607 311184
3293 311184 286049 263971 252724 359867 336334 236527 202929 207899 245186 205714 75807
3282 75807 99653 169413 226859 194046 188899 311186 261716 300442 207326 156222 148234 119002
3270 119002 234010 140401 100582 87139 109803 16844 87012 138491 247342 181481 70645
3259 70645 76743 50579 93427 154138 39893 82949 216744 201583 175419 126053 9754
3248 9754 24050 107879 142320 17428 79008 152826 159019 24688 81419 72411 -61267 -18512
3236 -18512 32471 50942 65317 115228 -3014 18071 112965 67163 53212 69233 42578 38028
3224 38028 101111 149004 46971 52307 148039 154056 131017 139617 140821 102574 44760 105926
$$ packed form
3304E62122j47919l9613n9280m0588P0434m7353N0200o7595K2056N2143m3423
3293C11184k5135k2078j1247J07143k3533r9807l3598M970L7287l9472j29907
3282G5807K3846O9760N7446l2813n147J22287m9470L8726r3116n1104p988k9232
3270A19002J15008r3609l9819j3443K2664r2959P0168N1479J08851o5861j10836
3259G0645O098k6164M2848O0711j14245M3056J33795j5161k6164m9366j16299
3248I754J4296Q3829L4441j24892O1580P3818O193j34331N6731r008j33678M2755
3236a8512N0983J8471J4375M9911j18242K1085R4894m5802j3951J6021k6655m550
3224C8028O3083M7893j02033N336R5732O017k3039Q600J204l8247n7814O1166
$$ plain form
3212 105926 4404 -30089 79979 137586 114871 87834 -7155 47178 100724 118481 50968
3201 50968 -5128 31369 21535 69624 23786 73902 -2009 22728 97175 42957 21433 66674
3189 66674 16942 63885 60937 66833 103053 53270 21865 113418 28256 -82009 42783 39582
3177 39582 19185 107684 116955 89869 171786 25066 54555 96360 141127 99731 42390 56349
3165 56349 34274 -10701 -10938 14364 178006 199267 136097 15965 169312 196706 171289 187678
3153 187678 155737 155112 136986 173431 158348 135699 48336 133650 67893 54008 177670 147766
3141 147766 87995 96230 -20694 48107 47495 -158890 -68868 77100 124663 67056 135481 70247
3129 70247 119224 130248 225481 181704 207819 189332 156666 151050 126367 231849 229741 73459
$$ packed form
3212A05926j01522l4493J10068N7607k2715k7037r4989N4333N3546J7757o7513
3201E0968n6096L6497r834M8089m5838N0116p5911K4737P4447n4218k1524M5241
3189F6674m9732M6943k948N896L6220m9783l1405R1553q5162j10265J24792l201
3177C9582k0397Q8499R271k7086Q1917j46720K9489M1805M4767m1396n7341J3959
3165E6349k2075m4975k37K5302J63642K1261o3170j20132J53347K7394k5417J6389
3153A87678l1941o25j8126L6445j5083k2649q7363Q5314o5757j3885J23662k9904
3141A47766n9771Q235j16924O8801o12k06385R0022J45968M7563n7607O8425o5234
3129G0247M8977J1024R5233m3777K6115j8487l2666n616k4683J05482k108j56282
$$ plain form
3117 73459 -4609 -74541 31390 113003 109435 49096 -72897 57903 23234 77223 104430
3106 104430 73627 58360 55225 115249 108249 207584 244375 226060 139074 248871 300764 202735
3094 202735 231699 128880 73596 51764 182045 183563 90365 84512 8294 11553 -2640 -15635
3082 -15635 102799 96321 26456 2807 5086 86431 49799 8645 16532 -16068 -292 75269
3070 75269 103523 133236 191392 85069 41066 154615 131953 33943 41251 59320 227119
3059 227119 241295 221749 169580 212783 217045 97603 -21698 10715 -23710 21826 90107
3048 90107 150912 221001 172855 224902 137905 89344 117038 116730 253499 220506 185285 48652
3036 48652 192586 89154 99492 130365 183573 115654 109257 173377 155325 211613 201970 104807
$$ packed form
3117G3459p8068o9932J05931Q1613l568o0339j21993J30800l4669N3989K7207
3106A04430l0803j5267l135O0024p000R9335L6791j8315q6986J09797N1893r8029
3094B02735K8964j02819n5284k1832J30281J518r3198n853p6218L259j4193j2995
3082a5635J18434o478o9865k3649K279Q1345l6632m1154P887l2600J5776P5561
3070G5269K8254K9713N8156j06323m4003J13549k2662r8010P308J8069J67799
3059B27119J4176j9546n2169M3203M262j19442j19301L2413l4425M5536O8281
3048I0107O0805P0089m8146N2047q6997m8561K7694l08J36769l2993l5221j36633
3036D8652J43934j03432J0338L0873N3208o7919o397O4120j8052N6288r643r7163
$$ plain form
3024 104807 127717 163067 142652 212255 199016 215914 219244 261692 234825 193788 221226 187260
3012 187260 249062 234574 260849 264415 198674 332303 334153 297213 329771 271509 268429 374319
3000 374319 405133 439475 323696 400168 426884 394159 420339 349992 494365 478346 463268
2989 463268 577793 542327 605963 507186 555238 538447 496256 580061 585370 679215 719216 647706
2977 647706 771483 813570 781496 867718 982508 971557 1010678 1094273 1029683 1034271 942955
2966 942955 949086 1038738 973654 987451 1059987 1018349 1009625 1163618 1205565 1104835 1191131 1218826
2954 1218826 1182025 1241697 1338985 1466606 1500748 1681627 1703447 1719262 1735348 1787292 1762345
2943 1762345 1721314 1706383 1718492 1698229 1774720 1810789 1824359 1954054 1874960 2081220 2305798
$$ packed form
3024A04807K2910L5350k0415O9603j3239J6898L330M2448k6867m1037K7438l3966
3012A87260O1802j4488K6275L566o5741J33629J850l6940L2558n8262l080J05890
3000C74319L0814L4342j15779P6472K6716l2725K6180p0347J44373j6019j5078
2989D63268J14525l5466O3636r8777M8052j6791m2191Q3805N309R3845M0001p1510
2977F47706J23777M2087l2074Q6222J14790j0951L9121Q3595o4590M588r1316
2966I42955O131Q9652o5084J3797P2536m1638q724J53993M1947j00730Q6296K7695
2954A218826l6801N9672R7288J27621L4142J80879K1820J5815J6086N1944k4947
2943A762345m1031j4931J2109k0263P6491L6069J3570J29695p9094K06260K24578
$$ plain form
2932 2305798 2407164 2549909 2612568 2670281 2568894 2572183 2566081 2491894 2453596 2324488 2126671
2921 2126671 1991478 1940355 1950808 1842761 1762193 1703548 1633703 1560302 1510290 1467868 1565522
2910 1565522 1516041 1375618 1424357 1464696 1489327 1477052 1525555 1455467 1398417 1301393 1142629
2899 1142629 1084810 1222370 1293245 1210309 1201839 1148121 1128424 1136605 1183898 1226272 1105917
2888 1105917 1061375 1014722 1036735 1131676 1025220 1106972 1247300 1305669 1389760 1409846 1273545
2877 1273545 1110015 1060696 995286 884638 861582 867906 848382 829909 870989 778535 707516
2866 707516 749672 797135 768280 665391 667691 780414 757691 697324 741371 812601 855793
2855 855793 985351 866724 659155 717527 657255 462115 474564 406193 468649 575350 520264
$$ packed form
2932B305798J01366J42745O2659N7713j01387L289o102p4187l8298j29108j97817
2921B126671j35193n1123J0453j08047q0568n8645o9845p3401n0012m2422R7654
2910A565522m9481j40423M8739M0339K4631j2275M8503p0088n7050r7024j58764
2899A142629n7819J37560P0875q2936q470n3718j9697Q181M7293M2374j20355
2888A105917m4542m6653K2013R4941j06456Q1752J40328N8369Q4091K0086j36301
2877A273545j63530m9319o5410j10648k3056O324j9524j8473M1080r2454p1019
2866G07516M2156M7463k8855j02889K300J12723k2723o0367M4047P1230M3192
2855H55793J29558j18627k07569N8372o0272j95140J2449o8371O2456J06701n5086
$$ plain form
2844 520264 424174 425447 346894 328708 457133 408210 355677 385747 418160 396513 470344 374333
2832 374333 402949 398610 372757 296788 394169 482796 364389 329907 291797 257540 249986 276108
2820 276108 275953 314904 327736 205650 275413 254056 279388 260244 273073 284970 237774 287444
2808 287444 327834 182489 247358 221563 179213 277584 304813 254814 274727 305435 276160
2797 276160 182054 256489 233184 206212 249959 215971 178195 121401 152650 101291 115677 142111
2785 142111 183676 143746 173624 172276 58707 136120 257050 98353 98646 99195 103453 109575
2773 109575 132880 199510 155051 229895 201955 173784 215038 259923 71177 148523 213680
2762 213680 125026 159857 197085 81064 97612 137550 165903 204729 139738 134168 185271 180744
$$ packed form
2844E20264r6090J273p8553j8186J28425m8923n2533L0070L2413k1647P3831r6011
2832C74333K8616m339k5853p5969R7381Q8627j18407l4482l8110l4257p554K6122
2820B76108j55L8951J2832j22086O9763k1357K5332j9144J2829J1897m7196M9670
2808B87444M0390j45345O4869k5795m2350R8371K7229m9999J9913L0708k9275
2797B76160r4106P4435k3305k6972M3747l3988l7776n6794L1249n1359J4386K6434
2785A42111M1565l9930K9878j348j13569P7413J20930j58697K93N49M258O122
2773A09575K3305O6630m4459P4844k7940k8171M1254M4885j88746P7346O5157
2762B13680q8654L4831L7228j16021J6548L9938K8353L8826o4991n570N1103m527
$$ plain form
2750 180744 159168 136216 116445 194608 235131 169284 140586 218148 160102 185453 158050 144853
2738 144853 99835 52398 136632 156207 165514 196966 114537 85103 85663 103448 33853 69687
2726 69687 57695 130586 156104 178687 166085 117223 83973 114627 70574 172882 282883
2715 282883 241181 346715 337534 248169 264336 224351 189387 302555 275715 328755 406861
2704 406861 303019 359420 357155 235509 274122 246929 440080 444136 395228 277365 445163
2693 445163 515657 404721 398733 426055 562594 653447 610228 467163 389400 447630 479591
2682 479591 521592 469514 410694 524918 442739 535087 568813 622638 587563 597083 551898 637172
2670 637172 541427 436807 521961 513590 559883 558755 520246 433609 452317 549235 499979 507699
$$ packed form
2750A80744k1576k2952j9771P8163M0523o5847k8698P7562n8046K5351k7403j3197
2738A44853m5018m7437Q4234J9575R307L1452q2429k9434N60J7785o9595L5834
2726F9687j1992P2891K5518K2583j2602m8862l3250L0654m4053J02308J10001
2715B82883m1702J05534r181q9365J6167l9985l4964J13168k6840N3040P8106
2704D06861j03842N6401k265j21646L8613k7193J93151M056m8908j17863J67798
2693D45163P0494j10936n988K7322J36539R0853m3219j43065p7763N8230L1961
2682D79591M2001n2078n8820J14224q2179R2348L3726N3825l5075R520m5185Q5274
2670F37172r5745j04620Q5154q371M6293j128l8509q6637J8708R6918m9256P720
$$ plain form
2658 507699 555944 544511 479454 542288 472129 465227 476414 443844 491370 498747 410106 338801
2646 338801 403333 410929 445301 468986 434638 432314 378453 326636 378368 367620 298626 318589
2634 318589 228065 237272 329975 294449 252337 188896 155507 181519 140184 109067 230648 127530
2622 127530 118975 125563 93899 20629 33999 111236 125756 153107 111830 54749 20003 22373
2610 22373 26729 73934 -53122 33075 -24079 -38305 -124833 -16381 -2457 -87390 -22962 -55549
2598 -55549 10974 -64561 -112321 -123553 -79926 23522 -58819 -54424 10649 -27274 24252 -38454
2586 -38454 -124061 -108899 15445 -20451 -43460 -122502 -188524 -131479 -19533 -135646 -25182
2575 -25182 4325 -51279 -167836 -215991 -100764 -140759 -123781 -180062 -101220 -151431 -131978
$$ packed form
2658E07699M8245j1433o5057O2834p0159o902J1187l2570M7526P377q8641p1305
2646C38801O4532P596L4372K3685l4348k324n3861n1817N1732j0748o8994J9963
2634C18589r0524R207R2703l5526m2112o3441l3389K6012m1335l1117J21581j03118
2622A27530q555O588l1664p3270J3370P7237J4520K7351m1277n7081l4746K370
2610B2373M356M7205j27056Q6197n7154j4226q6528J08452J3924q4933O4428l2587
2598e5549O6523p5535m7760j1232M3627J03448q2341M395O5073l7923N1526o2706
2586c8454q5607J5162J24344l5896k3009p9042o6022N7045J11946j16113J10464
2575b5182K9507n5604j16557m8155J15227l9995J6978n6281P8842n0211J9453
$$ plain form
2564 -131978 -129193 -177036 -99071 -185632 -106488 -95894 -114332 -123889 -104676 -145512 -135219 -179253
2552 -179253 -81322 -71296 -178768 -161385 -149294 -155485 -96077 -160469 -181457 -172109 -212553 -216566
2540 -216566 -163568 -153790 -141111 -115226 -151754 -109277 -95646 -81713 -58126 -50739 -186473 -165044
2528 -165044 -246200 -210983 -194953 -249224 -214796 -130656 -122329 -161119 -162589 -101880 -42128 -198321
2516 -198321 -184255 -246841 -155014 -149471 -123797 -85067 -67693 -93853 -154235 -148547 -228100 -97312
2504 -97312 -146777 -119927 -95516 -190840 -132210 -97585 -62731 -74020 -142704 -108263 -141190 -153108
2492 -153108 -178562 -195864 -161157 -193578 -178149 -202033 -201261 -153436 -253117 -192428 -57346 -76987
2480 -76987 -130195 -117959 -189504 -157688 -21927 -46298 -125828 -152430 -78117 -132766 -159160 -233879
$$ packed form
2564a31978K785m7843P7965q6561P9144J0594j8438r557J9213m0836J0293m4034
2552a79253R7931J0026j07472J7383J2091o191N9408o4392k0988R348m0444m013
2540b16566N2998R778J2679K5885l6528M2477J3631J3933K3587P387j35734K1429
2528a65044q1156L5217J6030n4271L4428Q4140Q327l8790j470O0709N9752j56193
2516a98321J4066o2586R1827N543K5674L8730J7374k6160o0382N688p9553J30788
2504i7312m9465K6850K4411r5324N8630L4625L4854j1289o8684L4441l2927j1918
2492a53108k5454j7302L4707l2421J5429k3884P72M7825r9681O0689J35082j9641
2480g6987n3208J2236p1545L1816J35761k4371p9530k6602P4313n4649k6394p4719
$$ plain form
2468 -233879 -135695 -50674 -57147 -77404 -144044 -238805 -90249 -152460 -172988 -164999 -150235 -244510
2456 -244510 -355023 -308555 -287524 -145378 -215713 -201125 -226750 -229075 -179025 -217428 -165413
2445 -165413 -115192 -123005 -138467 -39075 -116145 -187943 -175347 -243204 -263794 -210448 -275804 -268468
2433 -268468 -92107 -52960 -100012 -64145 -89925 -170883 -104435 -91059 -183579 -188872 -214774 -252926
2421 -252926 -75940 -151127 -53062 -126945 -188672 -167949 -188691 -190059 -134364 -176501 -165011 -180010
2409 -180010 -116694 -80156 22705 -67375 -177240 -234722 -117001 -111325 -286082 -271392 -146667
2398 -146667 -233499 -251421 -200759 -203119 -220347 -165099 -175157 -128542 -144500 -183379 -355534 -277295
2386 -277295 -132731 -116468 -52092 -119775 -216721 -175634 -273658 -214486 -255616 -285128 -180487
$$ packed form
2468b33879R8184Q5021o473k0257o6640r4761J48556o2211k0528P989J4764r4275
2456b44510j10513M6468K1031J42146p0335J4588k5625k325N0050l8403N2015
2445a65413N0221p813j5462R9392p7070p1798J2596o7857k0590N3346o5356P336
2433b68468J76361L9147m7052L5867k5780q0958O6448J3376r2520n293k5902l8152
2421b52926J76986p5187R8065p3883o1727K0723k0742j368N5695m2137J1490j4999
2409a80010O3316L6538J02861r0080j09865n7482J17721N676j74757J4690J24725
2398a46667q6832j7922N0662k360j7228N5248j0058M6615j5958l8879j72155P8239
2386b77295J44564J6263O4376o7683r6946M1087r8024N9172m1130k9512J04641
$$ plain form
2375 -180487 -192593 -189962 -227150 -213634 -229334 -281133 -201268 -162667 -174432 -174416 -194448 -138684
2363 -138684 -72334 -93288 -48287 -42522 -164390 -182456 -245015 -236545 -217784 -139735 -223232 -93489
2351 -93489 -238092 -163249 -153461 13547 -131528 -53661 -127556 -41403 -73971 1126 -42551
2340 -42551 -177265 -186729 -128583 -173621 -220348 -99378 -167138 -146072 -274438 -225458 -197833
2329 -197833 -282959 -234995 -166408 -221492 -163621 -78405 -83525 -147664 -156922 -137121 -127994 -177002
2317 -177002 -191316 -83629 18338 -120776 -126455 -107259 -57676 -155016 -208870 -109072 -64471
2306 -64471 -93739 -65863 -76748 -58886 -150287 -180117 -118373 -176408 -160865 -150241 -134002 -82304
2294 -82304 -64688 -42007 -78486 -81142 -26237 -31382 -61143 -81405 22148 -131600 -139888 -153893
$$ packed form
2375a80487j2106K631l7188J3516j5700n1799P9865L8601j1765J6k0032N5764
2363a38684O6350k0954M5001N765j21868j8066o2559Q470J8761P8049q3497J29743
2351i3489j44603P4843R788J67008j45075P7867p3895Q6153l2568P5097m3677
2340d2551j34714r464N8146m5038m6727J20970o7760K1066j28366M8980K7625
2329a97833q5126M7964O8587n5084N7871Q5216n120o4139r258J9801R127m9008
2317a77002j4314J07687J01967j39114n679J9196M9583r7340n3854R9798M4601
2306f4471k9268K7876j0885J7862r1401k9830O1744n8035J5543J0624J6239N1698
2294h2304J7616K2681l6479k656N4905n145k9761k0262J03553j53748q288j4005
$$ plain form
2282 -153893 -168898 -81475 -219023 -66945 -20360 -102001 -47552 -68996 -81070 -93370 -53121
2271 -53121 -50021 -45061 -160742 -219690 -186805 -216428 -162633 -36295 -67433 -119766 -140672 -188088
2259 -188088 -233510 -170808 -222347 -187714 -158596 -84839 -149906 -142371 -59533 -109448 -68594 -126791
2247 -126791 -76468 -79772 -52501 7148 -90676 -79282 -77261 -9149 4211 -124827 -59843 -38338
2235 -38338 -103745 -117169 -108630 -37146 -112864 -180830 -125606 -63281 -34539 -103735 -95773 -162312
2223 -162312 -233731 -228466 -129572 -26494 -33574 -97973 -75998 -64408 -29615 -111847 -55084 -44150
2211 -44150 -11710 40805 -152357 -78435 -101680 -176803 -91101 -106959 -85677 -130689 -174915 -142115
2199 -142115 -82297 -71249 -45602 -78503 -116928 -137155 52177 -14835 -63379 -128523 -126398 -145536
$$ packed form
2282a53893j5005Q7423j37548J52078M6585q1641N4449k1444j2074j2300M0249
2271e3121L100M960j15681n8948L2885k9623N3795J26338l1138n2333k0906m7416
2259a88088m5422O2702n1539L4633K9118P3757o5067P535Q2838m9915M0854n8197
2247a26791N0323l304K7271N9649r7824J1394K021O8112J3360j29038O4984K1505
2235c8338o5407j3424Q539P1484p5718o7966N5224O2325K8742o9196P962o6539
2223a62312p1419N265R8894J03078p080o4399K1975J1590L4793q2232N6763J0934
2211d4150L2440N2515j93162P3922k3245p5123Q5702j5858K1282m5012m4226L2800
2199a42115N9818J1048K5647l2901l8425k0227J89332o7012m8544o5144K125j9138
$$ plain form
2187 -145536 -175505 -175811 -105749 -61316 -141639 -115874 -72824 -78150 43680 -28792 -110888 -156954
2175 -156954 -146654 -32804 15350 11990 -61981 -99858 -94383 27969 -30135 -57625 27946 -30192
2163 -30192 -110199 -63234 -22458 -77700 -56926 20426 81142 -47245 -85362 -78059 -23877 -29852
2151 -29852 -46900 -44060 29829 73169 -12745 -23989 23341 33287 30810 -8368 35967 171667
2139 171667 214181 141597 94648 132806 107107 177790 198233 230019 173300 238013 291658 243681
2127 243681 209830 248276 180478 243081 356214 438717 470615 528036 514880 432592 576226
2116 576226 458613 544836 527997 538720 555428 608524 721505 724559 826542 799285 936926
2105 936926 1019969 1109246 1169691 1139770 1246372 1303628 1377340 1592865 1635257 1722360 1897328
$$ packed form
2187a45536k9969l06P0062M4433q0323K5765M3050n326J21830p2472q2096m6066
2175a56954J0300J13850M8154l360p3971l7877N475J22352n8104k7490Q5571n8138
2163c0192q0007M6965M0776n5242K0774P7352O0716j28387l8117P303N4182n975
2151b9852j7048K840P3889M3340q5914j1244M7330R946k477l9178M4335J35700
2139A71667M2514p2584m6949L8158k5699P0683K0443L1786n6719O4713N3645m7977
2127B43681l3851L8446o7798O2603J13133Q2503L1898N7421j3156q2288J43634
2116E76226j17613Q6223j6839J0723J6708N3096J12981L054J01983k7257J37641
2105I36926Q3043Q9277O0445k9921J06602N7256P3712K15525M2392Q7103J74968
$$ plain form
2094 1897328 2059377 2110546 2343043 2498442 2771434 2992517 3280755 3593153 3848138 4147688
2084 4147688 4595516 5080161 5668634 6385984 7456233 8959330 10853078 13331738 16424613
2075 16424613 17169518 16033569 13622202 10793160 8698796 7142307 6137926 5235365
2067 5235365 4586935 4117978 3856817 3527337 3180648 2732717 2503489 2193934 2104969 1866470
2057 1866470 1739715 1727400 1535050 1394041 1299167 1222478 1140332 1097316 924764 823540
2047 823540 850783 687784 638203 556703 548901 566046 592483 600302 600194 499141 489221 533617
2035 533617 554297 497070 443304 437084 352921 281353 277731 306413 320953 388982 394481 350273
2023 350273 309410 181796 236695 252972 165372 163847 166844 219717 195315 248021 234507 187944
$$ packed form
2094A897328J62049N1169K32497J55399K72992K21083K88238L12398K54985K99550
2084D147688M47828M84645N88473P17350J070249J503097J893748K478660L092875
2075A6424613P44905j135949k411367k829042k094364j556489j004381r02561
2067E235365o48430m68957k61161l29480l46689m47931k29228l09555q8965k38499
2057A866470j26755j2315j92350j41009r4874p6689q2146m3016j72552j01224
2047H23540K7243j62999m9581q1500p802J7145K6437P819j08j01053r920M4396
2035E33617K0680n7227n3766o220q4163p1568l622K8682J4540O8029N499m4208
2023C50273m0863j27614N4899J6277q7600j525K997N2873k4402N2706j3514m6563
$$ plain form
2011 187944 243122 271686 241101 170338 180600 115393 90362 68911 14185 58348 39638 89333
1999 89333 126793 84159 56267 56519 -5980 -9781 -36021 -2724 -32310 -120618 -123351 -109633 26301
1986 26301 37064 -10152 -41285 2166 98086 53480 -75693 -16808 12512 -51889 -82365 -27075
1974 -27075 24066 -1374 -47243 -56621 -49796 -120033 -111683 -89324 -72180 -80080 -103829 -31520 -152136
1961 -152136 -161624 -81725 -52542 -178381 -142626 -78643 -34329 -169789 -123374 -64019 -86908
1950 -86908 1935 -156787 -151501 -138047 -99722 -48509 -96955 -57311 -54831 -110795 -183517 -107710
1938 -107710 -53755 -38288 -81731 -121934 -65121 -115068 -8632 17212 -55818 -100919 -121261
1927 -121261 -99171 -26150 -68301 -97827 -56057 -120788 -61168 -83754 -4145 13261 -71148 -38397
$$ packed form
2011A87944N5178K8564l0585p0763J0262o5207k5031k1451n4726M4163j8710M9695
1999H9333L7460m2634k7892K52o2499l801k6240L3297k9586q8308k733J3718J35934
1986B6301J0763m7216l1133M3451R5920m4606j29173N8885K9320o4401l0476N5290
1974b7075N1141k5440m5869r378O825p0237Q350K2359J7144p900k3749P2309j20616
1961a52136r488P9899K9183j25839L5755O3983M4314j35460M6415N9355k2889
1950h6908Q8843j58722N286J3454L8325N1213m8446L9644K480n5964p2722P5807
1938a07710N3955J5467m3443m0203N6813m9947J06436K5844p3030m5101k0342
1927a21261K2090P3021m2151k9526M1770o4731N9620k2586P9609J7406q4409L2751
$$ plain form
1915 -38397 -51903 -52766 -124356 -170691 -95565 -69816 -111362 -30863 -107361 -31946 -43991 -67049
1903 -67049 -108107 -148530 -131671 -71903 -61941 -134061 11763 -13731 -34813 47142 -64391 -93395
1891 -93395 -43687 -12496 -51640 -76879 -11193 -61760 -192648 -120322 -65812 -128168 -205650 -260295
1879 -260295 -189417 -223378 -111530 -69267 -85045 3695 -46820 -11427 -48060 2532 -24295
1868 -24295 -29790 -56242 -3515 -8818 -182483 -177225 -66822 -120566 -194840 -134376 -123214 -87607
1856 -87607 -134404 -111809 -130461 -135617 -162879 -160703 -163045 -182355 -248013 -107258 -50307 -91035
1844 -91035 -38359 83860 3388 -143604 -182068 -55341 -37672 -233659 -272225 -164873 -115834
1833 -115834 -163906 -105970 -71689 -76625 -38700 -52266 -71821 33659 -107286 -133104 -102544
$$ packed form
1915c8397j3506q63p1590m6335P5126K5749m1546Q0499p6498P5415j2045k3058
1903f7049m1058m0423J6859N9768R962p2120J45824k5494k1082Q1955j11533k9004
1891i3395M9708L1191l9144k5239O5686n0567j30888P2326N4510o2356p7482n4645
1879b60295P0878l3961J11848M2263j5778Q8740n0515L5393l6633N0592k6827
1868b4295n495k6452N2727n303j73665N258J10403n3744p4274O0464J1162L5607
1856h7607m6797K2595j8652n156k7262K176k342j9310o5658J40755N6951m0728
1844i1035N2676J22219q0472j46992l8464J26727J7669j95987l8566J07352M9039
1833a15834m8072N7936L4281m936L7925j3566j9555J05480j40945k5818L0560
$$ plain form
1822 -102544 -67020 -104489 -67173 -22211 -122308 -146992 -85949 -74264 -107236 -104895 -30379 -163199
1810 -163199 -176420 -126688 -41151 -32759 -85112 -32850 -36226 -112120 -166443 -116588 -58167 -46868
1798 -46868 -134115 -136555 -164666 -149866 -98456 -139015 -126119 -77193 -80098 -125311 -64010 -16629
1786 -16629 -72948 -10294 -38265 -27268 -104003 -126893 -138953 -103300 -3839 -135356 -125322 -99996
1774 -99996 -229582 -132196 -137283 -37325 -57784 -73142 -55893 -76867 -42890 -132108 -116109 -51551
1762 -51551 1936 -48993 -83672 -131133 -44864 -27524 -12582 -84970 -76318 53433 32790 -32571
1750 -32571 -136961 -86340 -46935 -103699 -119892 -146312 -47325 61054 54211 -7455 -73127 -93561
1738 -93561 -33600 -43831 -104034 -68165 -95243 -75769 -39822 -102187 -102030 -199155 -134525 -135716
$$ packed form
1822a02544L5524l7469L7316M4962j00097k4684O1043J1685l2972K341P4516j32820
1810a63199j3221M9732Q5537Q392n2353N2262l376p5894n4323M9855N8421J1299
1798d6868q7247k440k8111J4800N1410m0559J2896M8926k905m5213O1301M7381
1786a6629n6319O2654k7971J0997p6735k2890j2060L5653R9461j31517J0034K5326
1774i9996j29586R7386n087R9958k0459j5358J7249k0974L3977q9218J5999O4558
1762e1551N3487n0929l4679m7461Q6269J7340J4942p2388Q652J29751k0643o5361
1750c2571j04390N0621L9405n6764j6193k6420R8987J08379o843o1666o5672k0434
1738i3561N9961j0231o0203L5869k7078J9474L5947o2365J57r7125O4630j191
$$ plain form
1726 -135716 -46411 -130784 -148821 -93402 -191609 13853 -722 -94655 -4574 -85767 -149380
1715 -149380 -94857 -124504 -73296 -85781 -130574 -248757 -230447 -183605 -135266 -122319 -60799
1704 -60799 8122 -22025 -143359 -66327 -47446 -40746 -108476 -115880 -165922 -121347 -115339 -143153
1692 -143153 -110682 -163439 -170015 -49374 -11267 -108925 -125330 -139573 -121594 -205045 -139405 -120569
1680 -120569 -92461 -148963 -80478 -105676 -85526 -132338 -69609 -5534 -69425 -129674 -126826 -104625
1668 -104625 -151806 -8401 -97262 -86268 -147894 -76756 -29865 -94369 -134136 -80085 -9243
1657 -9243 13223 -40164 -5627 -99046 -77348 -139241 -177773 -189242 -239504 -170021 -118684 -28690
1645 -28690 -89128 -60480 -42509 -135500 -58581 73300 3439 -102736 -118345 -234232 -201621
$$ packed form
1726a35716Q9305q4373j8037N5419r8207K05462j4575r3933R0081q1193o3613
1715a49380N4523k9647N1208j2485m4793j18183J8310M6842M8339J2947O1520
1704f0799O8921l0147j21334P7032J8881O700o7730p404n0042M4575O008k7814
1692a43153L2471n2757o576J20641L8107r7658j6405j4243J7979q3451O5640J8836
1680a20569K8108n6502O8485k5198K0150m6812O2729O4075o3891o0249K848K2201
1668a04625m7181J43405q8861J0994o1626P1138M6891o4504l9767N4051P0842
1657i243K2466n3387L4537r3419K1698o1893l8532j1469n0262O9483N1337Q9994
1645b8690o0438K8648J7971r2991P6919J31881o9861j06175j5609j15887L2611
$$ plain form
1634 -201621 -111004 -243282 -210239 -149104 -89107 -79370 -45641 -151671 -97382 -138246 -169491
1623 -169491 -73123 -42062 -12413 -50351 -57182 -11777 -93821 -153290 -141797 21572 17885 11181
1611 11181 -82569 -179023 -154965 -95131 -67332 -43022 -75511 -61511 -143994 -176234 -132072 25729
1599 25729 -13363 -34283 -80633 -60253 24618 -86168 -129032 -123868 -105079 -128857 -67612 -74565
1587 -74565 -60928 -72746 -107904 -55136 -40600 -86733 -76548 -65711 -34846 -96147 -114776 -62382
1575 -62382 -8458 -87972 -69433 -27991 -99581 -107627 -99327 -64889 3182 -82964 -167047 -161852
1563 -161852 -27931 -78719 -60630 -119469 -67213 -135754 -144422 -110791 -64885 -25316 -26189 -28682
1551 -28682 -33411 -36295 -65882 -117840 -94713 -12200 -135881 -179549 -73509 -50798 -10654 -120643
$$ packed form
1634b01621R0617j32278L3043O1135N9997R737L3729j06030N4289m0864l1245
1623a69491R6368L1061K9649l7938o831M5405q2044n9469J1493J63369l687o704
1611A1181r3750r6454K4058N9834K7799K4310l2489J4000q2483l2240M4162J57801
1599B5729l9092k0920m6350K0380Q4871j10786m2864N164J8789k3778O1245o953
1587g4565J3637j1818l5158N2768J4536m6133J0185J0837L0865o1301j8629N2394
1575f2382N3924p9514J8539M1442p1590q046Q300L4438O8071q6146q4083N195
1563a61852J33921n0788J8089n8839N2256o8541q668L3631M5906L9569q73k493
1551b8682m729k884k9587n1958K3127Q2513j23681m3668J06040K2711M0144j09989
$$ plain form
1539 -120643 -114755 -83312 -54406 -149222 -136165 10273 -63395 -54858 11375 -96166 -226106
1528 -226106 -181773 -127887 -115222 -163600 -103820 -122937 -55394 -92374 -117644 -76908 11812 11873
1516 11873 -80765 -116024 -91678 -126483 -47144 -25059 431 -139890 -134000 -19660 -113987 -73983
1504 -73983 -116221 -206089 -135401 -153772 -86154 -62652 -89384 -107779 -60310 -99028 -110799 -144512
1492 -144512 -108341 -204937 -44719 -69561 -120149 -7315 10604 17060 12381 -21374 -74828 -175892
1480 -175892 -60181 23810 -50497 -36429 -45474 -66814 -54955 13465 -85620 -99868 -19260 -44458
1468 -44458 -182336 -150381 -181772 -137243 -101405 -14488 -61143 -24546 8974 -33815 -89914 -50118
1456 -50118 -44961 -131643 -193535 -65566 -30541 998 -127418 -147382 -105403 -111181 -28940 -140632
$$ packed form
1539a20643N888L1443K8906r4816J3057J46438p3668Q537O6233j07541j29940
1528b26106M4333N3886J2665m8378N9780j9117O7543l6980k5270M0736Q8720O1
1516A1873r2638l5259K4346l4805P9339K2085K5490j40321N890J14340r4327M0004
1504g3983m2238q9868P0688j8371O7618K3502k6732j8395M7469l8718j1771l3713
1492a44512L6171r6596J60218k4842n0588J12834J7919O456m679l3755n3454j01064
1480a75892J15711Q3991p4307J4068r045k1340J1859O8420r9085j4248Q0608k5198
1468d4458j37878L1955l1391M4529L5838Q6917m6655L6597L3520m2789n6099L9796
1456e0118N157q6682o1892J27969L5025L1539j28416j9964M1979n778Q2241j11692
$$ plain form
1444 -140632 -163045 -58384 -154358 -191230 -107045 -84149 -123671 -118358 -109447 -19129 76093 -77941
1432 -77941 -165540 -42199 -163860 -153363 -52090 -32583 21057 61649 -25321 -29622 -128292
1421 -128292 -95911 945 11919 -12468 -31504 -72818 -15574 -100083 -140001 -85817 -179860 -118582
1409 -118582 -155446 -148906 -200193 -174896 -138211 -32146 -58785 -68272 -70750 -161567 -146853 -47913
1397 -47913 -49651 -99520 -51294 -44035 -93217 -81884 -151232 -13832 14216 -18372 -80340 -60794
1385 -60794 -50592 -11880 22349 -65931 -55376 -94691 -56380 -129787 -64358 -21051 17690 -48988
1373 -48988 -147909 -48539 92273 -17537 -107721 -68868 -146956 -74779 -103227 -43324 100561
1362 100561 156369 100589 110126 91598 63125 -19981 -37801 -10005 -50206 -16129 5027 30922
$$ packed form
1444a40632k2413J04661r5974l6872Q4185K2896l9522N313Q911R0318R5222j54034
1432g7941q7599J23341j21661J0497J01273J9507N3640M0592q6970m301r8670
1421a28292L2381R6856J0974k4387j9036m1314N7244q4509l9918N4184r4043O1278
1409a18582l6864O540n1287K5297L6685J06065k6639r487k478r0817J4714R8940
1397d7913j738m9869M8226P259m9182J1333o9348J37400K8048l2588o1968J9546
1385f0794J0202L8712L4229q8280J0555l9315L8311p3407O5429M3307L8741o6678
1373d8988r8921R9370J40812j09810r0184L8853p8088P2177k8448N9903J43885
1362A00561N5808n5780R537j8528k8473q3106j7820K7796m0201L4077K1156K5895
$$ plain form
1350 30922 -18351 2224 12225 14309 101364 1837 -66893 -117522 19989 32019 -49886 -36586
1338 -36586 -96689 -109662 -111629 -141751 -98403 -154441 -54282 63290 -21824 1168 10949 -45804
1326 -45804 -29057 -50726 -53460 -37948 -24499 -21437 -19278 -8850 -23924 -43395 -30022 25011
1314 25011 -100990 -112139 -142780 -54997 32379 -105162 -95989 -40361 -73514 -61101 26916 -39791
1302 -39791 -97226 -160965 -187622 -58502 -120414 -90882 -78416 -171831 -152010 -48907 -65239
1291 -65239 -25151 -103270 -126290 -99285 -48749 -96653 -82169 59283 64655 -22681 -124266 -80433
1279 -80433 -58848 -30592 -40520 -46285 -115883 50305 -45692 -24124 -64082 -69847 -16504 -77835
1267 -77835 -78723 -97443 -86713 -126441 -183797 -128793 -127886 -128070 -84807 -80660 -57867 -58231 -19467 -139862
$$ packed form
1350C0922m9273K0575J0001K084Q7055r9527o8730n0629J37511J2030q1905J3300
1338c6586o0103j2973j967l0122M3348n6038J00159J17572q5114K2992R781n6753
1326d5804J6747k1669k734J5512J3449L062K159J0428j5074j9471J3373N5033
1314B5011j26001j1149l0641Q7783Q7376j37541R173N5628l3153J2413Q8017o6707
1302c9791n7435o3739k6657J29120o1912K9532J2466r3415J9821J03103j6332
1291f5239M0088p8119k3020K7005N0536m7904J4484J41452N372q7336j01585M3833
1279h0433K1585K8256r928n765o9598J66188r5997K1568l9958n765N3343o1331
1267g7835q88j8720J0730l9728n7356N5004R07j84M3263M147K2793l64L8764j20395
$$ plain form
1253 -139862 -86962 -3294 -59069 -83714 -85535 -16839 1131 -29751 44271 -46283 33712 -1845
1241 -1845 -27508 -13299 44297 70474 -75553 -109396 13375 -29216 -49966 -4190 53325 83234
1229 83234 -24509 10866 -52978 -83503 -60530 -46780 -55486 -682 66000 36986 56302 74153
1217 74153 -50590 -196759 -42545 -102530 -75747 -109095 -166217 -173586 -79755 -44536 47422
1206 47422 108276 50721 60875 28628 94119 77138 13723 64527 -1881 -27113 50271 30976
1194 30976 21 4668 -53030 -30262 11939 -19353 -9343 28028 92704 -45921 -66121 -21618
1182 -21618 -26497 -90005 -106463 -42567 -83512 -10418 102897 -55624 -102602 -166055 -27676
1171 -27676 -115893 -25607 -47862 -83102 -151275 -122095 40746 39814 7595 37125 45649 10250
$$ packed form
1253a39862N2900Q3668n5775k4645j821O8696J7970l0882P4022r0554P9995l5557
1241a845k5663J4209N7596K6177j46027l3843J22771m2591k0750M5776N7515K9909
1229H3234j07743L5375o3844l0525K2973J3750q706N4804O6682k9014J9316J7851
1217G4153j24743j46169J54214n9985K6783l3348n7122p369R3831L5219R1958
1206D7422O0854n7555J0154l2247O5491j6981o3415N0804o6408k5232P7384j9295
1194C0976l0955M647n7698K2768M2201l1292J0010L7371O4676j38625k0200M4503
1182b1618m879o3508j6458O3896m0945P3094J13315j58521m6978o3453J38379
1171b7676q8217R0286k2255l5240o8173K9180J62841r32l2219K9530Q524l5399
$$ plain form
1159 10250 -8040 -58110 106167 60564 -37898 -131068 -140114 -69748 -131636 -130971 -46685 -96794
1147 -96794 -2618 -63258 -34774 8083 13656 -56272 -59820 -79059 -47265 -61649 -106206 -47755
1135 -47755 21260 -47502 -42374 -71387 -37661 22287 -45409 -24753 -20316 40223 -69479 -58029
1123 -58029 -123269 -108525 -8897 -37043 -84102 -10496 -89527 -66521 -71280 -4041 -47419 -138559
1111 -138559 -132310 -50042 61494 -85855 -89689 -81457 -81423 -61939 -60595 -69148 -9908 102328 60627
1098 60627 66602 89519 100252 70667 37770 -65192 -54047 -87933 -51409 -10588 10085 -53294
1086 -53294 -99154 -50725 -93314 -67511 44028 126464 48676 -74499 -53497 -38842 -63490
1075 -63490 -133606 -154536 -159109 -77420 -63633 -21111 -18272 -133846 -97785 -115284 -124783 -131700
$$ packed form
1159A0250j8290n0070J64277m5603r8462r3170r046P0366o1888O65Q4286n0109
1147i6794R4176o0640K8484M2857N573o9928l548j9239L1794j4384m4557N8451
1135d7755O9015o8762N128k9013L3726N9948o7696K0656M437O0539j09702J1450
1123e8029o5240J4744R9628k8146m7059P3606p9031K3006m759O7239m3378r1140
1111a38559O249Q2268J11536j47349l834Q232L4J9484J344q553N9240J12236m1701
1098F0627N975K2917J0733k9585l2897j02962J1145l3886L6524M0821K0673o3379
1086e3294m5860M8429m2589K5803J11539Q2436p7788j23175K1002J4655k4648
1075f3490p0116k0930m573Q1689J3787M2522K839j15574L6061j7499r499o917
$$ plain form
1063 -131700 -33007 -48465 -7077 17160 29043 41811 -53171 -104137 -78074 -21122 16719 -41995
1051 -41995 65145 -29470 -91621 -33921 9877 -83044 -131620 -41161 167427 18948 -25509
1040 -25509 -35233 48525 55007 -39533 -52989 65225 139816 97305 1324 58287 22547 -136932
1028 -136932 -49873 -83968 -31225 -53481 -75887 -53431 -89900 -102194 25183 14334 33660
1017 33660 -1823 23771 98307 85375 16734 76395 96818 99372 101782 59425 -35362 -8648
1005 -8648 -45742 -74524 -13458 -5601 15411 56965 86836 64014 94731 18232 29431 -59371
$$ packed form
1063a31700R8693j5458M1388K4237J1883J2768r4982n0966K6063N6952L7841n8714
1051d1995J07140r4615o2151N7700M3798r2921m8576R0459K08588j48479m4457
1040b5509r724Q3758O482r4540j3456J18214P4591m2511r5981N6963l5740j59479
1028a36932Q7059l4095N2743k2256k2406K2456l6469j2294J27377j0849J9326
1017C3660l5483K5594P4536j2932o8641N9661K0423K554K410m2357r4787K6714
1005h648l7094k8782O1066P857K1012M1554K9871k2822L0717p6499J1199q8802
$$ [...]
##END NTUPLES=NMR SPECTRUM
##END=
